##TITLE=1H_CA-8751-1
 CDCl3, 8 sc, 
 24.8.2020
##JCAMPDX= 6.0         $$ Bruker NMR JCAMP-DX V2.0
##DATA TYPE= NMR FID
##DATA CLASS= NTUPLES
##ORIGIN= UXNMR, Bruker Analytische Messtechnik GmbH
##OWNER= root
$$ XWIN-NMR		Version 3.5
$$ Tue Aug 25 10:27:50 2020 Russian Standard Time (UT+4h)  she@DPX200
##.OBSERVE FREQUENCY= 200.1314999998
##.OBSERVE NUCLEUS= ^1H
##.DELAY= (6, 6)
##.ACQUISITION MODE= SIMULTANEOUS
##.ACQUISITION SCHEME= undefined
##.AVERAGES= 8
##.DIGITISER RES= 18
##SPECTROMETER/DATA SYSTEM= spect
##.PULSE SEQUENCE= zg30
##.SOLVENT NAME= CDCl3
##.SHIFT REFERENCE= (INTERNAL, CDCl3, 0, 15.7039)
##AUDIT TRAIL= $$ (NUMBER, WHEN, WHO, WHERE, WHAT)
$$ ##TITLE= Audit trail, XWIN-NMR		Version 3.5
$$ ##JCAMPDX= 5.01
$$ ##ORIGIN= Bruker BioSpin GmbH
$$ ##OWNER= she
$$ F:/spectra/data/she/nmr/H-F/1/audita.txt
$$ ##AUDIT TRAIL=  $$ (NUMBER, WHEN, WHO, WHERE, WHAT)
(   1,<2020-08-25 10:26:05.64 +0400>,<she>,<DPX200>,
      <created by zg, POWCHK disabled, PULCHK disabled
       configuration hash MD5:
       00 E9 B6 7A A2 85 ED C7 34 08 36 98 17 FE 4E 26
       data hash MD5: 16K
       F1 6D 6A 6E 3A 22 7B 25 14 E1 80 FD 45 4B E1 F1>)
$$ ##END=
$$ 
$$ hash MD5
$$ F0 1E 92 04 BE E3 69 B3 35 C3 EC 02 82 37 F9 FF
##$RELAX= 
##$RELAX= 
##$RELAX= 
##$RELAX= 
##$RELAX= 
##$RELAX= 
$$ Bruker specific parameters
$$ --------------------------
##$DU= <F:/spectra>
##$EXPNO= 1
##$NAME= <H-F>
##$PROCNO= 1
##$TYPE= <nmr>
##$USER= <she>
##$AMP= (0..31)
100 100 100 100 100 100 100 100 100 100 100 100 100 100 100 100 100 100 
100 100 100 100 100 100 100 100 100 100 100 100 100 100 
##$AQSEQ= 0
##$AQ_mod= 1
##$AUNM= <au_zg>
##$AUTOPOS= <>
##$BF1= 200.13
##$BF2= 200.13
##$BF3= 200.13
##$BF4= 200.13
##$BF5= 200.13
##$BF6= 200.13
##$BF7= 200.13
##$BF8= 200.13
##$BYTORDA= 1
##$CFDGTYP= 0
##$CFRGTYP= 5
##$CHEMSTR= <none>
##$CNST= (0..31)
1 1 145 1 1 1 1 1 1 1 1 1 1 1 1 1 1 1 1 1 1 1 1 1 1 1 1 1 1 1 1 1 
##$CPDPRG= <>
##$CPDPRG1= <>
##$CPDPRG2= <>
##$CPDPRG3= <>
##$CPDPRG4= <mlev>
##$CPDPRG5= <mlev>
##$CPDPRG6= <mlev>
##$CPDPRG7= <mlev>
##$CPDPRG8= <mlev>
##$CPDPRGB= <>
##$CPDPRGT= <>
##$D= (0..31)
0 1.2 0 0 0 0 0 0 0 0.06 0 0.03 0 0 0 0 0.0002 0 0 0 0 0 0 0 0 0 0 0 0 
0 0 0 
##$DATE= 1598336765
##$DBL= (0..7)
120 120 120 120 120 120 120 120 
##$DBP= (0..7)
150 150 150 150 150 150 150 150 
##$DBP07= 0
##$DBPNAM0= <>
##$DBPNAM1= <>
##$DBPNAM2= <>
##$DBPNAM3= <>
##$DBPNAM4= <>
##$DBPNAM5= <>
##$DBPNAM6= <>
##$DBPNAM7= <>
##$DBPOAL= (0..7)
0.5 0.5 0.5 0.5 0.5 0.5 0.5 0.5 
##$DBPOFFS= (0..7)
0 0 0 0 0 0 0 0 
##$DE= 6
##$DECBNUC= <off>
##$DECIM= 24
##$DECNUC= <off>
##$DECSTAT= 4
##$DIGMOD= 1
##$DIGTYP= 9
##$DL= (0..7)
0 120 120 120 120 120 120 120 
##$DP= (0..7)
150 150 150 150 150 150 150 150 
##$DP07= 0
##$DPNAME0= <>
##$DPNAME1= <>
##$DPNAME2= <>
##$DPNAME3= <>
##$DPNAME4= <>
##$DPNAME5= <>
##$DPNAME6= <>
##$DPNAME7= <>
##$DPOAL= (0..7)
0.5 0.5 0.5 0.5 0.5 0.5 0.5 0.5 
##$DPOFFS= (0..7)
0 0 0 0 0 0 0 0 
##$DQDMODE= 0
##$DR= 18
##$DS= 0
##$DSLIST= <SSSSSSSSSSSSSSS>
$$ [...]
##$SUBNAM2= <"">
##$SUBNAM3= <"">
##$SUBNAM4= <"">
##$SUBNAM5= <"">
##$SUBNAM6= <"">
##$SUBNAM7= <"">
##$SUBNAM8= <"">
##$SUBNAM9= <"">
##$SW= 24.9337058888022
##$SWIBOX= (0..15)
0 0 2 0 0 0 0 0 0 0 0 0 0 0 0 0 
##$SW_h= 4990.01996007984
##$TD= 16384
##$TD0= 1
##$TE= 0
##$TE2= 300
##$TE3= 300
##$TEG= 300
##$TL= (0..7)
0 120 120 120 120 120 120 120 
##$TP= (0..7)
150 150 150 150 150 150 150 150 
##$TP07= 0
##$TPNAME0= <>
##$TPNAME1= <>
##$TPNAME2= <>
##$TPNAME3= <>
##$TPNAME4= <>
##$TPNAME5= <>
##$TPNAME6= <>
##$TPNAME7= <>
##$TPOAL= (0..7)
0.5 0.5 0.5 0.5 0.5 0.5 0.5 0.5 
##$TPOFFS= (0..7)
0 0 0 0 0 0 0 0 
##$TUNHIN= 0
##$TUNHOUT= 0
##$TUNXOUT= 0
##$USERA1= <user>
##$USERA2= <user>
##$USERA3= <user>
##$USERA4= <user>
##$USERA5= <user>
##$V9= 5
##$VALIST= <valist>
##$VCLIST= <CCCCCCCCCCCCCCC>
##$VD= 0
##$VDLIST= <DDDDDDDDDDDDDDD>
##$VPLIST= <PPPPPPPPPPPPPPP>
##$VTLIST= <TTTTTTTTTTTTTTT>
##$WBST= 1024
##$WBSW= 4
##$XGAIN= (0..3)
0 0 0 0 
##$XL= 0
##$YL= 0
##$YMAX_a= 584610
##$YMIN_a= -277671
##$ZGOPTNS= <>
##$ZL1= 120
##$ZL2= 120
##$ZL3= 120
##$ZL4= 120
##$ABSF1= 10
##$ABSF2= 0
##$ABSG= 5
##$ABSL= 3
##$ALPHA= 0
##$AQORDER= 0
##$ASSFAC= 0
##$ASSFACI= 0
##$ASSFACX= 0
##$ASSWID= 0
##$AUNMP= <proc_1d>
##$AZFE= 0.1
##$AZFW= 0.1
##$BCFW= 1
##$BC_mod= 2
##$BYTORDP= 1
##$COROFFS= 0
##$CY= 11.3945322036743
##$DATMOD= 1
##$DC= 2
##$DFILT= <>
##$DTYPP= 0
##$F1P= 16.9975609425685
##$F2P= -3.02152046262296
##$FCOR= 0.5
##$FTSIZE= 0
##$FT_mod= 4
##$GAMMA= 1
##$GB= 0.15
##$INTBC= 1
##$INTSCL= 1
##$ISEN= 128
##$LB= 0.24
##$LEV0= 0
##$LPBIN= 0
##$MAXI= 10000
##$MC2= 0
##$MEAN= 0
##$ME_mod= 0
##$MI= 1.114404
##$NCOEF= 0
##$NC_proc= 0
##$NLEV= 6
##$NOISF1= 3.799351
##$NOISF2= 2.8
##$NSP= 1
##$NTH_PI= 0
##$NZP= 0
##$OFFSET= 15.70392
##$PC= 1
##$PHC0= -9803.552
##$PHC1= 19.60092
##$PH_mod= 1
##$PKNL= yes
##$PPARMOD= 0
##$PSCAL= 0
##$PSIGN= 0
##$REVERSE= no
##$SF= 200.130013532006
##$SI= 16384
##$SIGF1= 3
##$SIGF2= 2
##$SINO= 400
##$SIOLD= 16384
##$SREGLST= <1H.CDCl3>
##$SSB= 0
##$STSI= 0
##$STSR= 0
##$SW_p= 3612.71676300578
##$SYMM= 0
##$S_DEV= 0
##$TDeff= 0
##$TDoff= 0
##$TI= <>
##$TILT= no
##$TM1= 0
##$TM2= 0
##$TOPLEV= 0
##$USERP1= <user>
##$USERP2= <user>
##$USERP3= <user>
##$USERP4= <user>
##$USERP5= <user>
##$WDW= 1
##$XDIM= 8192
##$YMAX_p= 0
##$YMIN_p= 0
$$ End of Bruker specific parameters
$$ ---------------------------------
##NTUPLES= NMR FID
##VAR_NAME=  TIME,          FID/REAL,        FID/IMAG
##SYMBOL=    X,             R,               I
##VAR_TYPE=  INDEPENDENT,   DEPENDENT,       DEPENDENT
##VAR_FORM=  AFFN,          ASDF,            ASDF
##VAR_DIM=   8192,          8192,            8192
##UNITS=     SECONDS,       ARBITRARY UNITS, ARBITRARY UNITS
##FACTOR=    0.0002004,     1,               1
##FIRST=     0,             0,               0
##LAST=      1.6414764,     0,               0
##MIN=       0,             -277671,         0
##MAX=       1.6414764,     584610,          0
$$ Real data points
##PAGE= N=1
##DATA TABLE= (X++(R..R)), XYDATA
0 0 0 0 0 0 0 0 0 8 -8 8 -8 16 -16 19 -24 31 -34 43 -50 59 -71 83 -93 110 -126 145 -165 188 -212 241 -272
31 -272 306 -344 386 -430 478 -534 593 -658 730 -808 895 -992 1097 -1215 1347 -1496 1665
48 1665 -1856 2080 -2340 2653 -3030 3500 -4102 4911 -6056 7811 -10864 17633 -64470 169704
62 169704 374668 100666 -203583 -277671 -52332 155111 129914 -75687 -140388 6771 182065
73 182065 168279 4485 -114719 -16983 172566 212832 64812 -57119 -27030 106940 198499
84 198499 149109 9882 -35601 59761 153622 133638 51644 6886 48207 121118 118838 38162
96 38162 671 49954 103233 98385 43979 -17473 -19648 47270 90502 57570 15522 14510 29103
109 29103 32090 13479 -16152 -16340 16592 25263 6326 3470 11764 7783 482 -13983 -37281 -23781
123 -23781 25407 35957 -4142 -29424 -17659 3559 11065 -12180 -43136 -24507 31592 48365
135 48365 7760 -41043 -52255 -1972 68378 60003 -29254 -77043 -26923 47955 68368 18913
147 18913 -51455 -51910 31737 86710 39070 -43456 -65744 -6924 71610 69668 -24835 -86797 -29697
160 -29697 64276 83992 18013 -67860 -82628 -439 77099 49295 -35892 -71185 -31014 32236
172 32236 47012 -11884 -68284 -42681 21976 38572 1564 -44164 -57630 -17802 30984 16570
184 16570 -39611 -53629 -18059 16375 18718 -13300 -48888 -38240 1969 12547 -9126 -26143
196 -26143 -26378 -8245 15731 6028 -31298 -35185 -2550 15697 9129 -5174 -21412 -18712 8608
209 8608 20455 5013 -4382 -1489 -915 5310 12650 7446 7837 18741 12968 -123 10959 25936
223 25936 18278 6921 5441 11969 32784 46299 20864 -12057 -3784 31976 54026 45192 5694
236 5694 -22668 9502 66191 67730 17066 -19277 -7902 39654 77438 49410 -17339 -30342
248 -30342 27554 78765 67580 6798 -40102 -11403 65259 84510 22286 -35662 -25839 32569
260 32569 80998 59937 -15306 -46017 6420 61768 51100 -790 -33602 -9744 51627 69047
272 69047 12978 -41200 -31113 16603 49084 36228 -11461 -34413 1611 41207 26790 -12915
284 -12915 -30395 -15343 18014 33857 4862 -28943 -21035 7733 16727 4187 -18552 -30201
296 -30201 -7422 21970 11833 -18996 -27851 -19512 -6734 7541 5359 -12530 -17643 -11141 -13264
309 -13264 -13659 -6058 -7815 -13443 -8031 -4546 -4908 -1687 -10697 -31686 -27392 2426 14642 1217
323 1217 -17201 -27350 -14726 14134 15036 -20326 -41210 -20980 14337 33960 14910 -31657 -47412
336 -47412 -7743 29971 21071 -10881 -29951 -17775 19738 33984 -3740 -41567 -26557 19130
348 19130 43315 24141 -23778 -46842 -10367 36581 32842 -5469 -27658 -15001 22401 42546
360 42546 11798 -34740 -33032 9376 36762 28461 -2468 -23332 -5801 27782 25875 -7163 -24648
373 -24648 -10931 18418 39522 25263 -13736 -25016 107 20243 18119 5406 -8557 -6967
385 -6967 15165 25722 8193 -9094 -9014 884 15359 21293 4374 -10953 -2376 10023 10241 8085
399 8085 1592 -7546 224 16434 14811 972 -6791 -10750 -5138 13708 21211 8153 -4053 -8044
413 -8044 -7629 2874 11954 413 -11094 -552 13506 13440 4804 -11986 -24299 -9505 17565 19914
427 19914 306 -14469 -15405 423 18976 8297 -21763 -26343 -2265 18762 20056 -842 -29108
440 -29108 -27807 6245 24817 4883 -20800 -25021 -5527 20984 19044 -17494 -39140 -16738 17136
453 17136 25878 4327 -29385 -36360 -12 30287 11491 -25382 -33783 -9722 23093 28519 -7959
466 -7959 -42424 -27653 12475 27523 8289 -21620 -31351 -3328 28592 16531 -21438 -32842
478 -32842 -11301 16676 27829 5568 -28097 -27202 5663 22932 10328 -11764 -23182 -8445
490 -8445 20395 23177 -4685 -21827 -13401 4004 17355 14028 -7407 -18024 -763 13874 8867
503 8867 -1963 -9042 -8592 4762 16041 6507 -6858 -8473 -4696 3325 13833 9104 -7718 -10328
517 -10328 107 5906 8425 4962 -8652 -12396 4003 14701 6348 -6553 -13959 -10432 8003
530 8003 17542 1634 -15769 -12593 -92 9329 10044 -7804 -24328 -11133 12995 15468 -1089
543 -1089 -17951 -21919 -4289 17513 10239 -16938 -25839 -9555 10743 17900 -585 -28526 -25549
556 -25549 4935 18755 2166 -19538 -26150 -10170 16155 17737 -11600 -30558 -18011 4034
568 4034 13642 2693 -21453 -26857 -1698 17505 7340 -12987 -23347 -17319 2689 15350 -114
581 -114 -20807 -16689 647 9898 5815 -10822 -23242 -12123 8542 9601 -2639 -10905 -12806 -5111
595 -5111 8465 5241 -10366 -12908 -3032 2827 4528 1779 -8633 -11656 -616 6738 4112 105
609 105 -7024 -11778 -3086 8458 5360 -2357 -4952 -6126 -1198 9299 5986 -9513 -11748 -1171
623 -1171 6796 8988 2033 -11422 -11127 5437 12651 1785 -9509 -14124 -5617 13496 19852 -909
637 -909 -19666 -14603 1662 12755 10564 -7040 -18949 -4222 15127 11881 -5885 -18426 -15017
650 -15017 6445 21580 6320 -19998 -20797 -1256 14695 13968 -4972 -24655 -15263 12286 20060
663 20060 1122 -18321 -21921 -6104 15693 14046 -9296 -20158 -7853 5722 7604 -2961 -20069
676 -20069 -19316 4402 17542 2706 -17144 -23818 -13971 5074 13723 -4056 -22685 -18650 -3326
689 -3326 6540 4754 -11421 -25087 -14727 3737 3960 -8425 -15519 -15262 -4724 6592 -887 -19539
703 -19539 -22151 -7608 5661 8132 -3416 -22023 -23623 -4944 8434 4627 -5568 -15407 -16572
716 -16572 -1963 8583 -874 -13337 -10865 -1931 5222 5566 -7694 -18210 -7655 8893 10143
729 10143 -29 -11206 -15565 -2605 15236 10818 -8339 -15628 -9241 2853 13614 9927 -8105
742 -8105 -14999 -3334 7260 6981 168 -9815 -8424 7396 14387 104 -13529 -11788 -239 14099
756 14099 14953 -5123 -20665 -9454 11129 15718 4994 -11541 -18113 -2843 15524 11226 -5613
769 -5613 -11760 -6861 3646 10933 1442 -13673 -9899 7088 12711 3749 -9095 -16523 -7273 12844
783 12844 17049 116 -14402 -13834 -2288 11514 11609 -5301 -14096 -3990 5681 4780 -294 -7586
797 -7586 -9199 1519 9201 955 -9432 -9160 -3843 2840 7402 -491 -11764 -10456 -1679 3056 4987
812 4987 -155 -12732 -14201 -1621 5538 1701 -4208 -10001 -10456 -707 4914 -4042 -11755 -9132 -2034
827 -2034 3373 2949 -9139 -17265 -7561 5213 4791 -3115 -11567 -15092 -4796 9349 5456 -10638
841 -10638 -16133 -9185 2249 8859 292 -15216 -14698 1108 8857 2466 -8849 -15697 -7566 10769
855 10769 12760 -6182 -18178 -10356 4029 12497 6626 -11728 -17796 -2038 13228 9266 -3282
868 -3282 -12831 -10000 5760 15589 2820 -12356 -10198 1499 10553 10370 -2620 -14950 -6325 10488
882 10488 12564 1830 -8403 -10096 706 14208 9740 -6372 -10591 -2905 6149 10987 5292 -8264
896 -8264 -8931 4343 11410 5158 -2461 -7817 -5475 6817 12735 3387 -6114 -5484 -835 6392 9887
911 9887 1406 -8306 -3652 5971 7785 4614 -1692 -8328 -2914 9901 10497 -699 -7707 -6302 2474
926 2474 13071 9934 -5734 -11924 -2438 7764 10363 4928 -7193 -10836 2788 12593 6002 -4323
940 -4323 -7591 -3568 7375 12409 549 -11750 -8121 4259 11324 8470 -4328 -14570 -5219 12199
954 12199 12739 -103 -9251 -9624 868 12549 8189 -7162 -11020 -509 8064 8511 9 -10523
968 -10523 -7338 7864 13044 2006 -8083 -9934 -2923 9940 13044 -1107 -12267 -6679 4245
981 4245 9093 6796 -3709 -10455 -1172 9232 6194 -1860 -5436 -3699 3895 9859 2376 -8559
995 -8559 -5616 4201 7694 5743 -1327 -8932 -5685 6176 8338 2512 -1991 -4422 -3739 2874 5538
1010 5538 146 -1773 867 546 364 2267 -2068 -5106 13 4798 2535 -223 -2748 -5366 -1032
1025 -1032 6359 4287 -3408 -5609 -4664 -536 6492 6066 -4187 -8322 -3283 1267 3650 2992 -4140
1040 -4140 -7224 -99 5211 -18 -5686 -6958 -3442 5289 8030 -2973 -13276 -7449 3202 8134
1054 8134 5024 -6130 -14022 -5570 8446 7658 -3038 -9562 -8650 587 9277 3822 -9571 -10144 -183
1069 -183 6523 5326 -3260 -12802 -8200 7865 12708 296 -11286 -12646 -3142 11149 12502 -2778
1083 -2778 -13356 -6600 5238 9654 4189 -7722 -10883 2526 13796 7210 -5625 -9652 -3818
1096 -3818 8487 14244 2785 -10751 -6817 6753 13601 8845 -2655 -11225 -3160 12938 14071
1109 14071 2912 -5445 -4761 2816 12562 9751 -3754 -6751 3764 10925 10019 2030 -7278 -5582
1123 -5582 7780 14701 5852 -3896 -6139 -1332 8479 12035 973 -8393 -4004 4596 7818 5494
1137 5494 -2582 -9010 -2960 6662 5295 -1599 -5169 -5242 -206 6300 1989 -8486 -9475 -2004 3125
1152 3125 4383 -597 -10766 -11805 -997 4848 -256 -5921 -9510 -8158 309 3630 -4621 -11371
1166 -11371 -7726 -2462 679 542 -7124 -12665 -6253 2251 493 -4895 -8572 -10347 -4578 3594 1163
1181 1163 -7739 -10388 -6850 -2392 2060 -370 -9224 -10142 -1995 1609 -629 -4623 -8842 -8831 92 4654
1197 4654 -2211 -8018 -7543 -4570 924 2854 -3824 -10951 -6566 668 2300 802 -5570 -10949 -5690
1212 -5690 4277 3870 -4703 -8849 -7648 -1204 6132 2452 -9406 -11671 -2617 4015 3959 -2150 -10770
1227 -10770 -9211 2945 7615 -281 -7894 -8230 -3104 5414 7259 -3096 -10548 -3902 4560 6181
1241 6181 2534 -5612 -8356 463 9709 6039 -2319 -5318 -2467 4446 10334 4398 -5293 -3777 4654
1256 4654 8633 7218 1623 -4250 -340 8941 10175 3300 -947 -468 3170 9503 9992 1190 -2644
1271 -2644 2668 6791 7825 7161 842 -3430 2581 8965 7770 3037 -661 -2463 3064 8874 4872
1286 4872 -2747 -3373 1166 4738 6897 1942 -7407 -6852 2367 5801 2087 -3349 -7735 -5815 2608
1301 2608 4186 -4605 -10530 -8212 -2227 3381 2708 -8249 -15092 -8159 462 340 -4584 -10695 -12809
1316 -12809 -4810 2140 -2841 -12474 -13914 -8404 -1893 1999 -5433 -15236 -12984 -3360 -193 -3525 -9717
1331 -9717 -14702 -9539 2243 3380 -7049 -13999 -12258 -5147 2844 1973 -8647 -13236 -5086 2102
1345 2102 2040 -3719 -11526 -10743 1514 9591 1663 -9234 -10355 -3994 5308 8319 -1141 -10820 -5341
1360 -5341 5962 8788 2712 -5980 -9290 -47 11864 8711 -2176 -5951 -1748 4932 9565 3622
1374 3622 -6415 -4307 7320 12027 6167 -2245 -6966 -1993 9510 11909 2061 -3740 -1031 3992
1388 3992 8501 6430 -2603 -5441 3244 9559 6547 1829 -1720 -2096 3809 7868 2777 -2056 -145
1403 -145 3423 5465 6558 1757 -4189 -1952 3609 4937 4961 4371 -825 -2023 2537 4016 1586 988
1419 988 1249 478 3541 5954 311 -3305 -1215 1879 4100 5226 754 -4379 -1069 4634 4063 -14
1435 -14 -2865 -4714 -416 7021 5313 -2851 -6571 -4141 -97 4123 2774 -4868 -5825 651 2892 -1369
1451 -1369 -5435 -7911 -4978 3879 5668 -3543 -10267 -8012 -2820 1620 1533 -6015 -10636 -4436 1762
1466 1762 -193 -4371 -9100 -9916 -3391 3301 -543 -8149 -8756 -4806 -1140 946 -4094 -11491 -9239
1481 -9239 568 4003 -528 -6925 -11800 -8169 2341 4816 -2778 -8092 -6317 -1614 3364 2153 -6756
1496 -6756 -10050 -1875 5300 4264 -583 -6643 -7098 1190 7927 2751 -4592 -5487 -895 5272 8659
1511 8659 2121 -7013 -4678 4191 7816 5973 468 -4951 -995 7693 8099 822 -2453 -368 3997
1526 3997 8429 6327 -1679 -3188 3438 7225 6346 3791 -800 -1981 3849 8655 4622 594 -303
1541 -303 703 4745 7628 3245 -2330 -460 4034 5190 4959 833 -3650 -307 6788 6223 385 -2568
1557 -2568 -2306 1139 6755 5009 -2774 -4514 567 3712 4051 983 -5015 -5335 2636 6573 1792 -3871
1573 -3871 -5862 -3408 4094 6840 -1322 -8099 -5494 1156 4255 2762 -4380 -9176 -2805 4621 3183
1588 3183 -3259 -7167 -5853 519 6040 1278 -7978 -8230 -1941 2144 2763 -1753 -7593 -6667 1086 3521
1604 3521 -1018 -5010 -6461 -4587 1762 3433 -2406 -6161 -4023 -1586 205 621 -3326 -5930 -1039
1619 -1039 3501 942 -2527 -4452 -5250 -826 4316 2494 -3050 -3274 -1878 -812 2035 1342 -2369 -2776
1635 -2776 1850 2387 825 -147 -2339 -1862 3022 4297 -361 -2276 -331 1489 4113 4492 -999 -4850
1651 -4850 -335 5171 6009 3594 -738 -4065 -121 5467 4162 208 -78 1592 3448 5385 2245
1666 2245 -3885 -2107 4661 6613 4660 800 -3417 -1851 5113 6810 1539 -2102 -2300 1079 6730
1681 6730 7314 -49 -5449 -2098 2691 4574 4280 -364 -3041 1057 5234 1659 -3159 -3309 -819 4423
1697 4423 7392 2347 -5419 -5299 -419 3275 4663 1356 -4495 -3976 2123 3947 -21 -2824 -4200
1712 -4200 -2480 2638 4058 -1394 -4467 -2252 211 918 -198 -5069 -5743 961 5646 2203 -3795
1727 -3795 -6857 -6288 468 5501 2440 -4459 -4622 -1698 29 1128 -2041 -6015 -2607 3448 3073 -1624
1743 -1624 -4692 -5463 -1309 4393 2992 -4465 -6138 -1123 3602 4240 298 -6762 -7053 1150 6106 2990
1759 2990 -1227 -3963 -2826 2046 4272 -1027 -4480 -937 3504 4558 2700 -3075 -6500 -1442 5756
1774 5756 5767 1308 -2201 -3887 486 6370 4485 -2581 -3955 -179 3647 6280 3357 -3137 -3522 1814
1790 1814 4506 2309 229 -1517 -414 5046 5945 -129 -4271 -2198 1507 5612 6429 477 -4884
1805 -4884 -1929 2545 3529 2334 -87 -2851 185 5431 3420 -1772 -3163 -1645 1546 4492 2502
1820 2502 -3510 -3542 1480 3247 1590 -1116 -4419 -3318 3599 5467 -295 -3870 -4007 -2059 1874 3220
1836 3220 -1219 -4259 -1455 933 539 -909 -3170 -4936 -944 3290 696 -3479 -4052 -3394 -1099 2319
1852 2319 75 -4597 -4279 -1029 550 254 -1260 -5015 -4765 4 1460 -337 -2072 -3542 -3837 -376
1868 -376 1952 -1477 -4766 -2794 -593 966 1811 -2402 -6229 -2935 2459 2645 -180 -2985 -4833 -1018
1884 -1018 3720 2326 -3147 -3790 -1222 1964 3624 664 -4159 -3752 2583 4311 1442 -1232 -2993
1899 -2993 -1318 4268 4988 -463 -3118 -349 1498 3554 3557 -838 -3371 840 4502 3412 1063 -936
1915 -936 -1848 1584 5149 2838 -1202 -1350 573 3000 4716 2208 -2661 -2502 2154 3903 3083 1411
1931 1411 -1981 -1751 3203 4782 422 -2468 -2133 826 4796 4419 -1974 -5381 -1273 3597 4263 1511
1947 1511 -3272 -4924 928 5732 2328 -3910 -4625 -1470 3164 4987 -596 -7058 -4010 2440 3592
1962 3592 376 -3824 -5649 -936 4959 2958 -4341 -6185 -3402 626 3597 954 -4750 -5276 -489
1977 -489 1837 -217 -2783 -4695 -3495 2102 2875 -2166 -5380 -3993 -2201 937 1965 -1856 -5261
1992 -5261 -2624 668 571 -537 -2991 -5004 -2423 2486 2225 -1134 -3077 -4162 -2292 2538 2146 -2491
2008 -2491 -3897 -567 1808 2758 -235 -4891 -4951 1314 4957 2116 -1919 -3558 -2111 3093 4512 -655
2024 -655 -4569 -1141 3296 4718 2889 -2019 -4612 -17 5240 3446 -523 -1453 -460 2710 4781 1332
2040 1332 -3389 -1810 2767 4482 4003 642 -2526 -1379 3145 3266 353 -125 525 1215 3406 2694
2056 2694 -805 -2004 482 1781 2475 2842 558 -1708 -122 1765 961 736 388 -1186 374 3544
2072 3544 2460 -1147 -2113 -1879 -122 3575 3078 -1393 -2920 -58 1710 1765 -155 -3525 -3070 2261
2088 2261 4671 569 -3273 -4078 -2015 2032 3606 -898 -4672 -2021 1933 2081 374 -3711 -5316
2103 -5316 -703 4224 2455 -2137 -4190 -3650 -26 2565 479 -4449 -3898 954 2588 956 -2282
2118 -2282 -5737 -3894 1913 2951 -859 -3677 -3203 -1176 1598 1672 -3510 -5356 -1475 1815 2151 308
2134 308 -4057 -5611 -912 2715 1250 -2198 -3372 -2660 733 3212 49 -4648 -3501 381 2772
2149 2772 2528 -1000 -4941 -2739 2776 3292 -584 -2823 -2771 733 4431 3116 -2621 -4567 -666 3092
2165 3092 3735 1868 -2280 -2744 1975 4449 1900 -1117 -1767 3 3930 5433 566 -3188 -660 2899
2181 2899 4067 3066 -84 -2030 1081 4976 3298 291 -313 -43 1820 4018 2346 -956 -385 1707
2197 1707 1910 1986 1594 -383 -928 1513 2499 1539 614 -560 -1411 732 3129 1144 -1117 -1573 -935 743
2215 743 2843 66 -3927 -2869 1196 2357 751 -2144 -4674 -2246 3141 2733 -2178 -4519 -3027
2230 -3027 180 3268 1016 -4885 -5355 -419 2739 1069 -2544 -5334 -3555 1788 3537 -1449 -5269
2245 -5269 -3780 -510 2198 1332 -3422 -5455 -1382 2453 1244 -1408 -3501 -3377 12 2874 339
2260 339 -2832 -2320 -635 207 863 -83 -2707 -1890 1153 1416 837 -246 -1977 -2107 1227 2650 1056
2277 1056 -681 -1193 -1157 1082 3094 227 -1914 -662 1830 2154 1651 -607 -2749 72 3666 2441
2293 2441 -164 -1092 -672 2046 4438 1911 -2731 -2133 1535 3649 3250 612 -2742 -1353 2753 3483
2309 3483 188 -982 -371 1415 3382 2683 -1560 -2734 872 2897 2698 1159 -1446 -1993 1321 3102
2325 3102 1065 -892 -918 -765 1017 3092 1703 -1450 -1739 -540 279 1789 1503 -1654 -1836 657 1606
2342 1606 562 -1001 -2795 -1746 2139 3495 -456 -3349 -3238 -1045 2509 3126 -1021 -4611 -2137
2357 -2137 1726 2520 398 -2581 -4153 -612 3529 1608 -2933 -3379 -1420 1765 3012 -618 -5237
2372 -5237 -3258 2087 3988 803 -3194 -5633 -2263 3661 3970 -1011 -4023 -2452 645 2741 1145
2387 1145 -3928 -4247 1073 3559 973 -2174 -3718 -1976 2510 3682 -796 -4059 -2162 653 3036
2402 3036 2718 -1686 -4489 -1767 2146 2322 779 -1374 -2247 -138 2477 1199 -1857 -1857 37 1801
2418 1801 2748 767 -3195 -2270 1903 2935 1914 -87 -2011 -1640 1690 3568 568 -802 -656 -482
2434 -482 1392 3022 626 -1270 470 1751 1647 1531 338 -1147 950 3622 2003 -391 -770 -417
2450 -417 1304 3868 2285 -838 -1026 563 1237 1830 1771 15 -490 1251 1930 338 303 76 -607 1166
2468 1166 2413 469 -1378 -139 518 812 1357 -200 -2936 -1237 1851 1637 588 -1335 -3009 -1894
2484 -1894 1330 1455 -1260 -2202 -1659 -491 850 81 -3000 -3471 -624 1216 22 -1862 -3589 -3640 535
2501 535 2708 -1055 -4203 -3824 -1484 1061 1620 -2072 -5249 -2685 1053 1162 -1005 -3283 -3850 -595
2517 -595 2541 353 -3543 -3304 -856 1109 2033 -462 -4006 -2652 1484 2374 645 -1125 -2519 -1388
2533 -1388 2451 2800 -526 -1903 -675 984 2577 2097 -807 -2056 1048 2740 2164 709 -510 -978
2549 -978 1640 3583 1877 -125 -384 406 1894 3439 2056 -861 -413 2211 2483 2195 1235 -1020 -302
2566 -302 3299 3257 856 -696 -725 455 3271 3284 -238 -2359 245 2353 2327 1557 -1369 -2487 956
2583 956 3693 1467 -1380 -1917 -832 1833 2830 221 -3335 -1906 1258 1825 1152 -1165 -3253 -1249
2599 -1249 2253 1553 -976 -1987 -1899 -251 2303 1473 -2248 -3031 -509 915 872 -282 -2591 -3028 395
2616 395 2400 141 -2083 -2835 -2279 486 2588 -511 -3382 -2235 -98 839 935 -1353 -3484 -1790
2632 -1790 1381 933 -1283 -2511 -2884 -753 2275 1128 -2771 -3698 -1143 685 1863 670 -3160 -3769
2648 -3769 134 2031 507 -1801 -2454 -2371 957 2258 -1122 -2772 -1631 479 1366 864 -1738 -3021
2664 -3021 -896 2338 1717 -409 -1781 -2220 130 2968 1850 -1430 -1695 -434 926 1858 1159 -1368
2680 -1368 -1124 1476 2111 743 -162 -869 -366 2350 2932 -105 -1501 -318 822 2574 3012 28 -1659
2697 -1659 417 2568 2235 1983 305 -702 584 2997 2309 164 258 624 1282 2854 1805 -1222 -1061
2714 -1061 1582 2861 2168 902 -1549 -1392 1781 3430 1285 -747 -861 -654 1493 2468 165 -2220
2730 -2220 -825 1032 1327 828 -883 -2465 -585 1982 1245 -1169 -2255 -2248 -159 2558 1003 -2719
2746 -2719 -3354 -884 505 948 -470 -3583 -3130 94 1266 -827 -2105 -3156 -1755 494 1196 -2118
2762 -2118 -3764 -1981 -399 597 275 -2563 -4351 -1187 2061 531 -1703 -2941 -3068 -111 2353 114
2778 114 -3102 -2858 -421 718 847 -556 -3365 -1986 1759 1752 -597 -1927 -2203 -558 2144 2094 -1575
2795 -1575 -2729 -410 935 1766 1440 -1367 -2252 813 2653 1700 -6 -753 -1235 1031 2830 1002
2811 1002 -1151 -687 1039 2048 2570 339 -1769 -775 2588 2873 1331 -88 -1183 131 3001 2995 230
2828 230 -1225 -170 1438 2766 2640 -882 -1716 1195 2673 2241 957 -750 -978 2002 3832 1165
2844 1165 -1224 -804 491 2110 2876 336 -2031 -567 1942 2149 989 -585 -1673 94 2870 2014
2860 2014 -1188 -1425 -683 627 2132 1460 -2056 -2039 115 1095 818 -230 -2087 -1775 1155 1893 -409
2877 -409 -2269 -1689 -845 749 1582 -1470 -3132 -1435 820 484 -240 -1897 -2925 -1013 1640 520
2893 520 -1787 -2417 -1923 -999 1329 321 -2441 -2542 -948 -31 87 -604 -2700 -2559 -89 887 -659
2910 -659 -1487 -1808 -1789 -5 1359 -1193 -2668 -1447 36 233 827 -960 -2693 -1132 1136 765 -65
2927 -65 -1403 -2080 -736 2231 1801 -1178 -1788 -677 586 2354 1250 -1728 -1806 1353 2498 1741 26
2944 26 -1743 -981 2270 3781 445 -1379 -457 914 2554 2712 -57 -1714 591 3034 2550 925
2960 925 -205 -652 1178 3507 1971 -283 -93 1095 1867 3022 1641 -1514 -721 2181 2899 1455
2976 1455 349 -1095 -515 2216 2750 296 -1040 -226 1138 2376 2071 -957 -1868 41 2228 1520
2992 1520 518 -989 -1928 421 2530 761 -1679 -1868 -686 811 2003 -193 -3023 -2198 350 1064
3008 1064 662 -926 -2597 -1470 1280 727 -1950 -2302 -1330 -364 956 441 -2109 -3067 -988 204 75
3025 75 -600 -1724 -2517 -317 871 -473 -1683 -2128 -1549 -47 1342 -166 -2318 -1394 -85 -21 -199
3042 -199 -1159 -2691 -1255 1562 962 -1307 -1961 -2181 -885 1511 896 -1525 -2170 -204 343 579 192
3059 192 -1675 -1926 555 1652 -224 -746 -1003 -883 1055 1521 -131 -1357 -171 725 1122 1358 -77
3076 -77 -1733 -555 1934 1926 486 174 -402 218 1623 1243 -351 -38 1239 893 1475 1254 -89 -503
3094 -503 1442 2042 1628 1055 316 -221 1151 2916 1423 -396 -465 367 2034 3194 1296 -1039 -5
3111 -5 1557 1710 1377 543 -798 295 2633 1609 -578 -1024 -274 1215 2568 1501 -1359 -1620 667
3128 667 1508 1122 606 -1345 -1418 1177 1916 95 -1404 -1157 -390 633 1609 -648 -2196 -555 1024
3145 1024 435 -4 -1632 -2443 -875 1932 680 -1542 -1640 -1306 -656 1195 465 -2357 -2165 -511 135
3162 135 -103 -517 -2083 -2042 313 1444 -644 -1576 -1623 -1163 568 1248 -1549 -2823 -989 623 1055 432
3180 432 -1434 -2918 -929 1717 1000 -688 -1166 -1443 259 1838 173 -1734 -1232 684 1387 1402 35
3197 35 -1984 -1656 1570 2099 537 -842 -1154 -43 2230 2412 -583 -1925 135 1674 1774 1476 -592
3214 -592 -1594 1110 2636 1181 -282 -366 -417 1158 2705 565 -1331 -686 1268 1750 1552 -52 -1801
3231 -1801 -225 1993 1977 513 -473 -819 374 2156 1652 -840 -1180 139 1152 1656 1140 -1102 -1600
3248 -1600 934 1797 925 -144 -870 -1254 1018 1883 -215 -1501 -1177 581 905 1397 -268 -2463 -1138
3265 -1138 1256 1226 133 -1188 -2029 -288 2364 1507 -1091 -1923 -767 364 1372 880 -1778 -1864 315
3282 315 1217 132 -680 -1838 -1181 1013 1984 -260 -2295 -1334 -463 789 1447 -461 -2224 -631 815
3299 815 234 -224 -612 -1695 -484 1152 662 -1080 -1194 -564 370 1101 611 -1551 -1465 162 948 410
3317 410 -110 -1716 -1559 805 1468 246 -1063 -879 -1192 220 1261 -369 -1594 -112 759 855 226
3334 226 -981 -1761 -138 1723 1260 -488 -1406 -591 391 1875 644 -1559 -1086 645 1193 1358 585
3351 585 -1148 -920 1142 1287 513 310 428 176 1294 1410 -414 -1115 -52 1424 1412 1817 38 -1532
3369 -1532 -355 1210 1174 1103 217 -1029 -301 2024 1251 -465 -971 -386 236 1385 1236 -1093 -1502 595
3387 595 886 532 -265 -1425 -1237 1178 1880 -158 -2278 -1733 -750 1184 1516 -750 -2536 -926 1103
3404 1103 221 -977 -2229 -2269 162 2063 62 -2881 -2340 -590 462 1216 -1617 -3197 -1917 991
3420 991 1185 -459 -2068 -2654 -1226 1441 1307 -1628 -2184 -755 305 705 -239 -2388 -2203 962 1990
3437 1990 397 -1062 -1868 -1363 951 2034 276 -1228 -633 619 1132 1845 -505 -2094 -463 1527
3453 1527 1309 784 55 -1030 -38 1625 1456 -46 -227 727 1012 1910 1487 -821 -923 686 1934 1975
3471 1975 1202 -599 -895 1168 2132 688 -154 -177 67 1385 1852 313 -1462 -471 871 1067 985 40
3489 40 -1187 -227 1482 575 -612 -731 -793 63 1546 983 -911 -1127 -398 163 689 154 -1044 -1177 -78
3508 -78 1063 -228 -950 -1044 -1309 351 1253 -333 -1500 -1138 -578 523 813 -538 -2544 -1012 663
3525 663 617 -371 -1516 -2226 -1139 1408 1175 -1487 -2175 -1292 173 1062 -5 -2211 -2446 171 1841
3542 1841 303 -1141 -2231 -1535 732 2169 -448 -2322 -1698 -10 1263 1120 -1196 -2498 -473 1366
3558 1366 557 -260 -1329 -1845 -121 1982 927 -1350 -1230 -245 595 1061 325 -1922 -882 1193 1256
3575 1256 127 -125 -1015 -949 1419 1455 -260 -932 -331 348 853 1195 -133 -1157 114 1349 1004 266
3593 266 -438 -805 319 2129 1144 -549 -322 -164 843 2105 969 -1021 -626 1002 1848 1302 274
3610 274 -1410 -552 2159 2323 5 -724 -356 322 1964 1710 -673 -1598 281 1821 1578 857 -813
3627 -813 -1309 530 1975 935 -296 -871 -496 1056 1973 653 -1512 -791 619 1432 1434 59 -1436
3644 -1436 -1036 1450 1188 -245 -988 -1224 -356 1298 1468 -1084 -2214 -461 313 499 354 -1242 -1940
3661 -1940 18 1311 18 -1168 -1872 -1797 616 1500 -167 -2236 -1845 -400 82 373 -1151 -2331 -1152
3678 -1152 1051 715 -1027 -1870 -2070 -743 1182 269 -1919 -1976 -401 175 206 -595 -2206 -1650 531 1206
3696 1206 -540 -1141 -1550 -1037 336 1165 -787 -1758 62 545 454 608 -519 -1448 -173 1396 593 -131
3714 -131 -61 -452 266 1122 726 -477 273 1186 756 1016 462 -319 -526 1065 1237 913 1137 256 -139 977
3734 977 1360 491 -122 319 519 1165 1677 396 -453 2 1070 1000 1143 395 -377 282 1690 941 -149
3753 -149 -348 -272 543 1699 1259 -609 -909 369 898 1163 280 -792 -596 1031 1592 -123 -737 -1020
3771 -1020 -402 1117 1541 -317 -1684 -350 757 213 254 -850 -1384 -187 1583 474 -536 -820 -873
3788 -873 -368 1012 503 -1467 -1054 136 272 375 -230 -1470 -1295 698 1315 -116 -802 -1318 -1031 687
3806 687 1270 -620 -1488 -288 327 398 481 -1233 -2130 -470 1245 340 -719 -1033 -1025 -147 1347 -78 -1703
3825 -1703 -1120 150 805 1060 -11 -1977 -1182 910 1142 48 -818 -835 -470 1496 1167 -1026 -1729 -236
3843 -236 738 1159 732 -1090 -1790 361 1501 1112 -214 -818 -751 634 1901 381 -1167 -833 186
3860 186 1074 1616 215 -1483 -714 1423 1284 777 -249 -1059 -938 1637 1614 -250 -1215 -408 338 1133
3878 1133 1313 -886 -1261 118 1042 797 183 -652 -927 848 1613 127 -671 -450 -436 567 1365 185
3896 185 -1305 -631 444 443 396 -251 -1111 -400 1043 983 -558 -852 -515 348 1189 371 -1185 -1130 234 690
3916 690 34 8 -1120 -1142 938 852 -346 -1075 -418 -163 394 726 -539 -1660 -374 394 237 -263 -917
3935 -917 -1727 -23 1118 654 -1061 -1011 -954 -40 832 394 -1615 -1001 285 384 235 -340 -1243 -1277 548
3954 548 713 -87 -693 -862 -779 526 1091 -531 -946 -281 199 550 553 -493 -1503 -398 1470 1121 -245
3973 -245 -500 -752 244 1529 771 -937 -718 350 921 956 381 -1355 -915 1095 1680 474 -417 -605
3991 -605 -265 1742 1571 -266 -1195 -211 665 1445 1117 -299 -1413 -64 1314 761 -146 -384 -818 844
4009 844 1970 354 -1265 -761 417 1277 1341 -10 -1658 -882 851 671 -136 -499 -650 -204 981 674
4027 674 -471 -1256 -358 -131 405 221 -1470 -1727 -329 756 -137 -894 -1511 -1450 227 1046 -367 -1409
4045 -1409 -1312 -942 -123 562 -319 -1710 -737 -30 -323 -90 -737 -1264 -840 754 527 -667 -1065 -1108 -177
4064 -177 540 332 -959 -1591 -184 739 221 -188 -878 -1314 188 1063 235 -441 -415 -306 176 672 -198
4083 -198 -837 40 925 759 200 -140 -816 -171 1189 948 -95 18 118 -143 714 935 -518 -592 640
4102 640 450 712 869 -354 -494 678 1137 252 -60 -210 129 1060 1619 158 -1017 -79 739 968 1036
4121 1036 -54 -999 -250 1218 1089 294 -127 -404 230 1564 873 -744 -995 193 541 1052 244 -1414
4139 -1414 -870 950 1438 527 -460 -1037 -535 940 1553 -427 -1177 -359 354 435 683 -425 -1092 -163 749
4158 749 -223 -272 -311 -1188 -513 860 345 -781 -1118 -442 -426 568 490 -1307 -1593 -522 -67 -257 -336 -1469
4178 -1469 -1881 -541 470 -719 -1260 -1300 -1085 -273 448 -923 -1982 -1246 -124 151 -35 -1208 -2077 -1107
4196 -1107 734 331 -1082 -1170 -903 -282 1098 200 -1345 -1410 282 385 106 -427 -1481 -917 726 881
4214 881 -730 -817 46 -92 758 1203 -166 -1069 326 894 543 561 101 -670 256 1412 794 100 -45
4233 -45 55 458 1791 1084 -473 -140 868 836 1343 748 -353 -433 1519 1540 881 123 -88 235 1719
4252 1719 1526 -30 -712 435 986 1440 1140 -473 -384 768 1801 961 -5 -477 -551 1319 1990 469
4270 469 -984 -342 934 1160 795 -300 -961 168 1529 814 -246 -627 -449 297 1356 689 -856
4287 -856 -1060 -23 586 547 29 -930 -1080 526 664 -176 -592 -957 -534 386 753 -474 -1589 -540 58
4306 58 -5 64 -930 -1694 -598 404 -109 -631 -828 -1177 -790 304 -97 -961 -878 -624 -585 -14 -185 -1239
4326 -1239 -1468 -355 104 -445 -451 -1240 -1399 81 462 -183 -996 -731 -465 96 780 -376 -1581 -732 165
4345 165 321 319 -448 -1092 -249 1205 513 -422 -372 -407 294 683 744 -734 -570 646 778 726 359 -543 -311
4366 -311 1044 1453 341 82 188 49 1089 1199 356 -333 708 793 1039 927 413 -61 601 1514 1084
4385 1084 456 683 127 721 1554 1410 630 368 712 669 1214 1039 -136 -145 1052 1622 683 116 4 185
4405 185 1149 1568 162 -775 75 745 1157 1003 -86 -1298 3 1458 516 -22 -545 -661 155 1225
4423 1225 307 -1172 -576 -66 342 354 -70 -1026 -582 643 400 -559 -605 -950 -736 430 341 -516 -1155 -731
4443 -731 -594 112 334 -748 -1439 -296 271 -212 -536 -1001 -1146 -198 1105 186 -1198 -869 -571 -90 984
4462 984 61 -1606 -1036 408 661 -104 -417 -1244 -497 1056 984 -469 -1044 -276 462 853 527 -1027 -1285
4481 -1285 721 981 312 -21 -891 -651 611 1491 227 -764 159 328 958 902 271 -849 221 1241
4499 1241 821 480 -75 -412 277 1226 891 -46 -4 342 315 820 699 -121 -134 659 806 736 733 -3 -505 365
4521 365 1011 630 256 207 -25 488 1426 340 -384 27 328 779 783 428 -767 -333 1108 956 -8 64
4541 64 -338 -94 953 664 -335 -430 61 461 876 635 -546 -975 544 938 449 -385 -283 -389 537 1213
4561 1213 101 -909 -454 97 236 430 -332 -1025 -343 768 406 -301 -468 -695 -148 517 144 -1128
4579 -1128 -1043 -150 -170 122 127 -1083 -1113 77 113 -367 -570 -709 -964 121 457 -453 -1604 -803 -256 -145
4599 -145 46 -783 -1516 -445 253 -136 -732 -687 -1016 -564 690 259 -1142 -531 -646 165 595 -34 -1256
4618 -1256 -918 538 302 46 -370 -449 -520 477 1099 80 -264 -332 -69 558 1291 -395 -480 2 1013 653
4638 653 593 46 -412 -5 1570 753 274 -66 100 837 1231 815 -374 -32 872 895 492 450 -230 -305 1115
4659 1115 1261 247 -316 -170 4 986 982 -295 -641 -173 570 695 588 -240 -1099 37 1041 472 -516
4678 -516 -532 -693 150 1017 24 -1237 -1114 194 460 226 -316 -1454 -971 587 447 -688 -974 -963 -835
4697 -835 326 104 -1223 -1644 -825 -63 -22 86 -951 -1325 -436 215 -494 -1216 -1219 -829 -58 866 -69 -1187
4717 -1187 -1010 -130 5 121 -372 -1545 -786 554 49 -633 -627 -817 -290 485 167 -762 -890 -234 333 484
4737 484 -54 -794 -864 332 710 -8 -123 -572 -434 152 697 -173 -489 -15 -1 271 383 -109 -664 -27
4757 -27 761 247 70 128 -614 96 691 720 -185 -272 4 -190 873 751 -197 -651 461 334 80 515 -129
4778 -129 -353 241 760 38 -76 104 -132 318 875 149 -627 28 324 168 567 233 -333 -355 847 526
4798 526 -264 -81 -582 -148 730 735 -262 -663 110 371 287 94 -424 -538 604 854 -239 -471 -461 -407 695
4819 695 657 -253 -977 -774 90 130 250 -534 -1243 -435 656 112 -722 -910 -918 -402 443 139 -1650 -1140 -479
4840 -479 106 237 -647 -1201 -1088 371 313 -612 -897 -759 -566 28 250 -683 -1326 -826 -46 151 -44 -812
4860 -812 -1287 -258 333 -252 -779 -1139 -944 -479 619 -183 -865 -664 58 93 50 -27 -1179 -495 207 578
4880 578 -390 -59 -357 -174 562 1042 -152 -827 -210 265 731 993 -401 -480 -7 808 720 454 -322 -396
4900 -396 537 1361 567 -258 -153 514 777 1030 474 -343 233 1136 1206 624 523 -423 167 1206 1197 51
4920 51 -249 678 701 953 911 -188 -575 484 842 717 294 -520 -135 453 1243 473 -345 -65 50 503
4940 503 927 70 -867 -349 674 368 -192 -184 -651 -275 362 307 -509 -488 -307 -145 421 0 -862 -860 -155 292
4962 292 -319 -96 -1056 -891 51 332 -621 -609 -221 -443 -122 304 -321 -1143 -296 -99 -166 -312 -439 -785 -517
4983 -517 108 7 -407 -594 -534 -598 135 25 -707 -942 -216 -231 -124 187 -562 -841 24 495 -304 -442 -528
5004 -528 -572 449 927 -213 -490 -495 133 202 571 -327 -692 -172 892 601 -45 -47 -172 156 617 597 -483
5025 -483 -189 427 545 755 54 -459 -555 516 805 605 207 -92 -95 975 1112 71 -471 231 760 640
5045 640 1027 454 -238 367 1114 888 524 431 -225 241 1266 757 -32 -125 703 842 1052 635 -612 -110
5065 -110 813 747 487 376 -306 -141 828 1058 -302 -463 107 195 483 767 -434 -284 230 511 205 -73
5085 -73 -310 -372 -92 791 150 -653 -382 -208 -56 705 425 -605 -473 181 243 -13 -263 -861 -437 524 412
5106 412 -381 -547 -550 -330 530 569 -695 -857 -105 120 -77 87 -590 -745 -47 552 -109 -432 -118 -119 30
5127 30 379 -144 -965 -394 145 309 305 -446 -692 -335 303 301 -357 -223 -218 -361 434 475 -366 -308 134 204 370
5150 370 243 -382 -528 176 776 454 -344 -237 -265 312 880 12 -543 -218 559 347 681 103 -465 -59
5170 -59 994 856 206 -234 11 396 1129 684 -789 -378 425 612 901 472 -324 -331 951 1106 609 -17
5190 -17 -154 106 992 1108 96 -306 122 693 763 709 -129 -257 336 636 326 263 95 180 247 866 337 -348
5212 -348 -32 289 16 605 316 -463 -374 60 384 -253 116 -274 -594 227 365 159 -330 -347 -395 -164 323
5233 323 -155 -802 -469 224 83 218 -473 -997 -288 509 166 -401 -538 -371 -18 219 -15 -740 -725 -116
5253 -116 205 -135 76 -657 -683 317 750 -22 -388 -589 -470 87 527 -26 -976 -136 143 617 82 -294
5273 -294 -787 49 879 439 -266 -333 -424 127 1125 -9 -434 -364 47 -86 509 382 -729 -490 642 538
5293 538 159 -320 -354 146 746 881 -592 -661 -8 453 479 93 -525 -923 233 808 308 -610 -429 -330 412
5314 412 442 -146 -937 -257 642 467 -57 -134 -878 -255 582 558 -135 -637 -286 -49 812 308 -582 -499 88
5335 88 -66 317 217 -583 -598 456 337 -71 -257 -63 -128 484 531 -138 -491 -81 -213 326 609 271 -257
5356 -257 -234 734 283 214 -79 -668 -208 520 528 -336 -294 -256 108 292 378 -476 -897 53 406 -30 -40 -573 -484
5379 -484 -122 489 55 -668 -151 -442 268 394 -334 -699 -165 486 406 -109 -68 -435 -260 453 337 -109 -682
5400 -682 -14 -6 294 367 -881 -354 61 310 195 118 -548 -466 280 639 304 -11 113 -121 215 535 74
5421 74 -401 -278 369 318 395 364 -478 160 675 81 107 -78 31 101 328 369 -692 -693 265 7 132 -47 -739
5444 -739 -413 137 625 -205 -475 -656 -304 307 434 -372 -824 -199 131 146 266 -401 -999 -136 251 198 -435
5465 -435 -429 -221 78 510 376 -644 -454 -53 -214 244 -89 -737 -230 410 7 -358 -284 -643 -322 121 371
5486 371 -351 -509 -236 -21 245 151 -413 -536 -252 433 -23 -66 -371 -445 -161 766 196 -598 -147 -65 18 674
5508 674 627 -624 -228 382 375 100 -174 -586 -82 788 601 -180 -520 -226 78 709 335 -142 -596 255 314
5529 314 157 86 -480 -391 310 588 -109 -386 28 -120 142 705 13 -284 -205 524 198 253 16 -240 -19
5550 -19 592 346 -381 -127 -105 337 476 680 -159 -439 47 630 252 316 -178 -372 265 602 223 -204 -329
5571 -329 -67 488 716 -41 -483 -172 294 463 273 -60 -760 -326 845 269 -217 -301 -233 -44 743 441
5591 441 -574 -299 185 370 -149 -52 -360 -624 121 220 59 -223 -135 -324 71 227 -128 -561 -207 -304 -57
5612 -57 193 -454 -671 -334 311 75 -165 -458 -278 -373 296 235 -571 -472 -227 -100 232 498 -341 -773 3
5633 3 382 -78 -56 -303 -473 100 374 128 -318 -365 94 543 515 -126 -270 -174 420 235 97 39 -529 -82
5655 -82 916 180 -220 -174 280 201 879 670 -320 -342 832 720 523 172 -148 -198 617 709 -3 169 568 260
5677 260 559 576 53 -274 322 621 471 366 -149 -410 251 833 258 7 371 -185 232 502 399 -162
5697 -162 -217 210 347 409 331 9 -178 512 497 -222 -433 4 -219 492 639 -229 -344 -169 57 454 28
5718 28 -52 -636 -198 927 148 -196 -265 -425 234 512 35 -728 -394 272 236 8 77 -775 -492 538 117
5739 117 -299 -338 -486 -342 669 149 -413 -511 -87 161 188 206 -438 -671 27 323 -196 -237 -488 -128 196
5760 196 481 60 -428 -287 201 247 103 -16 -508 -277 399 307 -121 -229 -402 132 341 425 -401 -417 -100
5781 -100 42 264 355 -457 -583 498 539 192 -59 -193 -198 303 849 65 -210 -187 154 324 601 -84 -372
5802 -372 -198 715 49 155 -3 -26 -148 924 772 -342 172 252 205 579 366 -214 -232 386 315 368 300 -102
5824 -102 -254 344 715 476 -560 -191 381 532 452 300 -274 117 517 312 307 109 -306 21 722 491 47
5845 47 -403 -23 40 580 427 -305 -438 125 318 497 8 -529 -394 369 318 99 -230 -308 -234 250 479 -356
5867 -356 -627 -319 242 41 -109 -354 -717 19 407 -6 -672 -137 -592 117 391 82 -601 -596 93 -63 -152
5888 -152 -2 -703 -408 18 407 -311 -383 -234 -147 291 296 -302 -558 38 47 299 415 -99 -300 85 239 67
5910 67 -173 -133 -388 137 614 275 -443 -21 94 422 296 270 -279 -153 335 306 162 305 190 287 687 939
5932 939 37 -138 -3 359 407 443 13 -424 390 518 382 174 190 -275 170 623 159 -133 -279 336 346
5953 346 633 133 -258 -269 670 407 344 19 -141 96 480 448 -71 -157 -237 -32 48 347 -311 -499 6 431
5975 431 189 -42 -433 -375 6 365 -166 -602 -141 57 360 389 -38 -687 -600 204 124 -61 -34 -657 -368 397
5997 397 240 -384 -238 -220 250 121 254 -380 -661 -72 248 -92 76 -251 -230 -26 254 -287 -431 -174 -302
6018 -302 -77 243 12 -377 -321 425 -2 21 -101 -452 -354 317 365 -291 -395 -67 -148 537 146 -274 -283 139
6040 139 -53 351 145 -394 -452 196 508 -212 -81 -436 -69 119 409 -229 -426 -72 187 142 348 -86 -388
6061 -388 47 257 410 43 -273 -108 79 361 565 -360 -105 -53 164 574 284 -373 5 539 470 62 79
6082 79 -179 -308 484 741 95 -131 21 519 487 505 -118 -454 229 550 219 119 -680 -168 200 351 325
6103 325 -584 -444 182 165 337 0 -547 8 233 276 33 192 -292 -226 181 412 -446 -637 -305 -132 -12
6124 -12 202 -220 -383 -206 101 -90 -381 -514 -946 -213 264 -184 -285 -415 -13 -71 206 -106 -831 -280 -14
6145 -14 12 -208 -441 -481 -770 -26 180 -375 -394 -214 -299 161 78 -426 -671 251 106 -30 -247 -372 -675 -36
6167 -36 614 -87 -465 -209 8 -135 437 -154 -515 -304 352 399 343 281 -534 -407 588 219 39 -72 -151 -292
6189 -292 595 322 -169 7 175 296 324 184 -52 -192 128 434 185 -121 261 292 303 808 330 -381 -130
6210 -130 412 330 62 211 -202 213 507 -86 -74 -57 -373 134 148 645 -209 -73 506 160 313 369 41 -490
6232 -490 -72 324 25 -34 150 -295 425 501 -284 -231 -39 246 148 84 -239 -608 -145 -14 101 -46 51 -357
6254 -357 -235 389 285 -536 -353 145 -72 202 283 -65 -76 255 -78 -245 -188 -214 -184 6 467 -208 -413 -121
6276 -121 -450 -56 27 -354 -496 -39 54 -412 -138 170 -449 -510 323 -215 -256 -109 -289 -412 224 332 -356
6297 -356 -433 227 160 -91 102 -279 -286 369 171 -53 -305 -185 -287 123 326 40 -280 -312 570 155 489 60
6319 60 -206 296 522 256 -65 74 89 363 829 221 -469 101 357 260 263 162 -35 102 553 862 179 99
6341 99 32 193 230 457 406 82 280 174 469 123 7 -155 249 634 263 -8 -177 253 163 436 302 -377
6363 -377 38 103 302 383 193 -374 158 480 388 -15 -436 112 143 358 438 -71 -257 356 -175 248 431 -238
6385 -238 -406 180 133 55 -276 56 -358 7 59 -225 -166 -181 -42 -246 286 -51 -397 -445 1 -168 -166 -179 -219
6408 -219 -636 123 -32 -222 -372 -208 -365 -46 323 -353 -352 -143 111 -97 -54 -340 -562 237 388 -122 -134
6429 -134 -326 -127 128 417 -204 -478 -407 180 293 258 -66 -362 -20 343 239 59 -316 -26 -47 347 221
6450 221 -525 -445 229 159 13 5 75 -146 254 633 190 -414 -83 94 355 765 458 -226 312 348 685 71
6472 71 -138 -8 112 444 343 113 -24 147 78 566 422 44 -244 579 208 87 473 -116 -219 492 411
6493 411 81 287 195 -53 269 384 3 -234 263 -49 37 195 -231 -222 -267 148 -174 60 150 -125 -190 -78
6515 -78 186 -256 -75 -137 69 -230 211 -220 -267 -77 496 -13 -275 -320 -282 213 442 -220 -419 -105 99 32
6537 32 -67 -160 -361 -232 17 94 40 -233 -162 -8 69 85 -456 -252 -284 95 108 -9 -105 -233 169 375 63 -124
6561 -124 -130 4 148 152 -250 -300 -14 -247 211 180 -60 -659 26 178 33 106 -167 -222 315 356 377 -169 -302
6584 -302 -320 -176 302 -211 -282 -234 369 153 -150 -39 -287 9 300 376 -105 -414 77 33 381 417 -418 -146
6606 -146 -33 291 85 83 -233 -115 353 544 -299 -422 -23 91 149 297 67 -84 92 187 50 210 88
6627 88 -146 -112 235 -104 1 -98 111 125 302 192 -268 -111 249 -121 61 77 -208 -278 13 462 174 -106
6649 -106 41 -96 -2 281 246 -102 -70 -17 -38 276 161 -520 -208 -194 -122 -322 -116 -212 -308 -97 -85 -285 -122
6672 -122 191 5 239 69 -309 -333 -101 -49 -387 145 -230 104 51 171 112 -306 -203 167 105 -178 -222 -453
6694 -453 -41 -51 28 -57 -25 -197 -128 116 158 242 49 52 464 211 285 -127 -420 135 331 407 -290 -309 -205 39
6718 39 323 -12 -107 -155 172 135 437 -138 -547 -234 140 203 -137 0 -200 133 382 350 -230 -296 -162 129
6740 129 176 -34 -349 39 180 171 221 165 -500 -133 232 543 73 -181 69 95 -100 309 -81 -398 -183 138
6762 138 -105 18 52 -144 -49 294 99 -258 126 110 -260 429 192 -402 -132 56 31 76 -100 -168 -490 2
6784 2 454 -140 -292 -200 -171 195 273 -242 -545 167 4 271 -6 -211 -212 55 443 -41 71 -123 -158 69 129
6807 129 -142 -114 -165 160 -128 109 -116 -313 -66 340 8 -152 -24 -160 60 -12 28 -336 -217 -53 -181
6828 -181 108 387 -57 -317 -52 87 -106 6 29 84 336 103 75 -181 166 28 152 210 25 -657 -90
6849 -90 255 191 207 -42 51 -3 163 5 250 -39 75 137 27 198 -291 -258 77 141 79 2 -43 -367 79 415
6873 415 -39 -160 -190 154 -1 156 104 -187 -69 224 144 69 -295 -838 88 416 267 -58 -142 -174 -216 299
6895 299 198 -150 -232 -114 220 189 -59 45 -183 -129 112 -17 -59 -42 -156 245 329 73 -365 -170 228 103
6917 103 -127 -263 -386 -35 172 170 129 -86 -178 -199 319 129 -238 -93 40 72 44 217 -204 -276 86 57 -118
6940 -118 -317 -18 60 145 89 -369 -214 -195 -47 2 146 103 -31 -133 424 237 -28 200 -98 335 516 287
6962 287 -5 -167 233 343 112 287 -68 -24 144 261 60 -114 -197 -226 407 238 -183 -110 -206 -81 180 11
6984 11 -232 -190 209 105 59 29 157 -78 73 360 21 -264 3 -156 79 120 270 -36 -303 -32 383 378
7006 378 74 -212 94 161 111 -64 -277 23 -217 215 192 -86 -197 114 367 295 -2 -139 -347 126 192 -129
7028 -129 -491 131 -17 273 -105 19 -363 20 176 76 -50 -372 -267 70 74 262 -390 -321 -81 227 300
7049 300 -290 -342 -618 -264 62 51 -430 -267 -281 -295 1 -317 -247 -224 -122 315 90 -291 -293 -214 -88 -174 -50
7072 -50 57 -235 -218 212 -68 -325 11 -264 -10 310 522 -284 -261 304 216 89 290 -64 -274 29 385
7093 385 99 43 -388 10 157 306 -8 -162 60 292 235 194 148 -96 286 242 236 -170 15 -182 74 224
7115 224 153 97 -15 94 50 506 190 -81 20 202 296 -48 -125 -226 -384 137 195 45 -36 9 313 58 123
7138 123 -138 -335 -92 257 156 -29 -171 -188 80 138 270 -256 -43 64 -26 216 110 -369 -92 -283 133
7159 133 -96 2 -79 19 202 512 -88 -264 -83 -548 -87 -146 -185 -104 64 121 126 -72 28 -255 -256 -13 43 -77
7183 -77 -49 313 -216 40 -27 -463 -5 106 -443 -119 -15 -150 -462 327 289 -337 -23 -233 -41 104 158 -86
7205 -86 -430 -170 311 -143 2 34 -240 36 201 -27 -65 -123 15 40 57 -76 -127 -160 297 180 67 126 -380
7228 -380 -124 440 338 23 -132 -245 164 509 181 -241 -111 -40 -86 24 22 177 -238 -1 254 -87 -161 -245
7250 -245 -200 138 506 -195 -47 72 232 57 352 126 -235 115 234 447 110 -127 -116 -127 392 373 -217
7271 -217 -248 -203 12 332 99 -368 -115 44 309 -80 -63 -15 -27 -123 140 -72 -133 -24 -205 46 64 32 -420
7294 -420 151 4 32 -129 -391 -227 -114 183 116 -118 -104 -18 30 39 85 -341 -111 51 44 -178 88 -49 -279
7317 -279 -53 404 16 -229 -91 -113 75 -57 143 -361 5 -120 29 121 -33 -326 134 -245 171 -109 -250
7338 -250 -192 -226 94 227 -261 46 62 103 -157 103 -198 -395 1 132 303 -79 -128 -153 78 252 -100 -263
7360 -263 -67 145 209 -41 -110 -85 237 225 175 -178 -152 224 195 254 60 -175 -200 218 -47 -161 65 -125 6
7383 6 115 385 -183 -316 42 -178 -53 322 136 -469 355 -77 -115 166 107 -171 -132 245 -113 -171 -390 3
7405 3 169 184 68 -378 -106 -51 43 129 337 -444 -140 -74 12 -57 -314 57 -83 117 28 -309 -350 50 -2 191
7429 191 383 -15 -319 143 -52 95 56 -364 -80 11 161 -164 -304 -82 -325 -82 255 -220 -61 -106 154
7450 154 151 -12 -52 -66 -371 30 154 -231 -262 -295 -115 192 146 -345 -346 14 -88 -67 36 -151 -363 335 153
7473 153 60 -359 -136 -59 -104 242 39 -140 -313 89 -172 100 -112 80 -38 86 252 -128 -207 107 -149
7494 -149 69 9 -417 -205 -30 192 -103 85 -400 -284 214 269 -189 78 49 80 105 238 -135 -238 303 238
7516 238 -39 221 -2 188 403 346 2 -85 -87 -49 51 213 48 -190 -168 200 273 -62 83 -116 17 223
7538 223 24 -89 -167 187 18 155 -12 -223 -387 282 303 -211 85 9 -312 319 227 22 -171 -94 -214 -49
7560 -49 116 34 176 -18 132 -78 302 289 -44 -210 -88 68 198 -164 -84 318 178 188 255 -92 -11 -225
7582 -225 201 89 63 -42 56 240 31 1 -18 -173 -54 183 163 -140 130 -240 74 29 -22 -360 -106 -155 441
7605 441 -135 41 -120 47 168 139 -108 -262 -146 10 193 137 -111 -289 33 309 133 49 102 8 45 -34
7627 -34 -51 -206 -3 -87 108 158 178 -226 36 154 99 23 17 -150 129 80 -51 -103 -78 -34 148 147 -202 -297 -216 -45
7653 -45 -229 -26 -30 -95 5 -69 327 -223 -303 445 157 174 290 176 -329 -69 -186 -55 245 294 39 120 33
7676 33 -164 -53 299 -113 -235 217 210 -244 55 -143 7 191 -7 131 -210 -297 13 74 62 -345 -26 55
7698 55 48 -4 -153 -35 28 -80 67 47 -57 -221 120 -49 -155 134 -271 -184 58 -52 -132 -370 -83 -197 -97
7721 -97 51 -374 -238 -324 -119 -267 233 -15 -87 219 89 208 -127 -209 320 136 349 44 30 -100 102 13
7743 13 142 12 -8 -145 147 117 -294 29 -59 94 138 -22 27 -380 266 136 -80 28 -238 -33 149 295
7765 295 -24 -273 70 -57 -38 145 1 -423 105 187 157 -272 -85 -187 -11 85 70 -20 15 80 107 191 -7
7788 -7 -317 -63 326 44 156 -150 -118 -53 232 191 -58 -234 -143 -37 153 -42 -61 -148 -138 -14 299 227 -163
7811 -163 -238 -74 210 78 152 39 -215 -46 122 164 -195 -377 10 21 -121 -204 -258 -176 184 339 -228 -246 -105
7834 -105 -186 296 -170 -262 -134 -87 -112 146 -27 -188 -253 -46 48 -153 -105 -254 -207 45 209 -137 74 -75 124
7857 124 -108 34 -25 -315 20 206 57 90 126 -9 -392 -160 -99 -48 -196 -31 150 -1 53 -193 -95 75
7879 75 73 -169 -130 -265 -111 -74 305 -88 -144 -44 145 29 85 8 -241 -16 178 75 -106 29 -88 -233 356
7902 356 132 -121 105 6 0 -37 61 -184 -387 80 224 9 -192 29 -245 -30 144 -54 -77 -169 -42 197
7924 197 216 -305 27 319 130 187 242 -68 -215 -255 -5 137 -81 -140 7 216 -79 188 -262 -73 178 232
7946 232 262 132 -485 -119 29 71 -4 -295 -132 -150 19 299 -56 -394 -31 239 -199 53 94 144 -188 117
7968 117 212 -17 -178 -126 47 -71 126 -102 -385 83 8 -58 25 -292 -120 4 -127 273 57 -154 -41 -67
7990 -67 0 -138 -274 -19 -156 -44 203 238 -146 -121 -122 -326 -115 -23 -233 253 0 -196 -77 -141 278 -31 -44
8013 -44 216 -433 242 138 160 185 281 -257 -88 239 395 235 -84 -85 5 -116 142 157 -254 89 213 172 -51
8036 -51 -23 -172 384 -73 216 -83 42 142 -93 165 128 -92 -37 369 64 -235 -326 -126 -101 218 497 -328
8058 -328 -235 13 173 98 -98 21 -60 200 126 -72 -161 84 124 47 132 -199 -129 -27 216 -292 20 268 75
8081 75 97 75 275 -146 47 -171 -145 383 20 -312 -145 -66 -185 271 180 1 104 102 200 -60 42 17 -344
8104 -344 170 401 -27 -157 203 177 158 223 -122 -13 141 76 -25 35 -89 -268 -147 -133 17 130 283 -311
8126 -311 251 35 261 -199 -273 -15 83 22 212 12 -335 -145 143 183 236 -77 95 7 399 -83 -237 -122
8148 -122 -58 2 48 -102 -163 60 2 373 -99 -48 6 57 48 -181 -73 -215 176 -483 200 -45 -258 -117 -99 123
8172 123 232 -130 -215 -120 282 276 131 -6 29 181 126 219 -205 44 148 148 -87 190 195
8191A95
$$ Imaginary data points
##PAGE= N=2
##DATA TABLE= (X++(I..I)), XYDATA
0 0 0 0 0 -8 8 -8 8 -16 16 -24 29 -32 40 -50 64 -72 90 -106 128 -150 176 -202 236 -274 313 -357 409 -463
28 -463 526 -593 669 -750 842 -941 1049 -1170 1301 -1446 1603 -1776 1969 -2178 2412 -2671
44 -2671 2958 -3284 3649 -4066 4545 -5103 5762 -6555 7530 -8764 10384 -12612 15891 -21216
58 -21216 31350 -57674 273746 584610 101671 -137232 -91664 224808 365151 265090 29792
69 29792 18723 186504 320048 218815 40172 -30029 111906 266562 236860 43482 -47567
80 -47567 37057 175327 201225 99287 -36629 -41003 76907 151795 86257 -10870 -33234 26307
92 26307 82838 57520 -28353 -50504 13397 57430 23888 -37446 -70641 -41902 29450 55803
104 55803 1662 -48294 -37261 -11914 -11088 -26823 -42208 -29860 6017 13432 -12613 -19642 -7393
117 -7393 -10323 -19146 -22065 -26503 -7535 33471 32038 -16550 -36590 -10134 14458 14281 -5780 -22394
131 -22394 2537 49166 46123 -7725 -42934 -25010 30100 72684 38693 -47935 -68471 8070
143 8070 75163 59757 -7765 -57995 -32315 49683 77863 5367 -69993 -56407 19676 74091
155 74091 40783 -52463 -84016 -2238 81444 60143 -29109 -87881 -59664 33567 85494 26812
167 26812 -61826 -67431 -678 54007 42547 -21926 -60128 -14480 51565 47700 -7077 -40700
179 -40700 -27628 20028 55363 27917 -27103 -26463 23550 50701 33950 -1418 -22142 952
191 952 43679 46660 14701 377 12270 31302 44484 30320 -1532 2649 41183 54251 33568
204 33568 16096 10538 20210 44316 50072 27584 15082 23758 29337 32088 36745 31143 26292 33378
218 33378 29568 16494 25714 39472 28650 14658 18484 28428 38481 39745 13432 -11951 6966
231 6966 44261 50268 23878 -10353 -20794 17747 62598 44125 -15758 -36927 -4024 40840
243 40840 54146 11326 -45701 -36833 29694 62189 23173 -38525 -58744 -10606 55229 49451
255 49451 -25891 -68836 -30746 32803 53211 8472 -60042 -66733 1290 47919 15061 -42027
267 -42027 -54508 -14053 35298 30347 -34717 -74102 -37984 18082 31851 -423 -44101 -51645
279 -51645 -7383 25865 -1207 -43384 -45004 -15282 13167 14369 -19293 -46724 -27592 6336
291 6336 7919 -13506 -30108 -28973 -3826 18376 534 -31736 -31293 -9265 4671 9572 1382
304 1382 -16324 -19187 -6454 -3554 -5228 1616 1655 -4841 -675 4537 694 -706 -5389 -15811 -6222
319 -6222 22160 27399 3166 -13908 -11851 4629 25858 19401 -14316 -24385 7497 38947 37352
332 37352 5753 -30686 -28446 19366 49343 24159 -13273 -19494 4021 33867 33769 -5829 -33146
345 -33146 -3531 42054 45689 9059 -30771 -32756 13321 52388 31677 -13953 -25328 1611
357 1611 32804 36151 -1103 -37392 -19247 29896 45075 17381 -15403 -23639 951 30187 19416
370 19416 -16216 -23449 2833 28231 31649 6100 -28089 -27859 7422 26113 12354 -5427 -12259
383 -12259 -5554 13433 18097 -4469 -19767 -10209 4866 13156 11112 -6606 -19000 -5714 9688
396 9688 5191 -2699 -6556 -10089 -3030 10688 5189 -11905 -15756 -10048 -1253 12409 12961 -5975
410 -5975 -18458 -13846 -6821 1740 7514 -3738 -14710 -2936 9836 2512 -10912 -19967 -20677 -1757
424 -1757 20845 13390 -12312 -22583 -12936 3510 13447 -950 -26154 -21980 7888 22370 9207
437 9207 -14571 -31220 -18440 15906 25500 -3063 -26679 -18304 5722 22361 10269 -23578 -33779
450 -33779 -723 29894 22185 -8353 -31526 -23717 14757 35302 5814 -29854 -24331 9020 31089
463 31089 20608 -17272 -39044 -11068 30564 31628 -146 -25188 -20895 10232 32883 10944
475 10944 -26151 -24806 7283 29164 23440 -4396 -29648 -17266 19211 28847 4396 -17200 -16581
488 -16581 3513 24989 18210 -12591 -23889 -4189 15097 18197 6816 -12513 -17086 3244 16846
501 16846 5235 -8229 -9977 -4150 7380 13591 285 -14138 -10068 102 5365 8930 915
514 915 -14108 -13232 2008 6631 2130 -3590 -12635 -12270 3806 11028 -2996 -15698 -15279 -6066 8662
529 8662 11818 -7562 -22172 -11956 4330 7544 1238 -14113 -22329 -5201 17130 11098 -11365
542 -11365 -22383 -14837 3877 17859 4668 -21735 -21793 1618 17412 12356 -8860 -27758 -15830
555 -15830 16100 22430 -2804 -21602 -16436 4289 22457 14357 -15728 -27197 -4392 18416 17538
568 17538 -123 -17781 -14746 11761 25449 5934 -15948 -15848 -1588 15955 20778 1121 -17071
581 -17071 -6593 13793 16770 4773 -9087 -13202 2092 20692 15356 -2564 -8531 -3214 5832
594 5832 14365 8600 -7096 -6698 6851 11784 7253 2658 -4464 -4938 7173 13097 5327 -1888 -4547
609 -4547 -5131 4435 14124 7060 -3966 -4090 -915 3203 9433 4256 -9344 -8791 5273 11302 6103
624 6103 -2380 -10854 -7190 8979 12409 -2522 -12373 -8663 2161 15157 13070 -9334 -23463 -9147
638 -9147 10106 13912 4292 -12030 -17373 61 16486 6673 -14273 -18960 -6757 12140 17917
651 17917 -2305 -24863 -17015 7806 16989 5692 -13069 -23262 -8064 17883 16367 -9519 -24433
664 -24433 -15999 3812 17847 8421 -16012 -21765 -2868 9679 5004 -8118 -18228 -10833 10922
677 10922 17543 -4044 -22404 -18099 -1252 13783 13706 -6654 -21293 -9961 9095 12725 3486
690 3486 -11069 -17192 -2170 15633 10805 -5306 -9329 -2565 6961 12796 3690 -12285 -9108 9555
704 9555 18653 11860 -1786 -13877 -8077 13679 22449 10325 -3093 -6741 -1742 11856 19029 6242
718 6242 -6133 158 11497 14049 9020 -2241 -7483 5298 20142 15070 120 -7091 -3660 9987
732 9987 21721 11711 -8425 -10705 3502 15119 17375 8251 -8159 -10351 5819 15679 9315
745 9315 32 -5559 -1242 12233 14793 -1718 -12386 -3242 10445 16779 10090 -8310 -17344 -433
759 -433 19596 16076 -1188 -13618 -11216 6196 20075 9932 -9653 -11503 -78 9270 10659
772 10659 235 -11599 -4709 12882 12871 -1602 -11893 -10252 2558 17515 14241 -6651 -17693
785 -17693 -7540 6414 14101 8411 -8789 -14095 72 10131 4569 -3298 -7027 -5085 4338 9464
799 9464 -685 -11009 -6144 2416 6501 5711 -2248 -11237 -6267 4911 7877 3742 -2832 -10778 -8257
814 -8257 5621 10848 2023 -5030 -6510 -3424 4668 8582 -1273 -8311 -1139 6417 7706 3627 -5897
829 -5897 -9234 2380 14352 8877 -2584 -6685 -4605 6148 16128 8027 -8116 -8720 3746 13481
843 13481 13003 2649 -9622 -5121 12678 16387 4820 -5746 -5451 4962 18699 15300 -5196
856 -5196 -12578 1915 16531 17517 6059 -8639 -9104 9650 21294 10718 -3970 -7727 411 14662
870 14662 18436 2534 -10564 -3015 11477 15597 8569 -3378 -10033 1728 17562 14014 -963
883 -963 -7760 -3211 8184 16513 8196 -7968 -8290 5032 12511 10614 2578 -7309 -5132 9660 13717
898 13717 3113 -5080 -4645 1029 10445 12411 866 -8026 -3079 4669 8558 8447 -852 -8172 -1025
913 -1025 9609 8114 442 -3898 -5696 990 11462 8497 -4553 -8641 -1712 6909 11385 4956
927 4956 -9106 -11331 2262 11781 7848 -495 -8854 -7681 6199 13334 2263 -8998 -7192 593
941 593 8603 8802 -3379 -13015 -4226 9480 11422 2721 -8427 -12221 -77 15008 9994 -6008
955 -6008 -12001 -5220 6115 12553 4479 -10153 -10087 3911 10614 5649 -3608 -9508 -3082 10428 11561
970 11561 -2754 -11132 -6322 3531 11322 9381 -5414 -13340 -2834 9411 9486 2017 -6855 -9083
984 -9083 1154 10543 4219 -5824 -6030 -745 4808 7493 -636 -10007 -4147 7208 7518 417 -5546
999 -5546 -8777 -2729 8149 7762 -2091 -6490 -5054 -1779 3401 4910 -1642 -4368 -559 130 -1417
1014 -1417 -446 -1780 -4263 556 4712 729 -3545 -4115 -3946 420 5706 1818 -6172 -6408 -1820 2566
1030 2566 5811 2908 -7193 -9230 -258 4707 3329 437 -4713 -6330 1413 6106 -516 -6344 -3926
1045 -3926 1138 6504 5903 -5445 -12234 -2921 9050 9002 983 -8028 -10280 237 12390 7278 -5654
1060 -5654 -8951 -2720 5789 10487 2448 -9076 -6784 5928 9776 3984 -4680 -8636 -916 12837
1074 12837 12432 -2770 -12097 -5799 6312 15072 10781 -5910 -12639 -823 11629 10769 1782 -7200
1088 -7200 -6021 7289 15153 4060 -8797 -7599 2828 11728 11754 -1522 -11959 -3584 10937 12164
1102 12164 2242 -8011 -10454 730 14060 10094 -4800 -10451 -4529 3932 9234 3339 -9128
1115 -9128 -9262 2865 8355 2099 -6796 -11228 -5963 6193 8600 -3966 -12783 -9972 -1809 5015
1129 5015 3906 -7488 -14795 -6433 3192 2364 -3408 -10051 -11860 -4866 4033 267 -8762 -10023 -6646
1144 -6646 -1566 1847 -3541 -12512 -10353 -190 2985 -485 -6122 -12488 -10125 1585 5249 -2777
1158 -2777 -9266 -8716 -4163 2248 3862 -4982 -10139 -3826 2334 2693 -135 -6254 -9013 -646 7057
1173 7057 2966 -4615 -5704 -3661 1858 7155 2814 -6496 -6538 592 4629 5167 1670 -5631 -5128 4258
1189 4258 7075 1408 -2600 -4060 -1208 5988 8714 79 -5663 -1913 3237 5763 5455 -1153 -6476
1204 -6476 4 7516 6392 1572 -3183 -4659 1609 10339 6524 -3340 -5221 443 6472 9506 4038
1219 4038 -6078 -5199 6101 10760 5955 -981 -5335 -1127 9880 11908 1035 -5637 -1252 5733
1233 5733 10842 8878 -1753 -6340 3122 11877 9132 2536 -3023 -2594 7100 13782 6528 -3125 -2832
1248 -2832 3344 8582 10265 3185 -5349 -1702 8412 9489 3700 -1628 -3813 961 9356 7772 -1632
1263 -1632 -4937 -1477 2681 6023 4147 -4446 -6964 -109 4146 2236 -1099 -5869 -7662 -1167 4492
1278 4492 205 -6248 -7684 -6359 -1710 2396 -3033 -10522 -8631 -2441 -267 -1571 -6863 -13058 -9713
1293 -9713 431 1734 -5255 -10079 -10755 -6623 235 157 -8986 -12821 -6949 -367 2166 -1875 -11059
1308 -11059 -14101 -4099 4792 1388 -5604 -8750 -7165 537 5925 -1345 -9727 -7309 1034 5797
1322 5797 5619 -2143 -9703 -3870 7047 7787 1045 -3642 -3822 2606 11758 9522 -2650 -6856 182
1337 182 8194 12281 8405 -2027 -4049 6085 12528 8357 1318 -2410 1142 12539 16239 5144
1351 5144 -5195 -1753 7808 13615 12031 1806 -4917 3093 13941 12573 2684 -3473 -1813 7864
1365 7864 15897 9500 -2900 -4402 3945 9644 9735 2829 -4720 -845 10999 11926 2193 -5501 -4952
1380 -4952 2334 11826 9791 -1698 -6331 -232 5768 6266 2324 -4511 -5082 4284 8958 2878 -3492
1395 -3492 -4387 -1749 3103 5515 -55 -5024 -1371 3090 3198 1061 -3023 -6913 -2565 4380 3701 816
1411 816 -1282 -4214 -4595 506 2223 -1619 -2561 -1300 -1671 -70 820 -3672 -6870 -2664 1061 1151 -6
1428 -6 -3913 -7549 -3390 2591 146 -5152 -6088 -5245 -1073 3738 340 -8643 -9807 -3959 469 2009
1444 2009 -1126 -7126 -7270 23 1470 -3809 -7279 -6256 -1901 4464 3353 -6399 -11321 -5081 2040
1459 2040 3663 634 -5688 -8017 -634 5448 1560 -4436 -5706 -3492 2744 7396 1577 -6012 -3913
1474 -3913 2446 4690 3917 -333 -5464 -1124 8658 9209 1715 -4077 -4665 1433 10735 10147 749 -3663
1490 -3663 1184 6678 8488 5342 -1911 -3071 6569 12178 7235 226 -2421 429 8154 12286 4997
1505 4997 -2945 -421 5804 9476 8886 1738 -5149 -239 9503 10500 4459 -498 -3112 1794 9231
1520 9231 7321 -1062 -3289 1538 5551 6955 2922 -4000 -3523 4298 6904 3195 -886 -3959 -2737
1535 -2737 3345 5963 589 -4227 -2685 -58 2374 3509 -1436 -6417 -2777 2533 2228 -640 -3742
1550 -3742 -5921 -1671 3974 1858 -5126 -6628 -3422 483 3044 416 -6919 -7260 -518 2563 65
1565 65 -3451 -6830 -5605 1910 4276 -2967 -7939 -5915 -1317 3420 3576 -4598 -10202 -4225 3230 3757
1581 3757 -496 -6376 -7963 -913 6070 1774 -5871 -6866 -2368 3085 5626 -332 -8598 -6415 2351
1596 2351 5252 2237 -2028 -5797 -3077 4483 5319 -1184 -4713 -2625 862 4978 5288 -1497 -4775
1611 -4775 -624 3244 3551 2281 -469 -2498 2659 6294 2469 -2015 -1700 120 4089 7309 3916
1626 3916 -2433 -1824 1975 3264 4129 3212 -581 -482 4267 4360 1654 521 149 787 4519 5071 286
1643 286 -1757 1738 3942 3938 2835 -1710 -3482 2231 7554 5149 293 -2758 -3388 1282 6202 3590
1659 3590 -1558 -1354 1220 2224 2472 -698 -4674 -1865 4908 4958 344 -3109 -4692 -2043 4237 4526
1675 4526 -2165 -5727 -2756 1109 4059 2500 -4929 -8226 -2195 3329 2815 2 -3651 -5229 -814
1690 -814 2723 -1438 -6309 -4012 344 3219 3071 -3050 -9037 -6100 942 3371 1653 -2364 -6310
1705 -6310 -4441 1730 2566 -2473 -4886 -3766 -1051 2789 2808 -3231 -6299 -1874 1394 603 -1317 -4150
1721 -4150 -3268 2873 5729 -279 -6214 -5882 -2138 3747 6436 1352 -5533 -3881 763 2298 1516 -995
1737 -995 -3153 -6 5539 3420 -2522 -3968 -1635 2397 5935 2912 -4203 -3953 2626 5963 3205
1752 3205 -1485 -5265 -3244 5872 8472 2472 -3008 -3265 -582 3945 4562 -602 -3000 1383 5534
1767 5534 3989 412 -3833 -4794 1910 7858 5141 -1863 -3827 -2457 2166 5885 2549 -4269 -3690
1782 -3690 1819 4463 3969 175 -4891 -3866 2296 4309 7 -2354 -2232 -588 2884 2625 -3649 -6253
1798 -6253 -1572 2630 4135 1917 -3692 -7511 -2614 3167 1938 -1313 -3124 -3455 -469 3122 214
1813 214 -5199 -4856 -1311 1441 2306 -812 -5582 -4507 1234 2013 -1561 -4013 -5038 -2215 3342 3382
1829 3382 -3281 -6693 -3652 -260 1832 1582 -2805 -5404 -1600 1373 -333 -2262 -3258 -3277 537 3792
1845 3792 -329 -4470 -3798 -1004 1039 2569 255 -4110 -2798 1818 2136 371 -1176 -3118 -2070
1860 -2070 2444 3846 162 -2125 -1684 -785 2285 3718 -266 -2911 -58 2930 2988 1906 -1219 -3481
1876 -3481 881 5792 4162 -197 -1680 -1428 2181 6058 3095 -2956 -2065 2133 4388 3822 321 -3126
1892 -3126 -1303 4858 5665 626 -1798 -1503 1008 5240 4465 -920 -3384 950 3176 2995 1588 -1869
1908 -1869 -3046 1473 4783 2039 -1615 -1745 -1516 1171 3853 814 -3283 -2174 527 1976 2383 -803
1924 -803 -4804 -2981 2124 2964 61 -2277 -3764 -2367 2390 2353 -2469 -4604 -2102 963 2872 921
1940 921 -5034 -6934 -987 3663 1995 -2204 -5831 -4966 821 4285 -975 -6737 -5027 43 3112
1955 3112 1969 -4067 -7774 -2992 3529 2657 -2346 -5231 -4111 594 4534 679 -6245 -5926 -364
1970 -364 3123 3097 -143 -5722 -4293 1737 3212 -186 -2600 -2822 -562 3519 3249 -2341 -4699 -1213
1986 -1213 1893 3331 2476 -1125 -3452 516 3538 2112 -104 -1403 -1751 1396 5342 3224 -1136
2001 -1136 -2107 -987 1250 4601 3709 -1176 -1889 2381 4420 2684 296 -2667 -1294 4932 7189 1846
2017 1846 -2466 -1925 991 4659 4873 -790 -3382 1086 5366 4690 694 -2380 -3278 2131 6239 2846
2033 2846 -1802 -2046 825 2826 3131 -390 -3869 -1045 3755 3866 807 -1736 -3470 -1200 3222 2390
2049 2390 -1470 -1975 -385 554 1169 316 -2792 -3080 264 1844 1082 -162 -1687 -3398 -819 1275
2065 1275 -345 -1309 -1161 -1724 -957 1811 -21 -3679 -3820 -1236 523 2329 1024 -3820 -4356 -324
2081 -324 1652 -496 -1898 -3579 -2341 2538 3487 -1791 -5399 -3822 10 2456 2556 -2425 -5084 -1497
2097 -1497 2539 1375 -1864 -4091 -3694 1219 5112 1693 -3935 -4403 -1348 1567 2772 -419 -4453
2112 -4453 -2537 2676 2918 -171 -2830 -4157 -1003 3988 3669 -1309 -3293 -1460 1180 2757 1371
2127 1371 -2759 -3347 1368 4368 2651 -742 -3018 -2636 2248 5366 1851 -2204 -1845 874 2864 3657
2143 3657 237 -3421 -541 3678 4833 2212 -1090 -2763 127 5337 4822 -110 -2157 -49 2964
2158 2964 5408 2705 -2810 -3201 2329 5562 3752 712 -1972 -1496 3041 4908 682 -2081 -1066
2173 -1066 1811 4118 3724 -1498 -3818 -444 3492 2820 648 -1623 -2509 588 3746 970 -2686 -2108
2189 -2108 -261 777 1828 41 -3495 -2162 660 596 -550 -875 -2204 -2324 150 1026 -1603 -2183
2205 -2183 -2084 -2527 -418 1578 -1028 -3710 -3187 -1037 391 1030 -1714 -4911 -2818 1624 1569 -1326 -3316
2222 -3316 -4023 -1048 3166 1547 -3874 -5036 -1549 1804 2306 -175 -5083 -3958 2027 4194 254
2237 254 -2986 -3801 -899 3917 4206 -2024 -4346 -1409 2752 3529 1393 -2731 -3477 1587 4881 1986
2253 1986 -1538 -2091 -271 2716 4038 682 -2127 -375 2218 2191 1656 746 -1215 117 2934 2411
2269 2411 564 93 -420 -139 3118 3417 705 -906 -536 572 2087 3095 400 -2056 475 2717
2285 2717 2092 945 -989 -1736 1224 3993 1611 -1555 -1276 281 2405 2787 258 -3651 -1596 2601
2301 2601 3427 1272 -1575 -3089 -992 2866 2442 -1292 -2438 -313 1159 2001 596 -3224 -3228 1139
2317 1139 2728 686 -1354 -2594 -2295 976 2518 -653 -2901 -1799 -761 558 1654 -616 -3179
2332 -3179 -2193 -437 502 485 -332 -2731 -2560 485 1024 -935 -1936 -2272 -1123 1909 2344 -2070 -4788
2349 -4788 -2248 1011 2843 1771 -2677 -4850 -771 2988 1783 -1177 -3048 -3071 1017 3939 915
2364 915 -3362 -2966 622 2643 2350 -1390 -4398 -1370 4085 3958 -705 -3826 -3844 395 5300 3546
2380 3546 -2735 -4141 -329 2998 3045 290 -3093 -2010 2703 4350 374 -2544 -2172 402 4085 3538
2396 3538 -1390 -3433 -252 3115 3216 1688 -2208 -3629 344 4009 2923 -169 -1214 -1258 819 3141
2412 3141 1049 -2073 -1137 1725 2465 1823 -179 -2920 -1009 3189 3747 960 -1149 -1472 -719 2596
2428 2596 3076 229 -1960 -517 691 1593 2315 -255 -1846 102 2095 976 72 -583 -1137 563
2444 563 2221 425 -2374 -1673 -26 1256 1846 215 -3045 -2566 193 842 -44 60 -1671 -2167 139
2461 139 685 -1182 -1777 -1165 -1170 -273 602 -1382 -3109 -1405 -469 -215 -683 -1805 -3625 -1755 1276 416
2479 416 -1584 -2605 -3138 -1727 1672 535 -2389 -3101 -1222 92 241 -510 -2965 -2813 615 1992
2495 1992 -561 -2234 -2654 -1155 2134 2798 -936 -3439 -1402 1465 2846 1742 -1455 -3359 75
2510 75 3481 2298 -378 -1578 -749 2069 4264 1660 -2217 -815 2692 3600 2910 123 -2057 145
2526 145 4380 4110 1049 -701 -386 1257 4311 3386 -250 -1209 1344 2799 2743 1929 -486 -1203 1896
2543 1896 3655 1474 -235 -333 -205 1833 3325 981 -1693 -997 1226 1560 1686 76 -1963 -1170 1674
2560 1674 1671 8 -812 -1809 -1064 2027 1734 -1312 -2525 -1575 138 1285 1111 -2613 -3737 -631 1597
2577 1597 925 -1234 -3014 -2965 388 2441 -625 -3467 -2783 -227 1301 1526 -1849 -4267 -2028 1450
2593 1450 1220 -731 -2211 -3440 -1114 2287 1025 -2521 -2522 -1151 132 1566 112 -3074 -2731 412
2609 412 1680 298 -1208 -2690 -1919 1447 2589 -354 -2744 -1832 -512 1543 2275 -816 -3228 -1415
2625 -1415 1337 1527 40 -1062 -2505 -232 2841 1680 -1282 -1947 -820 1456 2916 1314 -2855
2640 -2855 -2856 964 2714 2279 175 -2561 -2102 2247 3504 609 -1223 -1040 236 2678 2730 -467 -2194
2657 -2194 652 2444 2189 1204 -910 -1541 1308 3998 1976 -954 -941 16 1833 3949 2188 -1420
2673 -1420 -966 1368 2159 2088 943 -1082 -487 2456 2764 47 -341 188 1111 2641 2656 -739 -1769 397
2691 397 1860 2094 1495 -825 -2332 391 2262 1177 -229 -805 -1224 7 2056 818 -1574 -1326
2707 -1326 14 221 715 -49 -2646 -1850 1209 1188 -477 -1663 -3005 -1838 1255 1896 -1347 -2974 -1924
2724 -1924 -1004 355 792 -1884 -4058 -1368 569 261 -880 -2481 -3245 -881 1463 -465 -2844 -3053
2740 -3053 -1520 60 1823 -467 -4420 -3056 343 1246 558 -1418 -3260 -2239 1392 1786 -694 -2105
2756 -2105 -1714 -351 1610 1424 -1456 -3181 -102 2046 1547 768 -1717 -2128 989 3563 1625 -1059
2772 -1059 -1649 -432 2137 3701 1034 -2113 -1157 2161 2455 1835 72 -1564 110 3376 2951 -270
2788 -270 -1116 -103 1808 3394 2409 -1175 -1763 1189 2989 2607 967 -946 -1012 2098 3477 1591 -293
2805 -293 -301 463 2056 2987 827 -1620 -91 1881 1953 1436 -237 -1714 -217 3014 2339 -231 -1031 -1284
2823 -1284 332 2647 1711 -1487 -1518 120 1594 1514 376 -2132 -2430 758 2474 137 -1131 -1623 -1429
2840 -1429 1124 1805 -1200 -3171 -1417 274 1293 476 -1503 -3345 -1120 1694 701 -1230 -2128 -2262
2856 -2262 -490 1767 -104 -2678 -2650 -521 144 715 -691 -3066 -2663 248 1113 -644 -2017 -2315 -1733
2873 -1733 505 1147 -1746 -3114 -1481 -121 751 636 -2011 -3112 -350 1136 480 -963 -1808 -1904 -35
2890 -35 2153 579 -2411 -1521 -126 800 1459 420 -2135 -1477 916 1535 766 58 -1314 -1109 1756
2907 1756 2223 229 -826 -202 542 1697 2582 -2 -1596 313 2197 1971 1397 223 -1357 631
2923 631 3087 2042 -104 -16 -312 1401 3401 2290 -833 -1024 1026 2232 2980 1142 -956 -566 2581
2940 2581 3181 913 -817 -758 -122 3002 3710 -261 -1992 89 1961 1963 1622 -1027 -1924 625 2957
2957 2957 1337 -1348 -1321 -893 774 2542 466 -2203 -1343 509 901 795 -858 -2563 -1697 1315 1575
2974 1575 -811 -1801 -2467 -1182 1055 1222 -1931 -2890 -871 251 550 10 -2714 -3088 57 1525 -271
2991 -271 -1909 -2536 -2170 -104 1354 -928 -3675 -1886 -232 650 605 -1555 -3878 -1933 1084 750 -597
3008 -597 -1498 -1845 -752 1134 323 -2288 -2037 -255 622 771 -30 -2448 -2218 386 1406 -85 -654
3025 -654 -1328 -982 1100 1691 -264 -1695 -914 -2 998 1523 26 -1761 -467 1689 1069 88 -53
3042 -53 -636 407 2655 1876 -862 -1183 123 1211 2577 1678 -1013 -1219 1552 2030 1256 601 -352 -148
3060 -148 1992 2888 490 -684 241 938 1696 2132 494 -822 874 2487 1973 854 -208 -759 847
3077 847 3166 1810 149 131 146 297 1593 1326 -456 18 1166 1009 897 374 -842 -731 1268 1726
3095 1726 399 -148 -580 -453 699 1418 -43 -1833 -785 448 746 1184 -533 -2548 -1425 860
3111 860 643 -432 -1213 -1193 -749 1038 124 -2579 -2183 -547 617 482 -444 -2962 -2524 403 732 -773
3129 -773 -1062 -2358 -1709 209 863 -1197 -2715 -1707 -576 414 377 -1341 -2736 -580 677 79 -1394
3146 -1394 -1395 -1974 -256 1895 104 -2228 -2174 -415 295 1025 411 -1910 -1501 753 1000 200 -493 -1207
3164 -1207 -830 1425 1702 -323 -1175 -435 411 1812 1611 -926 -1994 281 2315 1301 615 -945 -1258
3181 -1258 1063 2888 1399 -912 -968 158 1318 2103 997 -1469 -570 1987 2203 772 39 -1099
3197 -1099 -152 2323 2550 -41 -1155 -309 1098 2417 1894 -1214 -1720 1024 1913 1444 149 -1171 -1588
3214 -1588 1249 2524 587 -1241 -909 212 1362 1665 -317 -2203 -960 1341 1368 296 -1069 -1859
3230 -1859 -408 1635 894 -1164 -1530 -808 -98 1516 669 -1939 -2230 79 900 202 -355 -2221 -1984
3247 -1984 710 1674 -455 -1694 -1341 -1136 470 1320 -1105 -2504 -1004 920 773 383 -1123 -2617
3263 -2617 -1027 1606 983 -958 -1798 -1765 179 1610 555 -1891 -2271 -86 658 1092 -158 -1745 -1899
3280 -1899 877 1957 -521 -1345 -1227 -448 1429 1604 -1233 -2496 -516 866 1422 926 -959 -2025
3296 -2025 -233 1687 496 -486 -519 -729 89 1628 470 -1502 -1134 566 633 1011 250 -1373 -916 1244
3314 1244 1139 -264 -708 -1166 -677 1176 1887 -44 -1536 -474 13 782 1417 14 -1278 515 1263
3331 1263 408 -314 -767 -966 679 2364 893 -1157 -1062 94 905 1573 522 -1405 -1203 1294 1639
3348 1639 465 -21 -1210 -827 1080 1359 -239 -499 142 268 681 567 -847 -1640 522 990 756 179
3366 179 -883 -1918 -425 1279 687 -363 -685 -1350 -314 1092 473 -1752 -1551 -511 98 808 -50
3383 -50 -1967 -1921 -120 774 -1015 -1571 -1951 -1287 1247 1144 -1613 -3250 -1779 372 997 548 -1723 -2809
3401 -2809 -437 1318 243 -1254 -1757 -1408 639 1788 -575 -3001 -1435 993 1361 610 -1218 -2611
3417 -2611 -142 2935 1761 -1148 -1842 -1057 949 2706 1623 -1309 -1277 809 1506 893 237 -1051 -283
3434 -283 2116 3153 470 -1266 -742 526 2443 2680 143 -1546 -22 1646 2017 1268 -131 -1220
3450 -1220 344 2253 1548 293 -506 -576 75 1796 1321 -892 -605 424 812 1420 333 -1480 -1628
3467 -1628 730 1694 350 -286 -1534 -1302 576 1649 -428 -1721 -929 -367 455 721 -880 -2074 -744
3484 -744 973 338 -630 -1145 -1543 -570 755 47 -1777 -1268 -532 71 468 -306 -2089 -1953 -26 204
3502 204 -158 -383 -1620 -1596 58 564 -626 -1687 -1083 -510 545 853 -692 -2275 -844 330 263 553
3520 553 -793 -1915 -631 1432 763 -622 -1212 -1511 -156 1794 1140 -1670 -2029 118 1207 1136 11
3537 11 -2037 -1239 1560 2540 257 -1312 -1505 -262 1801 1982 -402 -2111 -545 1410 1699 1113 -883
3554 -883 -1396 526 2299 1017 -688 -728 -378 1097 2079 733 -1499 -805 1019 1414 1249 368 -1260
3571 -1260 -18 1730 1563 47 -707 -366 379 1727 1391 -276 -912 251 631 912 831 -651 -1125 747
3589 747 1908 573 -4 -125 -461 823 1920 527 -816 -638 49 912 1237 29 -1520 -778 1468
3606 1468 1702 304 -731 -1371 -506 1750 1873 -865 -1641 -768 704 1336 887 -1471 -2051 24 1759
3623 1759 582 -798 -1286 -1257 297 1418 -355 -1804 -1188 -398 557 1108 -664 -2806 -1792 845 543
3640 543 -142 -1032 -2384 -820 830 523 -1398 -1673 -829 -298 429 103 -1855 -2175 -377 728 265 -450
3658 -450 -1531 -1990 273 995 -423 -1636 -1406 -321 690 1501 -567 -2132 -1031 774 911 311 -575
3675 -575 -1538 137 1771 960 -1057 -1097 -75 806 1614 901 -1311 -1154 1052 1388 666 -224 -878 -369
3693 -369 1943 1660 -102 -827 105 523 1386 1698 237 -655 692 1517 980 552 145 -538 755 2418
3711 2418 893 -279 -42 289 568 1600 890 -262 195 1057 766 404 243 -217 -183 1125 1072 370 208
3730 208 -92 -629 596 808 -136 -661 92 276 590 764 -812 -1374 -95 845 216 -7 -543 -966 -265
3749 -265 835 157 -1187 -1096 -26 0 259 104 -1767 -1633 496 510 -458 -764 -1094 -1215 469 901 -1016
3768 -1016 -1786 -1183 -70 541 401 -734 -2088 -409 593 -39 -613 -1144 -1380 -96 1237 -201 -1356
3785 -1356 -1247 -585 242 809 68 -1625 -1077 408 264 -227 -415 -1383 -927 1034 1116 -341 -1405 -954
3803 -954 -198 931 980 -1036 -1237 -23 821 175 -68 -840 -1185 344 1770 215 -674 -859 -219 617
3821 617 1226 -37 -1609 -752 1002 988 452 -363 -1399 -446 1313 1276 -316 -897 -629 254 1191 1072 -1040
3840 -1040 -1129 521 1325 938 313 -896 -1299 797 1719 338 -895 -693 -304 978 1626 -26 -1817
3857 -1817 -576 1061 886 790 -250 -1418 -496 1340 1181 -255 -799 -825 98 1425 911 -1092 -1655 -275
3875 -275 496 1099 274 -1130 -1350 89 1105 299 -699 -1010 -736 489 1220 -636 -1549 -742 -58 121
3893 121 436 -490 -1558 -828 680 234 -583 -920 -1233 -635 878 95 -1688 -1342 -440 365 326 -333 -1211
3912 -1211 -1426 406 836 -594 -671 -1083 -513 730 930 -762 -1540 -182 293 585 459 -731 -1260 -260
3930 -260 1032 347 -764 -534 -735 175 1258 16 -1100 -511 175 851 659 342 -1249 -775 603 799
3948 799 11 -200 -560 -562 1046 890 -760 -657 -71 111 780 870 -555 -1135 9 940 740 254 -856
3967 -856 -1303 284 1831 846 -615 -675 -495 654 1440 446 -1256 -794 462 995 614 -67 -1069 -514
3985 -514 1455 1406 -448 -760 -731 44 1239 1005 -894 -1926 -172 623 699 59 -1102 -1691 90 1097
4003 1097 -93 -1010 -903 -424 365 969 -704 -2142 -1223 340 525 -130 -1276 -2328 -1108 927 546
4020 546 -848 -1333 -1452 -237 695 187 -1612 -1560 -234 152 -175 -83 -1374 -1435 100 881 -205 -1074 -868
4039 -868 -756 495 1145 -329 -1895 -902 -193 775 686 -136 -1451 -412 913 453 -389 -529 -411 12
4057 12 1419 803 -640 -671 385 914 806 1005 -836 -912 739 1322 622 -95 -336 -355 813 1746 388
4076 388 -536 263 345 465 1091 328 -530 710 1152 658 -65 -121 -293 264 1468 795 -399 -86 24 132
4096 132 890 632 -460 -626 573 352 371 3 -265 -322 146 728 -42 -584 -103 -191 524 556 -494 -1715
4116 -1715 -372 908 784 41 -432 -1572 -290 1288 724 -1006 -1002 -696 -169 764 48 -1660 -1531 -15
4134 -15 459 102 -703 -1771 -980 676 907 -1069 -1626 -1130 -356 666 454 -1326 -2063 -508 228 -138
4152 -138 -81 -1164 -1520 -529 624 -432 -1264 -873 -691 61 661 -352 -1662 -937 -365 -141 92 -225 -1506
4171 -1506 -1245 -87 434 -116 -734 -963 -891 533 1248 -167 -1178 -385 -34 729 923 -179 -1055 -153
4189 -153 1070 599 35 -444 -836 225 1702 1145 -563 -826 503 862 1415 610 -744 -691 1515 1656
4207 1656 749 282 -305 347 1861 1806 326 -91 664 854 1288 1168 29 -391 894 1438 809 635 221
4226 221 -164 653 1581 661 -154 8 530 926 1393 540 -481 -345 956 954 416 416 -890 -413 1185 1000
4246 1000 -184 -813 -414 224 926 668 -1007 -1386 126 404 309 -70 -1233 -1182 410 1150 -678 -1363
4264 -1363 -1116 -338 30 396 -821 -1810 -740 561 348 -557 -1096 -1513 -387 905 -7 -1447 -1532 -896
4282 -896 10 250 -236 -1566 -1427 25 180 -286 -731 -1482 -1150 -20 677 -912 -1329 -768 -367 174 259
4301 259 -861 -1774 -724 315 -217 -469 -785 -1469 -264 948 238 -865 -880 -356 -19 623 244 -611
4319 -611 -533 -23 165 436 -51 -405 -742 764 805 212 -78 -350 -213 758 1274 264 -818 140 671 1013
4339 1013 1293 208 -793 575 1666 854 519 221 307 572 1478 827 -170 -46 554 946 968 679 -65
4358 -65 39 1302 1368 573 341 128 78 1011 1188 288 -360 217 473 701 932 -115 -474 413 1136 297
4378 297 222 -134 -597 -9 1232 231 -333 -515 61 61 540 416 -1079 -992 38 22 119 -260 -1079 -1475 186
4399 186 607 -815 -1018 -1076 -779 224 387 -1269 -1829 -671 119 -207 -316 -1231 -1586 -581 739 -329
4417 -329 -1329 -1346 -979 -366 315 -459 -1640 -985 -105 -49 -514 -793 -1537 -1075 342 240 -1039 -1329 -686
4436 -686 -604 641 515 -651 -1271 -601 213 72 65 -544 -1441 -296 969 38 -546 -808 -434 218 939 202
4456 202 -1179 -524 371 567 888 150 -1208 -361 1148 1203 -42 -658 -250 -13 1330 1252 -879 -1143 372
4475 372 1097 1118 578 -892 -745 1111 1217 65 -586 -61 144 1080 1242 42 -966 201 831 518
4493 518 316 -31 -654 85 1171 348 -112 -3 -24 -16 684 344 -560 -174 277 127 276 244 -461 -836 291
4514 291 247 -42 -256 -381 -415 -50 399 -315 -1030 -712 -356 -221 669 -128 -1135 -864 133 70 -271 -677 -1186
4535 -1186 -570 556 229 -954 -1061 -885 -213 31 50 -1477 -1274 -74 346 -193 -551 -1234 -1200 125 547
4554 547 -871 -1467 -477 -540 -21 346 -836 -1582 -1034 54 -212 -493 -1116 -1662 -631 558 51 -1115
4572 -1115 -757 -786 -430 419 -48 -1332 -1313 -191 19 -181 -464 -913 -913 212 193 -390 -598 -896 -605 141
4592 141 711 -580 -1153 -308 348 135 402 -310 -1046 45 1047 239 -350 -355 -156 389 878 328 -781
4611 -781 -432 425 715 654 195 -747 -179 972 1077 122 108 5 -103 928 1253 81 -516 276 365 650
4631 650 685 -86 -449 472 1051 619 -233 -94 -180 192 1070 492 -891 -603 202 383 481 75 -1010 -521
4651 -521 544 638 55 -275 -796 -731 629 512 -788 -1172 -462 -344 215 31 -1186 -1492 -476 119 -281
4670 -281 -464 -1055 -1505 -398 391 -572 -1272 -1328 -670 91 317 -704 -1786 -1065 11 -121 -567 -1093 -1463
4689 -1463 -897 354 503 -1194 -1201 -924 -281 561 236 -1301 -1140 -236 554 447 -448 -809 -736 597 1195
4708 1195 -232 -954 -593 -129 682 735 -322 -1011 -55 906 884 96 -354 -681 180 1300 692 -222 -396
4727 -396 89 451 1116 797 -663 -385 652 872 472 391 -398 -218 1003 1142 79 -335 -347 -182 746
4746 746 881 47 -467 153 537 190 757 177 -503 158 1009 178 -175 -355 -236 209 616 304 -568 -268
4766 -268 361 216 347 414 -629 -794 352 594 135 -349 -168 -432 -5 745 -498 -508 -153 -118 -197 360
4786 360 -317 -641 -202 600 147 -128 -458 -536 -31 594 522 -914 -584 -301 -169 345 -103 -856 -1133 -47
4806 -47 388 -316 -324 -724 -699 137 312 -908 -877 -556 -388 145 457 -478 -1392 -616 1 -22 66 -763 -1171 -387
4828 -387 515 -134 -1159 -840 -408 -10 765 -40 -1117 -685 420 489 111 -381 -1191 -533 703 751 -572
4847 -572 -799 -232 86 754 342 -279 -751 25 732 584 332 -45 -172 466 1366 406 -279 -27 78 719
4867 719 1151 816 -647 -103 1051 664 740 568 -113 224 1416 1147 209 210 379 379 1118 1167 -49 -191 469
4888 469 772 798 739 217 2 680 1321 378 -160 -193 6 334 977 522 -495 -101 677 509 572 -125 -806
4909 -806 -152 754 648 -144 -266 -397 -91 760 269 -800 -832 252 184 177 -5 -758 -1060 54 643 -258
4929 -258 -674 -616 -660 36 729 -560 -1185 -850 -203 266 -326 -605 -1264 -548 438 -129 -640 -844 -922 -378 452
4950 452 -175 -1065 -934 -477 114 343 -23 -1056 -946 330 656 -369 -340 -524 -516 341 323 -635 -955 -212
4970 -212 65 312 71 -262 -689 -103 415 75 -147 -34 -421 -20 762 404 -633 -294 -65 104 575 398
4990 398 -574 -644 399 646 109 223 -270 54 780 943 208 -366 -140 35 848 931 187 -518 289 955
5010 955 565 321 -86 -200 656 1153 592 -13 -30 -120 316 910 382 -448 -17 954 686 700 298 -591 29
5031 29 1131 824 47 -160 -198 -65 663 1029 -53 -695 -65 617 334 22 -400 -598 49 932 23 -517
5051 -517 -493 -231 255 583 39 -927 -504 296 164 69 -133 -1301 -1027 429 547 -320 -830 -849 -647 150
5071 150 229 -1007 -1367 -471 285 228 -376 -801 -1273 11 268 -435 -587 -947 -687 -95 98 -145 -919 -861
5091 -861 -512 -397 401 -74 -1073 -770 304 7 -446 -408 -775 -513 533 100 -576 -769 -80 -228 195 234
5111 234 -455 -654 171 504 4 -275 -402 -582 -40 795 103 -400 -477 210 201 590 -219 -373 -245 457 603
5132 603 -176 -384 -461 -16 594 369 -377 -166 -29 266 571 357 -437 -590 215 649 445 206 -258 -470
5152 -470 170 645 -12 -367 -196 57 559 647 -102 -671 43 520 434 298 -212 -539 179 941 288 -384 -332
5173 -332 -77 348 629 330 -791 -409 497 577 84 52 -559 -608 477 582 -419 -608 -694 -160 153 487
5193 487 -592 -935 -197 19 -223 -295 -433 -752 -125 116 -211 -803 -478 -421 -266 -5 -312 -1007 -636 -209
5213 -209 -74 -218 -147 -875 -621 83 219 -363 -684 -526 -842 -253 228 -483 -1061 -438 65 -135 -272 -339 -1050
5234 -1050 -235 250 -64 -217 -681 -512 -514 473 20 -506 -633 -284 262 409 -93 -930 -732 194 253 -35 -57
5255 -57 -679 -620 287 792 -200 -469 -282 -55 419 689 -316 -581 180 323 348 203 -188 -554 -63 791 252
5276 252 -437 -557 -261 -13 536 -18 -945 -519 515 623 -53 -400 -659 -621 628 531 -364 -1136 -421 -45
5296 -45 315 -78 -728 -1199 -91 708 36 -442 -1068 -541 253 621 -55 -792 -350 -89 40 330 -364 -917
5316 -917 -383 637 223 -3 -550 -802 -350 449 276 -754 -471 -409 190 190 -178 -505 -396 430 339 176 -19
5337 -19 -386 -798 270 295 -39 -362 -313 -401 -18 444 -96 -825 -182 -181 -120 101 -252 -762 -637 325 -37 -269
5359 -269 -543 -181 -229 710 138 -514 -575 78 61 173 -5 -448 -440 -3 507 -242 -339 -731 -145 427 664 -69
5381 -69 -703 -381 -199 -108 305 -80 -769 119 464 190 8 86 -303 -160 664 365 -350 -632 62 178 475
5402 475 139 -669 -428 449 430 8 -127 -201 -383 403 461 202 -340 191 -97 227 380 -148 -581 181 220
5423 220 -199 5 -281 -613 50 129 71 -350 -476 -390 -53 383 49 -1064 -585 299 14 59 -57 -385 -459
5444 -459 301 464 -291 -650 -159 -186 265 262 -355 -835 -177 89 294 16 -333 -495 -222 698 80 -302 -364
5465 -364 66 -44 105 381 -674 -382 241 305 -59 -100 -348 -87 568 255 -114 -227 -166 -220 458 416 -223
5486 -223 -470 -52 93 621 346 0 -180 157 563 425 -233 -81 -473 214 701 165 -583 -360 534 486
5506 486 424 34 -502 -202 740 613 160 -156 -336 -52 642 600 -226 -505 6 288 673 14 -235 -207 272
5527 272 645 -152 -336 -175 -233 362 893 -339 -537 -22 277 357 452 -106 -601 -297 504 349 422 -217 -87
5548 -87 95 382 118 -338 -427 42 253 294 141 -319 -324 447 524 28 170 -346 -670 194 517 -66 -781 -434
5570 -434 27 480 402 -261 -960 -334 339 196 -76 -563 -525 -267 332 198 -673 -618 -175 -136 288 -250 -1125
5591 -1125 -712 -142 379 -220 -236 -834 -577 146 154 -102 -468 -176 -226 180 462 34 -620 160 47 24 -248
5612 -248 -57 -124 -33 460 152 -423 -321 -91 46 491 479 -145 -90 5 82 282 162 73 -283 238 932 408
5634 408 -142 -103 -109 641 683 94 -67 394 424 412 415 -48 -77 109 1025 583 73 128 43 245 770 322 -121 -260
5658 -260 555 401 465 204 -485 -178 561 602 85 -249 62 12 149 343 -304 -501 205 75 119 246 -17
5679 -17 -317 280 643 -113 -309 -293 -463 -331 323 28 -484 -225 -309 -217 -161 -110 -506 -567 154 117 -69 -240 -518
5702 -518 -661 284 222 -319 -906 -435 -11 171 213 -648 -683 -227 539 18 -14 -388 -881 220 493 -57 -851
5723 -851 -715 -31 262 449 -392 -633 -118 231 222 19 -325 -374 -434 391 365 -323 -627 -19 156 310 316 -368
5745 -368 -456 15 555 -286 -65 4 -172 351 657 -79 -154 35 247 206 686 435 -775 -53 443 329 240
5766 240 -269 -344 -219 772 278 209 -132 -108 73 602 -50 -356 -193 410 261 134 328 -368 -551 364 567
5787 567 -111 -71 -164 -144 134 358 -209 -498 150 269 220 462 -85 -387 -67 689 304 -244 -34 -75 27 471
5809 471 147 -352 -208 174 -249 285 -1 -358 -448 164 44 -52 142 -178 -476 -54 289 -2 -636 -92 51
5830 51 203 337 -112 -700 -234 383 -55 -88 -112 -585 -164 226 -31 -553 -798 -311 -56 95 -41 -597 -821
5851 -821 -227 -49 -389 -423 -401 -470 111 110 -495 -932 -315 -251 195 -113 -337 -757 -323 176 -64 -372 -292 -661
5873 -661 391 359 -196 -396 -39 -202 151 736 5 -561 -685 289 252 -40 52 -328 -225 387 439 27 -147
5894 -147 -3 184 431 413 -149 -373 101 335 280 63 123 -305 350 725 206 141 -123 -26 272 573 103 -281
5916 -281 -41 348 93 124 263 -352 -38 203 307 -228 48 -197 -150 402 488 -301 -528 -12 110 360 4
5937 4 -35 -147 32 550 -132 -503 -126 -481 4 151 -171 -775 -200 -108 158 150 -257 -578 -403 85 -377 -231
5959 -231 -395 -452 -464 308 312 -664 -989 195 -297 -246 -85 -365 -568 -28 114 -39 -272 -399 -386 46 223 -528
5981 -528 -526 -195 93 -40 -19 -20 -984 -441 314 -16 -169 -474 -466 -102 317 -33 -621 -213 107 45 179 -24 -580
6004 -580 -363 410 450 5 -288 -127 -320 342 574 -273 -305 -135 230 -18 345 -57 -222 -91 475 226 87
6025 87 -123 -638 108 652 284 -212 -173 -18 -54 513 324 -372 -197 369 504 -85 -59 217 -378 320 694
6046 694 227 -263 119 316 81 458 108 -265 14 40 326 133 -39 -459 70 489 175 -79 252 -319
6066 -319 59 356 124 -447 -259 287 -15 352 189 -168 -349 445 335 -103 -311 -407 -205 462 595 -309
6086 -309 -624 -252 111 11 -23 -576 -746 -321 378 13 -313 -455 -617 90 346 -167 -728 -488 -62 299
6106 299 -17 -253 -538 -435 2 353 -384 -429 -351 -296 -29 215 -202 -783 -272 -240 176 -75 -144 -446 -181 567
6128 567 -277 -203 -257 -258 -112 200 -42 -549 -457 200 232 -29 -102 -303 -29 202 92 -81 43 -202 269 300 146
6151 146 116 -278 58 146 304 470 -189 -265 307 588 339 36 -13 -50 479 635 88 -363 39 487 458 474
6173 474 232 -698 -2 584 536 557 -92 -30 -28 461 454 193 -29 -3 268 246 215 -325 -348 330 324 106 39 -332 -147
6198 -147 431 191 -332 -315 -27 -42 284 378 -220 -427 101 600 277 -399 -196 -570 23 124 -125 -224 -444
6219 -444 252 1 284 -91 -556 -460 99 -298 219 -35 -599 -141 208 393 -450 -172 -409 15 -21 135 -280
6240 -280 -650 -162 246 -58 196 -455 -505 -282 158 15 -100 -288 -288 -190 307 -148 -280 -614 331 197 -66
6261 -66 210 -557 -451 421 78 140 -117 2 -268 102 321 -61 -246 183 -3 278 405 -197 -240 14 321
6282 321 13 -82 -76 -555 18 572 165 103 -46 95 25 426 650 -85 -57 483 424 57 -48 -190 12 339
6304 339 674 120 -82 -120 147 517 431 -238 -291 151 353 571 166 71 -187 309 656 518 -121 -111 6 202
6326 202 209 -135 -261 -9 428 479 208 -397 -313 -251 409 487 -192 -395 -70 63 207 343 -319 -413 86 366
6348 366 236 -89 -146 -337 60 510 -243 -288 10 73 21 407 59 -667 -412 66 67 99 -33 -550 -34 78
6370 78 142 -389 -39 193 -176 -2 -142 -594 -529 44 181 24 -226 -565 -180 338 43 -350 -240 -98 5
6391 5 386 120 -267 -427 -26 204 143 15 -142 -333 83 198 58 -319 -226 -114 -86 171 188 -190 -288 -171
6413 -171 64 112 -31 -329 -50 403 198 33 93 -262 -189 256 419 6 -361 254 117 530 343 30 -459
6434 -459 129 492 236 106 112 122 88 531 295 -359 24 126 391 468 251 79 -195 329 572 250 -265 132
6456 132 -23 428 306 -43 147 126 329 100 267 -84 -398 307 519 183 -37 -61 -299 105 422 151 -399
6477 -399 -325 100 -129 92 35 -481 -279 -166 -180 105 -171 -125 -408 101 357 -108 -401 -49 -62 -113 48 -358
6499 -358 -650 -245 75 -431 -135 -303 -278 -166 231 -401 -481 24 -4 -121 49 -1 -558 -180 -204 -167 -303 27
6521 27 -495 -557 -77 220 -367 15 65 -249 76 71 -303 -322 147 190 52 132 -247 -288 105 347 13 -33 197
6544 197 -154 -17 407 179 -204 -206 139 170 340 147 -241 -23 341 255 -8 -127 -225 -83 306 440 -72 -466
6566 -466 107 130 349 44 -406 -341 363 397 -19 186 -194 -239 11 647 -167 -84 -108 318 132 427 -47 -409
6588 -409 -10 88 257 -72 -57 -226 199 299 395 -267 -38 -28 286 43 222 -437 -382 439 238 -107 -191 142
6610 142 -29 225 315 141 -234 30 50 38 238 -289 -195 -66 162 -80 -629 231 -383 -219 -85 -17 -368 -418
6632 -418 39 -391 350 -283 -269 -216 92 38 -83 115 -237 -472 97 56 -102 -252 -193 -134 -91 225 -263 -148
6654 -148 -324 12 -21 262 180 -321 42 523 -6 -85 -224 -277 164 385 81 -467 -101 146 34 2 470 -178
6676 -178 -465 -44 612 12 -75 -230 -232 -108 210 -80 -358 31 251 198 -42 -169 -334 264 249 32 56 6
6698 6 -113 446 376 255 -274 -57 371 176 295 283 -356 -457 195 377 -107 -153 -20 -97 189 211 -127 -325
6720 -325 84 334 277 95 -156 -343 80 268 297 -111 1 -80 190 341 32 -378 -120 370 136 215 -103
6741 -103 -428 -43 316 482 -409 101 -195 -70 762 40 -363 -201 54 346 271 42 -428 -293 3 274
6761 274 10 -341 -377 -464 -86 276 -263 -453 -439 -92 211 196 -197 -434 -78 192 163 41 -3 -379 -34 82
6783 82 299 -235 -394 -190 25 66 101 -171 -397 48 -72 83 67 -292 -69 141 373 75 -151 -309 195
6804 195 19 150 28 -384 -76 306 -27 -67 81 -133 -200 309 319 -33 -279 147 184 439 164 -190 -246 19
6826 19 361 214 233 -160 -155 227 331 -182 -328 -121 -260 134 213 -254 -364 146 25 49 -26 -36 -336 -258 8
6849 8 93 -1 -124 -220 -197 134 -307 -26 -195 106 201 44 246 -239 -242 -78 354 -223 -71 -323 -280 68 259
6872 259 -353 -431 26 -10 -78 -60 66 -421 -225 200 76 -17 -82 -110 144 25 162 -260 -302 33 190 1 -94
6895 -94 -550 -221 -12 427 200 -78 -524 -108 223 537 -258 -253 -31 90 165 397 201 3 50 155 142 -411
6917 -411 -151 15 -1 407 -235 -27 -25 -95 -85 224 111 -68 30 110 36 -67 -28 -311 10 472 430 76 -335
6940 -335 246 -38 212 121 136 -242 -16 30 -69 -28 -121 -270 166 326 61 -179 -138 -122 -2 280 -2 -514 27
6963 27 378 11 -163 -75 -183 -251 424 55 -23 -29 61 -124 351 115 -100 -79 37 124 48 -161 -23 -48 153 41
6987 41 -180 -257 -77 -272 -59 393 55 -419 -115 65 35 8 -121 -142 -166 144 175 -36 -224 -386 109 479
7009 479 -110 95 -399 -36 307 -196 253 -379 -408 274 151 139 43 -128 -81 -89 158 -312 -271 2 160 63 124
7032 124 -91 -170 -114 491 -56 -47 -162 -76 4 228 79 -340 -408 223 205 58 91 -28 -13 187 110 71 -54 -115
7056 -115 74 -135 59 58 -145 -83 489 67 94 -16 -47 143 137 -123 37 -64 -124 248 510 631 -241 31 168
7079 168 412 542 148 -263 -151 479 374 315 6 -235 -77 2 65 -151 31 -58 -44 320 190 -183 51 22
7101 22 15 159 -308 150 -234 -206 479 254 -259 -164 76 76 151 85 -46 -122 -16 -91 -56 110 -282 -461 -100 154
7125 154 90 -326 -150 -49 -11 115 104 -94 -55 -77 22 48 -322 -503 -80 130 -60 -294 -17 -358 -287 287 -84
7148 -84 -504 31 -16 14 51 -4 -380 15 327 213 -148 -305 10 -426 -178 118 -315 -443 -178 -8 -122 -76
7170 -76 -142 -314 -48 199 50 -56 -274 50 233 360 105 -299 152 171 88 206 -36 -357 3 470 -30
7191 -30 -247 -8 0 10 192 238 -132 -504 -42 38 89 -28 -241 91 256 436 34 247 199 -280 249 385 80
7214 80 -67 75 46 236 26 48 -382 7 279 133 -241 246 -110 -86 234 227 -369 -93 184 157 218 59 -191
7237 -191 -24 -172 196 -104 70 120 -332 -5 471 85 -74 -271 87 53 171 171 -581 -75 362 264 -141 -35
7259 -35 35 -179 296 18 -359 -189 20 -324 -56 215 -251 -224 519 200 -14 64 -203 -290 -62 136 -27 -180
7281 -180 -198 -140 21 -84 -356 -212 150 45 -16 -152 -35 -509 -7 55 -45 -293 -297 212 115 190 -369 184 -321
7304 -321 76 -218 178 -274 -153 -281 213 40 -273 -50 -274 -115 171 51 -123 -48 279 48 -87 -114 -177
7325 -177 -244 -180 347 1 -99 158 -189 6 419 163 -277 -83 330 231 114 126 57 -95 106 303 184 120
7347 120 -31 -129 40 325 -19 109 -171 260 305 84 -74 -168 110 3 304 -114 -8 -381 45 474 189
7368 189 35 139 -213 240 305 -58 13 126 371 161 106 -361 92 150 393 320 -42 -132 -28 202 224 -20
7390 -20 -195 124 155 79 129 35 -272 -299 -16 123 -168 -222 -152 14 -16 246 33 -356 126 11 -56 9 162 -110
7414 -110 -150 344 -174 -279 100 -224 -56 204 110 -42 -106 -2 48 135 81 -66 -454 41 161 -41 1 -254
7436 -254 -198 200 473 -55 -203 -159 274 95 -192 244 -280 14 588 56 -218 -183 -100 -111 254 336 -171 -16
7458 -16 -98 -41 107 241 -99 -186 13 182 54 -49 -15 -137 -40 173 173 -308 76 41 52 62 130 -218 -212 333 211
7483 211 -276 91 -277 -47 197 21 -178 78 222 186 -87 131 -105 -83 225 5 -81 77 91 -84 158
7504 158 124 23 -373 121 113 135 232 -269 178 172 139 -140 102 -98 -95 252 721 50 -227 -272 -286 -181 321 167
7528 167 -225 40 -57 -106 -251 -209 -162 82 360 31 -284 -166 15 70 22 -10 -337 -209 91 283 11 -158
7550 -158 108 -68 48 231 -57 -149 113 254 -85 198 152 -316 64 210 235 -102 217 -344 -29 -78 157
7571 157 366 -254 -98 -72 284 193 140 -251 161 55 -15 120 -48 -66 154 307 78 -77 75 69 -107 298
7593 298 -8 58 -36 52 85 143 159 -181 -51 616 47 -202 -191 -240 -123 355 37 -78 -533 346 136 174 100
7616 100 -306 -405 358 470 117 -137 79 -111 -42 589 217 39 91 171 169 -190 -285 8 40 258 102 -215 -103
7639 -103 -45 77 -49 129 -122 -341 485 -30 -131 87 -73 -47 209 -181 136 73 -121 8 79 -70 -163 21
7661 21 -15 180 -37 121 -396 -289 -186 345 -51 -359 72 -103 -31 380 -24 -320 -101 167 -119 -70 124
7682 124 -4 -111 -374 -95 -46 323 54 72 148 190 -301 -100 58 176 34 35 -377 -140 -364 132 -61 -9
7704 -9 165 -498 105 105 -17 -96 -79 101 -31 -4 -61 -249 -202 211 352 124 291 -91 -247 150 175 -30 5 287
7728 287 104 91 453 -253 -272 -17 -53 72 -68 -42 -229 62 38 252 -240 -272 -104 -234 229 266 -219 -39
7750 -39 178 210 -25 1 -156 -307 60 137 178 24 -61 102 141 256 143 -409 300 167 34 137 -87 -209
7772 -209 -40 505 79 -101 -14 80 -77 279 -164 -130 -83 20 -28 -159 -94 -341 -420 -4 209 -133 83 4 -165
7795 -165 77 56 -118 -63 123 -1 35 -32 -33 -190 170 235 -271 123 -227 139 66 336 -157 -149 -143 24 -100 -12
7819 -12 318 -224 103 124 -172 -272 162 -389 55 91 173 -142 -193 -285 -74 97 171 -192 82 3 179 210 0
7842 0 -200 117 31 126 -200 -28 83 -131 207 9 43 -118 105 348 -140 125 111 -163 -89 500 -182 -77
7864 -77 71 28 19 200 69 -410 -23 177 34 110 276 -51 -167 219 140 -180 -91 23 211 101 203 52
7886 52 -362 202 296 -74 59 -101 -237 -174 -53 105 -244 -38 -329 -125 -28 134 -105 -55 264 110 81 166
7908 166 -197 71 608 85 -291 8 -46 -10 107 24 206 88 365 158 -10 273 -214 -54 -86 115 -48
7929 -48 -140 95 31 525 230 -81 -256 -304 -18 -449 335 88 67 10 67 262 -12 -202 135 -245 350 41
7951 41 -260 -101 -211 -133 125 -123 -318 -474 -98 434 -37 -171 -23 -318 -13 101 163 -133 -215 103 -149
7972 -149 36 -9 -517 1 184 90 -322 -323 -110 10 53 40 30 -44 194 -237 412 -44 120 -330 -36 126 41
7995 41 44 -57 -167 -54 313 -37 -209 -135 140 38 176 206 -297 101 48 105 97 42 -104 -51 -1 -167 32 88
8019 88 181 134 72 122 215 -108 -54 58 46 49 51 45 49 490 -28 107 -26 -86 192 5 68 -390 -334 -308 64 -116 -71
8046 -71 -313 159 170 204 -58 -185 -373 -153 165 40 -70 89 218 -16 260 -204 -138 -256 113 41 -217 -231
8068 -231 -288 -173 -65 56 -239 -74 133 270 -96 -93 96 -242 -122 148 74 -254 191 -34 -149 210 -23
8089 -23 -281 -248 268 11 220 -53 154 96 -26 212 289 59 -195 -153 79 45 13 119 -100 256 -75 -75 27
8112 27 -253 -76 -35 -10 -79 -138 -106 144 54 121 -68 -391 -160 -374 30 141 25 -10 163 23 -191 74 -341
8135 -341 -293 9 -68 -108 38 129 -150 172 325 -202 -218 78 81 -79 55 -86 -93 -258 200 -159 -53 41 167
8158 167 142 136 187 -187 -71 -156 0 -69 -67 148 -6 144 269 5 72 -209 112 -23 381 -151 -201 -117 -16 84
8182 84 41 -166 -245 -49 336 74 -59 22 28
8191B8
##END NTUPLES=NMR FID
##END=
