##TITLE=1H_CA-8743-1
 CDCl3, 8 sc, 
 6.8.2020
##JCAMPDX= 6.0         $$ Bruker NMR JCAMP-DX V2.0
##DATA TYPE= NMR FID
##DATA CLASS= NTUPLES
##ORIGIN= UXNMR, Bruker Analytische Messtechnik GmbH
##OWNER= root
$$ XWIN-NMR		Version 3.5
$$ Thu Aug  6 09:36:26 2020 Russian Standard Time (UT+4h)  she@DPX200
##.OBSERVE FREQUENCY= 200.1314999998
##.OBSERVE NUCLEUS= ^1H
##.DELAY= (6, 6)
##.ACQUISITION MODE= SIMULTANEOUS
##.ACQUISITION SCHEME= undefined
##.AVERAGES= 8
##.DIGITISER RES= 18
##SPECTROMETER/DATA SYSTEM= spect
##.PULSE SEQUENCE= zg30
##.SOLVENT NAME= D2O
##.SHIFT REFERENCE= (INTERNAL, D2O, 0, 15.7039)
##AUDIT TRAIL= $$ (NUMBER, WHEN, WHO, WHERE, WHAT)
$$ ##TITLE= Audit trail, XWIN-NMR		Version 3.5
$$ ##JCAMPDX= 5.01
$$ ##ORIGIN= Bruker BioSpin GmbH
$$ ##OWNER= she
$$ F:/spectra/data/she/nmr/H-F/1/audita.txt
$$ ##AUDIT TRAIL=  $$ (NUMBER, WHEN, WHO, WHERE, WHAT)
(   1,<2020-08-06 09:35:31.03 +0400>,<she>,<DPX200>,
      <created by zg, POWCHK disabled, PULCHK disabled
       configuration hash MD5:
       00 E9 B6 7A A2 85 ED C7 34 08 36 98 17 FE 4E 26
       data hash MD5: 16K
       97 4D 09 51 AE 6B 6C 6B B4 03 EE 21 CC 03 22 AE>)
$$ ##END=
$$ 
$$ hash MD5
$$ 5C BB 9C FC D2 C1 2E A7 9D 99 E9 E7 4F 6E 93 81
##$RELAX= 
##$RELAX= 
##$RELAX= 
##$RELAX= 
##$RELAX= 
##$RELAX= 
$$ Bruker specific parameters
$$ --------------------------
##$DU= <F:/spectra>
##$EXPNO= 1
##$NAME= <H-F>
##$PROCNO= 1
##$TYPE= <nmr>
##$USER= <she>
##$AMP= (0..31)
100 100 100 100 100 100 100 100 100 100 100 100 100 100 100 100 100 100 
100 100 100 100 100 100 100 100 100 100 100 100 100 100 
##$AQSEQ= 0
##$AQ_mod= 1
##$AUNM= <au_zg>
##$AUTOPOS= <>
##$BF1= 200.13
##$BF2= 200.13
##$BF3= 200.13
##$BF4= 200.13
##$BF5= 200.13
##$BF6= 200.13
##$BF7= 200.13
##$BF8= 200.13
##$BYTORDA= 1
##$CFDGTYP= 0
##$CFRGTYP= 5
##$CHEMSTR= <none>
##$CNST= (0..31)
1 1 145 1 1 1 1 1 1 1 1 1 1 1 1 1 1 1 1 1 1 1 1 1 1 1 1 1 1 1 1 1 
##$CPDPRG= <>
##$CPDPRG1= <>
##$CPDPRG2= <>
##$CPDPRG3= <>
##$CPDPRG4= <mlev>
##$CPDPRG5= <mlev>
##$CPDPRG6= <mlev>
##$CPDPRG7= <mlev>
##$CPDPRG8= <mlev>
##$CPDPRGB= <>
##$CPDPRGT= <>
##$D= (0..31)
0 1.2 0 0 0 0 0 0 0 0.06 0 0.03 0 0 0 0 0.0002 0 0 0 0 0 0 0 0 0 0 0 0 
0 0 0 
##$DATE= 1596692130
##$DBL= (0..7)
120 120 120 120 120 120 120 120 
##$DBP= (0..7)
150 150 150 150 150 150 150 150 
##$DBP07= 0
##$DBPNAM0= <>
##$DBPNAM1= <>
##$DBPNAM2= <>
##$DBPNAM3= <>
##$DBPNAM4= <>
##$DBPNAM5= <>
##$DBPNAM6= <>
##$DBPNAM7= <>
##$DBPOAL= (0..7)
0.5 0.5 0.5 0.5 0.5 0.5 0.5 0.5 
##$DBPOFFS= (0..7)
0 0 0 0 0 0 0 0 
##$DE= 6
##$DECBNUC= <off>
##$DECIM= 24
##$DECNUC= <off>
##$DECSTAT= 4
##$DIGMOD= 1
##$DIGTYP= 9
##$DL= (0..7)
0 120 120 120 120 120 120 120 
##$DP= (0..7)
150 150 150 150 150 150 150 150 
##$DP07= 0
##$DPNAME0= <>
##$DPNAME1= <>
##$DPNAME2= <>
##$DPNAME3= <>
##$DPNAME4= <>
##$DPNAME5= <>
##$DPNAME6= <>
##$DPNAME7= <>
##$DPOAL= (0..7)
0.5 0.5 0.5 0.5 0.5 0.5 0.5 0.5 
##$DPOFFS= (0..7)
0 0 0 0 0 0 0 0 
##$DQDMODE= 0
##$DR= 18
##$DS= 0
##$DSLIST= <SSSSSSSSSSSSSSS>
$$ [...]
##$SUBNAM2= <"">
##$SUBNAM3= <"">
##$SUBNAM4= <"">
##$SUBNAM5= <"">
##$SUBNAM6= <"">
##$SUBNAM7= <"">
##$SUBNAM8= <"">
##$SUBNAM9= <"">
##$SW= 24.9337058888022
##$SWIBOX= (0..15)
0 0 2 0 0 0 0 0 0 0 0 0 0 0 0 0 
##$SW_h= 4990.01996007984
##$TD= 16384
##$TD0= 1
##$TE= 0
##$TE2= 300
##$TE3= 300
##$TEG= 300
##$TL= (0..7)
0 120 120 120 120 120 120 120 
##$TP= (0..7)
150 150 150 150 150 150 150 150 
##$TP07= 0
##$TPNAME0= <>
##$TPNAME1= <>
##$TPNAME2= <>
##$TPNAME3= <>
##$TPNAME4= <>
##$TPNAME5= <>
##$TPNAME6= <>
##$TPNAME7= <>
##$TPOAL= (0..7)
0.5 0.5 0.5 0.5 0.5 0.5 0.5 0.5 
##$TPOFFS= (0..7)
0 0 0 0 0 0 0 0 
##$TUNHIN= 0
##$TUNHOUT= 0
##$TUNXOUT= 0
##$USERA1= <user>
##$USERA2= <user>
##$USERA3= <user>
##$USERA4= <user>
##$USERA5= <user>
##$V9= 5
##$VALIST= <valist>
##$VCLIST= <CCCCCCCCCCCCCCC>
##$VD= 0
##$VDLIST= <DDDDDDDDDDDDDDD>
##$VPLIST= <PPPPPPPPPPPPPPP>
##$VTLIST= <TTTTTTTTTTTTTTT>
##$WBST= 1024
##$WBSW= 4
##$XGAIN= (0..3)
0 0 0 0 
##$XL= 0
##$YL= 0
##$YMAX_a= 591300
##$YMIN_a= -253092
##$ZGOPTNS= <>
##$ZL1= 120
##$ZL2= 120
##$ZL3= 120
##$ZL4= 120
##$ABSF1= 10
##$ABSF2= 0
##$ABSG= 5
##$ABSL= 3
##$ALPHA= 0
##$AQORDER= 0
##$ASSFAC= 0
##$ASSFACI= 0
##$ASSFACX= 0
##$ASSWID= 0
##$AUNMP= <proc_1d>
##$AZFE= 0.1
##$AZFW= 0.1
##$BCFW= 1
##$BC_mod= 2
##$BYTORDP= 1
##$COROFFS= 0
##$CY= 11.3945322036743
##$DATMOD= 1
##$DC= 2
##$DFILT= <>
##$DTYPP= 0
##$F1P= 16.9975609425685
##$F2P= -3.02152046262296
##$FCOR= 0.5
##$FTSIZE= 0
##$FT_mod= 4
##$GAMMA= 1
##$GB= 0.15
##$INTBC= 1
##$INTSCL= 1
##$ISEN= 128
##$LB= 0.24
##$LEV0= 0
##$LPBIN= 0
##$MAXI= 10000
##$MC2= 0
##$MEAN= 0
##$ME_mod= 0
##$MI= 1.114404
##$NCOEF= 0
##$NC_proc= 0
##$NLEV= 6
##$NOISF1= 3.799351
##$NOISF2= 2.8
##$NSP= 1
##$NTH_PI= 0
##$NZP= 0
##$OFFSET= 15.70392
##$PC= 1
##$PHC0= -9792.168
##$PHC1= 10.60093
##$PH_mod= 1
##$PKNL= yes
##$PPARMOD= 0
##$PSCAL= 0
##$PSIGN= 0
##$REVERSE= no
##$SF= 200.130013532006
##$SI= 16384
##$SIGF1= 3
##$SIGF2= 2
##$SINO= 400
##$SIOLD= 16384
##$SREGLST= <1H.CDCl3>
##$SSB= 0
##$STSI= 0
##$STSR= 0
##$SW_p= 3612.71676300578
##$SYMM= 0
##$S_DEV= 0
##$TDeff= 0
##$TDoff= 0
##$TI= <>
##$TILT= no
##$TM1= 0
##$TM2= 0
##$TOPLEV= 0
##$USERP1= <user>
##$USERP2= <user>
##$USERP3= <user>
##$USERP4= <user>
##$USERP5= <user>
##$WDW= 1
##$XDIM= 8192
##$YMAX_p= 0
##$YMIN_p= 0
$$ End of Bruker specific parameters
$$ ---------------------------------
##NTUPLES= NMR FID
##VAR_NAME=  TIME,          FID/REAL,        FID/IMAG
##SYMBOL=    X,             R,               I
##VAR_TYPE=  INDEPENDENT,   DEPENDENT,       DEPENDENT
##VAR_FORM=  AFFN,          ASDF,            ASDF
##VAR_DIM=   8192,          8192,            8192
##UNITS=     SECONDS,       ARBITRARY UNITS, ARBITRARY UNITS
##FACTOR=    0.0002004,     1,               1
##FIRST=     0,             0,               0
##LAST=      1.6414764,     0,               0
##MIN=       0,             -253092,         0
##MAX=       1.6414764,     591300,          0
$$ Real data points
##PAGE= N=1
##DATA TABLE= (X++(R..R)), XYDATA
$$ [...]
2644A625l7k635j604K493J910m531m599K269O302L643k150n740k354N215M168
$$ 1625 1588 -1047 -2651 -158 1752 -2779 -7378 -5109 1193 4836 2686 -3054 -5408 -193 3975
2659C975m705m345M325M094l803n066P88N839M857j669o672k090M630K079l148
$$ 3975 -730 -5075 -750 3344 -459 -5525 -4737 1102 5959 4290 -2382 -4472 158 2237 -911
2674i11k281J683K326J903k572m708K173Q378Q07q330m258L728M588q44m594j409
$$ -911 -3192 -1509 817 2720 148 -4560 -2387 5991 6798 -1532 -5790 -2062 2526 1682 -2912 -4321
2690d321M689N470l001o626R11N681P68l930l634K55M039K938l770m604K972P231
$$ -4321 368 5838 2837 -3789 -2878 2803 3571 -359 -3993 -3738 301 3239 -531 -5135 -2163 5068
2706E068r49n656k379K973K640j508n440m74P569M316o211o065L289N394J483
$$ 5068 4119 -1537 -3916 -943 1697 189 -5251 -5725 1844 6160 -51 -6116 -2827 2567 4050
2721D050l501m314n48M828J103n173j619O529N301k843o276l142L736O109k29
$$ 4050 549 -3765 -4313 515 1618 -3555 -5174 1355 6656 3813 -2463 -5605 -1869 4240 4011
2736D011o599k044N247J904l998j127M044M544K45o177n820K142P488P38n712
$$ 4011 -2588 -4632 615 2519 -1479 -2606 1438 5982 6227 50 -5770 -3628 3860 4598 -1114
2751a114m24K922J776j807k699K99N624L812o375q429J002P408L220k564l579
$$ -1114 -1538 1384 3160 1353 -1346 -1047 4577 8389 2014 -6415 -5413 1995 5215 2651 -928
2766i28J43L574J612n008l462N447N090l869o741j258M439M830N27m564j958M154
$$ -928 -785 2789 4401 -607 -4069 1378 6468 2599 -4142 -5400 -961 3869 4396 -168 -2126 2028
2782B028J584m507l254K661L849q1l552l639K855O085Q60o720k154M786K925l356
$$ 2028 3612 -895 -4149 -1488 2361 2280 -1272 -4911 -2056 4029 4889 -1831 -3985 801 3726 370
2798C70m520l73M339M190k274n701J476O303P40n642l057J716M023J472l834m372
$$ 370 -4150 -4523 -184 4006 1732 -3969 -2493 3810 4550 -1092 -4149 -2433 1590 3062 -772 -5144
2814e144K496O404q06m390M90L278Q39l153m395l03N948M038l966n355K218M491
$$ -5144 -2648 3756 2950 -1440 -950 2328 3167 14 -4381 -4684 1264 5302 1336 -4019 -1801 2690
2830B690L0k296j047J453K833j618o491j904O675O567k301n233j437K498L160
$$ 2690 2720 424 -623 830 3663 2045 -4446 -6350 325 6892 4591 -642 -2079 419 3579
2845C579q38m206L66N092J52o136k923M951N622J182l330m788J15M068n2m046
$$ 3579 2741 -1465 -1099 3993 4145 -1991 -4914 37 5659 6841 3511 -1277 -1162 2906 2854 -1192
2861a192L52M759J158m237l138J028N150M307l712o322J96M370j28l134k99K867
$$ -1192 -840 3919 5077 840 -2298 -1270 3880 8187 4475 -1847 -1651 2719 2591 -543 -842 2025
2877B025K951k27n418k865N181N324k624o232j081L173J724o08k996M13M739J975
$$ 2025 4976 4749 -669 -3534 1647 6971 4347 -1885 -2966 207 1931 1323 -1673 -1260 3479 5454
2893E454m886m698K787M236j057l321j917J131L896R81m621j693N245K601l710
$$ 5454 568 -4130 -1343 2893 1836 -1485 -3402 -2271 1625 2606 -2015 -3708 1537 4138 428
2908D28l976l32L140K476k125m669J726O113J400n435k925K648K901K86k829l293
$$ 428 -3548 -3880 -740 1736 -389 -5058 -3332 2781 4181 -1254 -4179 -1531 1370 1656 -1173 -4466
2924d466J745M567q64m501J71N770J860k588m764j505L813L846k651m741K366
$$ -4466 -2721 1846 982 -3519 -3348 2422 4282 1694 -3070 -4575 -762 3084 433 -4308 -1942
2939a942M687j044l636p70L126L412k65n808m008M137M692j493k846L24K587J152
$$ -1942 2745 1701 -1935 -2705 421 3833 3568 -2240 -6248 -2111 2581 1088 -1758 -1434 1153 2305
2955B305j993l920M46N677J996o332m938K775N051Q31j856j728J286K535j642
$$ 2305 312 -3608 -3162 2515 4511 -1821 -6759 -3984 1067 1898 42 -1686 -400 2135 493
2970D93n167Q9N476K515m021l529k1K935L782n54m203K57L804m90n049j899M026
$$ 493 -4674 -4585 891 3406 -615 -4144 -4165 -1230 2552 1998 -2205 -1948 1856 1366 -3683 -5582 -1556
2987a556L835N35m247l471L375N780k284m656M81L225O9k881j997P99M488K720
$$ -1556 2279 2814 -1433 -4904 -1529 4251 1967 -2689 -2208 1017 1086 -1795 -3792 -2993 1495 4215
3003D215l103m605J792M030m17k943k277J163L642N02m741j873N730M070m272
$$ 4215 1112 -3493 -1701 2329 1912 -1031 -3308 -2145 1497 1999 -2742 -4615 1115 5185 913
3018I13m183R83L213Q51k540l523Q40M767J526m300k152L082K551m73k424k722
$$ 913 -3270 -2287 926 1777 -763 -4286 -3446 1321 2847 -1453 -3605 -523 2028 1555 -869 -3591
3034c591R57M306mn619o77N406K956k833l113K56K751J223l322k883K913M378
$$ -3591 -2634 1672 1668 -3951 -4628 778 3734 901 -2212 -1956 795 2018 -1304 -4187 -1274 3104
3050C104j412m411J89K573K394Q10k763l341J302L996j867m226J554M914J698
$$ 3104 1692 -2719 -2530 43 2437 3247 484 -2857 -1555 2441 574 -3652 -2098 2816 4514
3065D514l397l894M63N235K671m789m160K551K912j961j648J061K309K264r14
$$ 4514 1117 -2777 -2314 2921 5592 803 -3357 -806 2106 145 -1503 -442 1867 4131 3217
3080C217m140k517M215L298k044l628j56J825K199j417k804K269N099o73o786
$$ 3217 -923 -3440 775 4073 2029 -1599 -1755 70 2269 852 -1952 317 5416 4743 -2043
3095b043k403M506L298j208k600j475K310K696j294k751Q44L612K69l532k975
$$ -2043 -4446 60 3358 2150 -450 -1925 385 3081 1787 -964 -120 3492 3761 229 -2746
3110b746k84L749M271k442m571J363M395q60l724m58K748J787j399m099j040M639
$$ -2746 -3030 719 4990 2548 -2023 -660 3735 2875 -849 -1307 1441 3228 1829 -2270 -3310 1329
3126A329L233k550l351J417K328m43j408j929k85L580J480m066l250L671M076
$$ 1329 4562 2012 -1339 78 2406 1963 555 -1374 -1659 1921 3401 -665 -3915 -244 3832
3141C832r85l355j732J828L249j059n216n51M939J793k974j852J875J966M89k055
$$ 3832 2847 -508 -2240 -412 2837 1778 -3438 -3989 950 2743 -231 -2083 -208 1758 2247 192
3157A92l589O76M126M43l966j108K201J864P72j755j877J969K897l097m493J184
$$ 192 -3397 -2721 1405 1848 -2118 -3226 -1025 839 1611 -144 -2021 -52 2845 -252 -4745 -3561
3173c561N427R99l040k740L88L632J842k911k359K319K310k401l371M60K615L061
$$ -3561 1866 2865 -175 -2915 -2527 1105 2947 36 -2323 -4 2306 -95 -3466 -3006 -391 2670
3189B670N41l538l256K747L828j639k803L2K283q5k431k348K566N832J97n572
$$ 2670 3211 -327 -3583 -836 2992 1353 -1450 -1418 865 780 -1651 -3999 -1433 4399 4596 -976
3205i76k522L204J438j239j006J41O10J420p40l187n3M909K581l415l356j311
$$ -976 -3498 -294 1144 -95 -1101 -960 -350 1070 330 -2857 -2910 1999 4580 1165 -2191 -3502
3221c502K923K757k026l690J947M971j501m634j53M206J354j456k649j861J571
$$ -3502 -579 2178 152 -3538 -1591 3380 1879 -2755 -2908 1298 2652 1196 -1453 -3314 -1743
3236a743K915p39j690N04K219N55j234k807o84L352K812l932m221L685M553j829
$$ -1743 1172 433 -1257 -753 1466 2021 787 -2020 -2704 648 3460 -472 -4693 -1008 3545 1716
3252A716l754L75L113J262j417l926r7L175J507l062j446J889J679J210j049l743
$$ 1716 -2038 -1663 1450 2712 1295 -2631 -2728 447 1954 -1108 -2554 -665 1014 2224 1175 -2568
3268b568n59M566K057m513k982K957K838j360k322P7L349K328l120n028R64M102
$$ -2568 -3127 1439 3496 -1017 -3999 -1042 1796 436 -1886 -1809 1540 3868 748 -4280 -3316 786
3284G86L85j892k32j66J340J030j120k518J744M425j281m893k119L270L221P76
$$ 786 1171 -721 -953 -1119 221 1251 131 -2387 -643 3782 2501 -2392 -4511 -1241 1980 2756
3300B756l521j309L356K220l552k987K791L626j079l342j773N75L156K793k583
$$ 2756 -765 -2074 1282 3502 -50 -3037 -246 3380 2301 -1041 -2814 -2239 917 3710 1127
3315A127k220K337J691k090k384j11K097K486q17m774n66N295K621l330k660K035
$$ 1127 -1093 1244 2935 845 -1539 -1650 447 2933 2116 -2658 -3224 2071 4692 1362 -1298 737
3331G37J426n49k566j600K011M336p54m344o24L010K075n79k108j813J599K667
$$ 737 2163 1614 -952 -2552 -541 3795 3041 -1303 -1927 1083 3158 2579 471 -1342 257 2924
3347B924j806l546J135M571L71k670k036J092K779Q09l598k856K946L592j679
$$ 2924 1118 -2428 -1293 3278 3649 979 -1057 35 2814 3623 25 -2831 115 3707 2028
3362B028l585J186K382R78j227j918j354L165J892l518l101J950L303Q05j665
$$ 2028 -1557 -371 2011 2989 1762 -156 -1510 1655 3547 29 -3072 -1122 2181 2986 1321
3377A321k662K99L198Q02m510j443L614K146l201k796K35L544K115j368l351l80
$$ 1321 -1341 -1042 2156 2958 -1552 -2995 619 2765 -436 -3232 -2997 547 2662 1294 -2057 -2437
3393b437K880j14k426q38J691J427q7k280k408K013N076o44m608j957K811J761
$$ -2437 443 329 -2097 -2935 -1244 183 96 -2184 -4592 -2579 2497 1853 -2755 -4712 -1901 -140
3409a40j377j710J19L024J349l099k976K531L346n96k426r97l10J634J308j025
$$ -140 -1517 -3227 -3108 -84 1265 -1834 -4810 -2279 1067 471 -1955 -2952 -3262 -1628 -320 -1345
3425a345j843K524K739j766l220RK564K162j622l399l91M172J464l304j060K604
$$ -1345 -3188 -664 2075 309 -2911 -2902 -338 1824 202 -3197 -3588 584 2048 -1256 -2316 288
3441B88K017j655j741r37M74K890J25l036r12K611K273j066j934j059J914K156
$$ 288 2305 650 -1091 -2028 -1554 1336 1461 -1575 -2487 124 2397 1331 -603 -1662 252 2408
3457B408j611l798R17M186m9l363m34K328J506k20j961j869J372K589j120k526
$$ 2408 797 -3001 -2084 2102 2053 -1310 -1744 584 2090 1870 -91 -1960 -588 2001 881 -1645
3473a645N73J641P65m72j552n54K634K360k950l989J570L454J79k568m83J270
$$ -1645 -1072 569 1334 862 -690 -1244 1390 3750 800 -3189 -1619 1835 2014 -554 -1037 233
3489B33J966R8k830j299K911J750k136k351M95J011J893K0k041p83K622P89l168
$$ 233 2199 2297 -533 -1832 1079 2829 693 -1658 -1163 -152 1741 1761 -280 -1063 1559 2348 -820
3506h20j297J976K294q57k016j312J304K802J79l400oK648o2j634j441n9J758
$$ -820 -2117 -141 2153 1296 -720 -2032 -728 2074 2253 -1147 -1153 1495 1433 -201 -1642 -1701 57
3523E7J697j284k750R27L311J82k770j031J037J543M81k328j657J967K838j156
$$ 57 1754 470 -2280 -1353 1958 2140 -630 -1661 -624 919 1400 -928 -2585 -618 2220 1064
3539A064k589O47J873P43j074j948l02K120J867k733j605K320K092p41k013l24
$$ 1064 -1525 -878 995 1738 664 -1284 -1586 534 2401 -332 -1937 383 2475 1734 -279 -603
3555f03O17J935j58l347j308L369K150j357k100J64J275J411p29k607Q4L149j27
$$ -603 14 1949 1791 -1556 -2864 505 2655 1298 -802 -638 637 2048 1319 -1288 -1204 1945 1818
3572A818k714j467K486J962j40j463j532M52K502n05k930j93K417N97j297j212
$$ 1818 -896 -2363 123 2085 1945 482 -1050 -598 1904 1399 -1531 -1724 693 1290 -7 -1219
3588a219l33J882K226j883l041J256K928n45l170l76J726J897J87k093j494K490
$$ -1219 -1552 330 2556 673 -2368 -1112 1816 1271 -1899 -2275 -549 1348 1535 -558 -2052 438
3604D38J940j681k495K82K095O73p58j921n48K902J896k342j971J469J916p91
$$ 438 2378 697 -1798 -1516 579 1252 494 -1427 -1975 927 2823 481 -1490 -21 1895 1104
3620A104k269o32J567K340j36k956n26K930J127j851j338M31R59P75j039k579
$$ 1104 -1165 -1797 -230 2110 1974 -982 -1508 1422 2549 698 -640 -209 750 1525 486 -2093
3636b093R48L599O24k817j925J688J678m4j684j582J336J977p51k921R60K895
$$ -2093 -1145 2454 3078 261 -1664 24 1702 1658 -26 -1608 -272 1705 954 -1967 -1007 1888
3652A888N60j693j630p74J668J688j476k271J572K088p77k022P4J362J566m2k680
$$ 1888 2448 755 -875 -1649 19 1707 231 -2040 -468 1620 843 -1179 -1105 257 1823 1781 -899
3669h99j784K560K078j701j795R34J545M06o09j936m4K848Q96l356j625K099J839
$$ -899 -2683 -123 1955 254 -1541 -607 938 1344 735 -1201 -1245 1603 2499 -857 -2482 -383 1456
3686A456k94j557q19J423J636k20k943k51K463N91j822q87M59J718J070j401k742
$$ 1456 1162 -395 -1214 209 1845 1625 -1318 -1569 894 1485 -337 -1224 -765 953 2023 622 -2120
3703b120R93L225l61k739j007J571J059l54j337m94K119J824j914l269Q96K210
$$ -2120 -1127 2098 1737 -1002 -2009 -438 621 267 -1070 -1564 555 2379 465 -2804 -1908 302
3719C02O75j009j113p64J293J749j522j705J978K060j760k120j230J564K214P49
$$ 302 977 -32 -1145 -1909 -616 1133 -389 -2094 -116 1944 184 -1936 -3166 -1602 612 1361
3735A361k801j057K446J416k195j172K116P14nj660k276M93L260J047k159j354
$$ 1361 -1440 -2497 -51 1365 -830 -2002 114 828 823 -837 -3113 -2620 640 1687 -472 -1826
3751a826J514R14m39j243q86J354K314j524l139J60L385J312j856j149L77O98
$$ -1826 -312 602 163 -1080 -1966 -612 1702 178 -2961 -2801 584 1896 40 -1109 -732 -34
3767c4P07j459j399J442K229q82k473O02J076J201K18j545j556J464K227j579
$$ -34 673 -786 -2185 -743 1486 604 -1869 -1267 -191 1010 1228 -317 -1873 -409 1818 239
3783B39k832J397K458M00j492j322M49K281N40k962j427K294J931j165j525j46
$$ 239 -2593 -1196 1262 1662 170 -1152 -703 1578 2118 -844 -2271 23 1954 789 -736 -882
3799h82N69J667M89k255o28J667Q25j979j323J022J853Q38j283k181K94L308L5
$$ -882 -313 1354 1843 -412 -1040 627 1452 -527 -1850 -828 1025 1863 580 -1601 -1307 2001 2036
3816B036k381n59K134J3j376j360pK324J481r39k379j53J679L21m31q06k98J416
$$ 2036 -345 -904 1230 1243 -133 -1493 -1500 824 2305 1366 -1013 -1166 513 834 403 -403 -701 715
3834G15Q53j977k151K710L239j021k938m93J063P72j7q22m75J408R42j954j333
$$ 715 1568 -409 -2560 150 3389 2368 -570 -1063 0 772 755 -67 -542 866 1808 -146 -1479
3851a479J471J722M24o23k246r01K258J318j849j172K011J848j738k044J0J735
$$ -1479 -8 1714 2138 1515 -731 -1632 626 1944 95 -1077 934 2782 1044 -1000 -990 745
3867G45K054r90l231PK596L47j628j93R13P37M5o95k042J50K630Kk397o31J620
$$ 745 2799 1809 -1422 -1415 1181 1528 -100 -293 620 1357 1402 707 -1335 -1185 1445 1447 -950 -1581 39
3886C9J313m45j534q55K000J637j961k304R34K063l37j374m13P87J242O29j986
$$ 39 1352 907 -627 -1482 518 2155 194 -2110 -1176 887 550 -824 -1237 -450 792 1421 -565
3903e65j766J702J921j063j503n62R20J654l57j938j61K415J421k932j935J276
$$ -565 -2331 -629 1292 229 -1274 -1836 -916 738 381 -1557 -1718 697 2118 -814 -2749 -1473
3919a473J416N92p65p42j64J748k72k120k2K636L66j424j263j019Q78K406J03
$$ -1473 -57 535 -230 -972 -1136 612 340 -1780 -1802 834 1200 -224 -1487 -2506 -1628 778 881
3936H81k425r8J787M01k370j74J458J475k76j869k499J894K974p24j793K35R20
$$ 881 -1544 -1642 145 546 -1824 -1998 -540 935 659 -1210 -3709 -1815 1159 435 -1358 -1123 -203
3953b03j80n70p11l0J636J377j918j808O42K188Q4j37j082l44J533L32k084r32
$$ -203 -383 -953 -1664 -1694 -58 1319 -599 -2407 -1765 423 507 370 -712 -1056 477 809 -1275 -2207
3971b207K670J717j719j837L91J354J307p43j547K67J354J8j540l13J350R03K97
$$ -2207 463 2180 461 -1376 -985 369 1676 933 -614 -347 1007 1025 -515 -828 522 1425 1722
3988A722l63j964K85K267J76k471p76K300Q95j084j409M59J276J347j530k150
$$ 1722 1359 -605 -320 1947 2123 -348 -1124 1176 2071 987 -422 37 1313 2660 1130 -1020
4004a020J332J643q41j574J82N89Q05Q34q55j966Q75K138n76j840l02J121J221
$$ -1020 312 1955 1114 -460 -278 311 1116 1950 1095 -871 4 2142 1566 -274 -576 545 1766
4021A766j030j876k65K751J474k391k060K000R40j277l81J51L04O88K26j772p01
$$ 1766 736 -1140 -1405 1346 2820 429 -1631 369 1309 32 -349 -198 106 794 1020 -752 -1453
4038a453K032J270o16j420r09M96J276k36j614P83K602o54k802j61J702J223m11
$$ -1453 579 1849 1233 -187 -1096 -600 676 440 -1174 -391 2211 1557 -1245 -1406 296 1519 1108
4055A108j304r85L68J287j79q76K10J548m19o38j166r23J394K650j149k865M18
$$ 1108 -196 -1181 -813 474 295 -581 -371 1177 758 120 -1046 -1969 -575 2075 926 -1939 -1521
4072a521K179k84j979R74J131M24q52j780q11J917J489j201j043K68L80K07P95
$$ -1521 658 374 -1605 -631 500 924 72 -1708 -2519 -602 887 -314 -1357 -1089 -709 -502 293
4089B93p75r35J280P65j760j389J174J948L15j398r63P58J761l36j882K35J723
$$ 293 -482 -1417 -137 628 -1132 -2521 -1347 601 916 -482 -1445 -687 1074 738 -1144 -909 814
4106H14J47j388P4J12J53J212Q9j397j53J498J46j082m68N53P85O39r31r48J103
$$ 814 961 -427 -353 -241 -88 1124 1213 -184 -337 1161 1307 225 -243 310 1095 1734 803 -145 958
4125I58J851j097j706J81J737J34r68o75k69J130J241p58j301R13O68n14q36k29
$$ 958 2809 1712 6 187 1924 2058 1090 415 146 1276 2517 1759 458 1371 2039 1525 689 460
4143D60L6J415O09j781j879K237J459p01j304j78P27M5o47j086Q8J942L78k036
$$ 460 496 1911 2520 739 -1140 1097 2556 1855 551 373 1100 1145 498 -588 -500 1442 1820 -216
4161b16r61J453P19n96J30r41k96J280j69j995r6K419R78j319j008j147P85J935
$$ -216 -1177 276 995 399 529 -412 -708 572 403 -1592 -1688 731 1709 390 -618 -1765 -980 955
4179I55m84k458P82J621o36j987K39J964N24k48j536j089J033J378m71j221M77
$$ 955 471 -1987 -1205 416 -220 -2207 -1968 -4 520 272 -1264 -2353 -1320 58 -413 -1634 -1157
4196a157N59J3k06r12l12J609J664k130k275J237K227r29j302J91J132Q91m48
$$ -1157 -598 -585 -791 -1703 -2015 -406 1258 -872 -3147 -1910 317 -612 -1914 -1723 -591 300 -148
4213a48j834k69K140Q45j462r59K67J47J159O7j098k71J987P59k336r81J425J092
$$ -148 -1982 -2251 -111 734 -728 -1687 -1420 -1273 -114 -47 -1145 -1416 571 1330 -1006 -1987 -562 530
4231E30k48j165n29J150J469r42j915Q96J894l97r62n02p3O64J058m58j453Q13
$$ 530 282 -883 -1412 -262 1207 265 -1650 -754 1140 743 -219 -721 -794 -130 928 470 -983 -170
4249a70J724k51j880l03R26J438j9j921r00J672J451j794j093J373J386p03o71
$$ -170 1554 1303 -577 -880 46 1484 1465 -456 -1356 316 1767 -27 -1120 253 1639 936 265
4266B65j070j30J321J319j257j198O14J025n65p61j33Q11J402n91k786k71K702
$$ 265 -805 -935 386 1705 448 -750 -136 889 324 -437 -570 241 1643 1052 -1734 -2005 697
4283F97M65j274m78N00K18J3m89m04N27J526p84j921k85J411J149j1p31j269O14
$$ 697 1162 -112 -590 -90 128 141 -348 -752 -225 1301 517 -1404 -1689 -278 871 860 129 -1140 -526
4302e26J348p27j771Q44J844k05j590n59L37J467P82j403j480J260R59o21j225
$$ -526 822 95 -1676 -832 1012 807 -783 -1342 -1005 462 1244 -159 -1639 -379 580 -41 -1266
4319a266M94R43L90k94j113p01J760J478j569j318N28J344k20n08o57J1J262O04
$$ -1266 -772 171 561 267 -846 -1547 213 1691 122 -1196 -668 676 456 -52 -709 -698 564 1168
4337A168j546n80J642N00q92p63m00J046Q68K8j552m22K169n3j288l12O89M58
$$ 1168 -378 -958 684 1184 292 -471 -871 175 1043 1071 -481 -903 1266 1213 -75 -387 302 760
4355G60M37p59j144N12J814k4j845JP80K91j27n99m20R73P63j360j040J087J133
$$ 760 1197 438 -706 -194 1620 1596 -249 -248 532 823 696 97 -323 650 1413 53 -987 100 1233
4374A233N4n62o02l16L55R41p93p22Q91P46j243p78M72Q70O10m05j361p49J217
$$ 1233 1287 725 123 -193 162 1103 310 -412 479 1225 -18 -796 -324 546 1156 751 -610 -1359 -142
4393a42J146j242n89Q98L83k93l43k86J48J471j06j833o11R33O29j89k02j76L3
$$ -142 1004 -238 -827 71 454 161 -182 -468 -320 1151 1045 -788 -1399 -466 163 -26 -228 -404 -371
4412c71Q04n47j682N46J476J62r92m46J37N19M28q4j150N94J018p36j260K41J118
$$ -371 433 -114 -1796 -1250 226 388 -604 -1050 -913 -394 34 -50 -1200 -606 412 -324 -1584 -1343 -225
4431b25J49j06p10r89R49J416j047j154Q39Q01n21k35k14l85J008R61j165r96
$$ -225 -76 -182 -892 -1881 -932 484 -563 -1717 -878 -77 -598 -833 -1047 -1432 -424 537 -628 -1624
4449a624J311N37n37n91Q6l33J102J25j300m11J657P35j190n30Q52P00l28k5j295
$$ -1624 -313 224 -313 -904 -818 -1151 -49 76 -1224 -1635 22 757 -433 -963 -111 589 261 236 -1059
4468a059K7K211l16j415j14R85K84K9n93o56J169J182q12j825O54J405N61q07
$$ -1059 -1032 1179 863 -552 -666 319 603 632 39 -617 552 1734 922 -903 -249 1156 1717 910
4486I10l02j82M43M75n86j115J112J393j177j220L74P08O92L70j348o31Q25J095
$$ 910 608 426 869 1344 758 -357 755 2148 971 -249 125 833 1525 1895 547 -84 741 1836
4504A836j221j298J188J120j31p54q52M1J146L54j249o13J145Q52j080n83K41
$$ 1836 615 -683 505 1625 1494 740 -112 -71 1075 1429 180 -433 712 1564 484 -99 142
4521A42M02P74j67j601l98J740K89j122m65M85O29P5o90p05N90J451l85k038N45
$$ 142 544 1318 1151 -450 -848 892 1181 59 -406 79 708 783 93 -612 -22 1429 1044 -994 -449
4540d49J046M3l27p91rN34J471j407j089O85J255k80q32q21K35P35R07j501j049
$$ -449 597 640 313 -478 -487 47 1518 111 -978 -293 962 682 -150 -971 -736 -1 906 -595 -1644
4559a644J470J166j000j100J53P79L12kj000l51R66O70j315n20R51N98nm99o35
$$ -1644 -174 992 -8 -1108 -955 -176 136 134 -866 -1217 -251 419 -896 -1416 -465 133 128 -371 -1006
4578a006J1J061K70j704k13J548O23j007q09J35R49R44q63j089J97J320j19j009
$$ -1006 -995 66 336 -1368 -1581 -33 590 -417 -1226 -1091 -142 802 -61 -1150 -953 367 248 -761
4596g61K1R48qL80m21j174O07J893q75j033J10R64K09l09m15m35J210P34j207
$$ -761 -740 208 200 580 159 -1015 -408 1485 610 -423 -313 651 860 551 136 -299 911 1645 438
4615D38q59J124O81l79o48K5L28L72P6l27q28Q96N75p86m06J01L80N34j82r66
$$ 438 -421 703 1384 1005 357 382 710 1082 1158 831 3 899 1474 688 282 383 763 1297 1115 149
4635A49j50J202O20j545n65J077p1j14l97J6j58J022o55n31j29Q60K80n25k76
$$ 149 -1 1201 1821 276 -289 788 717 603 206 222 64 1086 431 -100 -229 631 911 386 110
4654A10m56L60R19j87j410J50J337J44j382j23P43L72k71r28p6Q90N48j062l55
$$ 110 -346 14 933 746 -664 -514 823 967 -415 -538 205 577 306 -622 -698 192 740 -322 -677
4673f77N05J74k13J02k11p05O43P75n28j063P22Q44n12l55j31K39N54j6j225j27
$$ -677 -172 2 -211 -109 -320 -1025 -382 393 -135 -1198 -476 368 -144 -499 -630 -391 163 147 -1078 -1205
4693a205J258N0q74n88Q20n4M29k26n68o55J247K24p52l98Q88J4J29l22p95L82
$$ -1205 53 103 -771 -1359 -539 -593 -164 -390 -958 -1613 -366 -142 -894 -1292 -404 -390 -261 -583 -1378 -996
4713i96J305n69j365K64J305l59m45p7n4M07P47o16m60J31P79j2m86m1k28P01
$$ -996 309 -260 -1625 -1361 -56 -415 -860 -937 -991 -584 163 -453 -913 -782 -3 -15 -501 -542 -770 -69
4733f9O52q38j205J205J317p68j259P70P05k80Rn28k76J327M56r67o85J024J28
$$ -69 583 -255 -1460 -255 1062 294 -965 -195 510 230 239 -289 -565 762 1218 251 -434 590 718
4752G18m06l0k73r2O30N15j338j75R21M54n29n47k78M03J274n59j468K91J272
$$ 718 312 282 9 -83 547 1062 -276 -451 470 924 395 -152 -430 -27 1247 688 -780 -489 783
4771G83K42j397L5M88K54n47j6m80M05Q84qj025k93M38P44j45l22r09N02J251
$$ 783 1025 -372 -337 151 405 -142 -158 -638 -233 651 643 -382 -675 -237 507 362 40 -869 -367 884
4791H84j156j092O23J748n34j109m6O77L31k11o57k85Q04M17p74j60N17P2M86
$$ 884 -272 -1364 -741 1007 473 -636 -682 -5 326 115 -542 -827 -23 394 -380 -540 -23 49 535
4810E35L68j456n44J192Q91j055p53R80N72o08o79l03O28J423n57j698J36J795
$$ 535 903 -553 -1097 95 986 -69 -822 158 730 122 -557 -860 -232 1191 634 -1064 -928 867
4828H67m32j029M46O1k18L37N82q49n72J256M07j150o86P48P06p2r26m10J140
$$ 867 435 -594 -148 -87 -305 32 614 -235 -807 449 856 -294 -980 -232 474 402 -524 -934 206
4847B06J081j189j202J032O76k91q24J30Q0K12P96o82q47Q73J03K23n46l16K08
$$ 206 1287 98 -1104 -72 604 313 -511 -381 -301 -89 707 25 -822 51 154 377 -169 -485 -277
4866b77O87l4j134kJ558L15j333q73Q73J025m04m05k79O6N43Q2q46L05O36K14
$$ -277 410 376 -758 -760 798 1113 -220 -1093 -220 805 401 -4 -283 -217 326 408 -438 -133 503 717
4886G17n72m85m2k5J112K73j788K78J578q9j224k76P08P18k43n05o89P23O59m52
$$ 717 145 -340 -382 -407 705 978 -810 -532 1046 957 -267 -543 165 883 640 135 -554 169 828 376
4906C76o02N22N90m49l74j53j66N17O35o64q40J95J102j98o0n45K03P01J1q77
$$ 376 -226 296 886 437 63 -90 -256 261 896 232 -608 -413 689 491 431 -114 89 790 801 -76
4926g6n01J131K42q92l06O04J09K91k37p43k40Q72K47j101M14K08j24K21K05p99
$$ -76 -577 554 796 -96 -402 202 311 602 365 -378 -618 254 501 -600 -186 22 -102 119 324 -475
4946d75J76P82o7r90K40N78qj17l71j09L95N13m18r17P72N77p47l91P05m74J01
$$ -475 -299 483 416 -574 -334 244 236 119 -252 -361 34 547 129 -788 -16 561 -186 -577 128 -346 -245
4967b45P64o0q59K12N66j39l15n5L15K73Pj046N4J171L76r26m59M58K79l40J98
$$ -245 519 459 -400 -188 378 239 -76 -131 184 457 464 -582 -528 643 1019 93 -366 92 371 31 229
4988B29j55k19L55rJ36m91O34k42p7k48j01J08L99L72r40k40R91L00r35j93K41
$$ 229 74 -145 210 201 337 -154 480 238 161 -87 -188 -80 319 691 -249 -489 502 802 -133 -326 -85
5009h5M31j58M61m20k88L60K85q34K50L53j80K44Qo80L36Q05K08j700L06Q53P4
$$ -85 346 188 649 229 -59 301 586 -248 2 355 175 419 427 -253 83 888 1096 -604 -298 555 629
5030F29k60n47J67L08L37n72l71L43M64m17j78M24m19j03P56n65q04R64O60p27
$$ 629 369 -178 -11 297 634 62 -309 34 498 81 -97 327 -92 -195 561 -4 -808 156 816 89
5050H9q92Q45K13N9j01o03k10P50%n62k56Q33J18n48q9Ml94O85L84o43o69P33
$$ 89 -803 42 255 314 213 -390 -600 150 150 -412 -668 165 283 -265 -354 -350 -744 -59 325 -318 -987 -254
5072b54N04l20m67L1R6R42p55p44mJ132O0j347Q18K08r4Rl50l64Q24P97n15j185
$$ -254 250 -70 -537 -506 -410 532 -223 -967 -971 161 221 -1126 -308 -100 -194 -185 -535 -899 -75 722 207 -978
5094i78M01N91L00k01n14k17P84N74j199n52R91R05o98p21L82K31K98J42o96n54
$$ -978 -577 14 314 113 -401 -618 166 740 -459 -1011 -20 885 187 -534 -152 79 377 519 -177 -731
5114g31R15O58q02m58M40L74K02l77o05J88J155k20j050q4J106j17k98o51j31
$$ -731 184 842 40 -418 22 396 598 221 -384 -196 959 739 -311 -395 711 594 296 -355 -486
5133d86O18J047n65j135L0J135o4o86l46L87L71N31n38q79O51Q41n75j232N97
$$ -486 132 1179 614 -521 -491 644 580 -106 -452 -65 306 837 299 -580 71 912 337 -895 -298
5152b98P32M4k80l28m92R10R69j014r76N14N98n7m71l0k20J089j40j218J84Q80
$$ -298 434 478 198 -130 -622 288 1257 243 -733 -219 379 322 -149 -179 -399 690 550 -668 -484 396
5172C96M57q80m60L42L90J04m1j154OJ123J13n61l44M27K87k10l87l01K56Q47
$$ 396 853 -27 -487 -145 245 349 308 -846 -840 283 396 -165 -509 -82 205 -5 -392 -693 -437 410
5192D10m28q92K83J063l54q56K58j01J69M21k98q84K78R23j68k96q6p9L92r0m10
$$ 410 -18 -910 -627 436 82 -774 -516 -617 -448 -27 -325 -1209 -931 -8 -176 -472 -558 -637 -245 -335 -745
5213g45OO52K71j061k26P18K92k51l14k05K63P20J0o33l40P95J81k75j79j34K00
$$ -745 -739 -87 184 -877 -1103 -385 -93 -344 -658 -863 -600 120 130 -503 -843 -48 133 -142 -321 -455 -255
5234b55M13j8q05l8J115j6q54Q8M56L43L6K5r91L45N63j92j10O4lM7J36l07J71
$$ -255 158 140 -665 -703 412 396 -458 -370 86 429 465 490 -501 -156 407 215 105 169 166 213 349 42 213
5257B13Q3M65q17j57K90L87k59l01k74K78L61L67n03k51L19J68j40J83K04l11
$$ 213 296 761 -56 -213 77 464 205 -96 -370 -92 269 636 133 -118 201 369 229 412 616 305
5277C05j28J70k38l37Q46J38o24k29M71J95j28j24r6j34J31K71k84K7ONN8L86
$$ 305 177 347 109 -228 618 756 132 -97 374 569 441 317 221 87 218 489 205 232 238 243 301 687
5299F87n84m47M66K50n03K05M34j63n51M1K01k80N96K07j080o6O09j04j17N8Q6
$$ 687 103 -344 122 372 -131 74 508 345 -206 -165 36 -244 352 559 -521 -587 22 -82 -199 -141 -55
5320e5n09Q45o50j96L25N92l06p34L73Q6n7K35k08k49M3P37q66o5L16J43l42M97
$$ -55 -564 281 -369 -565 -240 352 46 -688 -315 -229 -286 -51 -259 -508 -465 272 -594 -659 -343 -200 -542 -45
5342d5j18o20M85P4l2o11Q75K5l91j09j0J68L89q2q15J32M02M88j13o05N56k76
$$ -45 -163 -783 -298 -224 -256 -867 8 33 -358 -467 -477 -309 80 -2 -817 -685 -283 205 92 -513 43 -233
5364b33N32j88n85n7P89J93q82L42K39K67j38n32J39N5P40j4j104J05O55J18n38
$$ -233 299 111 -474 -531 258 451 -431 -89 150 417 279 -253 -114 -59 681 667 -437 -332 323 441 -97
5385i7J03L56j22K73l28n38M15P63m24n78O07k90L04K9m35k85M96P15p34p07K59
$$ -97 6 362 240 513 185 -353 62 825 401 -177 430 140 444 473 38 -247 249 964 230 -477 -218
5406b18P73qj43l98j1K89Q8m89k85J301R9o15m67L89k14N42L03n82n02O38J48
$$ -218 555 547 404 6 -5 284 372 -117 -402 899 998 383 -84 305 91 633 936 354 -148 490 638
5427F38p14j83P02J09J86o14k46j7Q59k87q96O27O64k31o77j40L05K41L02l8p55
$$ 638 -76 -259 443 552 738 124 -122 -139 720 433 -463 164 828 597 -80 -220 85 326 628 590 -165
5448a65K03R7L41m81k9k31N54J70o06k79O72O25j222n60Q94J40O0j89l06o8L62
$$ -165 38 135 476 -5 -34 -265 289 459 -147 -426 246 871 -351 -911 -17 123 183 -6 -312 -380 -18
5469a8M1m68j7M97K06m28K1o9L7N03j81r52K94R85Q7p42j81L26K4K59l40l10K13
$$ -18 23 -445 -462 35 241 -187 -166 -235 -198 305 124 -828 -534 451 538 -204 -385 -59 -35 224 -116 -426 -213
5492b13N39k14o45M16N5q3Q0k5N00l02K47k79m15L50N14l13m49J33l4N54L90q53
$$ -213 326 112 -533 -117 -62 -145 -65 -90 410 108 355 76 -339 11 525 212 -237 -104 -138 416 806 -47
5514d7l15M60J97m26O3M35j41j4k00%j93O01j2l75j4L94j56l0j13j95q8R69n97
$$ -47 -362 98 295 -131 -68 367 226 212 12 12 -181 420 408 33 19 413 257 227 114 -81 -169 800 203
5537B03k46k73Q32m22r6J69M4j58j42L70l25j23Q58n54l45Q3k3j24L37M19n28
$$ 203 -43 -316 516 94 -2 167 211 53 -89 281 -44 -167 691 137 -208 -125 -148 -272 65 484 -44
5558d4J27J2m39l7K21K37k9J02p4m62L04J63n16j95N00O15n62l42O59l43j52J32
$$ -44 83 95 -344 -381 -160 77 48 150 76 -386 -82 81 -435 -630 -130 485 -77 -419 240 -103 -255 -123
5580a23J3j12Q7l9J62m53P05m57L59j2o18J68M18L36p78K4M86m94o9K62j17J01
$$ -123 -110 -222 -135 -174 -12 -465 240 -217 142 130 -488 -320 98 434 -344 -320 166 -328 -397 -135 -252 -151
5602a51NN6k17J91k65L2M15j3l49k23P55k72n09J38N61L5l40l34JR2K75K40n28
$$ -151 -146 -90 -307 -116 -381 -349 66 53 -296 -519 236 -36 -545 -407 154 189 -151 -485 -484 -392 -117 123 -405
5625d05L02J9l92N96K09o24j51N70j20n84q1J065Q6q96L97jP2j78r7o50J100L27
$$ -405 -103 -84 -476 120 329 -295 -446 124 4 -580 -661 404 490 -406 -9 -10 62 -116 -213 -863 237 564
5647E64n87r0K37k32l37Q88q2n51L60J83l16l45L20N53j43l95l55J61Q39p7o76
$$ 564 -23 -113 124 -108 -445 443 361 -190 170 353 37 -308 12 565 422 27 -328 -167 672 595 -81
5668h1l29J174l12n99K98M52n49n0J03j06k47N13L3p57N64q8Q0K26m61m30K84
$$ -81 -410 764 452 -147 151 603 54 4 107 1 -246 267 300 -457 107 19 99 325 -136 -566 -282
5689b82Q75l81n26K98N41l81k60qK1L45k62om67O82K61q79j76L15N09K5l01k52
$$ -282 593 212 -314 -16 525 144 -116 -124 -103 242 -20 -26 -493 189 450 -429 -605 -290 219 244 -57 -309
5711c09l41P32L29o15j78L63M46o91k10L34J65K83Kp00k92J021L80j155J09K23
$$ -309 -650 82 411 -204 -382 -19 427 -264 -474 -140 25 308 310 -390 -682 339 719 -436 -327 -104
5731a04J12L17m04j89j03O01j4m93K43J01J34l0j70l95J81K87k21n70Q19N13l84
$$ -104 8 325 -79 -268 -371 230 216 -277 -34 67 201 171 1 -394 -213 74 -147 -717 102 615 231
5752B31j55m45l7P16j99j96j98M63L66p31j54M20J35j89K15k59k40P61J84q76
$$ 231 76 -369 -406 310 111 -85 -283 180 546 -185 -339 81 216 27 242 -17 -257 504 688 -188
5772a88J53J88N22n06J6k43P8M57l2n88j32R37p64k04J34O16k35L95n47k31K02
$$ -188 -35 153 675 169 185 -58 20 477 445 -143 -275 662 -102 -306 -172 444 209 604 57 -174 28
5793B8P21j22n59N5k42J13J99J19m61L71K79q79j0L79L72l87k90L74j17L03J34
$$ 28 749 627 68 123 -119 -6 193 312 -149 222 501 -378 -388 -9 363 -24 -314 60 -57 246 380
5814C80p14N4K19K03j05j33q1j64J59K62k92n3N65j10p67J82O81N0m99J00k74
$$ 380 -334 -280 -61 142 37 -96 -177 -341 -182 80 -212 -265 300 190 -577 -395 286 336 -163 -63 -337
5835c37L4L26k14l12L75R9j76J17M4k63m11N75K08m92J82J33j46n93Q06M67k90
$$ -337 -303 23 -191 -503 -128 -29 -205 -88 -44 -307 -718 -143 65 -427 -245 -112 -258 -851 -45 422 132
5856A32m45K09l61M32K34k63L1K13l08m32K54O34m08K71M7k84k11N67j37m1o2
$$ 132 -313 -104 -465 -33 201 -62 -31 182 -126 -558 -304 330 -78 193 240 -44 -255 312 175 134 72
5877G2J0j22J51J58m24P5L49k34P6q5M02m33r0L85Kl2Jk61k45N58j69J1J63N0
$$ 72 82 -40 111 269 -155 -80 269 35 111 26 428 -5 -95 290 292 260 261 0 -245 313 144 155 318 368
5901C68l75j93P76k55l08K35K17l07J72L17o36l0K87J64j39jn8j24j86N70l27
$$ 368 -7 -200 576 321 13 248 465 158 330 647 11 -19 268 432 293 292 234 110 -76 494 167
5922A67K09N4k4l47j45Q6P3J4M15m15o4Q4Q6k76K26O5J3k60K16K06n44N26l5l88
$$ 167 376 430 406 59 -86 0 73 87 502 87 23 107 193 -83 143 208 221 -39 177 383 -161 365 330 -58
5946e8N0M24l07k46L8J29rL89o94l50N55M26n29j5L92k58l3r1j71L11R3J82j81
$$ -58 -8 416 109 -137 -99 30 21 410 -284 -634 -79 347 -182 -197 195 -63 -96 -187 -358 -47 46 228 47
5969D7k75L12k47J20j03j49j10O5P43o87j22O17j86m10o1M76P7J30o90P3J05O48
$$ 47 -228 84 -163 -43 -146 -295 -405 -340 403 -284 -406 211 25 -385 -446 30 107 237 -453 -380 -275 373
5991C73m86m78M46L29n2k45j07k05K38K31k6k42J12J93j84k96L85m5M4O6m36j7
$$ 373 -113 -591 -145 184 132 -113 -220 -425 -187 44 18 -224 -112 81 -103 -399 -14 -59 -15 51 -385 -402
6013d02N79K47o87j96N44k0P3J18j64k22M14Q9n74M1N39k41q7l31K89K79L36o17
$$ -402 177 424 -263 -459 85 65 138 256 92 -130 284 373 -201 -160 379 138 51 -280 9 288 624 7
6035Gk64K39M67N4p73O8K78j07J23r7K44p1M10m02l43L79J10j95K7m03j34O81
$$ 7 -257 -18 449 503 -270 -202 76 -31 92 -5 239 168 578 176 -167 212 322 127 154 -249 -383 298
6057B98L96o38l72P21L2k86j73J66k66K84K82l05m14O27j25m40j72N42J71J53
$$ 298 694 56 -316 405 437 151 -22 144 -122 162 444 139 -275 352 227 -213 -385 157 328 481
6077D81m82n00J26N84J80o90Q4L9K59j7J07m39M15J27k62k04k6N77l49j35j80
$$ 481 -1 -501 -375 209 389 -301 -217 -178 81 64 171 -268 147 274 12 -192 -218 359 10 -125 -305
6098c05K75K98l45N6n46N42J8j20j65L28J31n60K55l4M8L0P2m67M6N80k24n5P2
$$ -305 -30 268 -77 -21 -567 -25 -7 -127 -292 36 167 -393 -138 -172 -124 -94 -22 -489 -443 137 -87 -142 -70
6121g0qj91L69J7l50m14N95M9m73J31N76k32k41p6RL86j19l25R1J66L43k36j64
$$ -70 -78 -269 100 117 -233 -647 -52 -3 -476 -345 231 -1 -242 -318 -309 77 -42 -367 -276 -110 233 -3 -167
6144a67M89n94o5N33j06j61N7O11o86k55M26p4J70J9l18L9J62Q0j15j45L47O1
$$ -167 322 -272 -337 196 90 -71 -14 597 -89 -344 82 8 178 197 -121 -82 80 160 45 -100 247 308
6166C08m65N16N0m78lN39m96J27L02p0j83K5o4J89j66R3l01K81J58m67j04M12
$$ 308 -157 359 409 -69 -72 467 -29 98 400 330 147 172 108 297 131 224 -77 204 362 -105 -209 203
6188B03R5k23J48k57L27j47J32k52K03O6j50j49R9L7j27l8M71m1m57M49K1m80
$$ 203 298 75 223 -34 293 146 278 26 229 295 145 -4 95 132 5 -33 438 397 -60 389 410 -70
6210g0J7J77j96N2k2J14RL85m35m34K64K26k4n9J14L0m19L57j11p5n1o7k32M02
$$ -70 -53 124 -72 -20 -42 72 81 466 31 -403 -139 87 63 4 118 148 -271 86 -25 -100 -151 -218 -450 -48
6234d8L21n26k6L52m93K83J99J51n59L2M70l43n06O22M05l61q8j73Q0J57L85n09
$$ -48 273 -253 -279 73 -420 -137 62 213 -346 -314 156 -187 -693 -71 334 -27 -115 -288 -208 -51 334 -175
6256a75k65Q27j88m79K06K46n38J52K43rl45K28L50n47L16k12K84l35K25r3n6
$$ -175 -440 387 199 -280 -74 172 -366 -214 29 20 -325 -97 253 -294 22 -190 94 -241 -16 -109 -165
6277a65q2L90l11o9M67L6m07J10J72k67K02o7k43N17j20p4P7j14q7J43L64m51
$$ -165 -247 143 -168 -237 230 266 -141 -31 141 -126 76 9 -234 283 163 89 166 52 -35 108 472 21
6299B1m10M62M57j5p89L04K58j97k48L4L17L17l75r0k57N75L4l43l50O68p4q6
$$ 21 -389 73 530 515 -274 30 288 91 -157 -123 194 511 136 46 -211 364 398 55 -295 373 299 213
6321B13mk54j66O00J97m87l18J66j33O2J45P0j18N60j70p95M29M37r8m42j0J59
$$ 213 209 -45 -211 389 586 99 -219 -53 -186 -124 21 91 -27 533 363 -432 -3 434 336 -106 -116 43
6343D3L83O6k50l35J49K86l39l51J69K25k10K15k14q9J72M05o17O1K91J59rn25
$$ 43 426 492 242 -93 56 342 3 -348 -179 46 -164 51 -163 -252 -80 325 -292 -231 60 219 210 -315
6365c15k80L71L56q4l36j31P68o90jJ29M53l88J05J8l95K93J36J58n28n2L26N5
$$ -315 -595 -224 132 48 -288 -419 349 -341 -342 -213 240 -148 -43 -25 -420 -127 9 167 -361 -413 -87 -32
6387c2M6j23l48K47L98m84M5N24q5m87m40O01K84q7j22m81K16J02N30n84N0l00
$$ -32 14 -109 -457 -210 188 -296 -251 273 188 -299 -739 -138 146 59 -63 -544 -328 -226 304 -280 -230 -530
6409e30K66N0J55K35m75K89K09n49q1M54K59m31K14k6K28m00J15k39O0M94n41
$$ -530 -264 -214 -59 176 -299 -10 199 -350 -431 23 282 -149 65 39 267 -133 -18 -257 -197 297 -244
6430b44n6L85K2m64N36k51J85q1M33m79l33O05o0l02p8Q4j18K82J62l13J88K08
$$ -244 -300 85 107 -357 179 -72 113 32 465 -14 -347 258 198 -104 -182 -98 -216 66 228 -85 103 311
6452C11p3k61K35P5L8m94J75K55k75M15k00j14j65K05j95M89o46Q8N7N48k37m50
$$ 311 238 -23 212 287 325 -169 6 261 -14 401 201 87 -78 127 -68 421 -225 -137 -80 468 231 -219
6474b19L01J55j30n77L74Q5K45l19k0L14P0J5k74J47L3l19K9J45m5Po3Pq2l9K41
$$ -219 82 237 107 -470 -96 -11 234 -85 -105 209 279 294 20 167 200 -119 -90 55 10 17 -46 -39 -121 -160 81
6499H1Q2m67L93K1J49k10Qj61J78L42m16j16L25J5o8l50l8J62j32M78k81j56L12
$$ 81 163 -304 89 110 259 49 57 -104 74 416 0 -116 209 224 156 -194 -232 -70 -202 276 -5 -161 151
6522A51K92n41QJ34k5K97L6m12K4K9o5j32N73n0k48m86L09n2J82M18l39j77L9
$$ 151 443 -98 -90 44 19 316 352 -60 -36 -7 -72 -204 369 319 71 -415 -106 -158 24 442 103 -74 -35
6545c5M08l68k90M53Q1k14L49l97j43M3K85K52k45n9n8k39J15L66l55K98K24n92
$$ -35 373 5 -285 168 249 35 384 -13 -156 -113 172 424 179 120 62 -177 -62 304 -51 247 471 -121
6567a21n7K10K24q2k05J58l5p2O0l02L30K89l22k41Q6L42j42j86M05m36j34M11
$$ -121 -178 32 256 174 -31 127 92 20 80 -222 108 397 75 -166 -80 262 120 -66 339 -97 -231 180
6589A80j94l43K49L5R8K42k77J11l59N11j48k21K23M29p34k50N08k86k22N98l88
$$ 180 -14 -357 -108 -73 25 267 -10 101 -258 253 105 -116 107 536 -198 -448 60 -226 -448 150 -238
6610b38K5K09Q1k80p0J50J52j47r7l28L11M44j01p72M03N65l37m26j06M90K32
$$ -238 -213 -4 77 -203 -273 -123 29 -118 -215 -543 -232 212 111 -661 -258 307 -30 -456 -562 -72 160
6631A60k84m7k18m5O02j79k3j86Pj98K94R2m12M50j06j90n38M78M13j1k41P8K16
$$ 160 -124 -171 -389 -434 168 -11 -34 -220 -213 -411 -117 -25 -437 13 -93 -283 -821 -343 70 59 -182 -104 112
6654A12j39l61L26R3MJ17m71Q5J71j37K99j12j94K89L36j42m73j62N06J89l4j4
$$ 112 -27 -388 -62 31 35 152 -319 -234 -63 -200 99 -13 -207 82 418 276 -197 -359 147 336 302 288
6676B88k06m8o5M8J06J93j31k06k05M39J61j94j09l3k35K14L10j72l71N15k93
$$ 288 82 34 -31 17 123 316 185 -21 -226 213 374 180 71 38 -197 17 327 155 -216 299 6
6697FK47L7J90l40l2J75l24j8M27q5m22J66J63K6P4J78k26k59K36k12k35P0J61
$$ 6 253 290 480 140 108 283 -41 -59 368 283 -139 27 190 216 290 468 242 -17 219 7 -228 -158 3
6720CJ30l28K36n0J65J6l60J89J16M42o47j29j81M48l3K74j35l80J20K94l27K5
$$ 3 133 -195 41 -9 156 172 -188 1 117 559 -88 -217 -398 50 17 291 156 -224 -104 190 -137 -112
6742a12L97k01k26k39L25L74j52J70p67M2J97K98m85K16J59k58j34L80k67k08
$$ -112 285 84 -142 -381 -56 318 166 336 -431 -389 -192 106 -379 -163 -4 -262 -396 -16 -283 -491
6762d91L84Q3m1l27L58k74p9J44N5q6N59k49l35J46M71j16k32j77L66l03J02K4
$$ -491 -107 -24 -65 -392 -34 -308 -387 -243 -188 -274 285 36 -299 -153 318 202 -30 -207 159 -144 -42 -18
6784a8m43N76K92n21m03L59L6P7j34M35k34N79m31J40k94K59k37j59L65J1j65
$$ -18 -461 115 407 -114 -517 -158 -122 -45 -179 256 22 601 170 310 16 275 38 -121 244 255 90
6805I0P2J2p18M27P23j69m37j0J3P6K42J21m45K93Qm22j3M64Q9l38K08q9k37l6
$$ 90 162 174 -544 -117 606 437 0 -10 3 79 321 442 -3 290 298 -124 -137 327 416 78 286 197 -40 -76
6829g6L41k04K35K15k07n4l47M23J16j31k05J28j94j25M73q73O52K05l45J33m67
$$ -76 265 61 296 511 304 250 -97 326 442 311 106 234 40 -85 388 -485 167 372 27 160 -307
6850c07J6L14M09l06l56L12j08R6l15M63j27M3L9m39M76j72K24m14QK48k55j35
$$ -307 -291 23 432 126 -230 82 -26 70 -245 218 91 134 173 -266 210 38 262 -152 -144 104 -151 -286
6872b86J71J5l1N71k81l39P6J2J25o6L18j44j44O2M7k60m0K87R1l40K06j34r2
$$ -286 -115 -100 -131 440 159 -180 -104 -92 33 -33 285 141 -3 59 106 -154 -194 93 184 -156 50 -84 -176
6895a76j3K37l47O4J89J57j13l2Q1l53K60K46m09M19l84m5j87N75L0p4m37K49
$$ -176 -189 48 -299 -235 -46 111 -2 -34 47 -306 -46 200 -209 210 -174 -219 -406 169 199 125 -312 -63
6917f3l0N0J1R9m00L88k04m68L50K09K01k57J3q2O9J97j52k93K48K97j38k82N1
$$ -63 -93 -43 -32 67 -333 55 -149 -617 -267 -58 143 -114 -101 -183 -114 83 -69 -362 -114 183 45 -237 -186
6940a86K83k30L51Jm95M93r2k35k12O35j96j01K22k73m8K10j33j6J8M06J9o65
$$ -186 97 -133 218 219 -276 217 125 -110 -322 313 117 16 238 -35 -83 127 -6 -22 -4 402 421 -244
6962b44J11K53l93L24k4K64m81N15j60Q5j17n0J91n9j79r7K99j0j37m3J41l3k20
$$ -244 -133 120 -273 51 27 291 -190 325 165 250 133 83 274 215 36 -61 238 228 91 48 189 156 -64
6985f4P0Q1J97j46o3k50k19J08M76l74j06M69kj60L65l40j84M1K50k37J87P9j02
$$ -64 6 87 284 138 75 -175 -394 -286 190 -184 -290 179 177 17 382 42 -142 -101 149 -88 99 178 76
7008G6j93j4L42m30QO0k1K79j24k7p7L18L4l4k96M8J76j37o6J28m61J43L84j33
$$ 76 -117 -131 211 -219 -211 -151 -172 107 -17 -44 -121 197 231 197 -99 -51 125 -12 -78 50 -411 -268 116 -17
7032a7M7k8J7L36n26Oj67N34j94%j78J96j13k73O16m37K60Mk39L18j19o9K87l14
$$ -17 30 2 19 355 -171 -165 -332 202 8 8 -170 26 -87 -360 256 -181 79 83 -156 162 43 -26 261 -53
7056e3j59L56j24j20q4r1K79L40j12k25o3K92k40M20on05K24n6k4k66K89J16l33
$$ -53 -212 144 20 -100 -184 -275 4 344 232 7 -56 236 -4 416 410 -95 129 73 49 -217 72 188 -145
7079a45M54k65m28N72J75k48kJ28k29k60K52k3lr6J50J0J1K74l94q8JQ8Q1j44
$$ -145 309 44 -384 188 363 115 113 241 12 -248 4 -19 -22 -118 32 42 53 327 -67 -155 -154 -66 15 -129
7103a29L23l93K19n1J45o5Q3j3j86m9Q1Q0r1J61o2l34K10R7Jr2R7J61j36l88K13
$$ -129 194 -199 20 -31 114 49 132 119 -67 -116 -35 45 -46 115 53 -281 -71 26 27 -65 32 193 57 -331 -118
7128a18k00J03J0L6J10J69n0l67J34J21NL23r7m32M0K72M8j67J6j55J65k3o9l72
$$ -118 -318 -215 -205 -169 -59 110 60 -307 -173 -52 -47 276 179 -253 -213 59 107 -60 -44 -199 -34 -57 -126 -498
7152d98L69K67m23p2M08L4j67j96L12l5p3L23j85o4n0J47l75N6J39J13p0l0J31
$$ -498 -129 138 -285 -357 51 85 -82 -278 34 -1 -74 249 64 0 -50 97 -278 -222 -83 30 -40 -70 61
7175F1k77K44M9n09J01M61p5O4k83M25k10N5j25K88n1kl19J42R6J49l08J20J25
$$ 61 -216 28 77 -432 -331 130 55 119 -164 261 51 106 -19 269 218 216 -103 39 135 284 -24 96 221
7198B21m14K9N55J57o14o8J65K26j42j5k24L28j80l03M28j12J14r4l10M76k87
$$ 221 -193 -164 391 548 -66 -134 31 257 115 100 -124 204 24 -279 149 37 151 57 -253 223 -64
7219f4k6K22r5Q7J26m8m21J74K18m30K48q0l10L63J61J92l12K14R5n21L87k41
$$ -64 -90 132 37 124 250 202 -219 -45 173 -257 -9 -89 -399 -36 125 317 5 219 314 -207 180 -61
7241f1K01k06J7L19l8O0k33N4k62L61k55J46m4J58j46k9J59m59L17j49K89r7j47
$$ -61 140 -66 -49 270 232 292 59 113 -149 212 -43 103 59 217 71 42 201 -258 59 -90 199 102 -45
7264d5r7M05k71K02n09M26O9l92j19L70J59l54j32K09n1J66N3k76q9L84n3r6L2
$$ -45 -142 263 -8 194 -315 111 180 -212 -331 39 198 -156 -288 -79 -130 36 89 -187 -276 108 55 -41 -9
7287io2P7Q5j27L2l70M30P8l14J1J92K13j64K50m67K9J67l92K75j09M5L85l77
$$ -9 -71 6 91 -36 -4 -374 56 134 -180 -169 23 236 72 322 -145 -116 51 -341 -66 -175 -130 255 -122
7310a22L98l09j90J97kk48M66k60m0p7L66k46N44m44j07J06J14j06k65M6K60P4
$$ -122 276 -33 -223 -26 -28 -276 190 -70 -110 -187 179 -67 477 33 -74 32 146 40 -225 -179 81 155
7332A55j20r5N3J62p7j32J43r9KK15l49P9M82l07q2j68K02k07L23k4k13p4J65
$$ 155 35 -60 -7 155 78 -54 89 -10 -8 207 -142 -63 419 112 30 -138 64 -143 180 156 -57 -131 34
7355C4l4l40J66N1J26L04j47j86J29M36l99l71M77k45K17l45O1Q6J36n8Q1l69
$$ 34 0 -340 -174 -123 3 307 160 -26 103 539 140 -231 246 1 218 -127 -66 20 156 98 179 -190
7377a90L83k07j00L55l10K94l5K9m56L04n7J62l53P8J51j65k05L05j86J41K17
$$ -190 193 -14 -114 241 -69 225 190 219 -237 67 10 172 -181 -103 48 -117 -322 -17 -203 -62 155
7398A55On78M12p6M2J12n5j80r6O66p31k32N30K4k60L40j04k2j49PL31l59K31
$$ 155 161 -417 -5 -81 -39 73 18 -162 -258 408 -323 -555 -25 -1 -261 79 -25 -47 -196 -189 142 -217 14
7421A4L91j90m11n4R4k59L23k86N05l4J16m96l0O03l36l88J19J28K87l35K31j56
$$ 14 405 215 -196 -250 -156 -415 -92 -378 127 93 209 -287 -317 286 -50 -438 -319 -191 96 -239 -8 -164
7443a64K33m8l49M60r5k3k31M28k02J39o8K21l12n1J06P4P3j33K4j59l1M39k76
$$ -164 69 21 -328 132 37 14 -217 211 9 148 80 301 -11 -62 44 118 191 58 82 -77 -108 331 55
7466E5m54K95L76k21j11K68j03Q4M5j64k82K27K38l75K95j99o0K86k47L3k71M62
$$ 55 -399 -104 272 51 -60 208 105 189 234 70 -212 15 253 -122 173 -26 -86 200 -47 -14 -285 177
7488A77J11m12l3K17L28l82N6k54J3K40m2J07J8K9k48J37J72ok43P8J84k16K21
$$ 177 288 -124 -157 60 388 6 62 -192 -179 61 19 126 144 173 -75 62 234 228 -15 63 247 31 252
7511B52J83l05L7k19J81J14o9N8K2j96n0k5k26L39L0q4J6Q7j50J50j19j59Q5j06
$$ 252 435 130 167 -52 129 243 174 232 254 58 8 -17 -243 96 126 42 58 145 -5 145 26 -133 -48 -154
7535a54M00m55J70j41m0K69N3j05l9r1n7j36M20J01k79k03J68j79K63j76k3j0
$$ -154 246 -209 -39 -180 -220 49 102 -3 -42 -133 -190 -326 94 195 -84 -287 -119 -298 -35 -211 -234 -244
7557b44j14K70j31P3J35P2l69j05K14L08k45%l5N2N33o58k9J11K38j02j32L57
$$ -244 -358 -88 -219 -146 -11 61 -308 -413 -199 109 -136 -136 -171 -119 414 -244 -273 -162 76 -26 -158 199
7579A99m19K62o2m64K05N87J33l89K4j62k3K02k44N7J71K6j7p9J86J43l74J3N0
$$ 199 -220 42 -20 -484 -279 308 441 52 76 -86 -109 93 -151 -94 77 103 86 7 193 336 -38 -25 25
7602B5J42l68L69j25l29L32K38n9O0l47M7O00m82k03k74N96L27n00j72p6K17q9
$$ 25 167 -201 168 43 -286 46 284 225 285 -62 -15 585 103 -100 -374 222 549 49 -123 -199 18 -71
7624g1J32K48k69j48L12l08r0K17J64l58L11l95K75O6j23J34J14p6K84o77J47
$$ -71 61 309 40 -108 204 -104 -194 23 187 -171 140 -255 20 86 -37 97 211 135 419 -258 -111
7645a11M92k95J39k07k10n8L29kk89K93j1J77k02ml96J97N0L5m22O07k2o5l51
$$ -111 381 86 225 18 -192 -250 79 77 -212 81 70 247 45 41 -355 -158 -108 -73 -495 112 90 25 -326
7668c26L10J5p1K9k60M93Mk35L55n16K16j74K19l95J86n1K88l2l61K84R3J64k19
$$ -326 -16 -1 -72 -43 -303 190 194 -41 314 -202 14 -160 59 -336 -150 -201 87 55 -306 -22 71 235 16
7691A6l76M55j16P2J99k00k99K47o7r7K38j02M3J58j22l72L30K25k68r1q8L8M82
$$ 16 -360 95 -21 51 250 50 -249 -2 -69 -166 72 -30 13 171 49 -323 7 232 -36 -127 -215 -177 305
7714C05m81O0J17O2j06J88k8m6p3J01j17k2k3J16J90l60J37K30J46k67k79J58
$$ 305 -176 -116 1 63 -43 145 117 71 -2 99 -18 -40 -63 53 243 -117 20 250 396 129 -150 8
7736HL5m3J03j97P1%J0K87k07J68k86P9k17K68N0k81K38K0p0J78l80J86Q5j52
$$ 8 43 0 103 -94 -23 -23 -13 274 67 235 -51 28 -189 79 129 -152 86 106 36 214 -166 20 105 -47
7760d7R6MR1m20L26J47k19j9J35q6n2K2q9Qr0N52n24J73p8K17j59q9K75m94K12
$$ -47 49 53 144 -276 50 197 -22 -41 94 8 -44 -22 -111 -103 -193 359 -165 8 -70 147 -12 -101 174 -320 -108
7785a08o2J59LK20k89R1j54L02q1j17N0k71K87L6j15R8Q7k6k99J37J11j33K12
$$ -108 -170 -11 -8 212 -77 14 -140 162 81 -36 14 -257 30 66 -49 49 136 110 -189 -52 59 -74 138
7808A38l63J52P1j07pj43J16j35L75k75L64J99l60L9RN9J75L7l76J06M7r3K0J51
$$ 138 -225 -73 -2 -109 -116 -259 -143 -278 97 -178 186 385 25 64 73 132 307 344 -32 74 121 28 48 199
7832A99r1j46J3qK24j80K17l6j92R7K46l18J39l21M18l51L65j86q9J58J20k58
$$ 199 108 -38 -25 -33 191 11 228 192 0 97 343 25 164 -157 261 -90 275 89 0 158 278 20
7854B0M1j04K52n85O24pl29L75p5j21Qj3N5j18K56K0m51q6J78M07l65O9l2K00
$$ 20 61 -43 209 -376 248 241 -88 287 212 91 99 86 141 23 279 299 -152 -238 -60 347 -18 51 19 219
7878B19L0j9k98j54M42j01m8O0j84L0N3J16j97J00k5j46N3K02m37L42K4j08J8
$$ 219 249 230 -68 -222 220 119 71 131 -53 -23 30 146 -51 49 24 -122 -69 133 -304 38 62 -46 -28
7901b8j90P2j42L70J85m67j70J16R0K56l60J33JQ5M3n02L02N1m7p7M3J27Ml5L39
$$ -28 -218 -146 -288 82 267 -200 -370 -254 -164 92 -268 -135 -134 -49 -6 -508 -206 -155 -202 -279 -236 -109 -105 -140 199
7926A99m54Q6J45rp2j35J61J7k17K70k25J71K33l07J88k34L39j35m4K23j12k44
$$ 199 -255 -169 -24 -33 -105 -240 -79 -62 -279 -9 -234 -63 170 -137 51 -183 156 21 -23 200 88 -156
7948a56K67M1n3RL23k73k41J33K02n6j22j59N9J10J85M2j92ML6k66K31%l0K43
$$ -156 111 152 99 108 431 158 -83 50 252 196 74 -85 -26 84 269 311 119 123 159 -107 124 124 94 337
7972C37k91r9k87P01j79o2k89N7J39m2M87l04j92K95j19l30m2L03l2K46j18k72
$$ 337 46 -53 -340 361 182 120 -169 -112 27 -15 472 168 -24 271 152 -178 -220 83 51 297 179 -93
7994i3k18L44L15n79M48l77J32O2K76m63K28RQ9q2q1J13k63K95N5j77p3M13n45
$$ -93 -311 33 348 -231 217 -160 -28 34 310 -153 75 84 173 91 10 123 -140 155 210 33 -40 373 -172
8017a72K26J02j65K12k82k2n6K75j36J36O4p0j61p7O1K81l28j7j45L29P0m99L18
$$ -172 54 156 -9 203 -79 -101 -157 118 -18 118 182 112 -49 -126 -65 216 -112 -129 -274 55 125 -374 -56
8040e6m7j77L62j77j39o1K96j21J15l26k23P53l69k02J32K35J8j64q1J73r0k4
$$ -56 -103 -280 82 -95 -234 -295 1 -120 -5 -331 -554 199 -170 -372 -240 -5 13 -151 -232 -59 -149 -173
8062a73J85j41o2J51L9j64j2L21l18K0LM7j77K90q6j79K70j26K25j30r6L45p53
$$ -173 12 -129 -191 -40 -1 -165 -177 144 -174 -154 -151 -104 -281 9 -77 -256 14 -112 113 -17 -113 232 -521
8085e21N11P9k10K71j97l23L17L53k02l17J58K33k51k02j1K84J68m82M02j50n3
$$ -521 -10 69 -141 130 -67 -390 -73 280 78 -239 -81 152 -99 -301 -312 -28 140 -342 60 -90 -143
8106a43P4K25j47k58N52m09K1M87j58k50rk09N76k46j60Q6K30l34K31j29O3j09
$$ -143 -69 156 9 -249 303 -106 -85 402 244 -6 -15 -224 352 106 -54 32 262 -72 159 30 93 -16
8128a6J89L0k0j33r2J75j62J56pj21J43J78j13l47J54J41j81K09J01l09M62j45
$$ -16 173 203 183 50 -42 133 -29 127 120 -1 142 320 207 -140 14 155 -26 183 284 -25 437 292
8150B92j95N1J43L0k07J35j47p8j63JK16J4j14Q3J97k63J15q1O6k01K14j14k0
$$ 292 97 148 291 321 114 249 102 24 -139 -138 78 92 -22 61 258 -5 110 29 95 -106 108 -6 -26
8173b6K28m20R5M0P4Q6K37m70N9j39J1L2L49l9j74p9K86j7
$$ -26 202 -218 -123 -83 -9 77 314 -156 -97 -236 -225 -193 156 117 -57 -136 150 133
8191A33
$$ Imaginary data points
##PAGE= N=2
##DATA TABLE= (X++(I..I)), XYDATA
0@%%%qJ6j6J6k4L2l3M1n6P2q8J12j36J60j92K28k68L13l65M24m90N63o48P42q41
$$ 0 0 0 0 -8 8 -8 8 -16 16 -17 24 -32 40 -48 64 -72 88 -104 124 -144 169 -196 228 -262 301 -347 395 -446
28d46R55j082J219j372J540j721J922k146K388k653K946l266L616m003M433m910
$$ -446 509 -573 646 -726 814 -907 1015 -1131 1257 -1396 1550 -1716 1900 -2103 2330 -2580
44b580N440o034O700p455Q322r324J0500j1905J3618j5757J8518k2246K7585l5931
$$ -2580 2860 -3174 3526 -3929 4393 -4931 5569 -6336 7282 -8475 10043 -12203 15382 -20549
58b0549N0941q6405L20178L27135m42394j82873O0120K11098K6153m6573m8404
$$ -20549 30392 -56013 264165 591300 148906 -33967 26153 237251 263404 216831 168427
69A68427N6183j7623j07394p8620J27784J67251K0923j61045j56830k2714J17861
$$ 168427 224610 206987 99593 20973 148757 316008 336931 175886 19056 -3658 114203
80A14203N3991q1650m8467J24278Q1802j32623j77706L1928J81756Q9925j20994
$$ 114203 168194 86544 38077 162355 244157 111534 -66172 -34244 147512 237437 116443
91A16443j75356k0016J20557M1367p7600k5722Q8207O4466n1347j14598o1054
$$ 116443 -58913 -78929 41628 82995 5395 -20327 67880 132346 80999 -33599 -94653
102i4653P0463J17222k5461j53416n2166J25010J05044n0699j08044q731R7650
$$ -94653 -24190 93032 67571 -85845 -138011 -13001 92043 41344 -66700 -75431 22219
113B2219N4008q4657j00209L6708Q1826m0713r2719K1855J20028P3637n1797j28308
$$ 22219 76227 -8430 -108639 -71931 9895 -30818 -123537 -101682 18346 91983 40186 -88122
125h8122o4868Q3949J12065j8661r9320l0374M5099K1859l5363k4329O7362J20457
$$ -88122 -152990 -69041 43024 24363 -74957 -105331 -60232 -38373 -73736 -98065 -30703 89754
137H9754L050j58365j20805O1626J17158J6996m8631j7713K9150K2244l6529n5167
$$ 89754 92804 -65561 -186366 -124740 -7582 9414 -39217 -56930 -27780 -5536 -42065 -97232
149i7232M0394J25870M4086j05953j31823l2229P2505J04386M6575l0799k4818
$$ -97232 -56838 69032 113118 7165 -124658 -156887 -84382 20004 66579 35780 10962
160A0962N748l6382n9871L1703J18068N8091p4862j33463n7088Q5144J30451K7729
$$ 10962 16710 -19672 -79543 -47840 70228 128319 53457 -80006 -137094 -51950 78501 106230
172A06230n8353k0523J9699k2430n0081p580M6807O0068Q437p5138p5255L3254
$$ 106230 47877 27354 47053 24623 -25458 -33038 13769 73837 82274 7136 -68119 -34865
184c4865R3893L3511l5087l1251K381R055k6596o4160j2302Q8706P4374m6150
$$ -34865 59028 92539 57452 26201 28582 37637 11041 -53119 -65421 23285 97659 51509
196E1509q4822m312N4558L3291j1346l6276j8761J1380n907m0512p300N4596M3198
$$ 51509 -33313 -37625 16933 50224 38878 2602 -16159 -4779 -10686 -51198 -58498 -3902 39296
209C9296j2906l9438k5581K1902N0602q944q7929m4545O3661O5272j6146m8382
$$ 39296 26390 -13048 -38629 -16727 33875 24931 -62998 -107543 -43882 21390 5244 -43138
221d3138r696L1122L1604r008l0780Q278K7042l0278o5672j1770N3526O3259K8699
$$ -43138 -52834 -21712 9892 884 -29896 -21618 5424 -24854 -90526 -102296 -48770 14489 43188
234D3188l6506o6800m304N9840J8517m8084k0641L5014J8127l7709n1175J0071
$$ 43188 6682 -60118 -64422 -4582 13935 -34149 -54790 -19776 -1649 -39358 -90533 -80462
246h0462Q5877O8964l6539p9442j4820K5661k474j4554J1925K9322K2592j5672
$$ -80462 5415 74379 37840 -41602 -56422 -30761 -33235 -47789 -35864 -6542 16050 378
258C78o6944l6203P2742J05894O870r0814p9391k160N0265K7325j8194N019N2655
$$ 378 -66566 -102769 -30027 75867 82737 -8077 -87468 -89628 -39363 -12038 -30232 -25213 27442
271B7442N107q0159m7254O0732Q4431Q037o7977p4642n625O2512L6463l1360j6269
$$ 27442 32549 -47610 -94864 -34132 50299 58336 -9641 -84283 -89908 -27396 9067 -22293 -38562
284c8562M8788M2275l0710p1376k9445N4412P3026j9738q8993j6924P2784L6269
$$ -38562 10226 52501 21791 -49585 -79030 -24618 48408 28670 -60323 -77247 -4463 31806
296C1806m0573k0476M5039M9937j7298q2490n3858N1425Q7310k641p3610k3793
$$ 31806 -8767 -29243 15796 65733 48435 -34055 -87913 -36488 50822 48181 -25429 -49222
308d9222N1595N3622m527n0383k2246M5488L5727n6612o8135L4459Q2439O582
$$ -49222 2373 55995 51468 1085 -21161 24327 60054 3442 -64693 -30234 52205 58787
320E8787o6033l2986N2574Q0238k970r9260o0856N4348P2240j5413n6165j0685
$$ 58787 -7246 -40232 12342 92580 89610 -9650 -70506 -16158 56082 40669 -15496 -26181
332b6181L9294L4676j7323m4848J1341O9376J2519q6083o7916L4466P3860J7451
$$ -26181 13113 47789 30466 -14382 -3041 66335 78854 -7229 -75145 -40679 33181 50632
344E0632m5771l4907L7012O0049k3314q0747o600P8676L8436n8991p6171n513
$$ 50632 4861 -30046 6966 67015 43701 -37046 -43646 35030 73466 14475 -61696 -67209
356f7209O6077N5450k3928m7463K2690N3753k3384q1093k4035O3316O9071j3567
$$ -67209 -1132 54318 30390 -17073 5617 59370 35986 -45107 -69142 -5826 63245 49678
368D9678q9232m9663O5891R0466p670o5310j1533L5794M354m5574l8612K6639
$$ 49678 -39554 -89217 -23326 67140 59470 -5840 -17373 18421 22775 -22799 -61411 -34772
380c4772O9838J4792o8162m0898N5032O3616j7969o0559k0209L6126L6528k9067
$$ -34772 35066 49858 -18304 -59202 -4170 59446 41477 -19082 -39291 -3165 33363 4296
392D296o8078p58Q4226N0270m5074n6474Q925M7480J4996m3787m6937K3201O0447
$$ 4296 -63782 -64540 19686 69956 24882 -31592 -22667 24813 39809 -3978 -50915 -27714 32733
405C2733o902o6210j1213O7263N2996k1874o0462k6848L8674M5259k6820o0238
$$ 32733 25831 -40379 -51592 15671 68667 46793 -13669 -40517 -1843 43416 16596 -43642
417d3642K876N5213K0906k7011j9827J7223L4596j311n1234l0919M3704M5937
$$ -43642 -40766 14447 35353 8342 -11485 5738 40334 39023 -12211 -43130 574 46511
429D6511l4839o2371L799O2520M6083j9756n7487j6558M7110K9208m4764m6938
$$ 46511 11672 -50699 -46900 15620 61703 41947 -15540 -32098 15012 44220 -544 -47482
441d7482J8188M3831N075l0619k1227K5497N0139J368n7041k9512L5374K8704
$$ -47482 -29294 14537 19612 -11007 -32234 -6737 43402 44770 -12271 -41783 -6409 22295
453B2295k6054l8942q85L9633L9169j1626m5261m634M3230J3095l6396k6951R108
$$ 22295 -3759 -42701 -43586 -3953 35216 23590 -21671 -26305 16925 30020 -6376 -33327 -24219
466b4219J8895M63k0761r151L8234M4672k0368n7383j0008M0587K5998k0948m3327
$$ -24219 -5324 -4861 -25622 -34773 3461 48133 27765 -29618 -39626 961 26959 6011 -37316
479c7316j8968L5909M4752j0034l8257N008L6356P078k9272k8512m19K6201J1607
$$ -37316 -56284 -20375 24377 14343 -23914 -18906 17450 24528 -4744 -33256 -33675 -7474 4133
492D133l0200k2442L2790M0815j1621l4177o774K1574J9107j0864m1174j9944
$$ 4133 -26067 -48509 -15719 25096 13475 -20702 -27476 -5902 13205 2341 -38833 -58777
504e8777L2384L2954j2175k1101J0158K2763N242j8513k3758O455L2292k727m7912
$$ -58777 -26393 6561 -5614 -26715 -16557 6206 11448 -7065 -30823 -24368 7924 5197 -42715
517d2715j9190M4096M4824l519l3368j9070K1330L7436n416m8829j8529L1936
$$ -42715 -61905 -17809 27015 23496 -9872 -28942 -7612 29824 24408 -24421 -42950 -11014
529a1014K4638j0849j7832L334K7439K5023j3936l5903L650L5024k717m1454j6460
$$ -11014 13624 2775 -15057 -11723 15716 40739 26803 -9100 -5450 29574 26857 -14597 -31057
542c1057L0687L7930N363l2479k2927L0121M2585j3206m7264j0819K3464J1226
$$ -31057 -370 37560 42923 10444 -12483 17638 60223 47017 -247 -11066 12398 23624
554B3624j2435j6941P944L8305J9379l5787l7821K2497M3617n683m7238l2128
$$ 23624 11189 -5752 2192 40497 59876 24089 -13732 8765 52382 46699 -539 -32667
566c2667J8220M7137J2860m1016k4278L8819L8762k1486m3435q005K2923J5423
$$ -32667 -14447 32690 45550 4534 -19744 19075 57837 36351 -7084 -15089 7834 23257
578B3257j7540l2092P104M5449J3766l8711k3615K9358L5273q361m7238l5892
$$ 23257 5717 -26375 -19271 26178 39944 1233 -22382 6976 42249 33888 -13350 -49242
590d9242K3127N3172M12n1440j3692M6949L1959k3593l7336K57L3588J2092m2474
$$ -49242 -26115 27057 27469 -23971 -37663 9286 41245 17652 -19684 -19427 14161 26253 -16221
603a6221m2162K8082N8039J611m7119j8892L2680M1261k000n1161l7676K9026
$$ -16221 -58383 -30301 27738 29349 -17770 -36662 -3982 37279 35279 -15882 -53558 -24532
615b4532M5539j4681m5878J588M6607K3979k7062l7091J1583M8528M572o2319
$$ -24532 21007 6326 -39552 -37964 8643 32622 5560 -31531 -19948 28580 33152 -29167
627b9167l8666M1977N0990j0810m1677q564L6620L8303j1414n2465j7802M0847
$$ -29167 -67833 -25856 25134 14324 -27353 -35917 703 39006 27592 -24873 -42675 -1828
639a828K9157k9959m0059Q471M3543K3160k6899l4086K5150N4574j2399p0710
$$ -1828 27329 -2630 -42689 -34218 9325 32485 5586 -28500 -3350 51224 38825 -31885
651c1885k2797N3375M5037j8681m7548j0015M4526M2041j7197m3480L189L6339
$$ -31885 -54682 -1307 43730 25049 -22499 -32514 12012 54053 36856 -6624 -3435 32904
663C2904L777l7526k6937J9132M7990J5798m4824l5287M1197N7448j8190o2218
$$ 32904 36681 -845 -27782 -8650 39340 55138 10314 -24973 16224 73672 55482 -6736
675f736j3267M2501K8532k6792m5917L667N4601K6518l5206l1671J9236K8840
$$ -6736 -20003 22498 51030 24238 -21679 -18012 36589 63107 27901 -3770 15466 44306
687D4306r719l5759k0559K0796L9223n405n1821j4995N4793M4537k6842n5753
$$ 44306 34587 -1172 -21731 -935 38288 32883 -18938 -33933 20860 65397 38555 -17198
699a7198j2079L6684K5396l0185m4714J2814M9680O403l9214j3099K8761K5405
$$ -17198 -29277 7407 32803 2618 -42096 -29282 20398 26801 -12413 -25512 3249 28654
711B8654j1594l8041k3099K3690L5453j2537m2404j668M2789K8230j8610l6626
$$ 28654 17060 -20981 -44080 -20390 15063 2526 -39878 -41546 1243 29473 10863 -25763
723b5763o116L2821J8500l4849l5868K1427L8749o197l0480k67L1525K4872j4919
$$ -25763 -31879 942 19442 -15407 -51275 -29848 8901 2704 -27776 -28043 3482 28354 13435
736A3435m3097j3734L6260K7129k5332l6251L543L3811K5483q629k9568m859L0068
$$ 13435 -29662 -43396 -7136 19993 -5339 -41590 -38047 -4236 21247 12618 -16950 -21809 8259
749H259J0091l4672k4242K0168K4257o684k3257m239K6786K8935j3233l9485m547
$$ 8259 18350 -16322 -40564 -20396 3861 -2823 -26080 -30319 -3533 25402 12169 -27316 -31863
762c1863L0235R733k4331k1133L439J9854J6520q480j8609Q368K6033l123l1418
$$ -31863 -1628 8105 -16226 -37359 -33920 -14066 2454 -6026 -24635 -16267 9766 6643 -24775
775b4775j4025J4670J9855l633k7000j2404L2552L7597j3270l8475l289K6790
$$ -24775 -38800 -24130 -4275 -7908 -34908 -47312 -14760 22837 9567 -28908 -32197 -5407
787e407J1561j6041k3866o956J9807K1599n470j2082Q752J4145k813j3398q952
$$ -5407 6154 -9887 -33753 -40709 -20902 697 -4773 -16855 -8103 6042 3229 -10169 -19121
800a9121M405J7608J306k8882j4767L1097L3719r139k4667m5J7747Q473j5275
$$ -19121 -14716 2892 4198 -24684 -39451 -8354 25365 16226 -8441 -8486 9261 17734 2459
813B459k2021L499K5109M994k0317o664J6903J8344N120r935j9026m92K2053J197
$$ 2459 -19562 -16063 9046 14040 -6277 -12941 3962 22306 27426 17491 -1535 -2027 20026 21223
827B1223l3360j4355L1392L3556l804k9349j4065K0844K6131q932k6579j525J4421
$$ 21223 -12137 -26492 4900 38456 34652 5303 -8762 12082 38213 29281 2702 1177 15598
840A5598o054j4587N109J9535J5318K243j9202k3134J0457L0087L75l1838j7695
$$ 15598 9544 -5043 66 19601 34919 37162 17960 -5174 5283 35370 35745 3907 -13788
853a3788J6150K4643j296k4627m233L6425K2879l1434l7332P524K5700P99j7928
$$ -13788 2362 27005 25709 1082 -3151 33274 56153 24719 -12613 -5089 20611 21410 3482
866C482j0472Q828K2799P344k2246j7015J8171K5764o290l3746k5038J3038L4528
$$ 3482 -6990 1838 24637 31981 9735 -7280 10891 36655 30365 -3381 -28419 -15381 19147
879A9147N774l0239r335L0926J4893k7306k0423J5575K0014q052k9497j5893K1432
$$ 19147 24921 -5318 -14653 16273 31166 3860 -16563 -988 19026 10974 -18523 -34416 -12984
892a2984L3702l492l2629r755K5861K4439p259l3172k3318J7804L1033j0465l4451
$$ -12984 20718 17226 -15403 -25158 703 25142 17883 -15289 -38607 -20803 10230 -235 -34686
905c4686P265M1672J0002l4474k5472J7765L6295J978m1783k9783K4079L5130
$$ -34686 -27421 14251 24253 -10221 -35693 -17928 18367 20345 -21438 -51221 -27142 7988
917G988n587k3681J644K5425J4696j5576l4071q527L4103K5430k4724l3565Q864
$$ 7988 2401 -21280 -19636 5789 20485 4909 -29162 -37689 -3586 21844 -2880 -36445 -27581
930b7581L1636O725k0084r881K6256L0782k0226n7660j5852M8273M1016j4346
$$ -27581 4055 10780 -9304 -19185 7071 37853 17627 -40033 -55885 -7612 33404 19058
942A9058l5891r306K2428K2817o493k0987P689K6275p376m2788k0408K8540M2457
$$ 19058 -16833 -26139 -3711 19106 12613 -8374 -685 25590 18214 -24574 -44982 -16442 26015
955B6015J0563k9381k8059J6672L2063r221l4786L28L2972J0041k9811l0907R350
$$ 26015 36578 7197 -20862 -4190 27873 18652 -16134 -15806 17166 27207 -2604 -33511 -24161
968b4161M3663K4232k5450l0620J0963K2838j0745k7503k797K5456K2541j1013
$$ -24161 19502 43734 18284 -12336 -1373 21465 10720 -16783 -19580 5876 28417 17404
980A7404l7665r983M1337L6397j8366m0814p050K3442J4243j7539k5297R654L6059
$$ 17404 -20261 -30244 11093 47490 29124 -11690 -18740 4702 18945 1406 -23891 -14237 21822
993B1822N386l2394j1633K9872J9905j9739l1102o263K4282K3655j1656l3447
$$ 21822 27208 -5186 -16819 13053 32958 13219 -17883 -24146 136 23791 12135 -21312
1005b1312k758L2383J9909j2027j9502j285J3571K820k5314k1599K4756L9902
$$ -21312 -24070 8313 28222 16195 -3307 -4592 8979 11799 -13515 -35114 -10358 29544
1017B9544m812l8426j0923K5334K1160o482k0341m830J5194M045k5496k0647K0529
$$ 29544 24732 -13694 -24617 717 21877 15395 -4946 -9776 5418 9463 -16033 -36680 -16151
1030a6151L7272J2801j8675k7882r875J9230J7429j2311j3858J3412J0900k2487
$$ -16151 21121 33922 15247 -12635 -22510 -3280 14149 1838 -12020 1392 12292 -10195
1042a0195k5039J3225M1168K6186j9031m3504j5642K2470J6810o872m843O972
$$ -10195 -35234 -22009 19159 45345 26314 -17190 -32832 -10362 6448 -424 -5267 1705
1054A705K848o730r787l597J7157K7561j595l5225k2398J2162J8833R83r494R58
$$ 1705 4553 -2177 -11964 -15561 1596 29157 27562 -7663 -30061 -17899 934 1917 -7577 -6619
1068f619J6698R879j9663k3502J2168K9570J805k3634j6595P38J1929J1951j183
$$ -6619 10079 19958 295 -23207 -11039 18531 20336 -3298 -19893 -19155 -7226 4725 3542
1081C542o332Q924J2669r625k1665m248J5113J3773m856k2264q077K3363K2326
$$ 3542 -2790 6134 18803 9178 -12487 -16735 -1622 12151 7295 -14969 -23046 317 22643
1094B2643j0930j9786M153J4867J096j0801j0273j675Q488M194q622q8J8906J2596
$$ 22643 11713 -8073 -3920 10947 12043 1242 -9031 -10706 -2218 1976 -6646 -6734 12172 24768
1108B4768j2089k0605q232J1085K0120K58k4167j2234J6624J4150q259o305J1189
$$ 24768 12679 -7926 -16158 -5073 15047 15305 -8862 -21096 -4472 9678 1419 -4886 6303
1121F303J3823j778k1283k3372L514K6426J1223j3052r974L833N812Q13m249j391
$$ 6303 20126 18348 -2935 -26307 -22793 3633 14856 1804 -8170 -4337 1475 2288 -1961 -3352
1135c352J2190J3710j7045l4849o885K6513K5419L157j2476j1857J323N450o929
$$ -3352 8838 22548 5503 -29346 -36231 -9718 15701 18858 6382 -5475 -4152 1298 -5631
1148e631m727J7209J5698j7199l1340p581K2145L1419J0961j9843k1421N447J3170
$$ -5631 -10358 6851 22549 5350 -25990 -33571 -11426 19993 30954 11111 -10310 -4863 8307
1161H307q131j4168O484J8464O314j5540k2745J725L2790K1330j7494k3509Q64
$$ 8307 176 -13992 -7508 10956 17270 1730 -21015 -19290 13500 34830 17336 -6173 -5309
1174e309R970l580j1637k333J6347K0093m956k7864p725K5118J8287j0602k0332
$$ -5309 4661 1081 -10556 -12889 3458 23551 18595 -9269 -16994 8124 26411 15809 -4523
1187d523p204Q124R821o257j3275R916K5853J364k5844j2220J5636J8397n905
$$ -4523 -11727 -3603 6218 -39 -13314 -3398 22455 23819 -2025 -14245 1391 19788 13883
1200A3883k6475j5041K1193K9501n585k8402m119K1909J4390r063j7537n042J3590
$$ 13883 -12592 -27633 -6440 23061 17476 -10926 -15045 6864 21254 12191 -5346 -10388 3202
1213C202P016j9192j7620J8818L1818J080k4315j6037Q646J9827J575k1135j0117
$$ 3202 10218 -8974 -26594 -7776 24042 25122 807 -15230 -6584 13243 14818 -6317 -16434
1226a6434J8856J2252k0599j9551J3940L1585J2303j8910k9460l856K2324P773
$$ -16434 2422 14674 -5925 -25476 -11536 20049 32352 13442 -16018 -19874 2450 10223
1238A0223j9034p609K0251J4763j4339k5481l129L0026L1378j0828m2294j8715
$$ 10223 -8811 -16420 3831 18594 4255 -21226 -24355 5671 37049 26221 -16073 -34788
1250c4788K0238J8336n452p190O844J2592j634k0821j5152J9759L0606o434l4053
$$ -34788 -14550 3786 -1666 -8856 -2012 10580 8946 -11875 -27027 -7268 23338 16904 -17149
1263a7149j5451J3664J8073J396j0942r76J8987R315k3897k5671J0517K8099M807
$$ -17149 -32600 -18936 -863 533 -10409 -11385 7602 16917 -6980 -32651 -22134 5965 10772
1276A0772k1154j8704N117K3155Q701j7601j0055J9747J5684j7632k7388k640
$$ 10772 -10382 -29086 -23969 -814 7887 -9714 -19769 -22 15662 -1970 -29358 -31998
1288c1998K2014J9241p770k4580k357K6365J3492j6933j5725P496J2138j890j4772
$$ -31998 -9984 9257 1487 -23093 -25450 915 14407 -2526 -18251 -10755 1383 -507 -15279
1301a5279r699J2209J9693l771k0925Q47K4979J1780j6829k3299m261J8726J6805
$$ -15279 -24978 -12769 6924 3153 -17772 -16925 8054 19834 3005 -20294 -24555 -5829 10976
1314A0976j0079k0561O571K2067J435j7004m288J4212J3454m906k4955j4907J7434
$$ 10976 897 -19664 -13093 8974 10409 -6595 -10883 3329 16783 11877 -13078 -27985 -10551
1327a0551K4059k350j6524M39J3089O202q679j4080P50J9728Q788k1100k0545
$$ -10551 13508 11158 -5366 -4927 8162 14364 5685 -8395 -7645 12083 20871 -229 -20774
1340b0774R351K1814O615o078n486L929O596p817j9046N92K4097J2058j7114j9224
$$ -20774 -11423 10391 17006 10928 5442 9371 15967 8150 -10896 -10304 13793 25851 8737 -10487
1354a0487J474J8311J6890k767j7529m720J1841l9j6262n922J4318J5232j22j4877
$$ -10487 -9013 9298 26188 23421 5892 1172 13013 12974 -3288 -9210 5108 20340 20218 5341
1368E341j0652J1370J9101l613k0430m342J2034L339r790r169L513J5957J2090
$$ 5341 -5311 6059 25160 21547 1117 -3225 8809 12148 2358 -6811 -3298 12659 24749
1381B4749j0645j7624J816J3997J74j1017p563L077Q842K724j2137o499J6480
$$ 24749 14104 -3520 -1704 12293 12467 1450 -6113 -3036 5806 8530 -3607 -10106 6374
1394F374J6865j0752k0666k480J2015P326p566j4154j993J7156J0685r659j0440
$$ 6374 23239 12487 -8179 -10659 1356 8682 1116 -13038 -15031 2125 12810 3151 -7289
1407g289N926Q118j444q584q724J916J2605J823j6354n878J8254J6091o060j6246
$$ -7289 -1363 6755 5311 -3273 -11997 -10081 2524 4347 -12007 -17885 369 16460 10400 -5846
1421e846o115Q655J0534o664j6131J673J7498M012j1325m157P272R166L002r161
$$ -5846 -11961 -3306 7228 564 -15567 -13894 3604 7616 -3709 -7866 -594 8572 11574 2413
1435B413j3879J597J4074J80j3472k829J4483J2738l819j5653o799J4862J4946
$$ 2413 -11466 -9869 4205 4385 -9087 -11916 2567 15305 11486 -4167 -10966 3896 18842
1448A8842j1870k0890K336J4568K804o998j850O792J0013R77j5390j1626J0845
$$ 18842 6972 -13918 -11582 2986 5790 -1208 -3058 3734 13747 14724 -666 -12292 -1447
1461a447J5121m284j6805p215J0881J7624J696j7628o142J7739J0772j7431j7729
$$ -1447 13674 9390 -7415 -14630 -3749 13875 15571 -2057 -8199 9540 20312 2881 -14848
1474a4848O826J4862J618j0334p548P702J6379J15j6464n989J1750Q414p330j4802
$$ -14848 -8022 6840 8458 -1876 -9424 -1722 14657 14772 -1692 -7681 4069 12483 5153 -9649
1488i649n708J2305J7563l377j9785K08K1172O147j8118j3210O555J3867K78j6578
$$ -9649 -15357 -3052 14511 11134 -8651 -8443 12729 18876 758 -12452 -5897 7970 8248 -8330
1502h330r247J6188K0430n491k0025k102J3404Q520o517j6307p866J4857J6179
$$ -8330 -17577 -1389 19041 13550 -6475 -8577 4827 13347 6830 -9477 -17343 -2486 13693
1515A3693q972j6495N516J8593L431j4250j1758N740J4593j929k0923o168K1084
$$ 13693 4721 -11774 -6258 12335 15766 1516 -10242 -4502 10091 8162 -12761 -18929 2155
1528B155J5847j1735j5905K878J5167P378j0025j8016j740J7319O356j5223r314
$$ 2155 18002 6267 -9638 -6760 8407 15785 5760 -12256 -13996 3323 9679 -5544 -14858
1541a4858J2494J6343K86j5933j2333J0821J9063n902k5616n213K0488J2507r119
$$ -14858 -2364 13979 14265 -1668 -14001 -3180 15883 9981 -15635 -20848 -360 12147 3028
1554C028j2770K556J5305P511j4182j7001O079J6027j681j4329m053R977J1009
$$ 3028 -9742 -7186 8119 15630 1448 -15553 -9474 6553 4872 -9457 -13510 -3533 7476
1567G476k29j2592o145J5328J3580j4412k2787J032J9367J0191j0093j5638L042
$$ 7476 7247 -5345 -11490 3838 17418 3006 -19781 -18749 618 10809 716 -14922 -11880
1580a1880K0940P409j8447j3323J2243J2616p843j5292l336J2283J3915j269j5524
$$ -11880 9060 16469 -1978 -15301 -3058 9558 1715 -13577 -16913 -4630 9285 8016 -7508
1593g508l467J5310R608j1202j5151r27J1727Q538q068j3410O545J9901m87j8181
$$ -7508 -10975 4335 13943 2741 -12410 -13337 -1610 6928 -1140 -14550 -8005 11896 11409 -6772
1607f772l897J5318Q252j1132j5369j648J4392J1377q431j2991N552J5385K710
$$ -6772 -10669 4649 12901 1769 -13600 -15248 -856 10521 2090 -10901 -5349 10036 12746
1620A2746j1030j0683m14J2608Q137j3118j6592Q842K0163O85j3587k321J0326
$$ 12746 1716 -8967 -9381 3227 11364 -1754 -18346 -9504 10659 11344 -2243 -4564 5762
1633E762N719r485j5681M88J6691Q139j2136r841N900R082L384k007o665k661
$$ 5762 11481 1996 -13685 -13197 3494 11633 -503 -10344 -4444 4638 8022 6015 -650 -3311
1647c311O755J143j3344o824J3223J4319m029j3200m110J1434J2160p571j6952
$$ -3311 3444 4587 -8757 -15581 -2358 11961 7932 -5268 -9378 2056 14216 6645 -10307
1660a0307N29J4876O00j3325m486P450R935N246m213j0852j270Q878R85q916m895
$$ -10307 -9778 5098 5698 -7627 -12113 -4663 5272 10518 6305 -4547 -5817 3061 4046 -4870 -9765
1675i765N987O896n61q330l547J2551J1860r888j5798K333J1072p19q071l149
$$ -9765 -3778 3118 2557 -5773 -9320 3231 15091 5203 -10595 -8262 2810 2091 -5980 -9129
1689i129M478P541K979o528n178O363P342m308r036m223M130R034R95j2518m362
$$ -9129 -4651 2890 5869 -659 -5837 526 7868 3560 -5476 -9699 -5569 3465 4460 -8058 -12420
1704a2420J5566J2594q691j3566R71P908J933n785p662K763J1184K798q243l180
$$ -12420 3146 15740 7049 -6517 -5546 2362 4295 -1490 -9152 -6389 4795 7593 -650 -3830
1718c830P677N735k141n965o726J319R034m21j0705M63J4145O845q642r714K03
$$ -3830 3847 9582 7441 1476 -5250 -3931 5103 4682 -6023 -5560 8585 15430 6788 -2926 -2723
1733b723R190O016p691j1725K762J1309q69p889J277Q855N744k716j0745q580
$$ -2723 6467 12483 4792 -6933 -4171 7138 6269 -1620 -343 8512 14256 11540 795 -7785
1747g785P076J1774l435j2065j631R206N986j431p124r77R566M718j3191j2952
$$ -7785 -709 11065 7630 -4435 -6066 3140 9126 7695 571 -406 9160 13878 687 -12265
1761a2265O633J2175p47q035k385O036Q394k063j1931l175J1442N681j0246j1739
$$ -12265 -5632 6543 5796 -2239 -4624 1412 9806 7743 -4188 -7363 4079 9760 -486 -12225
1775a2225M48J0132R359j831j1212j568J1855L651j3247p871P872R413l200j2347
$$ -12225 -11777 -1645 7714 5883 -5329 -6897 4958 8609 -4638 -12509 -4637 4776 1576 -10771
1789a0771n150J2214J4629l678j5067j796J1720K339q737p390Q42Q336O603o171
$$ -10771 -15921 -3707 10922 7244 -7823 -9619 2101 4440 -4297 -11687 -10845 -2509 4094 -2077
1803b077j0187N475J3991R45j2588p539N719R578j694j3751n137J5308J3325q787
$$ -2077 -12264 -6789 7202 8147 -4441 -11980 -6261 3317 1623 -12128 -17265 -1957 11368 2581
1817B581j4063M074J2446K075r128r634O63J0524M827r837o466Q936J1272j345
$$ 2581 -11482 -7408 5038 7113 -2015 -11649 -10986 -462 4365 -5472 -11938 -3002 8270 6925
1831F925j0307o163O790J1238m533j7738l255J8686J0868j0908j1492N316J1976
$$ 6925 -3382 -9545 -2755 8483 3950 -13788 -17043 1643 12511 1603 -9889 -4573 7403
1844G403K952j0449r719M621J1490j658j2897j977J1729R447j418r816p149Q738
$$ 7403 10355 -94 -9813 -5192 6298 4640 -8257 -10234 1495 10942 9524 -292 -7441 1297
1858A297J1430o849j6106J128J4813M688j0547p464O528J3953K019j3357r261
$$ 1297 12727 5878 -10228 -9100 5713 10401 -146 -7610 -1082 12871 14890 1533 -7728
1871g728Q297R161o430j0332J981R451O959m172j0878k422J3699R941j1756j5381
$$ -7728 569 9730 3300 -7032 -5051 4400 11359 7187 -3691 -6113 7586 17527 5771 -9610
1885i610J164J1717M323p311p039N716J2792n54j5104m752J2226O813p584j0593
$$ -9610 -8446 3271 7594 283 -6756 -1040 11752 11198 -3906 -8658 3568 10381 2797 -7796
1899g796j556P573P668k242r334J948J1648J715j1762q060M396Q737K320r743
$$ -7796 -9352 -1779 5889 3647 -5687 -3739 7909 9624 -2138 -10198 -5802 2935 5255 -4488
1913d488q369Q259J2992l231j1489J016J0716K953r259j0873p09J2333Q685p276
$$ -4488 -12857 -4598 8394 5163 -6326 -5310 5406 8359 -900 -11773 -12482 -149 8536 1260
1927A260j0850M171J0832J533o509n242K231O304m64j0540m958J1080J0303m574
$$ 1260 -9590 -5419 5413 6946 437 -4805 -2574 3730 3266 -7274 -12232 -1152 9151 4577
1941D577q515Q00O907L648m939r575N54J0419K386j0346n324Q798R197l61p161
$$ 4577 -3938 -3138 3769 7417 2478 -7097 -6543 3876 6262 -4084 -9408 -610 8587 8226 1065
1956A065n726M072Q150k561j2499k172J1077O092m521o680K02Q306O502o381j1861
$$ 1065 -4661 -589 7561 5000 -7499 -9671 1406 7498 2977 -3703 -3501 4805 11307 4926 -6935
1971f935R91J0491J176q819l955M585P094K939m779m706M476N404n833r056K096
$$ -6935 -5944 4547 5723 -3096 -7051 -2466 4628 7567 2788 -1918 2558 7962 2129 -6927 -4831
1986d831P803L310m011o673r2R570P544o855q831K835O165k719p356k231O453
$$ -4831 2972 6282 2271 -4402 -4494 5076 12620 5765 -3066 -231 5934 3215 -4141 -6372 81
2001H1R770P19j1058n415R150Q146m177p439j669K866L127k239o868K210J2367
$$ 81 9851 10570 -488 -5903 3247 11393 7216 -223 -1892 974 4101 1862 -5006 -2796 9571
2016I571M645r163q792J792N969K496m257n362J766O592k372p827K403J1884M192
$$ 9571 14216 5053 -3739 -1947 4022 6518 2261 -3101 -1335 5257 2885 -4942 -2539 9345 13537
2031A3537p713j0254l202O687P329l626r028K284R398O17p121l113M503P388J22
$$ 13537 5824 -4430 -7632 -945 6384 2758 -6270 -3986 5412 6029 -1092 -4205 298 7686 7808
2046G808j0970r344N923J0672p11p655n56O153L887k584p419k913P971N317q193
$$ 7808 -3162 -12506 -6583 4089 3378 -4277 -4833 1320 5207 2623 -4796 -7709 262 5579 -2614
2061b614r237L724Q309K424m188l833K277O987n93j0563m839Q530N912n224p272
$$ -2614 -11851 -8127 182 2606 -1582 -5415 -3138 3849 3256 -7307 -12146 -3616 2296 -2928 -10200
2076a0200O81Q215P081l884j1413n68J1159L695r700q001L279P888K448m989m832
$$ -10200 -9519 -1304 5777 1893 -9520 -10088 1071 4766 -4934 -12935 -9656 -1768 680 -4309 -9141
2091i141O033R992l821j2623k773Q767O009k740p645k998P227P982m119o947M194
$$ -9141 -3108 6884 3063 -9560 -12333 -3566 2443 -297 -7942 -10940 -3713 4269 150 -6797 -2603
2106b603R258k285j0983o021M876J0768L505q770o410P638Q285m614p488K398
$$ -2603 6655 4370 -6613 -12634 -7758 3010 6515 -2255 -8665 -1027 7258 2644 -4844 -2446
2120b446P897J663p573j0683L97J4439Q818o821q744J743O100M68m579l258M061
$$ -2446 5451 7114 -459 -11142 -10745 3694 12512 5691 -3053 -1310 4790 5258 679 -2579 1482
2135A482P213l592j2587j270J3564R493m532q872k495M356L824m942o507L961
$$ 1482 8695 5103 -7484 -8754 4810 14303 9771 899 -1596 2760 6584 1642 -4865 -904
2149i04J0046j187j0053l626P431R017Q03q748q246L999Q099l974q917J728J0403
$$ -904 9142 7955 -2098 -5724 1707 10724 11527 2779 -5467 -1468 6631 2657 -6260 -4532 5871
2164E871L546o567p512J028R847M010r634r778M622Q476j508o523q85M911N923
$$ 5871 9417 2850 -4662 -3634 6213 10223 589 -9189 -4567 3909 2401 -4122 -5007 -96 5827
2179E827l93q707l484P660N056p747q518J892R054N310m751q608P53J0376K837
$$ 5827 5434 -3273 -6757 903 5959 -1788 -10306 -8414 640 5950 1199 -7409 -6656 3720 6557
2194F557r703m822N572M333m301o300j63Q276Q470k974j0594k477P426L575l809
$$ 6557 -3146 -7968 -2396 1937 -2364 -8664 -8827 -551 7919 4945 -5649 -8126 -700 2875 -934
2209i34m119Q1L903K732n503n936P625J3021j262j2156o230M738N817Km752j195
$$ -934 -5053 -4972 -1069 1663 -3840 -9776 -2151 10870 9608 -2548 -8778 -4040 1777 1779 -2973 -4168
2225d168O889L426p137o288O322R471J271o602q750k682P125P292l306n028M720
$$ -4168 2721 6147 -990 -7278 -956 8515 9786 3184 -5566 -8248 -1123 6169 2863 -2165 2555
2240B555N819l705p312m15P080O550m048j1588k199R547M923m033k532L541L183
$$ 2555 8374 4669 -2643 -3058 4022 10572 6524 -5064 -7263 2284 7207 3174 642 4183 7366
2255G366q09m488n394J905Q114J340q392n095N536P230Q12n809l779M671O269
$$ 7366 6557 2069 -3325 -1420 6694 8034 -358 -5453 83 7313 8125 2316 -1463 3208 9477
2270I477n285j0417J445R262J808n104l289K748N051J678m978o169K443N690j195
$$ 9477 4192 -6225 -4780 4482 6290 1186 -2103 645 5696 7374 2396 -3773 -1330 4360 3165
2285C165m998k063K538M736Q92n181k002P309N173p905j0221K080Q291K883l630
$$ 3165 -1833 -3896 -1358 3378 4270 -911 -2913 4396 9569 1664 -8557 -6477 1814 4697 1067
2300A067n369J170N998K099n370k959M968L569l651n990l696L221Q753K665o941
$$ 1067 -4302 -3132 2866 4965 -405 -3364 1604 5173 1522 -4468 -8164 -4943 3810 6475 -466
2315d66m238N478L953m987m800K092N390J085o235o681L419J0095J668o277j887
$$ -466 -4704 774 4727 -260 -5060 -2968 2422 3507 -2728 -9409 -5990 4105 5773 -504 -2391
2330b391K777Q94k161l882j606N489N963l951q611J96Q820N094l558o791k172
$$ -2391 386 1280 -881 -4763 -6369 -880 5083 1132 -7479 -7283 1537 6631 3073 -3718 -5890
2345e890N130L726o499n973N825Q999j467p123j975M313M984q53o562l742N351
$$ -5890 -760 2966 -3533 -9506 -3681 5318 3851 -3272 -5247 -934 4050 3197 -3365 -7107 -1756
2360a756M241m095m131K626N384L031l078o094o10P158K402q419n080O217O831
$$ -1756 2485 -1610 -5741 -3115 2269 5300 2222 -3872 -4482 2676 5078 -3341 -8421 -2204 4627
2375D627j387n952j682N687O715l713r422l22Q316J413n843m093J841O366M322
$$ 4627 3240 -2712 -4394 1293 8008 4295 -5127 -5449 2867 4280 -1563 -5656 -3815 2551 6873
2390F873k627p448k32P608P38o706l658L688N581p95o518k276Q411P184o580q640
$$ 6873 4246 -3202 -3434 4174 4912 -1794 -5452 -1764 3817 3022 -3496 -5772 2639 9823 3243 -5397
2406e397J995O568n56n429k281K948N703J113o433l770N787O703k347o996m544
$$ -5397 -3402 3166 2610 -2819 -5100 -2152 3551 4664 -1769 -5539 248 6951 4604 -2392 -6936
2421f936L584O639l40q274k027J0407O072q554p348L584O949Q20o853n072K442
$$ -6936 -3352 3287 2947 -5327 -7354 3053 9125 571 -6777 -3193 3756 4576 -2277 -7349 -4907
2436d907P070N72n174r25M656K629j529m648l672L527O428l069q833P46J0359
$$ -4907 2163 2735 -2439 -3364 1292 3921 2392 -2256 -5928 -2401 4027 958 -7875 -7129 3230
2451C230L662p958n324L916O772L39q378m928O376O243l987o393J885O201K996
$$ 3230 6892 -1066 -6390 -2474 4298 4637 -3741 -8669 -2293 3950 -37 -6430 -4545 1656 4652
2466D652j766n792m147M999O716m571p770J554P847K011n201m059L686Q118j017
$$ 4652 2886 -2906 -7053 -2054 4662 91 -7679 -6125 1722 3733 -1468 -5527 -1841 6277 5260
2481E260r988l810P775M559m502m034K190M728K277k153n686O34O786K309o935
$$ 5260 -4728 -8538 -763 3796 -706 -4740 -2550 2178 4455 2302 -3384 -2750 4036 6345 -590
2496e90n741K771O888K527m583n341M082Q404j147r380j569P142K317m129m481
$$ -590 -6331 -3560 3328 5855 1272 -4069 13 8417 7270 -2110 -3679 3463 5780 1651 -2830
2511b830N26N805M167l282n732K171O002m73m817l992J313M199K752m836l908
$$ -2830 -2304 3501 7668 4386 -1346 825 6827 6354 1537 -2455 -1142 3057 5809 973 -2935
2526b935O075O435m174p430J02O065K750l993o612o6O508L525m801l487M239M042
$$ -2935 3140 9575 5401 -2029 -1927 4138 6888 2895 -3717 -3783 2725 6250 1449 -2038 2201 6243
2542F243j819n103l313J368O213J187o631l148M522M841j975l484j88L375K280
$$ 6243 4424 -679 -3992 -2624 3589 4776 -1855 -5003 -481 4360 2385 -1099 -1287 2088 4368
2557D368m932p446J304R053J846n750l313L283L497M7l501l153K712M204l064
$$ 4368 -564 -8010 -6706 2347 4193 -1557 -4870 -1587 1910 1957 -1544 -4697 -1985 2219 -845
2572h45o509J66N752L811j173l958k614L300M206l929o534K557O157o96m870k231
$$ -845 -7354 -7188 -1436 2375 1202 -2756 -5370 -2070 2136 -1793 -8327 -5770 387 -309 -5179 -7410
2588g410L382N309N16n496l095M431L089m298m037J609K911K718k13l763j398
$$ -7410 -4028 1281 1797 -3699 -6794 -2363 726 -3572 -7609 -6000 -3089 -371 -584 -4347 -5745
2603e745N092L299n124n166K463M781J077m963l362L136P400M87o213q73M288
$$ -5745 -653 2646 -2478 -7644 -5181 -400 677 -4286 -7648 -4512 2888 3375 -2838 -3711 577
2618E77R68m162k224J440L353L374j701n615p2O574L555l554l588N31K326M54
$$ 577 1545 -2617 -4841 -3401 -48 3326 1625 -3990 -4062 2512 6067 2513 -1075 -544 1782 2236
2634B236m252l048O819P612l155q442l45O161K561j987l106r17J970J684l096
$$ 2236 -2016 -5064 1755 9367 6212 -2230 -2575 3586 6147 4160 1054 137 2107 3791 695
2649F95k935L986O349N05m561n561n98N503L683n198m508M667L750l637m421K760
$$ 695 -2240 1746 8095 8600 4039 -1522 -2120 3383 7066 1868 -2640 2027 5777 2140 -2281 479
2665D79N734K100m330o822n85N391K272l785k132K790K802m26k692l273K290O389
$$ 479 6213 8313 3983 -2839 -3424 1967 4239 454 -1678 1112 3914 3488 796 -2477 -187 6202
2681F202p27r054l588O647M639k130m356k23M845L635m615o411J955N826l04m701
$$ 6202 5475 -3579 -7167 -520 4119 1989 -2367 -2590 2255 5890 1275 -5136 -3181 2645 2341 -2360
2697b360k045K121L610J871l314m279L795N455k465o865p68M321K310k113l716
$$ -2360 -4405 -2284 1326 3197 -117 -4396 -601 4854 2389 -4476 -5244 -923 1387 -726 -4442
2712d442J224O586K177o762n592M422O110p12n223l160J525M816J143m731q86
$$ -4442 -3218 3368 5545 -1217 -6809 -2387 3723 3011 -2212 -5372 -3847 969 2112 -2619 -3505
2727c505O287L139n249o127j82M977N171j604o916o39O173K084m519r58M442K647
$$ -3505 2782 5921 672 -5455 -5637 -660 4511 2907 -4009 -4648 1525 3609 -910 -1868 2574 5221
2743E221k708n676l618M438Q090m39o472r39M284J465k673j787J260M359J222
$$ 5221 2513 -3163 -6781 -2343 5747 5308 -1164 -2103 2181 3646 973 -814 446 4805 6027
2758F027o744o322L785Q773K442n177l378N90L324Q39m636k038N178M157n236
$$ 6027 -717 -7039 -3254 5519 7961 2784 -594 -4 3320 4159 -477 -2515 2663 6820 1584
2773A584o032J729N908L727j873m742k081M113J323m342k742M250L767j525m055
$$ 1584 -4448 -2719 3189 6916 5043 301 -1780 2333 3656 -686 -3428 822 4589 3064 -991
2788i91j106L249M964j006p166j864N830K615m731l261J471M692K939l671n067
$$ -991 -2097 1152 6116 5110 -2056 -3920 1910 4525 -206 -3467 -1996 2696 5635 1964 -3103
2803c103K179O025q10o526j707L706L520q3l917k891L375O035j573n764M23L446
$$ -3103 -924 5101 4291 -2235 -3942 -236 3284 3201 -716 -3607 -232 5803 4230 -1534 -1111 2335
2819B335J4l959k585J915N679K614n298n244L470N000j250l592n04J448J351j497
$$ 2335 2349 -1610 -4195 -2280 3399 6013 715 -4529 -1059 3941 2691 -901 -1405 43 1394 -103
2835a03m604k27P763M744n169o386k82L752J979j081l719N53L985m1n878j277
$$ -103 -4707 -4934 2829 7573 2404 -3982 -4264 -512 1467 386 -3333 -2780 1205 1164 -4714 -5991
2851e991O219M568k018n236l835J101M904O64m261L67M797J7m819j758K894M234
$$ -5991 228 4796 2778 -2458 -6293 -5192 -288 376 -3885 -3518 1279 1296 -3523 -5281 -2387 1847
2867A847J629m681o239J838N556N10l344M46L200J324j931m195j154N238M769
$$ 1847 3476 -1205 -7444 -5606 -50 460 -2884 -2438 762 2086 155 -4040 -5194 44 4813
2882D813m411o198J106N117J668j475k070M51L960N08m969l747M236M071j471
$$ 4813 402 -5796 -4690 427 2095 620 -1450 -999 2961 3469 -1500 -5247 -1011 3060 1589
2897A589l583m88K541L532k15m399j302M655K141m391l787K032L373J486k295
$$ 1589 -1994 -2482 59 3591 3376 -1023 -2325 2330 4471 80 -3707 -1675 1698 3184 889
2912H89l105J640N673k03o493k118L951L058j354k778j977K234M245r86m442Q32
$$ 889 -2216 -576 5097 4894 -1599 -3717 234 3292 1938 -840 -2817 -583 3662 2676 -1766 -934
2928i34M707M01m401l966P59M186L286l032m026K131M385j399m295O91L276J576
$$ -934 3773 4174 -227 -4193 -3434 752 4038 1006 -3020 -889 3496 2097 -2198 -1507 1769 3345
2944C345k342m939j731N105M936k330m306P50K818n23k355k054J025M698P81o456
$$ 3345 1003 -3936 -5667 -562 4374 2044 -2262 -1512 1306 783 -1572 -3626 -2601 2097 2878 -3578
2960c578l534M891N575j340l353j275O82J956j590m086O13O155J232n168l132
$$ -3578 -7112 -2221 3354 2014 -1339 -2614 -1932 24 -1566 -5652 -5039 1116 2348 -2820 -5952
2975e952J734L929K211j692m666m14M398k73n035n7M927L145j853m289j971M096
$$ -5952 -4218 -289 1922 230 -4436 -4850 -452 -725 -5760 -5817 -890 2255 402 -3887 -5858 -1762
2991a762M625k547n430M02M722L6l036p63K049L668J426m121l963K776M526j459
$$ -1762 2863 316 -5114 -4712 10 46 -2990 -3753 -1704 1964 3390 -731 -4694 -1918 2608 1149
3007A149l394m39K310L040k20l618j020N427L133m982m868K690M114k39k587j945
$$ 1149 -2245 -2684 -374 2666 2446 -1172 -2192 3235 6368 1386 -3482 -792 3322 3083 496 -1449
3023a449J745M704K46m670j481L645J944j587l012j039K191L426k24n248l0N788
$$ -1449 296 5000 5246 576 -905 2740 4684 3097 85 -954 1237 4663 4439 -809 -839 4949
3039D949K418m542l335J070K856J28k698k076L205M107k317m560J032L754J106
$$ 4949 7367 2825 -510 560 3416 3544 846 -1230 1975 6082 3765 -795 237 3991 5097
3054E097j272l052k231K284L672j939l356J550M849j0m636k937J789N109O76n236
$$ 5097 3825 773 -1458 826 4498 2559 -797 753 5602 5592 956 -1981 -192 4917 5593 357
3070C57l778L806L611k429j628J742J912N1k079l652r37M633K773l179l506P10
$$ 357 -3421 385 3996 1567 -61 1681 3593 3644 1565 -2087 -3024 1609 4382 1203 -2303 -1593
3086a593K451J182j251k317J333L892j807o989n83N979K940k830l113k17J982
$$ -1593 858 2040 789 -1528 -195 3697 1890 -5099 -5682 297 3237 407 -2706 -2923 -941
3101i41K354j341l358P65L494j204l748j876J985M123K121l018m457J409M793
$$ -941 1413 72 -3286 -2521 973 -231 -3979 -5855 -3870 253 2374 -644 -5101 -3692 1101
3116A101j312m132J83L221M63j957k868Q70M647K387l723l727K248K590j252j645
$$ 1101 -211 -4343 -4160 -939 -476 -2433 -5301 -4431 216 2603 -1120 -4847 -2599 -9 -1261 -2906
3132b906p71R84L040R69m166j687M419L742k781m094j39K442K719j285m235J99
$$ -2906 -3677 -2693 347 1316 -2850 -4537 -118 3624 843 -3251 -3390 -948 1771 486 -3749 -3550
3148c550N572J746m185k172K758J695m33k404j885J486M016j9l798j059L349J945
$$ -3550 2022 3768 -417 -2589 169 1864 1431 -973 -2858 -1372 2644 2625 -1173 -2232 1117 3062
3164C062p17j955j741J761K151k148l807J910N910K1m476k228J892L619Q89l393
$$ 3062 2345 390 -1351 410 2561 413 -3394 -1484 4426 4447 -29 -2257 -365 3254 4143 750
3180G50k726K861K060k982k358J569L732J394j190l444k625L473L770k136l739
$$ 750 -1976 885 2945 -37 -2395 -826 2906 4300 3110 -334 -2959 514 4284 2148 -1591
3195a591Q84K708l45k508o39K802M135j499n968j938M258K253k091j372R80N41
$$ -1591 -707 2001 1656 -852 -1491 1311 5446 3947 -2021 -3959 299 2552 461 -911 69 610
3211F10M80r01k037L95M044R44m456l291R27L423K254k398l162J908M254j879
$$ 610 1090 189 -1848 -1453 2591 3535 -921 -4212 -3285 138 2392 -6 -3168 -1260 2994 1115
3227A115m925O86M460N95k705k523k45K235K525p66k314O82K267m68k207j719
$$ 1115 -3810 -3124 1336 1931 -774 -3297 -3542 -1307 1218 452 -1862 -1180 1087 619 -1588 -3307
3243c307N47L154J718l904l056L753M832k651m139J146K851J031k659k812Q87
$$ -3307 -2760 394 2112 -1792 -4848 -1095 3737 1086 -3053 -1907 944 1975 -684 -3496 -2609
3258b609L555J323l036j160K444J615m85j316k935O40M213J206m463k688L749
$$ -2609 946 2269 -767 -1927 517 2132 1647 331 -2604 -1964 2249 3455 -1008 -3696 53
3273E3L354j758k456R42K500Q97l372l892J858N109M4l181n36J322N67K69n48
$$ 53 3407 1649 -807 135 2635 3532 160 -3732 -1874 3235 3279 98 -438 884 1451 1720 1172
3290A172j694J398K962j813m835j45M422K789r02l354j383L010K254l556k822
$$ 1172 -522 876 3838 2025 -2810 -2955 1467 4256 3354 0 -1383 1627 3881 325 -2497
3305b497L460L242k384l473l94K181L144J201l141k655K120J650j869k308R46
$$ -2497 963 4205 1821 -1652 -2046 135 3279 4480 1339 -1316 804 2454 585 -1723 -777
3320g77K603J319j755l986J85N567J711m465l111K182J782j163j787k72K241L169
$$ -777 1826 3145 1390 -2596 -2411 3156 4867 402 -2709 -527 1255 92 -1695 -1967 274 3443
3336C443j734m440j66L622J565j964k616m48J844J608j271l136J670M141n17l919
$$ 3443 1709 -2731 -2897 725 2290 326 -2290 -2738 -894 714 -557 -3693 -2023 2118 1601 -2318
3352b318j361J664K434n32l085k015L331L633k449l157J194K807K7j918j574j87
$$ -2318 -3679 -2015 419 -113 -3198 -5213 -1882 1751 -698 -3855 -2661 146 173 -1745 -3319 -3506
3368c506K558J196k850k330K919L277j98k642j896Q42K915K23l557j204M120J839
$$ -3506 -948 248 -2602 -4932 -2013 1264 1066 -1576 -3472 -2630 285 508 -3049 -4253 -133 1706
3384A706l170k395J778L301J107k402l041J95L412M10k717k43K422J066q03j571
$$ 1706 -1464 -3859 -2081 1220 2327 -75 -3116 -2921 491 901 -1816 -2059 363 1429 626 -945
3400i45j073K392L914j419n578q53L842J898j465j535J000K040P18l013k490L238
$$ -945 -2018 374 4288 2869 -2709 -3562 280 2178 713 -822 178 2218 2936 -77 -2567 671
3416F71L215j577k992l99J119J389J428j086j808J571K144j983l184R37L133Q02
$$ 671 3886 2309 -683 -1082 37 1426 2854 1768 -40 1531 3675 1692 -1492 -555 2578 3380
3432C380j770k860N17L904J345l639j367K936J340k397k049K11J646J714l08k781
$$ 3380 1610 -1250 -733 3171 4516 877 -490 2446 3786 1389 -660 -449 1197 2911 2603 -178
3448a78q93L313J277j607k428n18K135J225j571l476J626M040l95m011m24K982
$$ -178 -1071 2242 3519 1912 -516 -1034 1101 2326 755 -2721 -1095 2945 2550 -1461 -1885 1097
3464A097P51j490k058j068J665K230j211k346N61K255k40j114j275l3K016J426
$$ 1097 1848 358 -1700 -2768 -1103 1127 -84 -2430 -1869 386 146 -968 -2243 -2276 -260 1166
3480A166l463l177K740L748o10l244L24J364J420r78k136o19K830J407k670j720
$$ 1166 -2297 -5474 -2734 1014 404 -2840 -2516 -1152 268 -710 -2846 -3465 -635 772 -1898 -3618
3496c618J195K277O79Ok022l43K130P60k821j286K691J999j404j495k44J716K779
$$ -3618 -2423 -146 533 539 -1483 -1826 304 1064 -1757 -3043 -352 1647 243 -1252 -1496 220 2999
3513B999j073l141j08L203J54k560k93P77K104R65j372k485J208L184m35l103
$$ 2999 1926 -1215 -1323 1880 2034 -526 -819 -42 2062 3027 1655 -830 378 3562 3127 24
3529B4p18J601J676k39j873r42K175K666j930k644P57K201j14j605r77j38K128
$$ 24 -694 907 2583 2344 471 -471 1704 4370 2440 -204 553 2754 2640 1035 58 -80 2048
3546B048J606k232j976K314K025j518k286J17J006J322n08k659k93L208K045k444
$$ 2048 3654 1422 -554 1760 3785 2267 -19 98 1104 2426 1918 -741 -1034 2174 4219 1775
3562A775k439J143J744L57j352k354P49K999J63l121j008K798J573q34k002r70
$$ 1775 -664 479 2223 2580 1228 -1126 -377 2622 2785 -336 -1344 1454 3027 2193 191 -779
3578g79P46J993r34k646K68L012M13k025j186O67J638M55j969k733J602L136j504
$$ -779 -33 1960 1026 -1620 -1352 1660 2073 48 -1138 -471 1167 1622 -347 -3080 -1478 1658 154
3595A54k602k03K492J126o91k057j229K032K312k687k313J103K197R4j272j325
$$ 154 -2448 -2651 -159 967 276 -1781 -3010 -978 1334 -1353 -3666 -2563 -366 -272 -1544 -2869
3611b869n8K417J692l035k501K120J809j108j802K33J570J951p18k643l71K881
$$ -2869 -2927 -510 1182 -1853 -4354 -2234 -425 -1533 -3335 -3102 -1532 419 -299 -2942 -3313 -432
3627d32J284k787j579J420J296J77j246j227J439L095q7l382j359K507J407m49
$$ -432 852 -1935 -3514 -2094 -798 -621 -1867 -3094 -1655 1440 1353 -2029 -3388 -881 526 77
3643G7j805o63J624K268j052k658J396K673j87k219j430M04J865J275j438j798
$$ 77 -1728 -2391 -767 1501 449 -2209 -813 1860 1673 -546 -1976 -1572 293 1568 130 -1668
3659a668J401K740j322k348L62K077Q95j021k448o13K912J870j862k087J532J724
$$ -1668 -267 2473 1151 -1197 -835 1242 2137 1116 -1332 -1945 967 2837 975 -1112 420 2144
3675B144o8j399j394L20K565O4k595j572K816K052j009j920l09J230J354o02k640
$$ 2144 2076 677 -717 -397 2168 2232 -363 -1935 881 2933 1924 4 -305 925 2279 1677 -963
3692i63k60K761R94k122r64J275J289K65j619j931J182K703r03k818m31J948J346
$$ -963 -1223 1538 2532 410 -554 721 2010 2275 656 -1275 -93 2610 1707 -1111 -1542 406 1752
3709A752n64j576j18J806J229k560k187R76K555L81j846j109J80J377J213j589
$$ 1752 1188 -388 -506 1300 2529 -31 -2218 -1242 1313 1694 -152 -1261 -1081 296 1509 -80
3725h0j533J707J621j744k672L74J925J701m41j959j316K592J168j964j289J668
$$ -80 -1613 94 1715 -29 -2701 -2327 -402 1299 858 -1101 -2417 175 1343 -621 -1910 -242
3741b42J047j152j861o81J379K801M48k653j507J949J223j477o41j37J076J417
$$ -242 805 -347 -2208 -2889 -1510 1291 1739 -914 -2421 -472 751 -726 -1367 -1504 -428 989
3757I89j332k792J102L738M51k894j095Q47J219J13j195r69J439J981j293k094
$$ 989 -343 -3135 -2033 1705 2156 -738 -1833 -986 233 346 -849 -1818 -379 1602 309 -1785
3773a785R22J651N44m58j769j004J971J784k031k129J800K374k07j702j001J008
$$ -1785 -863 788 1332 874 -895 -1899 72 1856 -175 -2304 -504 1870 1663 -39 -1040 -32
3789c2J663Q9k824p50K367K020k152j502Q25J075J055l33j678j008K096P86j990
$$ -32 1631 1720 -1104 -1854 513 2533 381 -1121 -296 779 1834 1501 -177 -1185 911 1697 -293
3806b93q98J186K027k42j271j864R01K863k04k927k78K083K39j745j047J554J581
$$ -293 -1191 -5 2022 1780 509 -1355 -454 2409 2205 -722 -1000 1083 1322 -423 -1470 84 1665
3823A665J042j558k562J41K448O73j562n33Q3J056M80j575j423K388K599j668
$$ 1665 2707 1149 -1413 -1272 1176 1849 287 -246 -163 893 1373 -202 -1625 763 3362 1694
3839A694l620k1J948R83l61j261K05J148O30k115r63K092J212m89j759j015l05
$$ 1694 -1926 -1947 1 984 623 -638 -433 715 1345 -770 -1733 359 1571 1082 -677 -1692 -1997
3856a997K623J251k027j402K235J019j921j751O28K062J061j436k884O71K993
$$ -1997 626 1877 -150 -1552 683 1702 -219 -1970 -1342 720 1781 345 -2539 -1868 1125
3871A125M95k101k57J365K86o95q86q84L82K439l32k061l15J695J356j019j547
$$ 1125 1620 -481 -738 627 913 218 -668 -1552 -1170 1269 937 -1124 -1439 256 1612 593 -954
3888i54m35J661J308j826k252J698K268p94j727kJ241O76q1j790j133J672J645
$$ -954 -1389 272 1580 -246 -2498 -800 1468 674 -1053 -1055 186 862 781 -1009 -2142 -470 1175
3905A175q32j950J78J376Q71k22j306r78K859N69k945j991K460K302j147o21o76
$$ 1175 343 -1607 -1429 -53 818 596 -710 -1688 1171 1740 -1205 -3196 -736 1566 419 -202 -878
3922h78N20J271k04j744L51J871J51j894j020N83J509J487k81k621K14K018K38
$$ -878 -358 913 709 -1035 -684 1187 1338 -556 -1576 -993 516 2003 1722 -899 -685 1333 1571
3939A571k457J98J365J113j008j695r47K168K973j539k605N60J200n54o42k52
$$ 1571 -886 -688 677 1790 782 -913 -1860 308 3281 1742 -863 -303 897 343 -299 -551
3955e51K99J329L01j651j773J422K024j29j305q91O1R16L41j828R5K408J413k832
$$ -551 -252 1077 1378 -273 -2046 -624 1400 1271 -34 -925 -864 52 393 -1435 -1340 1068 2481 -351
3973c51k029J172J691M09r90j358K82J302K80j518l47J520J016l95j188q81J70
$$ -351 -2380 -1208 483 892 -98 -1456 -1174 128 408 -1110 -1457 63 1079 684 -504 -1385 -1215
3990a215K234J86k748m73K634J172j976j346J322J452K66j729j518J481K077j270
$$ -1215 1019 1205 -1543 -2016 618 1790 -186 -1532 -210 1242 1508 -221 -1739 -258 1819 549
4006E49j315L49J384Q5Np33j647J288J995o70k107K36J569Q09j376j647R77J963
$$ 549 -766 -417 967 1052 1057 324 -1323 -35 1960 1290 -817 -581 988 1797 421 -1226 -249 1714
4024A714R39k640j523K132J096j380p39P69O05K00l10j262o7J473J226j198j546
$$ 1714 2653 13 -1510 622 1718 338 -401 368 973 1173 863 -399 -466 1007 2233 1035 -511
4041e11n46J161R90N2j581L12K443p72k886k09K642J372j406j303l69P18J145
$$ -511 -1057 104 1094 1146 -435 -123 2320 1548 -1338 -1547 1095 2467 1061 -242 -611 107 1252
4058A252k77j132P83R46k61q93p28k64J531J573j438k757P31K584N6j883K49J285
$$ 1252 975 -157 626 1572 1311 418 -310 -574 957 2530 1092 -1665 -934 1650 1706 -177 72 1357
4076A357j08q55j454K0K278O08j299j117K32P01m6L85p10j085J155P32j560j318
$$ 1357 1249 394 -1060 -1040 1238 1846 547 -570 -338 363 317 702 -8 -1093 62 794 -766 -2084
4094b084J893J380k65j777l33M06J303j43k261q1K157L3j256l70Q12L11M78k70
$$ -2084 -191 1189 924 -853 -1186 -780 523 380 -1881 -1962 195 228 -1028 -1398 -586 -275 203 -67
4112f7j490pJ385O13k087J4Q48P08j03r61n39R76J579j227k043P84J865m7j402
$$ -67 -1557 -1564 -179 434 -1653 -1639 -791 -83 -186 -1147 -1686 -710 869 -358 -2401 -1617 248 201 -1201
4131a201l70L44R30J124j273j515J068R88p53o40k30O88O77l0j308j048K197J325
$$ -1201 -1571 -1227 -297 827 -446 -1961 -893 95 -658 -1298 -1528 -840 -163 -193 -1501 -2549 -352 973
4149I73j001j452j35R26L63r53l43K96J781J99k753m76J815J254o27p82k76j62
$$ 973 -28 -1480 -1615 -689 -326 -1279 -1622 -1326 455 654 -2099 -2575 -760 494 -133 -915 -1191 -1353
4167a353J166j48j696N85K041J83j395j387L57J279J105n23k026O22K140n89j605
$$ -1353 -187 -335 -2031 -1446 595 778 -617 -2004 -1647 -368 737 214 -1812 -1190 950 361 -1244
4184a244R28J360L11q72j029o82J420J229rj901J88J524k69j52n76P4J561N99
$$ -1244 -316 1044 1355 483 -546 -1228 192 1421 1412 -489 -301 1223 954 802 226 300 1861 2460
4202B460j978j910J927J956o37j711L72J126P25j017j122j39J625O59j949p69
$$ 2460 482 -1428 499 2455 1818 107 479 1605 2330 1313 191 52 1677 2336 387 -382
4218c82Q45Q93L03n8j293m18J855L07k240r84J730J382j146j050k21J221R30j324
$$ -382 463 1356 1659 1601 308 -110 1745 2052 -188 -1172 558 1940 794 -256 -477 744 1674 350
4236C50j633O60J945l92j619o79P62R03K10o81j237Q65J405o04j874l49J706P48
$$ 350 -1283 -623 1322 930 -689 -1368 -606 297 507 -174 -1411 -546 859 255 -1619 -1968 -262 486
$$ [...]
8191E8
##END NTUPLES=NMR FID
##END=
