##TITLE=1H_CA-8742-1
 CDcl3, 8 sc, 
 4.7.2020
##JCAMPDX= 6.0         $$ Bruker NMR JCAMP-DX V2.0
##DATA TYPE= NMR FID
##DATA CLASS= NTUPLES
##ORIGIN= UXNMR, Bruker Analytische Messtechnik GmbH
##OWNER= root
$$ XWIN-NMR		Version 3.5
$$ Tue Aug  4 13:35:26 2020 Russian Standard Time (UT+4h)  she@DPX200
##.OBSERVE FREQUENCY= 200.1314999998
##.OBSERVE NUCLEUS= ^1H
##.DELAY= (6, 6)
##.ACQUISITION MODE= SIMULTANEOUS
##.ACQUISITION SCHEME= undefined
##.AVERAGES= 8
##.DIGITISER RES= 18
##SPECTROMETER/DATA SYSTEM= spect
##.PULSE SEQUENCE= zg30
##.SOLVENT NAME= D2O
##.SHIFT REFERENCE= (INTERNAL, D2O, 0, 15.7039)
##AUDIT TRAIL= $$ (NUMBER, WHEN, WHO, WHERE, WHAT)
$$ ##TITLE= Audit trail, XWIN-NMR		Version 3.5
$$ ##JCAMPDX= 5.01
$$ ##ORIGIN= Bruker BioSpin GmbH
$$ ##OWNER= she
$$ F:/spectra/data/she/nmr/H-F/1/audita.txt
$$ ##AUDIT TRAIL=  $$ (NUMBER, WHEN, WHO, WHERE, WHAT)
(   1,<2020-08-04 13:34:16.26 +0400>,<she>,<DPX200>,
      <created by zg, POWCHK disabled, PULCHK disabled
       configuration hash MD5:
       00 E9 B6 7A A2 85 ED C7 34 08 36 98 17 FE 4E 26
       data hash MD5: 16K
       BC 45 E9 3F D9 67 B3 87 76 28 A0 C2 E9 71 88 08>)
$$ ##END=
$$ 
$$ hash MD5
$$ 35 74 0F C4 A2 20 7D 71 22 F4 CC 15 05 EF 4D BF
##$RELAX= 
##$RELAX= 
##$RELAX= 
##$RELAX= 
##$RELAX= 
##$RELAX= 
$$ Bruker specific parameters
$$ --------------------------
##$DU= <F:/spectra>
##$EXPNO= 1
##$NAME= <H-F>
##$PROCNO= 1
##$TYPE= <nmr>
##$USER= <she>
##$AMP= (0..31)
100 100 100 100 100 100 100 100 100 100 100 100 100 100 100 100 100 100 
100 100 100 100 100 100 100 100 100 100 100 100 100 100 
##$AQSEQ= 0
##$AQ_mod= 1
##$AUNM= <au_zg>
##$AUTOPOS= <>
##$BF1= 200.13
##$BF2= 200.13
##$BF3= 200.13
##$BF4= 200.13
##$BF5= 200.13
##$BF6= 200.13
##$BF7= 200.13
##$BF8= 200.13
##$BYTORDA= 1
##$CFDGTYP= 0
##$CFRGTYP= 5
##$CHEMSTR= <none>
##$CNST= (0..31)
1 1 145 1 1 1 1 1 1 1 1 1 1 1 1 1 1 1 1 1 1 1 1 1 1 1 1 1 1 1 1 1 
##$CPDPRG= <>
##$CPDPRG1= <>
##$CPDPRG2= <>
##$CPDPRG3= <>
##$CPDPRG4= <mlev>
##$CPDPRG5= <mlev>
##$CPDPRG6= <mlev>
##$CPDPRG7= <mlev>
##$CPDPRG8= <mlev>
##$CPDPRGB= <>
##$CPDPRGT= <>
##$D= (0..31)
0 1.2 0 0 0 0 0 0 0 0.06 0 0.03 0 0 0 0 0.0002 0 0 0 0 0 0 0 0 0 0 0 0 
0 0 0 
##$DATE= 1596533655
##$DBL= (0..7)
120 120 120 120 120 120 120 120 
##$DBP= (0..7)
150 150 150 150 150 150 150 150 
##$DBP07= 0
##$DBPNAM0= <>
##$DBPNAM1= <>
##$DBPNAM2= <>
##$DBPNAM3= <>
##$DBPNAM4= <>
##$DBPNAM5= <>
##$DBPNAM6= <>
##$DBPNAM7= <>
##$DBPOAL= (0..7)
0.5 0.5 0.5 0.5 0.5 0.5 0.5 0.5 
##$DBPOFFS= (0..7)
0 0 0 0 0 0 0 0 
##$DE= 6
##$DECBNUC= <off>
##$DECIM= 24
##$DECNUC= <off>
##$DECSTAT= 4
##$DIGMOD= 1
##$DIGTYP= 9
##$DL= (0..7)
0 120 120 120 120 120 120 120 
##$DP= (0..7)
150 150 150 150 150 150 150 150 
##$DP07= 0
##$DPNAME0= <>
##$DPNAME1= <>
##$DPNAME2= <>
##$DPNAME3= <>
##$DPNAME4= <>
##$DPNAME5= <>
##$DPNAME6= <>
##$DPNAME7= <>
##$DPOAL= (0..7)
0.5 0.5 0.5 0.5 0.5 0.5 0.5 0.5 
##$DPOFFS= (0..7)
0 0 0 0 0 0 0 0 
##$DQDMODE= 0
##$DR= 18
##$DS= 0
##$DSLIST= <SSSSSSSSSSSSSSS>
$$ [...]
##$SUBNAM2= <"">
##$SUBNAM3= <"">
##$SUBNAM4= <"">
##$SUBNAM5= <"">
##$SUBNAM6= <"">
##$SUBNAM7= <"">
##$SUBNAM8= <"">
##$SUBNAM9= <"">
##$SW= 24.9337058888022
##$SWIBOX= (0..15)
0 0 2 0 0 0 0 0 0 0 0 0 0 0 0 0 
##$SW_h= 4990.01996007984
##$TD= 16384
##$TD0= 1
##$TE= 0
##$TE2= 300
##$TE3= 300
##$TEG= 300
##$TL= (0..7)
0 120 120 120 120 120 120 120 
##$TP= (0..7)
150 150 150 150 150 150 150 150 
##$TP07= 0
##$TPNAME0= <>
##$TPNAME1= <>
##$TPNAME2= <>
##$TPNAME3= <>
##$TPNAME4= <>
##$TPNAME5= <>
##$TPNAME6= <>
##$TPNAME7= <>
##$TPOAL= (0..7)
0.5 0.5 0.5 0.5 0.5 0.5 0.5 0.5 
##$TPOFFS= (0..7)
0 0 0 0 0 0 0 0 
##$TUNHIN= 0
##$TUNHOUT= 0
##$TUNXOUT= 0
##$USERA1= <user>
##$USERA2= <user>
##$USERA3= <user>
##$USERA4= <user>
##$USERA5= <user>
##$V9= 5
##$VALIST= <valist>
##$VCLIST= <CCCCCCCCCCCCCCC>
##$VD= 0
##$VDLIST= <DDDDDDDDDDDDDDD>
##$VPLIST= <PPPPPPPPPPPPPPP>
##$VTLIST= <TTTTTTTTTTTTTTT>
##$WBST= 1024
##$WBSW= 4
##$XGAIN= (0..3)
0 0 0 0 
##$XL= 0
##$YL= 0
##$YMAX_a= 1025603
##$YMIN_a= -649783
##$ZGOPTNS= <>
##$ZL1= 120
##$ZL2= 120
##$ZL3= 120
##$ZL4= 120
##$ABSF1= 10
##$ABSF2= 0
##$ABSG= 5
##$ABSL= 3
##$ALPHA= 0
##$AQORDER= 0
##$ASSFAC= 0
##$ASSFACI= 0
##$ASSFACX= 0
##$ASSWID= 0
##$AUNMP= <proc_1d>
##$AZFE= 0.1
##$AZFW= 0.1
##$BCFW= 1
##$BC_mod= 2
##$BYTORDP= 1
##$COROFFS= 0
##$CY= 11.3945322036743
##$DATMOD= 1
##$DC= 2
##$DFILT= <>
##$DTYPP= 0
##$F1P= 16.9975609425685
##$F2P= -3.02152046262296
##$FCOR= 0.5
##$FTSIZE= 0
##$FT_mod= 4
##$GAMMA= 1
##$GB= 0.15
##$INTBC= 1
##$INTSCL= 1
##$ISEN= 128
##$LB= 0.24
##$LEV0= 0
##$LPBIN= 0
##$MAXI= 10000
##$MC2= 0
##$MEAN= 0
##$ME_mod= 0
##$MI= 1.114404
##$NCOEF= 0
##$NC_proc= 0
##$NLEV= 6
##$NOISF1= 3.799351
##$NOISF2= 2.8
##$NSP= 1
##$NTH_PI= 0
##$NZP= 0
##$OFFSET= 15.70392
##$PC= 1
##$PHC0= -9797.053
##$PHC1= 14.80093
##$PH_mod= 1
##$PKNL= yes
##$PPARMOD= 0
##$PSCAL= 0
##$PSIGN= 0
##$REVERSE= no
##$SF= 200.130013532006
##$SI= 16384
##$SIGF1= 3
##$SIGF2= 2
##$SINO= 400
##$SIOLD= 16384
##$SREGLST= <1H.CDCl3>
##$SSB= 0
##$STSI= 0
##$STSR= 0
##$SW_p= 3612.71676300578
##$SYMM= 0
##$S_DEV= 0
##$TDeff= 0
##$TDoff= 0
##$TI= <>
##$TILT= no
##$TM1= 0
##$TM2= 0
##$TOPLEV= 0
##$USERP1= <user>
##$USERP2= <user>
##$USERP3= <user>
##$USERP4= <user>
##$USERP5= <user>
##$WDW= 1
##$XDIM= 8192
##$YMAX_p= 0
##$YMIN_p= 0
$$ End of Bruker specific parameters
$$ ---------------------------------
##NTUPLES= NMR FID
##VAR_NAME=  TIME,          FID/REAL,        FID/IMAG
##SYMBOL=    X,             R,               I
##VAR_TYPE=  INDEPENDENT,   DEPENDENT,       DEPENDENT
##VAR_FORM=  AFFN,          ASDF,            ASDF
##VAR_DIM=   8192,          8192,            8192
##UNITS=     SECONDS,       ARBITRARY UNITS, ARBITRARY UNITS
##FACTOR=    0.0002004,     1,               1
##FIRST=     0,             0,               0
##LAST=      1.6414764,     0,               0
##MIN=       0,             -649783,         0
##MAX=       1.6414764,     1025603,         0
$$ Real data points
##PAGE= N=1
##DATA TABLE= (X++(R..R)), XYDATA
$$ [...]
3147b966N715K336l199o294k875M600Q924N08r907p268N689J1334L158p784j1373
3162i402J753J2964O805q947j1896M24J0472P617l867j0587k545R610Q001m199
3176F203r019l853L839P852M326m833p639j430L877N906L618l100q516k407O969
3191A793O144k608p676l248O328J0989l77j3264q806P404J3758K823j1017j2166
3205i923J642J4024P778q486j1543O89Q958O207l153j0174m053O664P917r40o270
3220f63l933L95O013N613k185q744m493L169P714N003n108j0931k010J0721Q636
3235I197m325j1024m865P293J1704q70j3684q242Q901J3189K027j0129j0656J983
3249i501J1629N919p690r550M02P415O296j403p444n121L969P449K447m067n935
$$ y = [-2966, 2749, 5085, 1886, -4408, -7283, -2683, 6241, 6749, -3158, -10426, -4737, 6597, 9755, 1971, -9402, -7649, 5315, 12120, 3173, -8723, -8299, 2173, 9790, 5923, -4664, -7209, 2401, 10402, 6203, -2816, -6669, -2830, 5022, 9348, 4515, -3124, -4554, -677, 5229, 8847, 5747, -2769, -5176, 1793, 7937, 5329, -2347, -5595, 733, 11722, 11345, -1919, -10725, -3321, 10437, 13260, 2243, -9923, -8281, 5743, 13521, 5035, -6508, -5819, 3139, 9346, 6193, -3981, -8034, -1370, 6547, 5607, -663, -4596, -4201, 1812, 7425, 5240, -3504, -7997, -4828, 2886, 7889, 2781, -8150, -10160, 561, 9197, 4872, -6152, -11017, -3724, 7980, 7110, -6574, -14816, -5915, 7274, 9301, -828, -11484, -9501, 2128, 8047, 357, -9193, -8791, -1376, 4920, 3517, -3927, -9048, -5079, 2370, 4817, 750, -5185]
3264e185l874M043Q190J803p254n676K753P806M876o128j1126r43J1942Q847n380
3279D694j1592m552Q318J1610N76j1179p326O168R122L36p229n450K031Q469M158
3294H154n385o087j30M420M362P62m506n939L08O545N202r19n979n957K767R807
3310G425L142p986p770J775Q386M571n133r212K33J0771O245o338r879k366O975
3325H39Q306p05q721m975M563N814L69k734k851j048K871K455j563l668j583J08
3341b523L287M735p03o510l743L691O197N06o060o168K045R153K931p682p314
3356h158J929Q031M520m524q695j278O960M345l170n076L43L172L307j351l268
3371b913k012K150J364k88O31o79k612p85L507L486l45m056m168J995O615K083
$$ y = [-5185, -9059, -5016, 3174, 4977, -2277, -7953, -5200, 2606, 7482, 1354, -9772, -10715, 1227, 10074, 4694, -6898, -11450, -3132, 8478, 9054, -2125, -9451, -3283, 5839, 6175, -1054, -6504, -4473, 3996, 8154, 2769, -3318, -3448, 972, 5334, 6096, 1590, -4349, -4041, 2504, 7706, 6787, 808, -5149, -2382, 7425, 10567, 2581, -5189, -3414, 4972, 9543, 4410, -4802, -4569, 6202, 12447, 6109, -3770, -6136, 839, 9145, 8440, -281, -5256, -693, 5121, 5490, 2756, -95, -1143, 1728, 4183, 2620, -1048, -2631, -2523, 764, 5499, 4796, -1714, -5457, -1766, 4431, 4937, -1123, -7291, -5246, 3907, 6838, -844, -8158, -6229, 1802, 6322, 1798, -6897, -8175, -1215, 3130, -40, -5116, -4773, -1601, 1706, 355, -2913, -4925, -2775, -1411, -1699, -1068, -1747, -4359, -5144, -1637, 1849, 1504, -2552, -6720, -4725, 1890, 3973]
3387C973o797n751L314P001K297m350n530O07P028K388n805n316K278N643K590
3402C570k809m506j017M125K588j213j128M23k033q29J449J677R64j460j779M10
3418a568M538J006n623l929L481O099P85m383n438J522P040L487n328n855K331
3433a835N260J671l224m810m24N384L390k229k175k30N11O00Q13p2r22n70j81
3450I57Q10K739K94m182k392M285M784m70n582m551K242O811K654o299n234L064
3466g0O280K006m704n592j53N886L148l748m567N91L160J679j5k682k212J152
3482A59K256L90r52j919k908l98N371L308k983n046j722L342M795j68p568l424
3498g467N172O342j025o127m417K890P546K076o640o157J568N547J952k727l647
$$ y = [3973, -2824, -8575, -5261, 1740, 4037, -313, -5843, -5236, 1792, 4180, -1625, -6941, -4663, 980, 3570, 761, -3745, -4762, -637, 1951, 738, -390, 33, -2000, -2829, -1380, 297, 1261, -199, -1978, -1568, 2970, 3976, -1647, -5576, -2095, 4004, 4789, 406, -5032, -3510, 3530, 7017, 1689, -4166, -1835, 3425, 5096, 1872, -2938, -3362, 2022, 5412, 3183, 1008, 778, 1289, 1889, 2702, 2630, 1708, 1138, 957, 1767, 4506, 4800, 618, -1774, 2511, 7295, 6825, 1243, -3308, -1066, 5745, 8399, 2100, -3134, -70, 6210, 8216, 3512, -2080, -2233, 3653, 6801, 3053, -1514, -923, 2237, 3916, 3901, 1219, -993, 159, 2415, 2805, 1853, -66, -2974, -3372, 1999, 5307, 2324, -2722, -4444, -1102, 3693, 3525, -4043, -7467, -2295, 4047, 3022, -3105, -7522, -4632, 2914, 4990, -1650, -7807, -6239, -692, 1260, -1467, -5114]
3513e114j038M234L753j351l792k192O17K513L169m20m417k675K328M250J987
3528A852k570n142o75O546M014m625o642p90O448O763j198q380m257N628P733
3543D705r25o422l897K086O372K646m409n042J524M401K382j058l348k227J203
3558b009L902J256k130k847j376K978N850P36o376n509K619O282L607l867p103
3573c987j131P796N754m677o998n29N677N803j981p834m154N514P097l07m705
3588A338l243J150L653K385k734m107K06K170K577O70j630m063q25M407L952r56
3604D950m571l961J515N938K016n768n354L203O939K382m698p338r05P713N745
3619G806m100p862j363N286M881k42n396l366L592M177p47l555k382M43K452K609
$$ y = [-5114, -6152, -1918, 1835, 484, -3308, -5500, -4883, -2370, 799, 379, -4038, -6713, -4385, -135, 1852, -718, -5860, -6535, 11, 4025, -600, -7242, -8032, -1584, 5179, 3981, -4399, -8656, -3028, 4705, 3780, -2642, -6539, -4453, 1919, 4565, 156, -4886, -3362, 1039, 3421, 2363, -985, -3212, -2009, 1893, 3149, 1019, -1828, -3204, -226, 5624, 6360, -16, -5525, -2906, 3376, 6983, 3116, -3987, -5118, 2678, 8432, 3755, -3243, -3772, 1905, 7708, 5727, -2107, -6261, -747, 6350, 6043, 1338, -1905, -755, 2898, 5283, 2549, -1558, -1352, 818, 3395, 4065, 2435, -1628, -2453, 1954, 5906, 4950, 379, -3582, -2067, 3871, 5887, 119, -5235, -2032, 4907, 7289, 2591, -4747, -5652, 2061, 7806, 3706, -4156, -5519, -233, 4648, 4406, -990, -4356, -764, 3413, 2666, -889, -3271, -2828, -376, 2233]
3635B233m88l207j226N01K759K206j054n507k572M408N589N3m826n199J294O896
3651A860L524n133o139J328N626K721l760n708K25O355M851l444o038j689L298
3666b123L677P66k825k587O01K649R15p04r93j203L59K824J500k508l153j147
3682c952K527M513J125n039l605K935N002L12m779l543J112N849L052n052n469
3697e012J337N581K387j622m289j892K985L458j650k502o22J049J334J491k20
3712A813k514o17O76J661J250j011l597j215M421L773j610m357k666K527N371
3727C905J344n511m173K431M579J013l168k663Q71M128J463l591l907Q06L295
3742H22J796K10k490k514m7K291J520N78n75k526j587K704J798j604k471j02K941
$$ y = [2233, 1745, -1462, -2688, -2187, 572, 2778, 1724, -3783, -6355, -1947, 3642, 3695, -1131, -6330, -5036, 1860, 5384, 251, -5888, -4560, 1066, 3787, 27, -5681, -5456, 899, 5750, 2306, -3732, -5421, -2123, 1554, 2320, -505, -3092, -2491, 158, 1073, 369, -624, -1827, -1468, 1356, 2856, 348, -2805, -3952, -1425, 3088, 4213, -826, -4431, -1496, 3506, 3818, -961, -4504, -3392, 2457, 5509, 457, -5012, -3675, 1906, 4293, 2671, -1618, -3510, -525, 2933, 1283, -1219, -1841, -792, 542, 2033, 1813, -701, -1318, -642, 1019, 2269, 1258, -2339, -3554, 867, 4640, 3030, -1327, -3993, -1466, 3905, 5249, -262, -4435, -2004, 2575, 3588, 420, -2243, -1372, 2756, 4219, 628, -3279, -2473, 822, 2618, 2828, 338, -2176, -2223, 68, 1588, 2166, 1591, -935, -2522, 182, 1980, 376, -2095, -2197, 744]
3759G44K915j418n253k187M076N300j245m867l029K310M224J260l573l420J947
3774b216L598R7j843k370m46K069J459o93j613J82L14N51J421O8k524k034J461
3791b519L133J578j517m068j306M817M401k296n181j221L614M082k43n420k892
3806e038M116N066l48l603k625J540L033R42k784k225K002K235K53k09j599j296
3822e40O8K866J810m73k606k867l31M135L525k399l705k05L018K060j683m133
3838a460r99M644L812l065n436q62M268L652K98m684l397K305L838n11k538j419
3854a554K10J739J223o31j432n74O56K87N27K68k494j333J901K948J78k253l538
3871c872j04M803L436l746n151j71M052L329j772l955j601M868L596k721m701
$$ y = [744, 3659, 2241, -3012, -5199, -1123, 4177, 2932, -1935, -4964, -2654, 1570, 2830, -743, -4163, -2216, 1382, 1479, -364, -2734, -3180, -1111, 348, -345, -1958, -1776, -1462, -911, 510, 578, -1946, -3980, -2519, 614, 2192, 675, -3393, -4699, 118, 4519, 2223, -2958, -4179, -565, 3517, 3274, -2146, -5038, -922, 4144, 3796, 193, -2432, -892, 2141, 3083, 299, -1926, 76, 2311, 2564, 2355, 756, -540, -472, 2394, 4204, 3731, 1125, -1742, -2073, 2062, 5587, 3188, -517, -722, 2296, 4356, 2673, -1460, -2459, 2185, 5997, 2932, -2504, -3366, 902, 4554, 4852, 168, -3229, -924, 2914, 2403, -135, -1554, -1344, 395, 1618, 987, -445, -1019, -363, -76, 451, 719, -1775, -3108, -1207, 1741, 1919, -334, -3872, -3976, 827, 4263, 517, -4634, -4805, -753, 2576, 804, -3151, -4752, 116, 3712, 991, -3710]
3886c710j053L114K947N35k927k725J391K332K92o13m99o45k94J373J177j682
3902i87j330m28R56L225J547l496l818J275L884J428k191l391l57M152L141l594
3918A6m147J069L931K422j909l815j843L031K898o47k085m61J344L7J149m30j408
3935h48oQ25K88M33M6j708j088K703K705j205k185k432J660M260J528l960m336
3952c320J567M575J657j912k927m00K701K014k668k846J372L203M49j064k321
3967H0r87J425K262N12m98p21j834j799K223K580p69j807r39Q97K393J53l111
3984F0k389K297M118q16l686k073J327L564J848l443l612J261L443M38k204j735
4000a602m08J805J761n14j772J11K03m78Q00Q08j527j163J17J305J251m29k560
$$ y = [-3710, -4763, -1649, 1298, 1833, -1094, -3819, -2428, -96, 196, -417, -916, -1561, -1855, -482, 695, -987, -2317, -2745, -1789, 1436, 2983, -513, -4331, -3056, 828, 2256, 65, -3326, -3683, 469, 3610, 16, -4131, -3062, 869, 3291, 1382, -2433, -4276, -1245, 1653, 1006, -1079, -1540, -196, -159, 990, 560, -848, -854, -29, 259, 692, 738, -970, -2058, 645, 3350, 2145, -40, -2472, -812, 3448, 4976, 1016, -3320, -1753, 2822, 4479, 2567, -360, -760, 1941, 3955, 1287, -1559, -187, 3016, 3465, 2401, 80, -907, 518, 2780, 3292, 2794, 2073, 239, -1560, 663, 3243, 2474, 667, -272, 625, 3018, 3171, 60, -2329, -32, 4086, 3270, -416, -2489, -1162, 2402, 4250, 807, -2805, -1544, 1899, 2337, 133, -1602, -2010, -205, 1556, 1042, -730, -619, -416, -894, -94, 714, -813, -1976, -1859, -554, 697, 268, -2292]
4017b292j581L046L528j591m141j583K337L379J69l517k863K540M832l99l587
4032a723k561R88K871J362j947k274O49J871P1p52L7n54J52J156N42j046p13j698
4050c569pL295K881j747m545n54K578L089L03l522k225K765L886j394m239r53
4066c958L027M033K23m298k892J697M293J97k034j344J25J770J281m17j611k2
4082G0O17K88O87O19j525j439J382K343J50j611k799J46L885K960k847n319j91
4099b584M296L358r83l792k340L084L593j157m209j000K461L083n4k956k679J088
4115g91L331M42p38j369j121j77J735R54j230j461j95J194K240J70l393k838J798
4132a449L666J114k492l309k21L672K682k888l736P44L311K010k024l467j404
$$ y = [-2292, -3873, -827, 2701, 1110, -3031, -4614, -2277, 1102, 1271, -2246, -5109, -2569, 2263, 1864, -1723, -4284, -3296, -425, 937, -1010, -3284, -2635, -764, -693, -1445, -1408, -1962, -1810, -654, -112, -1158, -1871, -3569, -3576, -281, 2600, 853, -3692, -4246, -1668, 1421, 1724, -1798, -4023, -1258, 2628, 1234, -3005, -3958, -931, 3102, 3325, -973, -3865, -2168, 2125, 2322, 288, -1056, -931, 839, 2120, 1703, 92, 70, 687, 975, 1662, 2281, 756, -683, 699, 3042, 3192, 1581, -1218, -1072, 2813, 5773, 2926, -2393, -2584, 1712, 5070, 4087, 295, -2045, 1039, 4632, 3475, -734, -1734, 727, 3810, 3756, 800, -1879, -791, 2540, 2982, 2244, 875, -246, -423, 1312, 2266, 1036, -425, -620, 574, 2814, 2984, -409, -3247, -1449, 2217, 3331, 839, -2470, -2691, 981, 3663, 775, -2961, -2217, 1094, 3104, 1080, -2387, -3791]
4147c791K849L875p79l213j516Q66J953J008q51j950o60J563Q42J10n84j385m36
4164b099K109J994j873k384k73J458K690J73l576k941K544M447N32k686l063k28
4180c176L150K505k329k674M19K472J110j561j803j166K384K868o76k758j339
4195b574O17P53K230O86k044j414M36J222Q45l41k070q44K523K235j517l046n24
4212b827K429K450N88l386k255J994L234k91k551j349Q80K395J252k155k237N14
4228a315K299N64o57j180m11P53Q84j98m80k44J18l86J289Q01j666j314O7J514
4246D38J295m14j873j249K368K670j626k848n71J476J778P28k270j842J511K313
4262A884j112j725L24R92Q71k38j977j240J783J176l80j01N00j042j000J65L82
$$ y = [-3791, -942, 2933, 2154, -1059, -2575, -1709, 244, 1252, 401, -1549, -2209, -646, 196, 306, -278, -1663, -2099, 10, 2004, 131, -2253, -2526, -1068, 1622, 1795, -1781, -4722, -2178, 2269, 2801, 115, -2948, -3176, -26, 2479, 150, -2524, -2105, 367, 1477, -84, -1887, -3053, -669, 2199, 1523, -1235, -2574, -1957, -1204, 1026, 1712, -332, -1746, -1310, -88, 757, 416, -1654, -2498, 25, 2260, 743, -2303, -2827, -398, 2052, 2640, -746, -3001, -1007, 2227, 1936, -615, -1964, -1084, 1311, 2563, 408, -1829, -1315, 984, 1548, 891, -289, -700, 53, 937, 739, 259, 15, 133, -253, 1036, 1837, 171, -1143, -1076, 438, 1733, 1319, -554, -1803, 565, 3235, 1609, -1239, -1810, -334, 1444, 2172, -98, -1940, -429, 1884, 772, -953, -629, 363, 1234, 996, -981, -2221, -438, 738, 358, 257, 757, -285, -1285, -1120, -738]
4279g38J395L68j234j342M95J724k81j975O55J207Q29p08j771j174J367K722o08
4296I31k050K7P74P01R4j041o86J080Q12j341l24R23O99n34n74KN52J277q60j691
4316a229K71K255m06j496k04R69J084O82j232k242N31K557o6j571m32O78R64o0
4334A053o27j168R17J775j052p20P52l78p07P6M84N83M19l45j147K5J927k64k516
4353i13o5J414J719J33k303k014J237L224K31k134j471Q49R18K18q46j398Q04
4370c97K162J93j458j023j32P18R36M69o92j149l60K94Q52J417j357k271L80K236
4388H18R92j235k010r53J987K184p75l154m55K745J364q47k188j674J284L590
4404A673j95k986j314P18J661R98l63j869n75J436P22j020j75q55n0J526J962
$$ y = [-738, 657, 1025, -209, -1551, -1056, 668, 387, -1588, -933, 274, 1103, 395, -1376, -2550, -1183, 1539, 931, -1119, -1092, -318, 383, 477, -564, -1250, -170, 642, -699, -1023, -100, 599, 65, -509, -507, 45, 1322, 462, -1229, -958, 1297, 891, -605, -809, 160, 1244, 1926, 694, -1548, -1017, 1540, 1474, -97, -529, 149, 1113, 1053, 426, -742, 175, 1950, 898, 178, 930, 552, -155, -79, 405, 988, 1407, 1062, -85, -60, 1867, 1603, -913, -978, 436, 2155, 2288, -15, -2029, -792, 2432, 2663, 529, -942, -93, 825, 1043, 197, -1201, -397, 1765, 1958, 500, -523, -655, 63, 999, 1468, 776, -373, -733, -439, 413, 1830, 473, -1798, -1418, 818, 1810, 575, -1435, -2388, -401, 1783, 1008, -2146, -2601, 144, 1508, 661, -1527, -3201, -1917, 1673, 1478, -1508, -2822, -2104, -443, 555, 192, -1677, -2252, -816, -94, -1114, -1289, -2144, -2194, -668, 1294]
4421A294j443j776q37J334J657R55j994k591J130L104N46k430j988L58L274K372
4437B965j968m153KL075J954o55k130j044J535K529m13k508q20J219J034J450
4453B072o58k184j185J450K501L8q05j755o54J467K758j295k866m19K039K011
4469B515M99k504l053J758L570J72k558k654J183K634K092j912l964L99L138J816
4485C131j316k487n68Q14K083J08j993o49J014J340M08m95k144r17J380K285M2
4502B036j350j642r63K146K543p39l399k90K269K108n45l251k132K351M109j67
4518C084l444j783R55K628J220k283k767J064K887O01j932j263m57J490J699Q
4534A707k226m54L84L56L72P59j306j410J172J518J20j517j227k45K169J850j305
$$ y = [1294, -149, -1925, -2762, -1428, 229, 1184, -810, -3401, -2271, 833, 1379, -1051, -3039, -2681, 593, 2965, 997, -3156, -3154, -79, 1875, 1220, -910, -1954, -419, 2110, 1697, -811, -1631, -412, 622, 2072, 1414, -770, -1955, -505, 1996, 2034, 1229, -526, -1180, 287, 3045, 1750, -1116, -1535, 504, 2515, 3014, 510, -2543, -785, 2785, 2957, 399, -2255, -1072, 1562, 3654, 1742, -2222, -1823, 1315, 3131, 1815, -672, -1240, -426, 1657, 1765, -228, -877, 137, 1477, 1885, 1390, -754, -1671, -291, 1994, 2036, 686, -956, -1919, 227, 2770, 2031, -1368, -1658, 611, 2719, 2174, -1077, -3209, -858, 3251, 3084, -360, -2143, -1188, 1440, 2660, 377, -2390, -1326, 1561, 2162, 230, -1033, -1490, 0, 1699, 1707, -519, -973, -589, -233, 139, 898, -408, -1818, -646, 872, 992, -525, -1752, -1997, 172, 2022, 717]
4551G17l350l66K949J873q02k787j221J772L265r13k985j036J611J725j8j256
4567h22j933J290K149K1k250k75M28J021P84p9j453n21Q84M31O88L70r66j706
4585a939J075J525m5j187q24K94K175J016j789k454Q08K615N81j177j555l37J791
4602E73J788j571j958N36J652Q14p91j039q51O91J463l48p95P33k5l20l9K90o12
4621A91J17N05l83N89l50p61n84J404J227q04j406l76P48J628m99j370j541J725
4639F0K198j423j185o50R89J145k30j819q25J720J452r58j628l4O50P49K27q96
4657d58l59M61K22q01O4N03L2k7K12J12o36lo03K20J069P53j456r37N99J377L4
4678C78j302p50M16K338M45k346j426J248J780O98j503j271L64J982L42k169r78
$$ y = [717, -2633, -2999, -50, 1823, 1021, -1766, -2987, -1215, 2050, 1137, -1848, -2884, -1273, 452, 434, -822, -2755, -1465, 684, 705, -1545, -1820, -1392, -371, 413, 334, -1119, -1640, -756, -325, 363, 733, -233, -1939, -864, 661, 616, -571, -1395, -1101, 1074, 2090, 301, -2153, -1345, 1270, 1851, 674, -881, -1218, 573, 2361, 790, -1168, -632, 1020, 1834, 1043, 4, -847, -156, 1307, 959, 164, 897, 872, 552, 513, 803, 191, 308, 813, 430, 1019, 669, -92, -676, 728, 1955, 1151, -255, -631, 117, 1745, 1246, -124, -1665, 60, 2258, 835, -350, -1000, -11, 1134, 904, -915, -1740, -20, 1432, 474, -1154, -1188, -538, 211, 438, -458, -817, -356, -134, -935, -871, -368, -336, -363, -151, -39, -675, -678, -1281, -1061, 8, 761, -695, -1632, -1033, 344, 378, -924, -1674, -1258, 1080, 1525, -821, -2247, -999, 781, 1479, -24, -1295, -931, 1051, 1393, -776, -1754]
4695a754J452J278J32j008r15k57J549Q30j068m4O4k34P6Q02k61q86L0K90N42
4714F18J133p04k026j16J886J570j531j974k63J821J788r67k618q34K690J647
4730B120p27j946q30R31K028l23k211l66J806J399n87j525j317N24J362Q82q77
4747C43r20J0k69O66J263o33q92l65J246O00m21j411j300J543K749K3k677j646
4765b091J006K313J116j710k579K75K716J296k012j989m8K253J411j80k586p99
4781a608J139J365j08r32q37J26J700Q99j319j626j35R27J136P08j844j416J00
4798a725K258J038j593j498m63J574J921m06l062q44J753J895L70j790j850Q38
4814a584K753M41k349j871N28K146J911j235k521j156K401J572l77o59j184jJ482
$$ y = [-1754, -302, 976, 1108, 100, -815, -1072, 477, 1307, 239, 195, 259, 25, 101, 903, 642, -244, -214, 76, 618, 1751, 1047, -979, -1095, 791, 2361, 830, -1144, -1407, 414, 2202, 1235, -1383, -2217, 473, 2120, 1393, -553, -1383, -452, 1576, 1253, -958, -1324, 482, 1881, 1294, -231, -1548, -1024, 338, 1220, 343, -577, -567, -836, -170, 1093, 460, -432, -797, 449, 1049, 628, -783, -2083, -540, 2209, 2232, -445, -2091, -1085, 1228, 2344, 634, -1945, -1670, 1046, 2342, 330, -1659, -1707, 546, 1957, 1777, -809, -1608, -469, 896, 788, -144, -981, -855, 845, 1744, 425, -1201, -1336, -409, 727, 1435, -409, -1825, -1725, 533, 1571, -22, -1520, -1983, -409, 1512, 1106, -1956, -2800, -1047, 848, 1218, -572, -2422, -1584, 1169, 1610, -739, -2610, -2082, 64, 1975, 740, -1781, -2937, -536, 1036, 659, 0, -1184, -1185, 297]
4831B97O62j429j258P57J502J062j26j901k116J517K476P79j643j752q5J744K028
4848B514q18k983mK383J415n74k239j178J280K790M7k416j732J614J366J058j244
4865A279k115k76K131J318j251j133p69N46J315Q61j136j369N30R39P00l25j636
4882c91j153J435K306m57k049j144L13K197Q98j346k806P16K731J113k022k056
4898a715l29K105K242j162k637n92J351J157m1r87j019L92J515Q25j190j451j10
4915a646Q40J029O10j342j308J9J398J087n94j231p01J451K026j232k516n72K126
4932e56J907Kk323j861J223L007l22k356p69R06J501R52j407j850N22K045K11
4949H32p10o95k17J46J116J90j375j73J60R54P07P4j684q36R95J753J01q79j350
$$ y = [297, 959, -470, -1728, -971, 531, 1593, 1467, -434, -2550, -1033, 1443, 2222, 579, -1173, -1258, 486, 2514, 1696, -1287, -1291, 1092, 2507, 1933, -306, -1484, -204, 2586, 2633, 217, -1515, 99, 1465, 2523, 1279, -836, -1112, 1019, 2337, 1086, -47, -816, -270, 1045, 1906, 770, -599, -69, 870, 1570, 1245, -391, -1544, -109, 2197, 1740, -309, -1453, -1140, 1057, 1955, 609, -2197, -1481, 1250, 2363, 341, -1715, -2044, 61, 2303, 1141, -1496, -2088, -737, 420, 379, -608, -1627, -1235, 280, 1105, -85, -1536, -1646, -806, 223, 833, -509, -1817, -1798, -400, 687, 93, -1138, -1839, -388, 1638, 406, -2110, -2682, -556, 1351, 1353, -970, -2831, -1608, 1399, 1077, -1279, -2048, -1142, 359, 1311, -96, -1946, -1424, 621, 832, 122, -573, -790, -644, 472, 662, -713, -886, -726, 228, 935, 1009, -675, -1511, -516, 1237, 1338, 459, -891]
4968h91n2J760J095j464k027P38K282P37j267k055n47K216J969j277j922j03J343
4985E35J396j92j882j031J101K008k1j493o79l8O63R61P0j434q8N49N75J25o61
5004D64j147J57J483J514j149j382p58R76J570L32j999j271J221J625m59j442
5020b65r60N25K367P23j907j872K53J702Q99j029j298l72J079J685m34j562n86
5037a052L04J035O25m63j297m87J462N58l59j283k28M77J292L46j944j078L71
5054a721K048O81r68j670l46J557J163q64j482l88J351J478k21k303j040J359
5070a366K264k3j636j163J43J040J496p46j761q3J042J357m5j017j284K58K201
5087F77L75j255j400K0Q78J567q9k152l52J080K043m21j397j171L30J969J132
$$ y = [-891, -943, 817, 1912, 448, -1579, -841, 1441, 2178, 911, -1144, -1691, 525, 2494, 1217, -705, -808, 535, 1931, 1739, -143, -1174, -73, 1935, 1914, 421, -258, -296, 367, 1328, 1398, -36, -124, 425, 1000, 1125, 464, -683, -526, 957, 2471, 1322, -60, -818, 158, 1728, 2060, 61, -1210, 11, 1636, 1177, -265, -1225, -700, 1667, 2390, 483, -1389, -1136, 566, 1465, 436, -862, -1234, -155, 1530, 1096, -466, -1052, -748, 287, 912, 449, -848, -1335, 127, 685, 326, -957, -1185, -708, 584, 930, -1014, -2092, -1721, 327, 1008, 40, -1630, -1976, -419, 744, -120, -1602, -1990, -639, 839, 618, -1685, -2725, -1366, 898, 875, -761, -1924, -1781, -741, 755, 9, -1752, -1835, -793, 564, 519, -498, -1782, -1524, 677, 1052, -203, -1603, -1583, -705, 862, 773, -1379, -1731, -651, 1392, 971, -426, -1597, -1267, 702, 1834]
5104A834j450k116P35J616P37q12j777j78J638J781r08j603p27Q77J359R74j450
5121E30j179J19J540N21n56j348o17P57K013M57j772j336M45J093J233k85k385
5138g70k60J795J272o23j924n01J165K198K7k482j705J204K424P0j520j449l5
5155a114K004J145j393j993L70J470J109l86j708r79J107J314J79r11r38l61P90
5172b95J518l8j586r47Q42J172P61q82j982j14K212R72j299j943j40J711J645
5189A607n79k831n65K220J884o34j688j085O39K166nj720q63J025J399K4q58j257
5207a121k17J447J129l13j340l29j48R68J175o24j882k2J638J033M6j960j479
5224a999Q51K642N01k285j297P50K149J19j342j814M15K476R37j916j634l37J923
$$ y = [1834, 384, -1732, -997, 619, 1356, 544, -1233, -1411, 227, 2008, 1100, -503, -1230, -353, 1006, 1980, 530, -649, -530, 1010, 1531, 975, -373, -990, -233, 1780, 2237, 465, -871, -426, 667, 1900, 1615, -770, -1030, 765, 2037, 1414, -510, -1011, 154, 2352, 2379, -103, -1808, -604, 1820, 1890, 370, -1079, -1114, 890, 2035, 642, -1351, -981, 489, 1598, 1212, -496, -1475, -368, 946, 1125, 214, -724, -1085, -295, 1223, 1185, -401, -1348, -506, 666, 1427, 545, -1437, -1551, 661, 1633, 334, -1609, -1749, -38, 1607, 1028, -1803, -2368, -148, 1736, 1102, -586, -1671, -1032, 1134, 1129, -591, -1454, -429, 970, 994, 136, -1121, -1338, 109, 1238, 925, -415, -744, -892, 76, 1251, 627, -1255, -1277, 361, 1394, 1440, -520, -1999, -1148, 1494, 1995, -290, -1587, -837, 1312, 1431, 89, -1725, -1310, 1166, 2103, 187, -1447, -1784, 139]
5241A39J499p11j828k38R92R13J80r47j018R4J546Q25r89j102q0N43P66P30r63
5260C51j609M13J740P15r47k007m05J992J932q72k642o13K091J181j70j766r79
5277a595J265J954l46k249p22J019J418O83p23j942l39J546R88m23j100o53J68
5294a051J448P04j221j627L82J462J218k51k555o46J174K171j60j983j364J316
5310i83J780N25j694k214Q43K054Q41j161j538L5J004J558n85j580m62J481J126
5327A030j67r51j474M56J424J086q62j226o03N68J733K00j438j506J037J843Q24
5344A974j448k368q2K375K035j354k303m52J820J703n62j885j062J306K314l55
5360A656j413j314J79J656J210n82k158N6J077Q39R5r99j160M72J696Q08j454
$$ y = [139, 1638, 927, -901, -1139, -147, 766, 946, -1, -1019, -925, 621, 1446, 457, -645, -725, -182, 584, 1314, 351, -1258, -845, 895, 1610, 663, -1344, -1749, 243, 2175, 1303, -1339, -1952, 139, 1320, 1150, -616, -1595, -330, 1624, 1278, -971, -1693, -674, 744, 1427, 704, -1238, -1577, -31, 957, 534, -566, -1219, -1051, 397, 1101, -120, -1747, -1365, 97, 1315, 1064, -1491, -2137, -963, 1208, 1048, -935, -2299, -983, 797, 1322, -372, -2586, -1743, 311, 1152, -9, -1547, -1512, -508, 1050, 465, -1115, -1577, -96, 1030, 863, -88, -1562, -1106, 318, 1404, 542, -684, -1287, -719, 1014, 1214, -224, -1730, -693, 1150, 1974, 526, -1842, -1924, 451, 2486, 1132, -1171, -1623, 197, 1900, 1338, -547, -1609, -303, 2011, 1656, 243, -1071, -892, 764, 1974, 1392, -766, -710, 367, 1206, 1301, 302, -858, -386, 1310, 2118, 664]
5377F64j622K50J447J223l16k087r92J850J498r1j725j320N30J981J271j551k657
5394a647L07K181J104o89k103m57J531J342k42j930r63J017J960L31j045j835
5410a138j13J549J117j022r32l94P98J340m5k003q80J116J537L20q22k024n15
5427b111K002J429m89j790r23J184J621J24j434k230J006K288L51p21k161k65
5443b119J862J521q97j957k5J550R10l4j649r96P88J739K72r88j276J5J029J010
5461G55n90j228m56J291J140m81q14r11n6J800J131j304j655K38Q24J429J24k417
5479a180n45J382J716o6j653j174L77J741J090j377j522J32J618P62r55q13m03
5496h70R19J529k85j317r56Q44R06L19k44j291j45J226R43r09p18n68Q19J276
$$ y = [664, -958, -708, 739, 1962, 1646, -441, -1433, 417, 1915, 1824, 99, -1221, -691, 1290, 2561, 1010, -1647, -1340, 841, 1945, 1256, -847, -1304, 227, 1569, 1327, -603, -1566, -549, 1411, 1742, 697, -1138, -1251, 298, 1415, 393, -539, -933, -135, 1205, 1160, -843, -1723, -607, 930, 1250, 428, -1596, -2111, -109, 1320, 831, -959, -1882, -698, 923, 1047, -387, -2617, -1611, 677, 1028, 307, -1854, -2119, -257, 1264, 367, -1590, -1615, -65, 845, 811, -838, -1834, -1046, 693, 965, -23, -1299, -1284, -255, 755, 165, -1063, -1519, -228, 912, 431, -383, -1294, -1350, 450, 1581, 277, -1378, -1140, -316, 1113, 1237, -1180, -1725, -343, 1373, 1307, -346, -1520, -1143, 598, 1688, 311, -1211, -1079, 539, 1301, 346, -467, -870, 49, 1578, 1293, -24, -980, -136, 770, 1089, 845, -446, -591, 635, 1578, 669, -49, -617, 202, 1478]
5514A478j87j446j353Q60J555Q10r50j581k97K080R45j209j315m76J001J162k
5531A075j580p57J094J346l25j002m26J05O88J062p96j580L84Q31J053n81o05
5548a4j042R1J525L71q68j225N18R98N62n14k010j26J745J558q44j706r87J064
5566i04J749J84j648q76P67J430M7r70j429L50J173R68q46r59n4J77J146K35q81
5585c41r48L01R03R13o30j323n42J308J485j98j597q04J056J363L37j502j165
5602a384M73K268O83k132j413L72J591J149p21k080j88J694J095m99j108q72J011
5619f1R43P73j308j348K29J285N03K2j198o44Q49J248j81j381q57O36J724N89
5637A823j098k188KK108J228o14j695r40J307J797q0k182j067J109J993J45j446
$$ y = [1478, 1291, -155, -1508, -648, 907, 1717, 767, -814, -1111, 969, 1914, 705, -610, -1086, -85, 1077, 1075, -505, -1262, -168, 1178, 853, -149, -575, -470, 218, 1280, 484, -1096, -712, 119, 1172, 591, -14, -1056, -965, 560, 931, 63, -1162, -644, 354, 916, 402, -1608, -1734, 11, 1569, 725, -981, -1968, -904, 845, 1029, -619, -1495, -728, 702, 749, -221, -1650, -1300, -127, 841, -5, -964, -1018, -841, 305, 540, -341, -1289, -988, -85, 828, 198, -1125, -1667, -359, 1126, 928, -669, -1473, -417, 946, 1283, -219, -1384, -911, 1357, 2040, -92, -1505, -1133, 458, 1607, 886, -1194, -1382, 312, 1407, 908, -200, -1072, -61, 882, 1655, 347, -1001, -772, 513, 1016, 1038, -160, -804, 45, 1293, 1112, -269, -1126, -490, 1234, 1823, 725, -1463, -1461, 647, 1875, 1261, -434, -1374, -67, 1730, 1650, -532, -1599, -490, 1503, 1648, 202]
5654B02j774L42J787J289r25j819j50P05J815rj696j273O81J508N92q82j680j84
5672a471J506J634o91j689q28J151J151O56j671j634P91K122P91j547j647m22
5688a798J553J730n96j833q09J155J646K10j638j915P14K230P44j287j620l32
5704a846J142J848k42j980p25J302J784l80j325j417J12K342Q44j125j939O8J509
5721b8P68%j640q75J060K048j24j797j266N73J678J626j050k063n42J774J476
5738A618m93j602j096Q31K242M38k009j527O47J676J498j144k152m17J879J315
5754A704m51j436p74M16J777M20j363j546J02J805P82l47j496n50J248J387k45
5771A433j815j048R11J953L70j254j901j77K370R77j035j255q51J204J903m37
$$ y = [202, -1572, -1230, 557, 1846, 921, -898, -1048, -343, 1472, 1463, -233, -1506, -825, 683, 1275, 393, -1287, -1471, 35, 1669, 978, -711, -1539, -388, 763, 1419, -252, -1886, -1095, 1027, 1818, 271, -1376, -1798, -245, 1485, 889, -944, -1753, -598, 1048, 1258, -380, -2295, -1581, 649, 1393, 106, -1514, -1846, -704, 1144, 902, -1078, -1803, -501, 1283, 903, -422, -1839, -1727, 615, 1459, 334, -1605, -1537, -28, 740, 740, -900, -1775, -715, 1333, 1209, -588, -1854, -1281, 397, 2023, 973, -1090, -1632, 142, 1618, 1125, -477, -1573, -742, 1500, 1938, -71, -1598, -951, 725, 2223, 1079, -1073, -1490, 389, 1704, 1253, -183, -957, -541, 1236, 1656, 293, -1253, -1151, 654, 1436, 1089, -407, -957, 291, 1678, 1433, -382, -1430, -519, 1434, 1804, 550, -1351, -1528, 842, 1819, 784, -471, -1322, -118, 1785, 1348]
5787A348k082r63J404J649J81j294j473l41J900R64n46j336o38O27J261N73j476
5804b42j306N85J702O58q47j863k34J535J785q75j804m86R75J581m57j102j664
5821b059J200K079q1j685j038M32J225Q28o83j242k97J020J068m16n88o36J31
5838g42R76Q17p47j197j70R93N58N56j522j104P76J455P5j294o58K31J508Q47
5856A358j390j489O07J237P67q23j040l03J402J142q85j377k7P27P45o2n28q79
5874h18J10J087N20n96o75M8K53R68K25j407m90P03Q30M59p29j018l20J215Q63
5893A228p75j360J35J036P86q9j421o19R78J224K29j458m67N12R53Q5q33j034
5911h90O02J218J06n62q35n13N98J035K27j176l46K57O86N38o88j095r3J194R82
$$ y = [1348, -734, -1697, -293, 1356, 1537, 243, -1230, -1571, 329, 1293, 747, -589, -1227, -600, 661, 1234, -242, -1548, -963, 739, 1397, 550, -1313, -1547, -12, 1773, 898, -906, -1392, -417, 1164, 707, -395, -2059, -859, 1220, 1139, -546, -1584, -1152, 73, 901, 218, -1024, -1321, -301, 767, 351, -237, -873, -742, 234, 1051, 304, -893, -1063, -70, 488, 1044, -478, -1582, -806, 649, 724, -570, -1228, -997, 511, 1358, -32, -1521, -914, 323, 1090, 267, -773, -1076, 326, 1468, 583, -794, -821, -94, 651, 589, 61, -818, -708, 379, 899, 303, -372, -324, -71, 897, 1122, -285, -775, -72, 758, 1217, 488, -530, -850, 365, 1228, 453, -907, -772, 264, 1050, 961, -460, -1079, -101, 1123, 1352, -106, -573, -61, 892, 977, 144, -890, -288, 930, 1036, 474, -361, -874, -276, 759, 986, -190, -536, -279, 407, 945, 257, -838, -931, 263, 1245]
5930A245m30j545m88O69J372J94j296j122R70J148K36j210j281L87J523N00j033
5947a61r10k66J114N76k53j179l54Q40J074k71q27o54L3J369Q66q48j284k17J151
5966b01Q92J78j283j126P17J397K03j180j039N84J072Q91o92j531P5J381Q79n01
5984G16j156m51N30J391R6j439q37N08J167O07m51j452l60J329J245n69j383o08
6002a117P15J804O18j945j225P1J889R28p74j632n85J221J755p04j635o47Q71
6019c92J830m1j208j613M85J453J230j349j138m00J345J142Rj502j387J472J261
6036A197K43q58j856N4J823J131j238j115p30J360J314J04j813j361J127J774
6052A156K88j030j767Q4J107J757n68k001n09J158J351J43j395j534K91K452R09
$$ y = [1245, 815, -730, -1218, -549, 823, 1017, -279, -1401, -431, 717, 953, -257, -1538, -1151, 372, 872, -161, -1071, -1337, -223, 353, 100, -1079, -1433, -593, 481, 210, -617, -1271, -1238, 131, 997, 149, -1135, -1352, -201, 691, 869, -414, -1540, -823, 574, 777, -403, -1442, -858, 214, 1105, 413, -1118, -1043, 338, 1217, 716, -440, -891, -361, 1030, 1126, -313, -1150, -642, 525, 1132, 681, -771, -1131, 198, 1443, 874, -509, -1117, -402, 1402, 2020, 75, -1150, -1079, 810, 1738, 964, -668, -1253, -32, 1723, 1019, -616, -1263, -392, 1438, 1397, 189, -1424, -939, 514, 1744, 395, -743, -1143, 202, 1344, 1353, -149, -1536, -64, 1197, 1440, 582, -1274, -1220, 603, 1734, 496, -619, -1349, 11, 1325, 1429, -384, -1745, -618, 1156, 1444, 414, -1353, -1269, -162, 1595, 1027, -974, -1483, -325, 1026, 1169, -226, -1760, -1469, 983, 1892]
6069A892j595j576k01J656J256q07j587n97J157J634j85j472j176M41J765P96
6085A401j567j815M98J542J024m41j441o23O61J982m26j287j108N08J251J273
6101A432r26j912l78J683J551n34j575r62P09J725Q19k248r82L20J864M69k57
6118G98k375K26J379J253o11j567m53J211J079O18j597j472J088J250O86p48j345
6135e80r62J254J553J11j588o10O01J492L61j126j765M3K171J063j262q84j026
6152a154Q01J780J9j663o05L51J514M88j219j281K25J212P95n55j461K70L09R91
6170H17K78j513r63R92J044L64o42j094l97J337J056n59j413k97Q63Q09Lj004
6188c19j188J144J202L15j128j113K08J068N87l97j003n98J296M17j66r10m86
$$ y = [1892, 297, -1279, -1480, 176, 1432, 625, -962, -1559, -402, 1232, 1047, -425, -1601, -1160, 605, 1401, -166, -1981, -1483, 59, 1083, 642, -799, -1422, -761, 1221, 795, -492, -1600, -1092, 159, 1432, 506, -1406, -1784, -101, 1450, 916, -659, -1621, -912, 813, 1632, -616, -1598, -1278, 586, 1055, 798, -1577, -1351, 28, 1281, 670, -897, -1350, -139, 940, 1558, -39, -1511, -423, 827, 1513, 765, -580, -1542, -288, 1265, 1376, -212, -822, -221, 1271, 1632, 506, -1259, -1216, 955, 2018, 756, -128, -1154, -353, 1427, 1446, -217, -822, -471, 1043, 1531, 312, -969, -744, 468, 1263, 708, -753, -483, -174, 817, 1095, -418, -1381, -389, 655, 1019, 377, -717, -1114, 223, 1279, 720, -693, -990, -127, 682, 685, -319, -1507, -363, 839, 1154, 26, -1087, -879, 189, 776, 379, -624, -1222, 74, 491, 325, -585, -1071]
6205a071N52J014K43o20q31J36M51M88m9q06m17R37O74j59r67n18K24J048Q28
6224A157j284q32RJ363L63p51q07k50R02R14l43j277p7O65Q52l35m19o11l0Q45
6244E4L34k88m99R0M60L31k5r26k08N99P75l2m65j59q72J167O71r03p50M40O71
6265D65N61l46j221j49P80J174o20r69j43J89Q93K47r96m68K15J247j07n98p44
6284e90j48Q53J154l98j245k25M83P22K7k22j102K83J294K40q64r22k2O93P89
6303H00m5j372j40R49O95n0j081o37O47J252O5j299n85j61J171O51l46j263l39
6322a088R61R38l99p84n85J71J142Q21j124j398K53J246P35m66j295k96Q62J184
6340H78j11j529o07P69J402L49j035j235J89J019P27m57j168j00P07J059Q8j273
$$ y = [-1071, -519, 495, 738, 118, -713, -577, -126, 362, 313, -493, -910, 27, 701, 542, -425, -943, -719, 329, 1157, -127, -959, -950, 413, 776, 25, -782, -1032, -130, 784, 441, -836, -913, -248, 604, 269, -150, -761, -791, 54, 388, 100, -399, -309, 151, 482, 457, -469, -677, -78, 697, 665, 200, 41, -831, 336, 1007, 104, -646, -206, 465, 1026, 680, -541, -690, 90, 1264, 644, -325, -468, -279, 614, 861, -135, -603, -388, 859, 752, 154, -590, -738, 115, 1269, 871, -374, -599, -116, 606, 633, 411, -691, -408, 886, 1126, 262, -660, -682, 11, 800, 755, -617, -757, 192, 887, 837, -244, -881, -234, 1018, 1083, -216, -801, -962, 209, 860, 514, -749, -1088, -127, 811, 412, -372, -957, -786, 356, 1177, 53, -1345, -1092, 154, 889, 423, -872, -1168, -306, 878, 767, -762, -1369, -600, 802, 1151, 116, -1119, -930, 89, 816, 359, -809, -909, -202, 857, 945, -328]
6358c28j188P56J452O93j087j340o78J981P60k62j215o67Q64J197N35j824j247
6375a598P02J943N20r91j466m46J593J041m76j361m07Q70J125p0j213o69L44J524
6393I65O97j453p28l92R48J617k44j797j064J175J348P56j654j647J40K061R71
6410A699r76j636m67J339J187r6j454q36R92J360R1r50j584K56J555R78q09j548
6428h99j98J020R71r7j232o84O53J554L84j366j664L69J481J396q40j652p29J473
6446f0J371l13j557j005N51K008O63j573j581K34J520Q09l11j793n87J163J388
6463I27l45r63j110M65J590N92p25j641l94J331J272k71j541p87Q75J598L52j708
6481d83j100Q91R87R12r29j711J23J452J132o33j204m01P71J212k22r37j088M19
$$ y = [-328, -1516, -760, 692, 1385, 298, -1042, -1720, 261, 1021, 759, -456, -1123, -259, 938, 1473, -351, -1598, -896, 1047, 1567, 576, -890, -1336, 257, 1298, 822, -539, -946, -76, 1049, 979, -234, -903, -559, 965, 1662, 209, -519, -911, 37, 1654, 1410, -387, -1451, -276, 1072, 1828, 174, -1473, -1333, 728, 1699, 723, -913, -1380, -41, 1146, 1050, -404, -1240, -248, 1112, 1203, 253, -1331, -1075, 480, 1458, 649, -899, -1097, -77, 894, 797, -435, -1119, -466, 1088, 1472, 106, -1558, -1189, 292, 1688, 848, -804, -1533, -60, 1311, 998, -559, -1564, -1013, 995, 1658, 85, -1496, -1262, 258, 1067, 756, -1037, -1624, -461, 927, 582, -381, -1491, -1026, 564, 1156, 431, -1210, -1604, -273, 999, 728, -813, -1600, -725, 873, 1225, -483, -1583, -692, 295, 1207, 278, -1433, -1310, 142, 1274, 641, -563, -964, -193, 1019, 797, -140, -1228, -809]
6499h09J365P05n46j284o51J130R30K3j290m61N41J129M29r49j302J87J475L47
6517I69n4j445m38J015J554o20j295m64O07J041J80r01q15p6J399P71p37j029
6535c38r4K33J348r3q31j225Q97O88K28k66j438J40J015R74l70j233l78Q01P36
6554G94j14q47n58L84J215l6q45o62J82P00P32o31r55p6P61L81r7p90k25N20M99
6575C32L36r74m76L25L27N92k45p93k14O71M08l02o34m04N32Q20J31q28q63N63
6595f96P79J33l40k58j24M28M71l83o32o9N97K77ln08q52Q08L84J8l22l14J95
6616d11J22O53m27o07L54M30N32m40m29j88Q8R23j68o97m28O18M87J56n32p29
6636f93J29R37O45o83o15k02M92M98m4n06q10J108L30k97l72l19q0J220K14o09
$$ y = [-809, 556, 1261, 715, -569, -1220, -90, 840, 863, -427, -888, -347, 782, 1211, 262, -1040, -853, 622, 969, 915, -530, -968, 47, 1601, 981, -314, -778, -171, 870, 1050, 149, -666, -742, 657, 1428, 691, -338, -432, -199, 1149, 1056, 225, -1000, -103, 585, 813, 547, -891, -751, 264, 1238, 868, -365, -743, 58, 794, 680, -167, -725, -341, 874, 838, -7, -669, -487, 213, 945, 314, -641, -717, 44, 425, 328, -462, -687, -167, 332, 668, -306, -782, -457, -130, 462, 217, -576, -790, -119, 289, -13, -647, -1051, -519, 301, 432, -396, -1259, -696, 83, 216, -124, -382, -506, -78, 393, 10, -622, -691, -94, 183, 180, -328, -1180, -372, 12, 30, -292, -606, -411, -289, 364, -63, -670, -316, 114, 646, 206, -223, -411, -323, 600, 432, -265, -693, -75, 412, 568, 36, -693, -564, 373, 1018, 335, -280, -482, 10, 508, 464, -42, -852, 256, 586, 289, -83, -402, -482, 738, 952, 343]
6656C43p04R2N29L89n6n04p66N26J357k75p09p80o3J285L79k66j389PR09Q67l28
6677H43j025n01P08R09k7r72m62J80R20N63n74q26l77O41R39k91q72k61M40P81
6697G36M01j237r89N59J151N24q64q65m53J085J209l88j372o01K22J597R9r79
6715a65q44O9J240O15o56j339J05O48J231m30r72q88Q04J252L05p23j475q1J384
6734H0Q70o07j369n12J130J420k04j393j045O79J604L69j154j505M31J208J252
6751A254n34j889m83J346J244k88j054j119N72J624M13j022j019k25J057J154
6767A031k73j522o57R25J463L28j275j209J61J619J339j269j424m42J326J153
6783A274j05j729p11J034J504l18j140r38K26J561R10j114j325r0J008J447o99
$$ y = [343, -361, -269, 260, 649, 593, 89, -677, -151, 1206, 931, 222, -558, -621, 664, 1043, 777, -612, -605, 304, 1171, 843, -182, -683, 25, 934, 907, -65, -527, -347, 573, 1136, 562, -264, -641, 0, 939, 648, -224, -485, -45, 736, 1137, -100, -1089, -530, 621, 1145, 281, -584, -1037, 48, 1257, 869, -503, -1104, -882, 715, 814, -165, -1009, -940, 300, 915, 259, -1080, -975, -327, 904, 474, -498, -1386, -582, 670, 975, 252, -1223, -1304, 80, 950, 343, -1026, -1538, -408, 1012, 808, -585, -1630, -951, 653, 1022, -132, -1637, -1206, 2, 1254, 720, -1169, -1652, -306, 938, 650, -404, -1523, -951, 673, 1086, 64, -955, -1180, -123, 1031, 758, -764, -1421, -496, 967, 1295, 20, -1189, -1028, 591, 1930, 661, -763, -1205, 121, 1274, 1169, -560, -1271, -237, 1267, 949, -191, -1129, -903, 658, 1568, 454, -871, -961, 47, 1494, 795]
6800G95q06j317R30J232M95j237j011p8J522R19m10j587p65J341J010o3j275n94
6818h99L70J550L88j525r00J19J023J247l85j500o36P46J100J42j098r78L36J383
6836D83O78p00j621R2J246R28m63j374o04P93J594j04j525q02N70J040J009j010
6854B30j097k13J269Q25n57j047k95L74J160l5p62q49L00J204M21n10q86n76P79
6873b65R52k9r50o49L53J176J83r04r55M74J361l7k8j308o1N63J224n60q79m23
6893g62P33P53Q1r44n38L70O73M57p58n64K8N24O36K40q08m09r4Q59j84n7o29
6914c93J2O30M78k49q04j27M87L54O2o85k06N50N17j89o19k00K60N25Jk33k37
6935f6k28O66J44o68R6l55P25r1L6m34l37J72N74K98k01o77n0M32K0n2j06k06
$$ y = [795, -11, -1328, -398, 834, 1329, 92, -919, -997, 525, 1444, 1034, -553, -1318, 23, 1033, 970, -305, -899, -529, 1021, 1409, -116, -1016, -897, 126, 1373, 988, -512, -1148, -402, 698, 840, -258, -1236, -900, 483, 1161, 461, -1160, -1068, 178, 1106, 643, -731, -1335, -542, 1052, 948, -577, -1379, -809, 231, 1240, 230, -867, -1080, 189, 1014, 457, -590, -885, -511, 649, 614, -148, -997, -697, 507, 928, 418, -468, -1044, -265, 687, 658, -292, -941, -588, 588, 771, -133, -1088, -614, 747, 710, 682, -626, -687, -124, 1100, 540, -339, -762, -29, 724, 805, -139, -677, -307, 366, 823, 65, -499, -471, 53, 689, 929, 121, -288, -382, 477, 293, 236, -393, -381, 249, 727, 478, -326, -453, 34, 388, 450, -235, -441, 109, 626, 437, -182, -382, -122, 403, 404, 171, -66, -294, 372, 516, -152, -56, -411, 314, 223, 259, -175, -512, -340, 234, 532, 331, -346, -396, 36, 56, 4, -102, -308]
6957c08L42M20l34m20j91M61N01k25m86q7p1O38K56p14m61L41O30j70j45n56k1
6978f00M56K02Q8o29J13n5O53l9k43n92J2Q69m9n9r32Q8L20Q71l2q84k88N37P16
7001E23k34n83n41Q33M17O9q53j53K1P26M14k24j066p1J016M60k6j207k81O35
7021a25M30L07l89o79Q7L77N83o1q25rJ30J015o7j030k04J95Q87Q72j012r02k00
7042f20J009O93m37p17l16N63J234m28j124o12M08J312J80o91r99m11J301P46
7060A091o78j015l62J068O08R6p89j060M59J280L16p95r76j73J207Q46m85j273
7078f35j48M81J268k65p00j233L37J527N59q88j209r1P29J299m48j291n80R54
7096c34Q18N64j494o08J34R80J097o45j557j8J165O02J33j502r41J075J342M9
$$ y = [-308, 34, 454, 120, -300, -491, -30, 471, 246, -240, -327, -398, 240, 496, -218, -679, -338, 292, 122, -23, -579, -600, -144, 58, 146, -483, -370, -425, 228, 189, -54, -646, -634, 235, 186, 127, -805, -717, -397, 474, 442, -442, -730, -193, 523, 289, -294, -835, -2, 415, 484, -369, -522, -501, 225, 639, 415, -651, -722, 294, 754, 728, -479, -760, -125, 305, 612, 223, -456, -369, 8, 591, 530, -295, -304, -174, 841, 774, -256, -460, -265, 622, 1494, 482, -420, -620, 389, 1082, 645, -72, -388, 175, 1409, 981, -143, -755, -347, 965, 1145, 454, -545, -956, 345, 1091, 413, -602, -964, 104, 712, 808, 19, -1041, -582, 698, 1014, 219, -757, -930, 277, 1123, 638, -635, -783, -302, 966, 701, 1, -1232, -895, 632, 1191, 303, -906, -997, -268, 1031, 583, -708, -1288, -334, 484, 1048, -446, -1054, -920, 60, 1157, 512, -1045, -1063, 102, 704, 837, -665, -1606, -531, 811, 860]
7114H60j119o78l53J399R41p00j156l16Q78J077Q8j471p21Q77J029L65j173q93
7132a066k4J072R34l24j301o26Q81J256p9j140m75K76J299N49j248j411P53J027
7150C53R00m40j345p94J258J119k73r30j062P16J460J72r50j117j28J382P77l07
7168G91j231o57J110J281l59j068p29J7J407P30n09j300m43J172J014n48p04p98
7186h24N92J163J73j454m77J62J143M84l89r39n98R11Q90k19r19k67K77Q64O19
7205A192j169q21K80R05O71m06q99r39R41J029J93j412m15K08R91N64p65j024
7223h76j16J421L86m39q77m10P27O69R6o36o21L29N75L31n71o11l17Q10Q01k24
7243D47q64p8L97M78J36p18p32L48R28K41o33q17r9O16J118l93r28p5M65N16j01
$$ y = [860, -259, -937, -1290, 109, 1050, 350, -806, -1122, -244, 833, 921, -550, -1271, -394, 635, 1000, -173, -1066, -1090, -18, 916, 592, -709, -1335, -454, 802, 723, -417, -892, -616, 683, 1232, -16, -1427, -674, 353, 1253, 813, -532, -1326, -68, 1051, 778, -152, -1214, -498, 962, 1134, 184, -933, -1061, 321, 1098, 791, -440, -1097, 13, 1294, 935, -133, -862, -845, 562, 1292, 783, -517, -960, 212, 1226, 678, -26, -824, -232, 931, 1104, -350, -827, -665, 478, 962, 573, -366, -964, -53, 837, 618, -301, -568, -291, 573, 1192, 23, -798, -518, 387, 1058, 652, -247, -1186, -245, 784, 977, -435, -850, -642, 349, 913, 148, -876, -992, 429, 815, 376, -501, -911, -184, 485, 581, -55, -676, -347, 228, 559, -12, -623, -940, -130, 671, 447, -417, -495, -98, 380, 516, -202, -934, -586, 342, 583, -50, -867, -966, -350, 768, 375, -553, -628, -163, 353, 252]
7264B52l45m37L0Q86M16o85o17J79N0P15k45l11j45p4M05J00j02k76j93O33M21
7285F57p03p15P32n7N10j45m55k61P23N21p25k29k36L88N88n0m44k92J93L24K03
7306E27n45k74J84L88N1Q5m30l5L15J75L01n48k36j06M31p6l10P0j10L93J69k89
7328A30l35k6O11p4l82J2j81M70n1J61n37K5MM91l83k96j55N3M56M27l88n41k75
7351g84N30L72J89o40j42L01P12k99n00n45j02J230L17n56p39j58P07N62l36n40
7371d21k10J23J325l31o71p67M65O92K22l79o91nR37M20k68j020k86O60N40K82
7391F17q93o76M83R30L01k70o68o27P75J090n57r82j03N08Q56r5m67j177M53J100
7411E98M20p34o35k29R62N58k75j134k34O30R78j95p64p03J44Q60R46p94p28j28
$$ y = [252, -93, -530, -500, 386, 802, 117, -500, -321, -271, 444, 199, -112, -257, -331, 74, 174, 72, -204, -397, 236, 657, -46, -761, -29, -86, 424, 279, -176, -437, 286, 807, 82, -147, -383, 5, 593, 543, 99, -193, 0, 324, 527, -18, -292, -108, 280, 331, 416, -14, -49, 266, 441, 742, 194, -42, -148, 283, 207, -103, -33, -143, 250, 419, 130, -205, -231, 380, 306, -76, -64, -245, 225, 174, 335, -202, -177, -173, 318, -65, -361, -516, -463, -7, 420, 32, -509, -784, -254, 118, 307, -333, -475, -174, 538, 239, -261, -806, -908, 322, 639, 83, -656, -814, -107, 455, 119, -421, -631, -508, 817, 486, -185, -952, -487, 205, 427, 48, -643, -648, 289, 709, 441, -579, -865, -205, 335, 617, -276, -952, -469, 461, 762, 492, -176, -803, -28, 1062, 505, -477, -580, -72, 784, 689, 222, -955, -502, 598, 1018, 284, -351, -580, 382, 940, 665, -469, -703, -73, 905, 710, -54, -757, -613, 247, 1193, 399, -329, -457]
7431d57M96P52K27j474o17N67J307K88j066o95k60Q78J215p46r60j03Q55Q61j23
7450I45r97j201R46J239N6j087m69j70Q91R70n66j274m10J063J023Kj163q46L28
7469g20J275O29j020r60j94R99Q90L40j699m44N41J176j15j254k44J13J083N15
7487I11q33q29k49Q59P49l69n81q07O71Q02J17o35p97r0J127R36n25j306m67R63
7507c53Q83M1j112n03O00J333k58p59j097n6J524R06l17j898k8Q66J036l6j257
7526d85k32L12P87L82p50j021N07P82K66J42j097o96J062P89R2j037n02L21Q84
7545E06N20o07j353M91P47P00m38r28m35O60J181k03p32j013O44J122L7j81j330
7564f12K50L95J190l76q76k80K21R20k49l10r23K97J014K66m02n06o19K56J016
$$ y = [-457, 39, 791, 1018, -456, -1073, -506, 801, 1089, 23, -672, -932, -54, 1161, 415, -545, -648, 207, 1068, 945, -52, -1253, -307, 932, 988, -99, -568, -738, 153, 1123, 557, -717, -1127, -64, 959, 961, -202, -1048, -720, 555, 1184, 164, -796, -990, 9, 899, 1239, -460, -904, -363, 813, 698, -556, -800, -687, 396, 911, 78, -751, -1000, -141, 608, 239, -342, -1149, -478, 324, 441, -194, -991, -1081, 46, 982, 457, -849, -1316, -353, 530, 571, -541, -1044, -444, 889, 631, -128, -1225, -1281, 243, 1149, 832, -1066, -1094, -228, 808, 772, -485, -717, -405, 382, 764, 14, -1007, -500, 282, 548, 690, -407, -1103, -41, 748, 840, -197, -699, -378, 506, 1026, 419, -934, -443, 304, 1004, 566, -362, -797, -137, 1044, 841, 109, -904, -260, 862, 899, 718, -612, -362, 33, 1223, 847, -29, -309, -88, 832, 583, 273, -650, -353, 661, 927, 525, 19, -600, -344, 672]
7583F72P7p81m48P01L28O0p45o42K34R20L59o21p40o1O75N45l15m72l81K58P96
7604D19k82l25k63j87R69qk59k52m41L60L57N44q45m21J00O74K09l65k76k43J85
7625c50O58j66o88k03N54M92l27j76k78N08O4K79p09j68M25O3K43j28l77r1J32
7646b43L80j93j76j09j85O59J23n20k11J96M6L73K10l36j71K38k0n4k89P8K26
7667B2J68K15m97k55J37M10q6qj27JJ46K63n04j67N28L0K54n02N2j83K66K85l54
7690I4l70L73j1O2J16l01j10L3M65j46J6l04k75M23P1J48m25j82O86J63l84j54
7712a2m68L67O14O7p38ll97Q88J28k09o21k83N59N50nn00m78M10N81J68m79j019
7734h80L90R12J4n09m11k14O38Q26l04j008l7K16J038K15p02n82j88P20L63m62
$$ y = [672, 749, -32, -480, 221, 549, 609, -136, -778, -544, 376, 735, 114, -626, -687, -12, 533, 218, -254, -635, -377, 419, 137, -188, -451, -638, 331, 323, 64, -188, -629, -269, 88, 632, -213, -634, -534, 140, 349, -16, -292, -535, -350, 308, 142, -546, -749, -195, 297, -30, -206, -484, 24, 88, 367, -342, -510, -85, -22, 221, 93, -284, -375, -243, 137, -56, -232, -341, -526, 133, 256, -264, -475, -279, -233, 140, 350, 14, -157, 81, 61, 7, -282, -204, 22, 190, 405, -92, -347, -210, 200, 114, 106, -21, -20, 126, 389, -115, -282, 246, 276, 530, 28, 80, -103, 163, 448, 94, -276, 97, 86, 148, 264, -37, -147, -114, 351, 205, 221, -83, -358, 65, 136, 284, -141, -323, 363, 526, 142, -12, -480, -113, 501, 568, -170, -173, -570, 318, 446, 237, -384, -667, -108, 442, 437, -63, -541, -131, 450, 618, 139, -880, -490, 422, 436, -73, -484, -698, -60, 766, 462, -546, -583, -367, 671, 886, 184, -398, -586, 134, 497, 35]
7754C5m20k47N08O32k5n73p83L71R63K52n30o51j66R17N83n98j225p3J074O42
7774F86rj001o23K56Q74M39o85o13L2P88P59n87p88l62Q04L47M04o56j047N90
7794c92P34O53q05r74k8R42O67j27p10j072R25J121k41o99o28O0J035M91m90q81
7814d19j96P28O45J3r79l98J81J128L29r34o88P5O17Q02j62j111l70O14R85J23
7834I83j067p47J60J002N32p18r56L6Q21P28j94j217j71O36J121l93n41j137N33
7853e89J080K47m94j198pQ19J076p85n47n88P51O87R5q06q14M79J185K68o69j207
7873a017J7R73M27J49r43m70N47R50J52r64p60N21L56Q66n34j082J21O85N56k63
7893B87p37l74M99P09L8n67n00J00R58J51k00m96n78M42N68K21m88m89L9M93P86
$$ y = [35, -385, -632, -124, 508, 483, -90, -873, -502, 461, 713, 183, -468, -634, 283, 866, 268, -957, -1030, 44, 686, 677, -324, -947, -691, 183, 622, -63, -676, -644, 144, 903, 316, -472, -834, -30, 317, 721, 65, -982, -392, 342, 995, 190, -784, -812, 130, 797, 670, -40, -1112, -187, 934, 693, -6, -634, -574, 461, 952, 462, -419, -615, 113, 758, 771, -208, -606, -425, 703, 1032, 98, -590, -515, 102, 904, 742, -369, -739, -125, 860, 983, -84, -831, -671, 331, 863, 145, -811, -775, 46, 774, 580, -637, -808, -172, 949, 556, 15, -1122, -589, 491, 738, 244, -954, -961, -142, 934, 149, -398, -986, -235, 452, 547, -259, -1073, -594, 591, 859, 190, -1017, -1000, -27, 400, 549, -394, -864, -317, 633, 785, -179, -939, -418, -62, 804, 270, -812, -691, -6, 550, 287, -450, -824, -325, 384, 422, -145, -645, -545, 413, 564, 364, -132, -710, -268, 300, 521, 33, -456, -417, 76, 862]
7914H62r82m08J54N61M78l17n73j12J81P20J80p29o69K65J067Qm63r72K49O95
7934A95L87m88l91m4K32L41J14o6m64pK31M88j84q50R4L16O76l95o19Q4J13O41
7956D04M5o7m73m6J39M42k56j17l17J84M86J23n39n45L90L54l3m9k86j07M60J52
7978C44j77m44J97l08N10q7j27j40L05J56j15k7l12rJ81K39k40j22k97L86J06
7999A9k18Q9j79Q7Q9J29j67j77P4R4J93%l82J8M06j98J85j32l72M41n5N5m31L38
8023i4L42j7j26q0n23L66j13M47n83j10M68J84m74K23l4o3M19j43j18o3J72K9
8045A09j17K19l06l62N45K43J82l62j73k79N64L04n62j55m4N04J95k49n85K51
8065g8K27L73j21m12k41K06M01j39j73k62L00J14L72l67n97L10L85K02L5o87k73
$$ y = [862, -120, -528, -374, 187, 665, 348, -225, -337, -156, 564, 744, 15, -654, -389, 678, 686, 223, -749, -500, 195, 582, 94, -297, -341, -109, 232, 346, 280, -184, -191, 40, 528, 344, -506, -412, -96, 580, 185, -434, -350, -237, 404, 449, 382, -91, -137, 2, 444, 188, 71, -246, -62, 424, 547, 8, -537, -147, 207, 174, 125, -161, -268, 192, 344, 167, -277, -80, -388, 122, 35, -92, -232, 73, 229, 114, 87, -225, -234, -53, 186, -54, -176, -473, -87, 19, -199, -110, -289, -202, -113, 16, -151, -328, -254, -160, 33, 33, -349, -331, 75, -123, 62, -70, -442, -1, -56, -1, -432, -94, 248, 231, 105, 25, -498, -132, -245, 202, -381, -491, -23, 161, -313, -90, -124, -187, 232, 89, -29, -92, 80, 109, -8, 211, -95, -457, 88, 331, 513, 151, -22, -301, 263, 567, 5, -150, -194, 310, 505, 256, -329, -78, 149, 522, 401, -11, -252, -46, 355, 216, 43, -219, 81, 195, 567, 200, -397, -87, 298, 500, 535, -152, -425]
8086d25J99N87j13K9n49k31P63L38m62l69j38L79N59J87n78p72L31Q44j2j56q40
8107d29K6P35L00l49q55j56O74L69J50n51o44N03P99L6n62l92q0N60L48k04m78
8128b00n85O34N35M3m02l16m51Q94L36k99q55J45L78O24J13q61p10N70J111J76
8148H80j064n85M85M92L34n21n44J22O9R93m82p06l83M51Q62M15r34n20r4P83
8168E3M07k50q27j92R34L86K3k68j025L2J094L35m20r60J35J83J191n95o02k31
8188e97M27P96k38
$$ y = [-425, -226, 361, 248, 277, -272, -503, 260, 598, 136, -233, -371, 8, 567, 754, 176, -596, -265, 579, 567, 411, -429, -403, 332, 632, 283, -572, -728, -54, 315, 465, -86, -730, -227, 572, 608, 46, -346, -426, 134, 482, 278, -200, -785, -151, 384, 427, 25, -291, -742, 152, 488, 189, -666, -521, -143, 481, 594, -267, -977, -407, 704, 880, -184, -769, -284, 208, 542, 21, -523, -401, -332, 661, 179, -527, -910, -459, 403, 818, -116, -636, -730, 53, 460, 210, -617, -809, 125, 511, 534, 266, -759, -727, 367, 702, 282, -678, -543, -360, 831, 236, -366, -597, -170, 626, 388]
8191C88
$$ Imaginary data points
##PAGE= N=2
##DATA TABLE= (X++(I..I)), XYDATA
0@%%%qJ6j6K4m0M8n6Q0r8J14j44J80k18K61l12L68m34N12n96O92q04R23j056J208
27F44j373J555j761J986k233K508k807L132l495L891m320M797n322N891o520P223
43C796p996Q854r823J0910j2138J3554j5194J7113j9411K2215k5718L0256l6395
56a9977M5206n9028Q4005j43347N36392N82352r09052m87131K06558O83980J97721
67G17679l49132m73739O1055L49482J54964k55677k47237L4207K78013J57594
77D27209j58692l72893j76703J59583L43367J79133j58956l98034k06087K49083
87a12990M21870O3437l78133l83994P4905M31735K34680l06083m27276N9173M83992
98A61316K69394l00442m97095p4803M47699M00473j74563m99278j79051L31947
$$ y = [0, 0, 0, 0, -8, 8, -8, 16, -24, 24, -32, 48, -50, 64, -80, 100, -118, 143, -169, 199, -235, 277, -319, 373, -431, 492, -564, 644, -729, 826, -935, 1051, -1182, 1326, -1481, 1651, -1844, 2047, -2273, 2524, -2798, 3093, -3427, 3796, -4200, 4654, -5169, 5741, -6397, 7157, -8037, 9076, -10335, 11880, -13838, 16418, -19977, 25229, -33799, 50206, -93141, 443251, 1025603, 116551, -370580, -164022, 519958, 717679, 368547, -105192, -44137, 305345, 460309, 204632, -42605, -8398, 269615, 427209, 268517, -104376, -281079, -121496, 221871, 401004, 242048, -155986, -362073, -112990, 308880, 372317, -5816, -389810, -314905, 116830, 351510, 45427, -381849, -322676, 161316, 430710, 130268, -366827, -441630, 6069, 406542, 231979, -267299, -446350, -114403]
108a14403M06216K3648l37203k86330R5664L18014J37125j73670k64800q9173
118b84912J56447K59602Q4271j99195k45318j3580K21749J87034q6369k94961
128b15232j44849K22605K95751m4756l45999k01447K22846L99368Q2546l83710
138a12877l92279P8797M06466K13699j97517l07932m3968K48047K08995r8809
148B622k35336m0112J90899J61827n5933k10575j47306R9960K63802J57523q6366
159A01005k21259j39479P7012K36900J36965j28603k21675m6812J63344J65224
169A22622j8208j55801n9079J58004J50996r6321k40111p7565J84494K28984P722
180B05737k34708j85806J00368K40689Q4905j33420j58602k5029R5553P4005n1228
$$ y = [-114403, 291813, 315461, -21742, -308072, -212408, 105606, 242731, 69061, -195739, -284912, -128465, 131137, 215408, 16213, -229105, -242685, -20936, 166098, 79729, -215232, -360081, -137476, 158275, 113519, -232480, -433927, -211081, 188287, 270833, -112877, -505156, -426359, -19893, 193806, -3711, -311643, -355611, -107564, 101431, 2622, -232714, -272826, -81927, 79900, 23967, -186608, -333914, -233954, 29848, 187371, 101005, -120254, -259733, -182721, 54179, 191144, 62541, -159134, -205946, -42602, 122622, 104414, -51387, -110466, 47538, 198534, 102213, -137898, -215463, -30969, 198015, 205737, -28971, -214777, -114409, 126280, 211185, 77765, -80837, -105866, -10313, 63692, 12464]
191A2464q2772J8628R4017M7108l5443p1427n2493K9539R1721M8934m6323r4075
203d0122n8124L7735J31024R2378n9742j19302k1444R3722Q3136k7426j14606
214b771n7826R6729J24976m709r6408l9745N4134O3215K281n8628l0381M5396
226I6263K7286n9689o2803L6806Q6280L5425l9095o9238j9678L0642P68n1619
238A1348j1828O0095K2214o3126p6173j135Q1241P5451k8802j10970n5575L4920
250f2340K8740j3576j4383J4682K1315N14l5415l4122K8902M7875k351l1859j5059
263f7077j8777l6257O716P4677R3090K1976j02954j29123J7687J69045J00482
274A29485r5964j55676k2878J34303J20082m7727j39730p398J61648R7925j05995
$$ y = [12464, -70308, -51680, 42337, 89445, 54002, -17425, -69918, -40379, 51342, 100276, 53953, -40122, -98246, -60511, 70513, 162891, 103149, -16153, -37597, 56125, 139261, 111835, -2771, -60597, 36132, 161108, 156399, 59991, 20246, 74380, 137595, 139876, 81248, 50867, 96263, 123549, 63860, 1057, 37863, 124143, 159568, 120473, 51235, 31557, 62199, 62967, 11348, -480, 59615, 81829, 18703, -57470, -58605, 22636, 98087, 69285, -41685, -97260, -62340, -33600, -47176, -61559, -46877, -25562, -25048, -60463, -94585, -65683, -17808, -20159, -52018, -67077, -85854, -122111, -115395, -40718, 52372, 74348, -28606, -157729, -140042, 29003, 129485, 33521, -122155, -145033, -10730, 109352, 61625, -78105, -85503, 76145, 174070, 68075]
285F8075j78266l9820J39588J51872j3282j53398q4961P2683J09683K8821n5748
296D5247p5043l1040L9668N2834q699n6509n2831R727R5157R2006m7525j64282
308a01290p0222J18152J58393q359j93087j45734J10398K54909O0662k17879j99503
319b33560P6999K56785J15584j75034k55971j1994K44029J77886q4128j97550
329h6954n9168J36003J63660M169j54556j13603N2416J29990O6053n7666j22135
340d1791n2481J10536J68848K1861j62410j74492J3659K04571J56483j12340k66189
351a33745p1812K20029K30567m6686k64430j46560J63040K58466j4966k92459
361i8556j88654J49710K93930Q0299k19396k54261J5400K54332J66312j03234
$$ y = [68075, -110191, -150011, -10423, 141449, 128167, -25231, -110192, -37509, 72174, 100995, 45247, -29796, -60836, -21168, 31666, 22967, -33542, -86373, -76646, 18511, 110517, 62992, -101290, -171512, -53360, 105033, 96674, -96413, -242147, -131749, 123160, 183822, -34057, -233560, -156561, 100224, 215808, 40774, -215197, -227191, 16838, 194724, 110596, -86954, -146122, -10119, 153541, 157710, 3154, -110449, -58033, 71957, 138010, 80344, -41791, -94272, 16264, 185112, 206973, 44563, -129929, -116270, 88301, 244784, 132444, -133745, -205557, 14472, 245039, 198353, -66077, -212637, -49597, 208869, 193903, -98556, -287210, -137500, 156430, 236729, 17333, -236928, -221528, 32804, 199116, 95882]
371I5882k24056r7752J05847J77620N4964j27609j45257J9019J60308J26669n4925
382I0710j96911j20804J28011K40585M4604k12259k06428O6259K80842J61274
392B75883j68801k93842k6199K70319K04876j19845k86123r0713K19853K62206
402B47614k5628k68173j52641J38371K35014M5285j88495k05831Q588K08588J53342
413A96034o7596j91974j03514R4191J95364P5582j58969k19475j7742K01229J79276
424A82406o3217k42193j27105J74602K74080J5943k62066k10610R5432K71923
434A09195J04383j97785k46415L8149K74769J56295j38966k38543m5569J89981
444E494J91446m3152k17924j15526J08903J88817O3887j07240j50140j6633J45341
$$ y = [95882, -128174, -225926, -120079, 57541, 112505, -15104, -160361, -141342, 18966, 145635, 90710, -106201, -227005, -98994, 141591, 186195, -26064, -232492, -166233, 114609, 275883, 107082, -186760, -212959, 57360, 262236, 142391, -143732, -234445, -14592, 247614, 221986, -46187, -198828, -60457, 174557, 219842, 31347, -174484, -165896, 42692, 196034, 128438, -63536, -167050, -72859, 122505, 198087, 39118, -180357, -198099, 3130, 182406, 119189, -123004, -250109, -75507, 198573, 214516, -47550, -258160, -162728, 109195, 213578, 15793, -230622, -192473, 82296, 238591, 99625, -138918, -184487, 5494, 196940, 153788, -64136, -179662, -70759, 118058, 181945, 74705, -75435, -92068, 53273]
455E3273J29184m6389j71435j08750P9870J92880Q6489j45823k05514R07K09874
466G4566J62255q8128k42665j13220J59830K24706j1690k28243j45501J13961
476i4129K22578N8862j75396j97140K6896J95837R5926j15297j70207k3774J37236
487c8608J39435k1748j49667q7115O7558J26241M0935q2791j24433k8011J14957
498d3247J21639j3864j21369p9098O2213J43121N5797j23692j61054R852J67903
509A8201J19943o7325j65744o1118J33051J67003j6970j69980j02023Q0640J42397
520G8075K7363j16753j17242L8845J42229O2312p7574j03340j3532O8387O3274
531E2044k0640q1452l8352M1860O1646K1227k5436m8834k3172M2345N6856n526
$$ y = [53273, 182457, 136068, -35367, -144117, -64247, 128633, 215122, 69299, -136215, -135308, 74566, 236821, 148693, -93972, -207192, -47362, 177344, 165654, -62589, -208090, -94129, 128449, 187311, 11915, -185225, -158329, 37508, 133434, 18137, -152070, -175844, -38608, 100827, 79079, -70588, -157703, -90145, 36096, 77031, -5760, -130193, -158204, -43247, 78392, 64528, -56841, -135939, -73726, 69395, 125192, 1500, -159554, -149702, 18201, 138144, 70819, -94925, -156043, -22992, 144011, 127041, -42939, -144962, -64322, 78075, 105438, -11315, -128557, -89712, 52517, 114829, 37255, -66085, -79617, -11230, 52044, 31404, -50048, -88400, -46540, 15106, 36333, 10897, -37937, -61109, -18764, 38092, 32566]
543C2566o4666n2997J7288P8065N4557m7106q6395N713R8307O7195m7504j05958
555e0935m1976P8398J03593r169r4042l7605O6918P6146q15o1771m2240L4125
567B0627N4369r012n1076j3318L2367K3778J930k843J930N854j3112k9481n968
580A6045L2883J2414l6807k6326K2214L7304M890l0799k8370J2940L3791j2583
592C7596m9417j1997L2342J8512k0696k0816J0890L4272J0928l9590l4687K2100
604a0563L3596k2428m3976Q258N1215K8041l5762n5755J2910P9679L1818p7214
616a81p9679K4828Q7193L6220o0316p7484J3307R6125N1966n6925p7592r742M5368
629f912L5552r763m0553k4190J8771L1259J6745O33l0940m8281m210O0789M1882
$$ y = [32566, -32100, -85097, -67809, 10256, 64813, 17707, -68688, -62975, 35332, 102527, 55023, -50935, -92911, -14513, 89080, 79911, -14131, -51736, 15182, 91328, 90513, 28742, -13498, 20627, 74996, 65984, 14908, 1590, 33957, 57735, 59665, 56822, 58752, 64606, 51494, 22013, 16045, 48928, 61342, 24535, -1791, 20423, 57727, 62617, 31818, 3448, 16388, 50179, 37596, -11821, -23818, 8524, 27036, 6340, -14476, -3586, 30686, 41614, 2024, -32663, -10563, 23033, 605, -43371, -35113, 16102, 44143, 8381, -47374, -34464, 45215, 77033, -181, -79860, -55032, 32161, 68381, 8065, -69419, -56112, 40013, 91979, 35054, -42538, -52280, -6912, 28640, 18877, -21676, -45866, -27095, 4164, 20909, 21542, -9398, -57679, -61889, -1100, 40782]
642D0782m7128r1555k9819Q1571J04085j2047j24872o6500Q6775J11916j9198
653C4010j32223q0490P6614J40309J8877j29140r2980O6884J29129L2020r1203
664b8193r8893P591R7198O1607m2543p2712j7108M9891P3429L7010m3401q5980
676f2104k6451O7998R1514J2282r6697r6987M4773J59124P3769j10797j51326
687i4902K347J59096J15719q5243j86342m1800J62422J46899n1934j66916o4299
698a04953J16597J47242j3112j62735j05409P0937J39896M3634q5179j10708j4857
709g8647R7545R6311j5428j02856q1929K0348J05612P3935o2420j39477l4234
720a21240J28750J43551j6152j69152j21384Q7090J96392M4218j73925j64419
$$ y = [40782, -6346, -97901, -127720, -46149, 57936, 45889, -78983, -145483, -58708, 53208, 34010, -98213, -178703, -102089, 38220, 57097, -72043, -165023, -98139, 30990, 63010, -28193, -127086, -119495, -22297, 39310, -3233, -75945, -93053, -43162, 30267, 67277, 23876, -62104, -88555, -20557, 70957, 83239, -13458, -110445, -65672, 93452, 167221, 56424, -94902, -92555, 66541, 182260, 97017, -89325, -131125, 31297, 178196, 126262, -40654, -104953, 11644, 158886, 145774, -16961, -122370, -51433, 88463, 132097, 46918, -63790, -78647, 18898, 115209, 99781, -3075, -85004, -64656, 40956, 114891, 52471, -87006, -121240, 7510, 151061, 134909, -34243, -155627, -68537, 127855, 172073, -1852, -166271]
730a66271N3899K06874J07599j19719j93699j6342J78589J32747p4514j72461
740f3298o0930J09392J39498P242j25254q9779N4061J19046M7372p3469j17741
751e3860m0130Q8520J17038J616j16284r9160L6013J41106Q3597r3770j73069
762a08383l2695J50679J39348n2346j89659r6564J24726K01403K1045j86102j50834
773a79382O3949J82564O8991j28219j68336K44J66841J17862o6358j50453n3996
784a46293R5507J30022J4774j20451j11543K4372J19534P7544m3542j13478n0649
795a24203Q7661J28892N995j27766j10423L7078J42932P9114r1470j54389j0559
806a37138J52602J23780n5834j62503p1438J05293J51025l057j55880j04007P3510
$$ y = [-166271, -112372, 94502, 202101, 82382, -111317, -127659, 50930, 183677, 109163, -63298, -124228, -14836, 124662, 131904, 6650, -83129, -29068, 89978, 137350, 63881, -53860, -93990, -5470, 111568, 113184, -3100, -102260, -66247, 74859, 158456, 64686, -108383, -141078, 9601, 148949, 96603, -93056, -189620, -64894, 136509, 157554, -28548, -179382, -115433, 67131, 136122, 7903, -160433, -160189, 6652, 124514, 58156, -92297, -146293, -50786, 79236, 94010, -26441, -137984, -113612, 5922, 83466, 39924, -73554, -124203, -36542, 92350, 98345, -29421, -139844, -102766, 40166, 119280, 27810, -126579, -137138, 15464, 139244, 83410, -79093, -150531, -45238, 105787, 102730, -53150, -157157, -83647]
817h3647J51827M9976j00149j26179J680J25969Q5450n7693j24775m9727P1732
828e5536J13209L4448q3734r6962P931R5149P0455l2144r9301n3582O5064J06370
840G1367N045j01074p3335N5700J28101N0800r8099j38182k423J35140R9347n3616
852G8771j28856m5935R1286J17830k179j11390o7399N4516R2204J2356p7234p7274
864f3304J2602Q9943N6248l6750p5400k9197L7805O2932K0510n6309p4667p695
876f3282O1486O0144o102o5676n1258L3458Q0172J4973p1557o6794J8174P4165
888A7903L5056n3130p5875J1540Q9371M6553n1852p5203p999O0696M9753k7677
900A9136o8272j3867N4438M8353o255l3812k2191N939K4173J2314p232j1628j1991
$$ y = [-83647, 68180, 118156, 18007, -108172, -106492, 19477, 104927, 47234, -77541, -127268, -55536, 57673, 92121, 8387, -88575, -80644, 14505, 84960, 52816, -46485, -100067, -35003, 71367, 76412, -24662, -97997, -42297, 85804, 136604, 38505, -99677, -102100, 33040, 132387, 78771, -50085, -96020, -4734, 113096, 110917, -473, -67872, -13356, 78848, 91204, 13970, -63304, -50702, 39241, 95489, 58739, -16661, -45858, -8053, 54879, 75389, 19080, -55587, -63282, -1796, 58348, 52246, -13430, -64688, -31230, 48942, 63915, -7642, -74436, -56262, 17903, 52959, -171, -76046, -64506, 24865, 71418, 19566, -55637, -63636, -2940, 46813, 19136, -49136, -63003, -8565, 39788, 33533, -279, -22470, -16531, 7642, 19956, 12724, 1096, -10895]
913a0895j0853J0771L2552J1142k4597j8031J5495K9211j283m4452m2431K3510
925b9861O8909K0326n2326n1167J2011N1087K6542k6016m0110K179K6401r031
937a056l4874j2M1641K7942j6979l8521j1398L0525K3024k3009l0295J3411K9878
950A0277p432l2422p909L6738M5687m996n4906l3348L2117M1538l583k9478j1268
963a8985J5752J8894K75j3719N402K1313j304k3522q938R532j462q669Q622K7037
977C0228J8920k3266n1536q203O1182N1279l8027q0837k1894O0309O5461j5700
989D7916p8077k8994O5987O9164k6612q3385l6895M4885O4043L305n8920m0597
1001e8180L1035N1553Q621l1296l2691n446K6571L1967l979l9966l5287L535N1470
$$ y = [-10895, -21748, -10977, 21575, 32717, 8120, -9911, 5584, 34795, 33512, -10940, -53371, -29861, 39048, 59374, 7048, -44119, -32108, 18979, 45521, 19505, -20605, -18426, 7975, -1056, -35930, -35942, 5699, 33641, 16662, -21859, -33257, -2732, 20292, -2717, -33012, -19601, 10277, 2845, -29577, -37486, -748, 44939, 39943, -14963, -48311, -16194, 25344, 21761, -7717, -18985, -3233, 15661, 15936, 2217, 7619, 28932, 27628, 4106, -4832, 4700, 3238, -5431, 3191, 30228, 49148, 25882, -25654, -33857, 27325, 78604, 40577, -40260, -62154, -1845, 63616, 47916, -30161, -59155, 6832, 75996, 49384, -34001, -70896, -26011, 38032, 41337, -17583, -58180, -27145, 24408, 33029, 1733, -30958, -36404, -9833, 22134, 18155, -21811, -57098, -53563, -2093]
1014b093N7751n716p5484n1685M1747P8388J5152p0108p0444K5653R7362L8120
1026G8643p8781q5221K7451J07612N4094p1261j16908k3131R9776R5743k2289
1037F5728r6307n1778M1887Q0805K9621n0748o6982l858M8122L5129j6308n0412
1049c5101k7877M1155P5805J3642p5391p9478R015R5232P6091m3696j23637n1667
1061a25907Q9178J15788M082j01017p5063M6943J08354K1599j03488r0561M2485
1072f7607J20536N2555p3601j10853j4020J04252R6860k4903j04882o3132L9257
1083d5538R0385M1080n5046q3318m520Q0061P1572j7341q9883o4442M2227J04375
1095F9612L1866q5678r4597J3393J08420P5282n3582j22065l1773J02572R9921
$$ y = [-2093, 55658, 49942, -25542, -77227, -35480, 42908, 58060, -12048, -82492, -56839, 40523, 78643, -138, -85359, -57908, 49704, 103798, 32537, -84371, -107502, -7726, 88017, 65728, -30579, -82357, -40470, 40335, 69956, 19208, -47774, -51632, -3510, 31619, 15311, -35101, -62978, -21823, 53982, 67624, -7767, -87245, -78230, 17002, 93093, 49397, -74240, -125907, -36729, 79059, 83141, -17876, -92939, -45996, 62358, 83957, -19531, -110092, -67607, 52929, 105484, 31883, -78970, -92990, 11262, 108122, 83219, -21663, -84795, -45538, 44847, 85927, 30881, -52437, -56957, 23104, 94676, 77335, -12548, -76990, -34763, 69612, 101478, 15800, -78797, -65404, 43016, 118298, 64716, -57349, -89122, 13450, 113371]
1106A13371l3887j26501o6994P3891J28227K6451j08337j01482K9788J11535N5876
1117A01938o0526j03024k6609P8221Q1265j5800q2297m3790M5143Q3394K6867
1128H4782p0523r4112r66R4081P9855k5620j07047p0534N5522J26926M6188q8480
1140C0072j08220j740R6600O9125m7896j05682j8368J01859Q6442m3064j17226
1151e8098m5864Q3145J14324N083j16132r6954L4082J08194N3539m8105q2977
1162d9763k0628O1628O2847j6593p0065l9814K9340O4665K8862m7848p5124o145
1174g8638P7696P2724j6048r1358o6681L9855J04934L4967q2149r0663J6153J02349
1186B3141O4544m9992j01613k0571Q8351P4247l6952r3593l1069O5204Q1317K460
$$ y = [113371, 79484, -47017, -114011, -40120, 88107, 114558, 6221, -95261, -65473, 46062, 101938, 41412, -61612, -88221, -10000, 71265, 55465, -26832, -70622, -25479, 57915, 84782, 14259, -79853, -80819, 13262, 93117, 67497, -39550, -110084, -54562, 72364, 118552, 30072, -78148, -79888, 16712, 85837, 37941, -67741, -86109, 15750, 102192, 59128, -58098, -103962, -20817, 93507, 98590, -17542, -114496, -80414, 27780, 81319, 33214, -49763, -70391, -8763, 54084, 37491, -32574, -72388, -43048, 21617, 50479, 2631, -72493, -78638, -942, 71782, 55734, -35624, -102305, -62450, 42484, 77451, -4698, -95361, -79208, 23141, 87685, 37693, -63920, -84491, 3860, 78107, 41155, -52438, -83507, -18303, 63014, 65474]
1198F5474p5147n0736L6392O7917J5661m5385n2221o339M6701M6208p103m6716
1210e294l1127J5948N1462L7024k7146p1193l0554M8237O3360K388n9970m7389
1222e4254L1285P6474J6077p2745o2924K9944Q0894K8886o2176q0322L91Q1243
1234A2773N7966k7740o0696j8265K8230K9223l556k8596j0141J9540J6139o347
1246H530j1776m843O74J4311K1325R25k8649l2186m459L4808M3064l257n1899
1259a3432k8329L4119M7554J155m3083l2695J8216M2350R02m5139k1497L5154
1271d725M1581m005l8766k5656J4621L2421L299k5900j3409J0109M950o656L179
1284h957J4642Q373r463k1542p356J9005J4483j7565k0882J1011K4920N531j7449
$$ y = [65474, -9673, -60409, -24017, 43900, 59561, 14176, -38045, -44384, 2317, 48525, 41422, -5294, -36421, -20473, 30989, 68013, 40867, -30326, -60880, -12643, 50717, 53105, -6865, -54254, -22969, 53505, 69582, -3163, -66087, -36143, 44751, 73637, 11461, -68861, -68470, 12773, 70739, 42999, -17697, -35962, -7732, 21491, 17935, -10661, -20802, -1262, 14877, 8530, -3246, -8089, -7415, 6896, 28221, 29146, 497, -31689, -36148, -1340, 41724, 38467, -13432, -41761, -7642, 39912, 41067, -2016, -34711, -16495, 25855, 26757, -18382, -39879, -4725, 36856, 32851, -5915, -31571, -16950, 15471, 18770, -7130, -20539, -10430, -5480, -12136, -8957, 5685, 14058, 4595, -16947, -24303, -5298, 9185, -8380, -29262, -18251, 6669, 12200, -5249]
1297e249j4898Q344K3213K449k5631j3131J7375J3972j0084j3415N760J9314J1119
1310A9138j1457j7418O102J5624j0731k4285N835L1763J5015k1718l3371J143
1322b4360M2378K8481k8819m5291Q99L6968J6644k3903l1872N865M2453K4979
1334D4422k8022m0327j525K7999K0069n154k2073j8713L547J9662J6268O461r236
1347A3378k4688j2049K3299K9071r757l7022j8498K7557M4628K525m9673l3523
1359d4752L9500O2224j237o5029n0339K5097P2313K8131n0548n8813J3334O0865
1371C0746K7883l2458m8865p236M0885L5184j7724m4875j7473K4409L9345J9065
1383D8886k1100m4305j8582K9007M0234N028l9614m6093N883O1400M0144l8416
$$ y = [-5249, -20147, -11803, 11410, 13859, -11772, -24903, -7528, 6444, -3640, -17055, -11295, 8019, 19138, 7681, -9737, -3635, 11989, 1258, -23027, -17192, 14571, 29586, 7868, -25503, -24360, 18018, 46499, 17680, -27611, -26712, 10256, 26900, 2997, -28875, -23010, 19443, 44422, 16400, -23927, -25452, 2547, 22616, 17462, -4611, -23324, -19777, -115, 16153, 22614, 13378, -11310, -23359, -60, 29011, 19254, -17768, -36266, -8709, 35919, 38444, -11229, -44752, -5252, 56972, 55735, -9294, -59633, -34536, 37777, 65908, 15360, -43453, -30119, 30746, 58629, 26171, -22694, -29930, 10955, 46139, 28415, -16460, -33933, -9524, 29821, 48886, 27786, -16519, -35101, -6094, 34140, 39168, -446, -46539, -40656, 20744, 60888, 22472]
1395B2472o7653j0360O0137N7238k1438q2867m0897N6401P8696k669p3673m8479
1407g3092L6894P6701K0720o5418o9699J4012P0331L6809l3055n9932j6790M7459
1419a5060N7194k225n4009l9343J3930M9493L1451k6509o0427j9200N1754O3227
1431E0276J945o1520n5177K0117P8422L6310o0205q1375P27Q2180O5684k9315
1443D8069q9192l6529O6745Q1330q697q2583n2301L6050P6163K3265n8087o2661
1455e8428J5928P1535L7417l4654o5375k5181M1523O0825N747n3213m5466J2577
1467c6765N6960M1095k4303o7516k7133N1007O3799l446o9646n4567L0258Q7298
1479D7041L7299o3898q1214O479Q1944N3668m1461q9041k7055P1936P8762j3623
$$ y = [22472, -45181, -55541, 4596, 61834, 40396, -42471, -83368, -26967, 51729, 49060, -24613, -73092, -36198, 40503, 61223, -4195, -73894, -59882, 10449, 47258, 14203, -45729, -62519, -15060, 42134, 39909, -14100, -53443, -39513, 9980, 41431, 14922, -45505, -64705, -12951, 50276, 52221, -9299, -64476, -44359, 34063, 70373, 10168, -71207, -70480, 11700, 77384, 48069, -41123, -77652, -10907, 70423, 61726, -20857, -73158, -37108, 39055, 62320, 4233, -58428, -42500, 29035, 66452, 31798, -33577, -58758, -17235, 43590, 49337, -3876, -49342, -36765, 20195, 61290, 36987, -30529, -57662, -6655, 57144, 53698, -15948, -70515, -40257, 47041, 84340, 20442, -60772, -54293, 27651, 81319, 39858, -49183, -76238, -4302, 74460, 60837]
1491F0837p9473m3752L9576P1668J9378n6276o2376O267N8598L5812k2441n1017
1503b3199k3219L4081N7370J0901n0352n2560L126N3404M4110k1849o8664k8276
1515f5127N5983O8796m278p1520n1237L3214P9723K2118o9657p2113J7711P9294
1527B2907M2482l9296o8025j2172N7529N0730k1308o0357k4577L1079M5830J2324
1539C7146l2786l8574L514L9217K8558j0238l9147l0266J4680M9212K0100l7511
1551C905m8389J727N3255M4562k0361o6306k8052M8712N5628j1768o0882l1176
1563e9145L8320O0803O971n8114m4232K6634N5958J3810l8731m3559j824L9227
1575c882L1107j0901k8847j0713J2281J9720J1196j1834k7890j1767J9400K8310
$$ y = [60837, -18636, -62388, -22812, 48856, 68234, 11958, -50418, -44151, 14447, 50259, 27818, -23199, -46418, -12337, 45033, 55934, 5582, -46978, -43852, 9552, 53662, 31813, -36851, -65127, -9144, 59652, 55374, -16146, -67383, -34169, 45554, 67672, -1985, -74098, -56387, 22907, 65389, 26093, -41932, -54104, 3425, 54155, 32847, -27510, -52087, -21008, 24822, 37146, 4360, -34214, -30700, 8517, 37075, 26837, -12310, -42576, -27896, 21316, 41416, 3905, -44484, -42757, 10498, 55060, 34699, -31607, -59659, -10947, 44681, 32913, -27969, -59145, -20825, 39978, 46949, -11165, -55397, -28763, 27195, 41005, 2274, -41285, -43109, -3882, 27225, 16324, -12523, -23236, -10955, 8765, 19961, 8127, -19763, -31530, -12130, 16180]
1587A6180P944k2372k9964L835M1783K4533k7652m2401k957L7757K9911j7749
1599A8848m5125r370M4055L8332j6262m2503j3544K5676K8606n109l2041j3345
1611b1782K1858K1653m346j4919m321N241P436K196o469n751k718l722J481J4318
1625A0155Q134j3709j6042N928J9776R173j5684k7412m766K6632J9555j4011k1634
1638a3905J019J8721J0814r912j8286p64J8321O098j7467j2520Q355J2849K312
1651E635m721k373O456M397j2595j5477P097K1183K011j7580j1498Q523J9651
1664A0709O048j6750j6469R755J9345k843j9389j0495Q151J7172Q177r864j2397
1677h850L013R200P70k867k912p356n229O160J1968N229o003j4538m704J9429
$$ y = [16180, 24124, 1752, -28212, -24377, 17406, 41939, 14287, -28114, -31071, 6686, 36597, 18848, -26277, -35647, 8408, 46740, 30478, -12025, -25569, 107, 28713, 23604, -8437, -21782, 76, 21729, 17383, 2464, -1857, 3384, 10820, 13016, 6547, 796, -1922, -5644, -4163, 10155, 18289, 4580, -11462, -5534, 14242, 23415, 7731, -19681, -24447, 2185, 21740, 7729, -13905, -12886, 5835, 16649, 6737, -11549, -12313, 6008, 12106, -5361, -17881, -9526, 3323, 5635, 914, -1459, 4997, 9394, -3201, -18678, -11581, 9602, 11613, -5967, -17465, -8942, 10709, 16757, 7, -16462, -6707, 12638, 9795, -9594, -20089, -11938, 5234, 13411, 3547, -8850, -5837, 3363, 4133, 1266, -1646, -9002, -14231, -8071, 3897, 9126, 3123, -11415, -16119, 3310]
1691C310J9316j2157l1045q088K3193K5369l750l0962j7258K6054L7453k248l6988
1704g801k3816J4109L1943J0624k4806k8092Q871L2678J4027j5835k3156o358
1716a7612J5965K1682j4k3323j8739N908K1959J9391m442k6643j5996J9708K9957
1729B7801M11l2584l0015R468M4070K6220k9920m7809k288M5007L6075j5692n0104
1742a9360k4322L2866M6044l257m5358k5940K3536M4688J4104l2931m2685J00
1754c2515L8697K6622j3699l4560j9644J8378L8382J4500k8046l4342j682L1312
1766C403K9899r826m4209k5936L0734M8878N672m4244l8271J5954N5938K5320
1778E3312m4976o0508J667N8603M1972k3449n8184k0943M3238N2886n954n3219
$$ y = [3310, 22626, 10469, -20576, -28664, -5471, 19898, 16148, -14814, -32072, -6018, 31435, 29187, -7801, -31617, -17508, 14435, 25059, 253, -27839, -18968, 13710, 27737, 11902, -11254, -17612, -1647, 20035, 20021, -3302, -22041, -16133, 5826, 25217, 20775, -5868, -21864, -2156, 27801, 28212, -4372, -34387, -24919, 19151, 45371, 15451, -32358, -34646, 10361, 46436, 30744, -19360, -43682, -10816, 35228, 31971, -13387, -39327, -15791, 28897, 43001, 10070, -32615, -32515, 6182, 32804, 19105, -15455, -35099, -16721, 21661, 36161, 8115, -26227, -27909, 3403, 33302, 23476, -20733, -46669, -15935, 32943, 38615, -5629, -43900, -27946, 27992, 53312, 8336, -52172, -50505, 8098, 50070, 26621, -31563, -52506, -9268, 43618, 37664, -15555]
1790a5555l1154K2383M4396J3648l3574m1392K513M4293L2347j1864m0596k6693
1802d1248J5556M3566J8160l2694m3937j495M3521M0397j0655n3897k9496L8052
1814a4170N7068J275n6504m5274K1692O3764K7547m5088n7407P890O1109L4750
1826E6652l1348n7828j5711M4054M8228p381m8227k5146K2988M1243J5151k6295
1838A6380l8872n896L2474L1062n403l5758k8599J3347M7912K7043l1331n1280
1850b8921p620M4392M1278j4704n7763k7641M3236N9354l019n7880l7780K7880
1862a9188N8243J5505m9230n0751J2033N3203K4094k8380m1049n203L6570L4295
1874D0142r804l9729k2695J3811L0801J7790j4489l3926j3252K6251L4461L314
$$ y = [-15555, -46709, -24326, 20070, 33718, 144, -41248, -38735, 5558, 37905, 26041, -14555, -41248, -25692, 17874, 36034, 3340, -40597, -42092, 1429, 41826, 31171, -22726, -52222, -14170, 42898, 44173, -12331, -57605, -35913, 27851, 55398, 10310, -47097, -39207, 21902, 56652, 25304, -32524, -48235, -4181, 44047, 36666, -11561, -36707, -13719, 27524, 42675, 16380, -22492, -28388, 4086, 35148, 29745, -6013, -34612, -21265, 26647, 53690, 22359, -28921, -36541, 7851, 49129, 34425, -23338, -50979, -7743, 51611, 48592, -9288, -47068, -19188, 39055, 54560, 5330, -45421, -33388, 19815, 43909, 15529, -25520, -30723, 5847, 40142, 30338, -9391, -32086, -18275, 12526, 30316, 15827, -18099, -31351, -5100, 29361, 32675]
1886C2675l2398l3117P654M2397K2777l2690m7286N43M8053L7477j8703n3176
1898b5794k0419L9928M6166j0590n0410k5154K5555M2329Q457l2909k9954J1315
1910b1480L2751R873j9313k3045m845J6711J9533j181k0334j4353O359K1813J8967
1923B1456p815l3217k0006J9493L3364O205k7158k7531Q335L6872J7764k7642
1935A20l4306O616L5536J7414k2155l5447m887L3280K9289j0050k9123r103J5452
1948g364J7405Q55j4714j3338M737J2436N680j601m995n935O40J1834Q833p874
1962F599j5160n687J0647J6744J861j9934j2856J5799K4435Q61k1229j7775O010
1975i685K2395Q780j7560j7256Q126J8360N474r518r727O24R397L629q004n654
$$ y = [32675, 277, -32840, -25186, 17211, 39988, 7298, -39988, -39445, 8608, 46085, 27382, -25794, -46213, -6285, 39881, 29291, -21119, -46273, -20718, 21611, 30068, -2841, -32795, -21480, 11271, 21144, 1831, -21214, -26059, -9348, 10185, 9004, -11330, -25683, -19324, 2489, 21456, 13641, -19576, -39582, -20089, 13275, 19480, -7678, -35209, -26874, 9998, 27762, 120, -34186, -27570, 7966, 25380, 3225, -32222, -37109, -3829, 25460, 15410, -13713, -22816, -7364, 10041, 10896, -3818, -17156, -12419, 17, 5697, 4096, -899, -6834, -6194, 5640, 14473, 6599, -8561, -14248, -3601, 13143, 15004, -4930, -17786, -1987, 22448, 23309, 2080, -15695, -9685, 12710, 21490, 3930, -13326, -5200, 13160, 18634, 9116, -611, 13, 9410, 13039, 5035, -619]
1989f19M749L288l733L40N355K716j833m583j754N886M276j0068j2178N751J6987
2004A4580N800r230j3004j765J1566J0081o518j1712O82N579j828n029lN880O806
2019A1885J68p922n238L136l53n842J650R836K503j0332j1926J000J7979J4633
2033B1177j0892k4352m782J7977J2591q202j7562m394J7302J6989p922k1783m535
2046a8388J6470J3377n147j6996j2039P147J8016P511p548r670n113J568J0588
2059b24Q450o167j5066o283R119J5142M131j6053j5573J1742K6382M391k6421
2072f430k4471O064L1370J8315k1133l3241J548L4099K1192j6609l1511q121K4428
2085d500K6652p236l0605j4014J6335K3945P402j2768j8361k873J5119J2665m648
$$ y = [-619, 4130, 7418, 3685, 4025, 9380, 12096, 10263, 5680, 3926, 9812, 14088, 4020, -8158, -2407, 14580, 20380, 11150, -1854, -3619, 7947, 18028, 11510, -202, 480, 6059, 4231, -798, -801, 5079, 11885, 12053, 4131, -1107, 2029, 1676, -4166, -2516, 7320, 9823, -509, -12435, -11435, 6544, 21177, 10285, -14067, -18849, -872, 11719, 3517, -14045, -18439, -1137, 15852, 7930, -13853, -18388, -1918, 11459, 6312, -10684, -22723, -15576, 2440, 9951, 2403, -7267, -12380, -10812, -224, 8226, 2059, -13007, -19290, -10171, 4971, 9102, -6951, -22524, -10782, 15600, 19991, -6430, -30901, -24837, 6533, 24848, 3715, -29526, -27978, 6121, 27313, 10704, -20807, -28928, -4500, 22152, 14916, -15689, -29703, -13368, 10577, 17979, 5211, -13150, -16023, -904, 11761, 7113]
2098G113j5335j1674O532K2921J3473j6115k8618l551K7429K9063n121l8039k6924
2111c8846K0489M1963Q478l2579k8551J1681L7055J5363k7593l6040N042L7360
2123A3822J9690k1921l3407o841K9252L2737l048l1988k2714R905K6151J5020
2135B6658j1209k6819j2306J8306K7012L393k1689k1682N177L0644J6429k4936
2147H978l9231j688L9707L3495j2386m5766k3514L0219M6592J872m2775l1073
2159c5570J4611L8809J3940k7918l3392O085L7105J9663j8355l1729j1744J9848
2171h647K7834L131k5896k2502N987K6011J8949r196l0354j6033K2035L3061J204
2184B5584l3205l0479R353M1852K4304k6088m2005k601L8369K8963j6984m1849
$$ y = [7113, -8222, -19896, -13364, 9557, 23030, 6915, -21703, -25254, 2175, 31238, 26117, -11922, -38846, -18357, 23606, 32084, -495, -29046, -17365, 19690, 35053, 7460, -28580, -23538, 13822, 33512, 11591, -21816, -28657, 595, 33332, 30284, -1704, -24418, -14513, 11638, 26658, 15449, -11370, -23676, -5370, 21642, 25035, 3346, -18336, -13159, 17485, 33914, 8978, -30253, -31941, 7766, 41261, 28875, -16891, -40405, -10186, 36406, 38278, -4497, -35570, -20959, 17850, 31790, 3872, -29520, -23435, 13670, 33333, 14978, -16751, -28495, -8647, 19187, 22318, -3578, -26080, -20093, 5918, 24867, 15671, -14683, -30716, -8681, 24380, 25584, -7621, -38100, -28747, 13105, 37409, 11321, -30684, -33285, 5084, 34047, 17063, -24786]
2196b4786j5262L2047L7808n340l9247k0563K1495L5289R277k6615l2023J347
2208b6573K9229K0650r052k4265j3821J1726K6550J1154j8305k4507j855K1878
2220B809K0022p250l0489j5187K5184L6576O82l5705k9050J2729M1357J9242k9239
2233A1681m0030J02L5778K4085j4126l0043p421K5248K4650r815l1315j2472J7244
2246f434K4054O154j6861k1800j555K0189J7539k194j7198j6659J321K0234J3756
2259B0546j2670k3139l144K1394K1867m525k9081j7088J9269K9837r19l0086k0674
2272b8413J3547L1786J0815k4231k7022O251K7808J2370j5533k2678m914J6706
2284c508J6949k911j5782o950P246J0681M538n350j2859o417P987J1799K695q455
$$ y = [-24786, -40048, -8001, 29807, 24467, -14780, -35343, -13848, 21441, 30718, 4103, -27920, -26573, 2656, 23306, 14254, -10011, -23832, -12106, 14444, 25598, 7293, -17214, -19069, 2809, 22831, 15581, -14908, -30095, -4911, 31665, 32347, -3358, -32408, -19679, 21678, 40920, 11681, -28349, -28247, 7531, 31616, 17490, -12553, -19974, 5274, 29924, 20109, -11206, -23678, -6434, 17620, 23774, 6913, -14887, -16442, 3747, 21286, 19092, 1894, -14765, -13444, 6790, 20546, 7876, -15263, -18407, 2987, 24854, 20329, -8752, -25840, -6571, 23266, 22347, -7739, -28413, -14866, 16920, 27735, 3504, -23518, -17267, 10541, 22911, 7378, -15300, -20214, -3508, 13441, 10530, -5252, -12202, -4956, 5725, 10263, 4913, -7946, -14363, -6376, 5423, 8118, -337]
2298c37j2157j4J6325J3479j0652k1144m778J6169J7002l133k2011j3265J3913
2311a0603K2802K002j7032j1356N456J2690K015j2230j0422P590J4139J293r216
2324b872p426P70P293O371p59n928m722k133K44N778P612j995p723j906O390N726
2340D720r64r365o096O988J1241j891j0647l226P362R741J240r321p817N097Q873
2355E935n20o740k391K540L254K529K33l04Q54k136n125Q48P515J588o811m888
2371c619M290Q637L969p405r976K943J2569L222j0961r692K183J0237O910m829
2385H478j0448J60J0157M800n349o825m553J328O555M495j829m328l681r68O183
2400D175P790l323j2014m953P629R746q28j2698r193R391J9529K145j9072j5011
$$ y = [-337, -12494, -12508, 3817, 17296, 6644, -14500, -19278, -3109, 13893, 10760, -11251, -24516, -10603, 12199, 14201, -2831, -14187, -8731, 3959, 5974, -6256, -16678, -9088, 5051, 6344, -2872, -10298, -9528, -2235, 4136, 3377, -2551, -7273, -9406, -9162, -3384, 4228, 2233, -5490, -7396, -1006, 4720, 3756, -5609, -11705, -4717, 6524, 4633, -6014, -9240, -1878, 7863, 9103, -218, -8035, -2938, 5935, 5415, -1325, -3716, -1176, 2078, 4607, 4840, 4536, 5390, 3254, -1871, -1023, 6492, 8080, 1269, -3619, 671, 9308, 13277, 5872, -4104, -1161, 11408, 14630, 3669, -6023, -3840, 6397, 13307, 8478, -1970, -1810, 8347, 13147, 7798, 973, -3580, -2252, 4303, 8798, 6969, 2641, -1040, -2008, 4175, 11965, 8642, -3372, -8325, -696, 9050, 8222, -4476, -13669, -4278, 15251, 17396, -1676, -16687]
2414a6687O241J7668P053j3382j7334J470J9410R944j0961j5018j441J1146J1381
2427I490j802j5162q645O087J0473N492l139r147o391P451J3232J090j3319j3978
2441a8268J416J7921J4617r925k3786m736K1868K0339n784k5706j4555J6021K6761
2454A6183O68k6646j6925J3476K5502Q245j7736k1866J236K1524J1581j0556j6907
2467a2221m781J0311J6090M425j2486j4545K22J3859J2864j696j8405j5386R435
2480a2314K4430P232j8491k0262L309K6209J7041j6810l2398m949K8831K4340
2492B6168r627k9309j2904K0987K8026q65k7850j6330J3189K3420N453j7436k0052
2505a7130J115K1650J5450n849j6959j0177N366J6468R161j1749j9279k670J7821
$$ y = [-16687, -10446, 7222, 14275, 893, -16441, -14971, 4439, 14383, 3422, -11596, -13037, -1891, 9490, 7688, -7474, -16119, -10032, 441, 5933, 2794, -6353, -12744, -5293, 7939, 9029, -4290, -18268, -16852, 1069, 15686, 5761, -18025, -22761, -893, 19446, 13662, -12044, -26599, -10578, 16183, 16851, -9795, -26720, -13244, 12258, 20503, 2767, -19099, -17863, 3661, 15242, 4686, -12221, -17002, -6691, 9399, 13824, 1338, -13207, -12985, 874, 13738, 12042, -6363, -21749, -12314, 12116, 19348, 857, -19405, -16096, 10113, 27154, 10344, -22054, -27003, 1828, 26168, 16541, -12768, -25672, -4685, 23341, 22476, -5374, -21704, -8515, 14905, 20358, 2922, -17130, -16015, 5635, 21085, 15236, -1723, -11900, -6534, 9934, 19095, 7346, -11933, -14603, 3218]
2518C218J9038k229k3690j7593J4570L0468O018k6462k6590N738L0166J8017j7946
2531A2723l0732j361K9570K0204j3418k8857j0064J9790K4690j942k5955j4600
2543a9952J1846K0842Q408j2136j9343n693J4533J5442l14j5734j4355K096J8860
2556D500J4565r671k2650n613J7900J8555m447k6042j5924J6886L0462L991k7235
2569d723k3297Q883K8301J4019j8141k7188j424K4001J5141j0577j9683n419J5629
2582d478J8462j123j8999j3037O260J5062Q218o019j4886p323J1535J6501K269
2595A2442j3889j4446J261J9083J3397j1336k4329m890K0440K0448k416k2114
2607f349j4252J2727K3024J722k1679j4581R156J9640P306j4028j7222K085J8999
$$ y = [3218, 22256, 20027, -3663, -21256, -6686, 23782, 29800, 3338, -23252, -17514, 12652, 30669, 12723, -18009, -19370, 10200, 30404, 16986, -11871, -21935, -2145, 22545, 20603, -5352, -19952, -8106, 12736, 21144, 9008, -10335, -16028, -1495, 13947, 13633, -2101, -16456, -14360, 4500, 19065, 9394, -13256, -18869, -969, 17586, 13139, -12903, -28827, -11941, 18521, 22512, -4723, -28020, -19137, 9164, 23183, 5042, -22146, -23570, 431, 15572, 4995, -14688, -20107, -4478, 13984, 12861, -6138, -19175, -12915, 2147, 10365, 4346, -10540, -17863, -6328, 10173, 12442, -1447, -15893, -14632, 4451, 17848, 6512, -17817, -22707, -2267, 18181, 15765, -6349, -20601, -7874, 15150, 16872, -4807, -19388, -10232, 9408, 16714, 2686, -14536, -12451, 6548]
2620F548J0233q605j4113n920O715J1702M530q404r411m98P689R431J818j0327
2634A388j1126L822J3147L848r443j2184J164J6553J2113r888k0832k992J7127
2647B697J5132m210j7498j1078R512J6497J250j1924n605O227P555r2q260o973
2661f770K603Q620L563l508l940l277p28N472P247l50q069o611n3Q147O832n712
2677C466j0541Q87J2523N454o802j1359k183R845Q989n662j2663j326J0879O639
2691H146l269p761l009N090N631k588o330n4K330q05r79L070K582r50m296k280
2707e472L232O003k161r771l132Q692O946k153q054l124O390Q155k884j0770k442
2722a0545Q293O008l083o857l329M581P198R73l906j479k73l279j474N047M602
$$ y = [6548, 16781, 8176, -5937, -11857, -5142, 6560, 11090, 2686, -6725, -7223, 466, 9897, 11715, 1388, -9738, -5916, 7231, 11079, 1636, -10548, -9384, 7169, 19282, 9394, -11438, -14430, 2697, 17829, 13619, -3879, -14957, -5445, 11052, 12302, 378, -5227, 1000, 8555, 8463, 203, -6770, -4167, 4453, 8016, 4508, 568, -2709, -3437, 2035, 9282, 8932, 863, -5748, -5801, 2346, 9178, 3466, -7075, -6188, 6335, 11789, 4987, -6372, -8555, 1290, 10279, 4617, -8046, -9372, 1507, 8146, 4877, -2884, -5893, -803, 4828, 2240, -4090, -4144, -1814, -2619, -3598, -528, 2054, 1104, -3192, -5472, -2240, 3763, 1602, -8169, -11301, -2609, 4337, 2184, -5870, -8994, -2604, 5551, 2667, -8103, -10545, -2252, 3756, 673, -6184, -9513, -4932, 2266, 3239, -667, -2146, -2419, -5698, -7172, -2125, 2477]
2737B477r89m209l332L286O451k23q532j872R317O331o362j1947l387J1246J4905
2752A3160p83j5467q335Q622J0812O48q846o619L021R351J866o822m317L588M704
2767D583K191j061m726m716J038N212M200M71o414p835L029J3548N987j0317j3373
2782h183r51J2494J0947o719j6371k407J5693J2421p360j6620n277J2251J4496
2795A4414j757j7308r498Q962J3407K427p800q524j37Q667O431m179q858m443
2809h196K745Q540P553m600j3024m006R725J2031N52j3062j2216N947J7237L944
2823A3170j5063j4700P022J9210R961j3010k1549k308J9223J4278p170j6946o426
2836a4308J0015J4397Q97j2476q509N152J0512L353o382j1257l544R321J2860
$$ y = [2477, 1488, -2721, -6053, -2767, 3684, 3461, -5071, -6943, 2374, 8705, 2343, -9604, -12991, -1745, 13160, 12377, -3090, -11425, -2803, 8009, 8657, -189, -6808, -3787, 5564, 7430, 608, -3709, -121, 4583, 6774, 5713, 987, -3729, -2691, 2521, 6721, 7192, 778, -7057, -4028, 9520, 15507, 5190, -8183, -9134, 3360, 14307, 7588, -8783, -11190, 4503, 16924, 9564, -7056, -12333, -82, 14414, 12657, -4651, -14149, -5187, 8220, 10647, 2847, -5677, -5814, 2853, 9284, 5105, -3753, -8196, -5451, 3089, 10642, 6042, -6982, -10988, -1263, 10768, 11320, -1742, -13958, -8011, 9226, 13170, -1893, -16593, -9571, 9639, 19600, 6590, -14959, -17267, 1956, 16234, 9064, -7882, -14308, -4293, 10104, 11001, -1475, -9984, -4832, 5680, 9033, 2651, -8606, -12150, -2829, 10031]
2849A0031Q50j1715j1117J275J4661J1527p414k0144o741J5267J6606n59j7278
2862d751j2654R517K0035L310j9143j4535P858J8766O540j3857j8307L63J9624
2875B766J3232p196j5185p171O519J2144L732r582r791J887J0092O743j987j1252
2889e049p909P898J5426K900j3903j4465R02J6938J4018p349k0368m550J6712
2902A201J5467m426j9441j0216J1395J9986J772j7916j2945P895J6390O192r954
2915E400j4468j258J3113R143n436j0755m995N118J1532N138p320j2039j886Q946
2929B33R724k03j1850j1148N779J6101O339j1758j4287J70J4884J1518p911j8898
2943a1307m036J5686J3353n223j5559p297J1108J6262M21j6064j1192N170J1663
$$ y = [10031, 10881, -834, -11951, -10676, 3985, 15512, 8098, -12046, -18787, -3520, 13086, 12527, -4751, -17405, -7888, 12147, 15457, -3686, -18221, -10363, 8403, 14943, 1086, -17221, -16858, 2766, 15998, 8802, -6383, -13554, -7035, 5109, 8841, -741, -10532, -8645, 1447, 8190, 6203, -5049, -12958, -5060, 10366, 13266, -637, -15102, -14200, 2738, 16756, 9407, -10961, -15511, 1201, 16668, 12242, -7199, -17415, -6020, 13966, 15738, -2178, -15123, -7228, 9162, 15354, 5400, -9068, -10326, 2787, 11930, 6494, -4261, -9256, -4138, 7394, 12532, 5212, -6827, -8713, 233, 9957, 9754, -2096, -13244, -7465, 8636, 14975, 3217, -11070, -10900, 3984, 15502, 7591, -11307, -15343, 343, 13696, 8473, -7086, -14383, -3275, 12987, 13408, -2656, -13848, -8678, 2985]
2956B985N539m969q743k840P116O549j824n025l344P40N890M755n110r839k132
2971a0252Q627J1197J655j0868j2277K799J4923O581r693j2416qJ1349R403n147
2985E873j3654j839J2587Q416n398j1227m790O872J0737J53r111n663M253O510
2999C719K947j965n424m332J426M922K534r02m066l805L453P326N56p878m908
3014f397L522Q077K782p328r876J594J1792O173o736q560m36O478N747l640q667
3029e475j280P479M799k636l975j599J376K658J796j980j489l22j946K89L316
3044A011J397l509j805L090L686O27n476n936J163Q925L604o606o418J183N934
3059H70M542k933o025r25N534K162m427l367J123K594K121L75k733m56O94l77
$$ y = [2985, 8524, 3555, -5188, -8028, -912, 5637, 3813, -1212, -4556, -3816, 2074, 6829, 1719, -8120, -10252, -1625, 9572, 11227, 359, -11918, -9119, 5804, 12385, 2692, -9724, -9732, 1617, 11020, 5873, -7781, -9620, 2967, 11383, 5985, -5242, -10032, -3160, 7577, 7730, -1381, -7044, -2791, 3719, 6666, 4701, -723, -5055, -3629, 1293, 3827, 2925, -1141, -4946, -1493, 5833, 6389, -1489, -6397, -2875, 5202, 7984, 656, -9220, -7626, 4166, 10339, 3603, -4957, -5393, 1085, 6832, 3192, -5475, -6755, 724, 5523, 2887, -1088, -2687, -1311, 1347, 3143, 1163, -326, -648, -2594, -2305, 1011, 2408, -1101, -2906, 184, 3870, 4497, -979, -6915, -5752, 3173, 6777, 171, -6247, -5064, 870, 5412, 2479, -3546, -4471, 1063, 3225, -1202, -4569, -3446, -852, 1269, 1644, -1089, -1545, -851, -1228]
3075a228m22K907j52m580k645L252N494K286l803o989l46P989M488n997o424P97
3091e373N390M111l129o936J84Q739M869m790o859k138K487N117K327k273l316
3106a590l49K06J704L126Q35l532l318K632L580l22m518m123L646R832J742r387
3122A64q231L731R856L827o896r741j30J1234O626o413q767k51P114N428k042
3137E509p379l584M527N115o22l102j568m11K410M670j28n434m338P5N674O635
3153H049k835r853l988Q594R767j096j0532p990M890J3104K911j2198r843M926
3167f094J2044M024p078r897N87J0397N285p238r724q5P601O811K46p084o757
3182f962J374O639M608l96n435o665J41Q341M449m485p261m79Q088P397m294j3451
$$ y = [-1228, -1650, 1257, 1105, -3475, -6120, -2868, 2626, 4912, 1109, -5880, -6226, 1763, 6251, 254, -6170, -5373, 17, 4128, 999, -5937, -5753, 2986, 7855, 3065, -3794, -5932, -3445, 1672, 3999, 1726, -1590, -1939, -1733, -29, 3097, 3932, 400, -2918, -286, 3294, 2972, -1546, -5669, -2023, 7809, 9551, 164, -8067, -4336, 5520, 9347, 2451, -7290, -7420, 3814, 10440, 4027, -4740, -4991, 2123, 7551, 5509, -1870, -5454, -927, 4188, 3566, 464, -1104, -1515, 895, 5565, 5437, 3, -4335, -4260, 1414, 8049, 5214, -4639, -8627, -33, 9734, 8638, -1894, -9884, -4994, 8110, 11021, -1177, -11020, -6094, 5950, 9974, 2896, -7001, -6414, 3983, 9268, 2030, -7694, -7779, -178, 6633, 6879, -205, -6962, -5588, 1051, 5659, 5263, -172, -6837, -6696, 1645, 6094, 1609, -5652, -6131, 1957, 9354, 5060, -8391]
3198h391m267J1226J2143k475j3151q385O691J4476L365j1833j0581M099J0820
3211C737L495o873q462r67R344O812m121p514k260L954N725K657n237p888r35
3226h533O808O789Q67p167q152J924J1509N551p788j1172p3R599Q767m233j3185
3241h489l500J2269J1771l800j2708o987O291J1980K582j0766q053M079R826L422
3255G917m654p274k168O246O564o11o368m818M07N789O679j110p721m368N384
3270a06P347M67p910q075L428J2051N260r060j1230O72J0810R108m153j2582m664
3285h637Q961Q689k817p988l685M760P446J491p342o027K876N150K993k326n050
3300a506l791K831P088K561m132o344k821M969Q242R5r803o153N119Q209K192
$$ y = [-8391, -12658, -1432, 10711, 8236, -4915, -13300, -6609, 7867, 11232, -601, -11182, -7083, 3737, 7232, 359, -8103, -9070, 274, 7086, 2965, -4549, -6809, -2855, 2870, 5527, 290, -7598, -8533, -1725, 5064, 5931, -1236, -9388, -7464, 4045, 9596, 1808, -9364, -9437, 162, 8929, 4696, -8489, -11989, 280, 12051, 8251, -4457, -11444, -5153, 6827, 9409, -1357, -9410, -5331, 4495, 7917, 3263, -4011, -6179, 67, 6631, 6020, -348, -5166, -4759, 1030, 7709, 6599, -1122, -5490, -106, 7241, 7708, -202, -8277, -4849, 7202, 12462, 3402, -7828, -7156, 3654, 12762, 8609, -3973, -8637, 324, 9013, 6196, -1792, -5477, -717, 6729, 8220, 878, -5149, -2273, 2877, 5870, 3544, -1506, -5297, -2466, 4622, 7183, 3051, -3293, -6114, -1145, 7097, 7192, -2611, -8764, -3645, 4564, 6756]
3315F756o863p562K706J0285L290r249r572K350R673N947m104r250l155P284O153
3330D689k232m302k103O00K919J656j818l294M2J944L070K448k694o265j174N358
3346a156N004j850o033l606M471Q160M49r061n280N749P883J109o985p205J738
3361f613Q403L352n282m531J713M454J336k328l674l45L121J700r74n32l97j465
3377b062M49L464K121k328l956j986L171N425J94o920m038N787O537k33n589m713
3393d677K422O702R10o744l899M357N991K07m227l892Q50M580K029k640k367O70
3409B72p50j45J695J954m82j159j495Q37L285o03m905k559M466N613j392n724
3425a092l453L467O778J165p170m461L357N602J39m575l649J510N255K629m066
$$ y = [6756, -107, -7669, -4963, 5322, 8612, -637, -10209, -7859, 1814, 7761, 3657, -5593, -8748, -1464, 4689, 2457, -1845, -3948, -3348, -429, 1227, -591, -3885, -3843, -1899, 1171, 3619, 925, -5340, -6514, -1156, 3848, 1998, -4035, -7641, -3170, 4990, 5439, -3622, -8902, -3153, 4730, 5839, -1146, -8351, -6613, 1790, 5142, -140, -4671, -2958, 1496, 2832, 504, -3170, -3515, -394, 1306, 332, -200, -597, -2062, -1613, 1851, 3972, 1644, -2312, -4298, -1127, 4298, 4492, -2428, -6466, -679, 5858, 5625, 36, -4677, -2255, 4447, 5357, -1387, -5286, -929, 5062, 5269, 1042, -2850, -2000, 2580, 4609, 1969, -398, 272, -478, -623, 1072, 3026, 2544, 1385, -110, 727, 4012, 3409, -1496, -4055, 411, 6024, 4632, -1092, -4545, -1078, 5700, 6865, -305, -4766, -1409, 4193, 4332, -243, -3892, -2382, 2873, 5502, 1436]
3440A436l114P07J198L46N20m41j261m33N41J326J306m22m030q72L969M205l184
3457A797n614j449L510O444J56o951m089N062O472j117o199l882K195O299J834
3472D468n033m085K264L878J139k046k572r61J918K238k69j994j148j216J377
3487b042M711J516m246m662M03M288L588j985o580j526O624N508l423o854j799
3502f479N225O123m50p384m680M206O331N61m393k835O87M439K516l044m447l14
3518c938K613K823J324j698m245p40L896L502R8m084l612Q96O236K294n822n674
3534f131K383P583L775m175p756j565P113O480l719p219j986M825N853K2n571
3549h8m268L360M915M69l049l205q50K318L644J82l460k232O66L045L583j436
$$ y = [1436, -1678, -971, 227, 573, 1093, 652, -609, -1042, -501, 825, 2131, 1709, -2321, -3193, 776, 4981, 1797, -3817, -5266, -1756, 4688, 4844, -2107, -6196, -1134, 5338, 4221, -1978, -5860, -3665, 2634, 4468, -565, -4650, -2386, 1492, 2631, 585, -1987, -2948, -1030, 1208, 939, -1055, -2203, -3419, -2042, 2669, 4185, -61, -4723, -4320, -32, 3556, 1571, -5009, -6535, 89, 5597, 2174, -4680, -6479, -1254, 4869, 4419, -2965, -7645, -3439, 2892, 3453, -940, -3775, -3088, 1351, 3867, 823, -3624, -3938, -1325, 1498, 2822, 1124, -3121, -3861, 35, 3537, 3635, -449, -4061, -3165, 3071, 5365, -457, -6131, -3748, 3835, 7610, 3435, -4321, -5886, 1227, 7707, 3988, -3231, -5217, -392, 5461, 5483, -88, -4356, -996, 3919, 4388, 1339, -1866, -2716, -398, 3246, 3428, -32, -2264, -1598, 1447, 5030, 3594]
3565C594o554l072M276O250P28n544n524J315Q063L294o741o464J991O881L026
3580E519m304p618q43P601O082k868o707j978L282L636P47l522l739J493L783
3595E64J446o79k874k697J200M613K417k867m697j846K929N925J42n852l625M641
3611a260O048j59o078n463K309Q174L481o562p044J801O699L820k721n520j855
3626d330M539M490k118m285r94J856K849J815j674l146n17K328J817Q21k626l765
3642b940k57N406M586k393o185k468L317O612J216o964m876L327O245L58m802
3657A82l881J684O745K603n585n790N18N020K833j040l496k218J757L466m47j386
3673I65r43q86Q83J890O92l052k854J007L324L143j198n105k491M173M618j645
$$ y = [3594, -2960, -6032, -1756, 4494, 5222, -322, -5846, -4531, 3532, 6826, 85, -6379, -4388, 2493, 5519, 1215, -6403, -7246, 355, 6437, 3569, -3138, -5116, -1834, 1802, 2549, -973, -4712, -3219, 564, 2010, 1331, -1543, -4240, -3040, 1573, 3990, 1123, -3574, -5420, -2491, 3434, 3576, -2276, -5901, -1260, 4788, 4629, -1449, -6912, -4603, 3571, 7052, 490, -6554, -4753, 1946, 5766, 3045, -2475, -4330, 209, 4699, 2581, -1704, -2698, -842, 2007, 3822, 2148, -998, -1515, 813, 2630, 3451, 825, -2940, -3197, 2209, 6795, 4402, -1783, -4251, -934, 5678, 6894, -70, -4946, -1619, 4626, 4984, 182, -3699, -2015, 4730, 7333, 1748, -4042, -3524, 1496, 4329, 3289, -207, -2425, -668, 2798, 2351, 965, 22, -864, 19, 1909, 2601, -451, -3305, -2298, 1026, 4169, 2971, -2134, -4625, -452, 4166, 2521]
3689B521n214k300L049N161R93o087m303L438N775R45m004l897l24M022K748k369
3705A54l028K33K131J455N6j312k137k91J895J351J40j247k993K67M362K701k957
3722G80n004k15L814M275q80n590l349M237N054l80m026k235K136L538R0m041
3738a796l485K789M234P66j938k488j547J410K744R32q67j489j848m07K513J802
3754A325j742k375J049K834J324k304l867p25M834M122k892n674l51M058L793
3769C409k30m279k965L188M035o29l360j543J430J937J544j125j836L90R25K82
3785A173O93k82k093j201K395K935j75k244l070M61M745K984m084m821O86M609
3801B711K912k271n048r85M873M547k395m979j146K395K796l38k640j721K102
$$ y = [2521, -2693, -4993, -1944, 3217, 4210, -1877, -6180, -2742, 3033, 3978, -26, -3923, -4247, -225, 2523, 154, -2874, -2641, -510, 945, 1001, -311, -2448, -2739, -844, 507, 647, -600, -3593, -3326, 1036, 3737, 780, -4224, -4439, -625, 3650, 2770, -2820, -6169, -1932, 3122, 2742, -1284, -3519, -1383, 2155, 2245, -1796, -5281, -2492, 1742, 2508, 570, -1918, -3465, -2055, 689, 1621, 754, -735, -2583, -2990, -477, 1325, -417, -2792, -1743, 1091, 2415, 111, -3756, -4481, 353, 4475, 1583, -4091, -4442, -384, 3409, 3179, -1100, -4065, -877, 3158, 2529, -831, -2374, -944, 993, 2537, 1412, -424, -34, 891, 1173, 1866, 1584, -509, -1710, 685, 3620, 3445, 1201, -1869, -1408, 3337, 6321, 2237, -2584, -1898, 2711, 5623, 3352, -1696, -2681, 2192, 6739, 4344, -635, -1781, 614, 3410, 3072, 432, -1289, 813]
3816H13K446o08j918q13n83J078K304K37j698k579j690J706L957J871l544l881
3832b902R97L305J090k417l651M66N001K369m543n130J147N238L028k403n114
3847c519j696L376L945j464l304m75J541J602Q74j614j661M97P40K77L1R0j319
$$ y = [813, 3259, 2651, 733, -80, -663, 415, 2719, 2956, 1258, -1321, -3011, -1305, 2652, 4523, 979, -2902, -1905, 1400, 2490, 73, -3578, -3112, 1889, 4258, -285, -5415, -4268, 970, 3998, 1595, -3519, -5215, -1839, 2106, 642, -2662, -3137, -1596, 6, 880, -734, -2395, -1898, -1158, -881, -850, -760, -2079]
$$ [...]
8191c96
##END NTUPLES=NMR FID
##END=
