##TITLE=1H_CA-8741-3
 CDCl3, 8 sc, 
 3.7.2020
##JCAMPDX= 6.0         $$ Bruker NMR JCAMP-DX V2.0
##DATA TYPE= NMR FID
##DATA CLASS= NTUPLES
##ORIGIN= UXNMR, Bruker Analytische Messtechnik GmbH
##OWNER= root
$$ XWIN-NMR		Version 3.5
$$ Mon Aug  3 10:03:40 2020 Russian Standard Time (UT+4h)  she@DPX200
##.OBSERVE FREQUENCY= 200.1314999998
##.OBSERVE NUCLEUS= ^1H
##.DELAY= (6, 6)
##.ACQUISITION MODE= SIMULTANEOUS
##.ACQUISITION SCHEME= undefined
##.AVERAGES= 8
##.DIGITISER RES= 18
##SPECTROMETER/DATA SYSTEM= spect
##.PULSE SEQUENCE= zg30
##.SOLVENT NAME= D2O
##.SHIFT REFERENCE= (INTERNAL, D2O, 0, 15.7039)
##AUDIT TRAIL= $$ (NUMBER, WHEN, WHO, WHERE, WHAT)
$$ ##TITLE= Audit trail, XWIN-NMR		Version 3.5
$$ ##JCAMPDX= 5.01
$$ ##ORIGIN= Bruker BioSpin GmbH
$$ ##OWNER= she
$$ F:/spectra/data/she/nmr/H-F/1/audita.txt
$$ ##AUDIT TRAIL=  $$ (NUMBER, WHEN, WHO, WHERE, WHAT)
(   1,<2020-08-03 10:00:35.00 +0400>,<she>,<DPX200>,
      <created by zg, POWCHK disabled, PULCHK disabled
       configuration hash MD5:
       00 E9 B6 7A A2 85 ED C7 34 08 36 98 17 FE 4E 26
       data hash MD5: 16K
       36 EA EF 57 7C F7 97 C2 90 AD F9 CA 42 FB E5 D5>)
$$ ##END=
$$ 
$$ hash MD5
$$ 33 CF 1D 73 8D 5C D4 C3 74 EE 37 F9 CD 69 61 5F
##$RELAX= 
##$RELAX= 
##$RELAX= 
##$RELAX= 
##$RELAX= 
##$RELAX= 
$$ Bruker specific parameters
$$ --------------------------
##$DU= <F:/spectra>
##$EXPNO= 1
##$NAME= <H-F>
##$PROCNO= 1
##$TYPE= <nmr>
##$USER= <she>
##$AMP= (0..31)
100 100 100 100 100 100 100 100 100 100 100 100 100 100 100 100 100 100 
100 100 100 100 100 100 100 100 100 100 100 100 100 100 
##$AQSEQ= 0
##$AQ_mod= 1
##$AUNM= <au_zg>
##$AUTOPOS= <>
##$BF1= 200.13
##$BF2= 200.13
##$BF3= 200.13
##$BF4= 200.13
##$BF5= 200.13
##$BF6= 200.13
##$BF7= 200.13
##$BF8= 200.13
##$BYTORDA= 1
##$CFDGTYP= 0
##$CFRGTYP= 5
##$CHEMSTR= <none>
##$CNST= (0..31)
1 1 145 1 1 1 1 1 1 1 1 1 1 1 1 1 1 1 1 1 1 1 1 1 1 1 1 1 1 1 1 1 
##$CPDPRG= <>
##$CPDPRG1= <>
##$CPDPRG2= <>
##$CPDPRG3= <>
##$CPDPRG4= <mlev>
##$CPDPRG5= <mlev>
##$CPDPRG6= <mlev>
##$CPDPRG7= <mlev>
##$CPDPRG8= <mlev>
##$CPDPRGB= <>
##$CPDPRGT= <>
##$D= (0..31)
0 1.2 0 0 0 0 0 0 0 0.06 0 0.03 0 0 0 0 0.0002 0 0 0 0 0 0 0 0 0 0 0 0 
0 0 0 
##$DATE= 1596434434
##$DBL= (0..7)
120 120 120 120 120 120 120 120 
##$DBP= (0..7)
150 150 150 150 150 150 150 150 
##$DBP07= 0
##$DBPNAM0= <>
##$DBPNAM1= <>
##$DBPNAM2= <>
##$DBPNAM3= <>
##$DBPNAM4= <>
##$DBPNAM5= <>
##$DBPNAM6= <>
##$DBPNAM7= <>
##$DBPOAL= (0..7)
0.5 0.5 0.5 0.5 0.5 0.5 0.5 0.5 
##$DBPOFFS= (0..7)
0 0 0 0 0 0 0 0 
##$DE= 6
##$DECBNUC= <off>
##$DECIM= 24
##$DECNUC= <off>
##$DECSTAT= 4
##$DIGMOD= 1
##$DIGTYP= 9
##$DL= (0..7)
0 120 120 120 120 120 120 120 
##$DP= (0..7)
150 150 150 150 150 150 150 150 
##$DP07= 0
##$DPNAME0= <>
##$DPNAME1= <>
##$DPNAME2= <>
##$DPNAME3= <>
##$DPNAME4= <>
##$DPNAME5= <>
##$DPNAME6= <>
##$DPNAME7= <>
##$DPOAL= (0..7)
0.5 0.5 0.5 0.5 0.5 0.5 0.5 0.5 
##$DPOFFS= (0..7)
0 0 0 0 0 0 0 0 
##$DQDMODE= 0
##$DR= 18
##$DS= 0
##$DSLIST= <SSSSSSSSSSSSSSS>
$$ [...]
##$SUBNAM2= <"">
##$SUBNAM3= <"">
##$SUBNAM4= <"">
##$SUBNAM5= <"">
##$SUBNAM6= <"">
##$SUBNAM7= <"">
##$SUBNAM8= <"">
##$SUBNAM9= <"">
##$SW= 24.9337058888022
##$SWIBOX= (0..15)
0 0 2 0 0 0 0 0 0 0 0 0 0 0 0 0 
##$SW_h= 4990.01996007984
##$TD= 16384
##$TD0= 1
##$TE= 0
##$TE2= 300
##$TE3= 300
##$TEG= 300
##$TL= (0..7)
0 120 120 120 120 120 120 120 
##$TP= (0..7)
150 150 150 150 150 150 150 150 
##$TP07= 0
##$TPNAME0= <>
##$TPNAME1= <>
##$TPNAME2= <>
##$TPNAME3= <>
##$TPNAME4= <>
##$TPNAME5= <>
##$TPNAME6= <>
##$TPNAME7= <>
##$TPOAL= (0..7)
0.5 0.5 0.5 0.5 0.5 0.5 0.5 0.5 
##$TPOFFS= (0..7)
0 0 0 0 0 0 0 0 
##$TUNHIN= 0
##$TUNHOUT= 0
##$TUNXOUT= 0
##$USERA1= <user>
##$USERA2= <user>
##$USERA3= <user>
##$USERA4= <user>
##$USERA5= <user>
##$V9= 5
##$VALIST= <valist>
##$VCLIST= <CCCCCCCCCCCCCCC>
##$VD= 0
##$VDLIST= <DDDDDDDDDDDDDDD>
##$VPLIST= <PPPPPPPPPPPPPPP>
##$VTLIST= <TTTTTTTTTTTTTTT>
##$WBST= 1024
##$WBSW= 4
##$XGAIN= (0..3)
0 0 0 0 
##$XL= 0
##$YL= 0
##$YMAX_a= 656779
##$YMIN_a= -345054
##$ZGOPTNS= <>
##$ZL1= 120
##$ZL2= 120
##$ZL3= 120
##$ZL4= 120
##$ABSF1= 10
##$ABSF2= 0
##$ABSG= 5
##$ABSL= 3
##$ALPHA= 0
##$AQORDER= 0
##$ASSFAC= 0
##$ASSFACI= 0
##$ASSFACX= 0
##$ASSWID= 0
##$AUNMP= <proc_1d>
##$AZFE= 0.1
##$AZFW= 0.1
##$BCFW= 1
##$BC_mod= 2
##$BYTORDP= 1
##$COROFFS= 0
##$CY= 11.3945322036743
##$DATMOD= 1
##$DC= 2
##$DFILT= <>
##$DTYPP= 0
##$F1P= 16.9975609425685
##$F2P= -3.02152046262296
##$FCOR= 0.5
##$FTSIZE= 0
##$FT_mod= 4
##$GAMMA= 1
##$GB= 0.15
##$INTBC= 1
##$INTSCL= 1
##$ISEN= 128
##$LB= 0.24
##$LEV0= 0
##$LPBIN= 0
##$MAXI= 10000
##$MC2= 0
##$MEAN= 0
##$ME_mod= 0
##$MI= 1.114404
##$NCOEF= 0
##$NC_proc= 0
##$NLEV= 6
##$NOISF1= 3.799351
##$NOISF2= 2.8
##$NSP= 1
##$NTH_PI= 0
##$NZP= 0
##$OFFSET= 15.70392
##$PC= 1
##$PHC0= -9795.112
##$PHC1= 16.20092
##$PH_mod= 1
##$PKNL= yes
##$PPARMOD= 0
##$PSCAL= 0
##$PSIGN= 0
##$REVERSE= no
##$SF= 200.130013532006
##$SI= 16384
##$SIGF1= 3
##$SIGF2= 2
##$SINO= 400
##$SIOLD= 16384
##$SREGLST= <1H.CDCl3>
##$SSB= 0
##$STSI= 0
##$STSR= 0
##$SW_p= 3612.71676300578
##$SYMM= 0
##$S_DEV= 0
##$TDeff= 0
##$TDoff= 0
##$TI= <>
##$TILT= no
##$TM1= 0
##$TM2= 0
##$TOPLEV= 0
##$USERP1= <user>
##$USERP2= <user>
##$USERP3= <user>
##$USERP4= <user>
##$USERP5= <user>
##$WDW= 1
##$XDIM= 8192
##$YMAX_p= 0
##$YMIN_p= 0
$$ End of Bruker specific parameters
$$ ---------------------------------
##NTUPLES= NMR FID
##VAR_NAME=  TIME,          FID/REAL,        FID/IMAG
##SYMBOL=    X,             R,               I
##VAR_TYPE=  INDEPENDENT,   DEPENDENT,       DEPENDENT
##VAR_FORM=  AFFN,          ASDF,            ASDF
##VAR_DIM=   8192,          8192,            8192
##UNITS=     SECONDS,       ARBITRARY UNITS, ARBITRARY UNITS
##FACTOR=    0.0002004,     1,               1
##FIRST=     0,             0,               0
##LAST=      1.6414764,     0,               0
##MIN=       0,             -345054,         0
##MAX=       1.6414764,     656779,          0
$$ Real data points
##PAGE= N=1
##DATA TABLE= (X++(R..R)), XYDATA
$$ [...]
2794B451J583l900k485M935L936l900n081L68K977J714k107k823K048N647m30
2809D933p680k728O846O092k044p457n025L272P815N69n993r37N092J775m670
2824a40m228R84N175L774m312p272Q75N845J214k183J021K182k70m277n063L57
2840f318Q264N579o478q102J385P207K472k503m347L92N383M70q817m542O830
2855c125Q437p3n894m870P74N759K110m161k232K642K88l901o56L399L693K81
2871B471l431l066K615M225l416n853J939O761J346n455n197J113Q446N741o630
2886A609r856J552Q336K826n219o095P55P527M707n070o723K487N236M56l535
2901a007j581M09J754O98j867j97L664O03l754l78M093P81m386l741Q80O498N697
$$ y = [2451, 4034, 134, -2351, 2584, 6520, 2620, -2461, -2093, 884, 2598, 491, -2332, -284, 5363, 4933, -2747, -5475, 1371, 7463, 5419, -2038, -7063, -3791, 4024, 4593, -1400, -2337, 2755, 4530, -140, -4368, -3384, 1791, 5565, 1253, -6019, -5144, 701, 1915, -268, 753, 2935, 2665, -1612, -6675, -6318, 1946, 7525, 1047, -7055, -5670, 1537, 4009, 1506, -2841, -2449, 2934, 3404, -5413, -9955, -3125, 5312, 5239, -655, -5525, -4751, 1008, 3118, -1043, -3275, -633, -345, -4246, -4902, -1503, 2190, 2471, -960, -4026, -1411, 2814, -602, -6455, -4516, 2245, 3591, -1864, -7061, -5948, 2498, 8239, 1609, -8247, -6695, 1641, 4467, -752, -6847, -6092, 1435, 6142, 1072, -5651, -3164, 2072, 2528, -1007, -2588, -2179, -425, 273, -1594, -1791, 1873, 2476, -1278, -1656, 2437, 3218, -1168, -4909, -4029, 2469, 8166]
2918H166m975j0046L12J0616N677n167q444j617O771N948m446q411J808J0012
2932F204L600o037o579j191N530O142j823o356j483L024L60r9K972J890j980k857
2948A317j736J771L459n70n210n25O508L234o333n949K091Q620N740n543j2562
2963e688k711J0824P874m579p752j627N454O293k347p881j295P431L044m498n419
2978b877l92L183L613J048k527j224J97k360o40L898K965l973n627J85M742M825
2994E036j751p513k053Q101N758o107r671l51Q273O846k909j0228k773R062P525
3009G245m369q315j439M381M667o00n882k685M878L396j699j108R59q51j778M7
3025c153J111J292J50l335k230M706N290l600o584M68O358M549l897q989l208
$$ y = [8166, 3191, -6855, -6543, 4073, 9750, 4583, -3861, -5478, 1293, 7241, 2795, -5616, -3808, 6204, 9804, 3767, -2812, -4003, 1527, 7669, 5846, -510, -1993, 1031, 1391, 1292, 4264, 6154, 4174, 1317, -419, 1352, 4811, 4241, -969, -1494, 5014, 8248, 1915, -4034, -1943, 6677, 12417, 6874, -5688, -8399, 2425, 10299, 5720, -2032, -3659, 1795, 8088, 5741, -2140, -3435, 3996, 7040, 2542, -2877, -3269, -86, 3527, 4575, 2048, 824, 1021, -1339, -1979, 1919, 4884, 911, -4716, -4531, 211, 5036, 3285, -4228, -6281, 1820, 7578, 1471, -8200, -8551, -278, 6568, 3659, -6569, -9342, -280, 7245, 2876, -5439, -6878, -2497, 2170, 1570, -4312, -6997, -2119, 1277, -422, -1530, -571, -1422, -3200, -3153, -2042, -750, -600, -3935, -6165, -1459, 3831, 231, -6353, -5885, 473, 5022, 1125, -7864, -11072]
3040a1072Q687R646l181r225k899O287O064o63o470m240N699N288l893n975P78
3055e169M983L453k38l079k723R84J485j013J319L136k037n003r54M867M786J70
3071D967m577m607K893O183j901p540o48P171N333k283p794m437P049R337j595
3086G551r111l998M055M277N28l082j956L135L945k985m465J266L626j96k060
3101E30k00q1M60l80j659J337N597j24o813m030M294N412J1n053m457K816P180
3118D840Q93p352l430N208N183k029n708l092K859O406m54n866j493M650K292
3133B907k166k427n85J560J336j727k539K833L066k982l760K302M575R31k993
3148C31m774n95N325K990m388m249L305N121o75m124l220K458O353J061o829m947
$$ y = [-11072, -2385, 7261, 4080, -5145, -8044, -1757, 4307, 3644, -2826, -7066, -1367, 3921, 28, -5947, -5169, -186, 3267, 3029, -50, -2773, -1789, -304, -1317, 2, 3138, 1101, -3902, -4856, 11, 4797, 4967, 390, -4217, -1324, 4859, 2958, -4582, -5230, 1941, 7274, 4991, -2803, -7240, -191, 9146, 7551, -1560, -5558, -1503, 2774, 3302, 220, -1736, 1399, 5344, 2359, -2106, -840, 2786, 2590, 530, 330, 249, 709, 329, -1330, 7, 5604, 5480, -1333, -5363, -1069, 4343, 4354, -699, -5156, -2340, 4840, 5733, -1619, -5049, 159, 5342, 3313, -2395, -5487, -2628, 3778, 3324, -2542, -4035, 615, 2907, 741, -1686, -2271, -711, 625, -1102, -3641, -808, 2258, -724, -4484, -2182, 2393, 3324, 331, -4443, -5038, 287, 3277, -1111, -5360, -2055, 3066, 2391, -1733, -4953, -2495, 3858, 4919, -1910, -6857]
3164f857L728M804L51j830l64O60J028j279l459J548M663N76m932j878K017K553
3180A329Q37j252j132K507K400m195n689J810O833K745m089m799j081N067M754
3195F045k586m620R70L447j519l284n82K036L793J146l870l305K922K779j880
3210A492j781J440J231j152k778j415L035N349m04o222k533M622L177j862l948
3225a749k054L556M494j170o606o12N990K990k913m154j216K564L818k285m359
3240c706J116L741J15j843l06O96j03n25j764l9L202J354m700k931L908M360l61
3257B214l602k783J669M388o41n816k126N830N185k545n503k687L572O551J95
3272C901o023l734L493K194j175r63J015J495P06j221k707L78L250J5k415N41
$$ y = [-6857, -3129, 1675, 2026, 196, -168, 492, 1520, 241, -3218, -1670, 2993, 3569, -1363, -3241, -1224, 1329, 2166, 914, -218, 2289, 4689, 494, -5195, -3385, 3448, 6193, 2104, -2695, -3776, 1291, 6045, 3459, -1161, -191, 3256, 1737, -1547, -2129, -93, 3700, 4846, 976, -2329, 593, 3372, 1492, -289, 1151, 2382, 1230, -1548, -2963, 72, 5421, 5017, -1205, -3738, 884, 4061, 2199, -1749, -3803, -247, 4247, 3077, -3529, -4141, 1849, 4839, 1926, -2228, -3444, -880, 2938, 653, -3706, -2590, 1151, 1266, -577, -883, -187, -290, -815, -2579, -2618, 584, 1938, -2762, -5693, -1785, 2575, 2214, -1388, -4171, -2502, 1886, 1245, -4571, -6697, -867, 4318, 1773, -3730, -6417, -2845, 3706, 3901, -2122, -5856, -2363, -169, -1344, -2307, -1292, 203, 909, -312, -3019, -2641, 609, 624, -1791, -1250]
3288a250K082j741k262J1L147M523L65o230n267M004O832j29n039k751J508N058
3304B861J541n339l331M998N459k022n878k526J818N103K474l133l539J584K427
3319B497p34p21J359l36j322p67J75J446J739j298l031J824M706o22m906k448
3335b439K659M361J084m910n289L670P068M06o041l411K111M633J967m424n267
3350c822J457N484J065l133j280O71J211M29j580j299J248J648k222j124K077
3365H30L07j944o27K464J821J25l607m992J809O665K060n290m785J329M957K749
3381C871l095n357J340N718N76n854l383K685M979K055k813m825N7M167J177k360
3397a062k17O83r10j059K76J189J755L58k945r70L311J720l291l155J837M281
$$ y = [-1250, 832, -909, -3171, -3160, -13, 4510, 4875, -1355, -6622, -2618, 4214, 4085, -954, -3705, -2197, 2861, 4402, -937, -4268, 730, 6189, 4167, -1711, -4237, -2419, 2684, 5158, 2025, -1514, 70, 2497, 1763, 1042, 2401, 2065, 743, -24, 151, 1597, 3336, 2038, -993, 831, 5537, 4915, 9, -2439, 220, 4581, 5665, 755, -4534, -864, 6204, 6610, 569, -2842, -731, 3902, 5869, 1445, -3822, -2365, 3119, 4184, 1051, -229, 442, 1653, 2082, 502, -797, 451, 2099, -123, -1247, 830, 1137, -807, -1434, 1030, 2851, 2976, -631, -5623, -3814, 2851, 4911, -379, -5164, -3835, 1122, 3871, 776, -4581, -3241, 2477, 3053, -2801, -6184, -3499, 1480, 3535, 722, -4103, -4046, 121, 1298, -1062, -1279, -596, -1506, -2565, -2289, -1100, 655, 1013, -1932, -2902, 409, 2129, -1162, -4317, -2480, 1801]
3413A801J461l729m821R81O899L058n126n178J484M373K136k638m671M91N325
3428A846K255l826l028K006K490j58r85k021L99J909j08j888J179K373j004k564
3444a125O58K027J011j800l263p35M716L638l574n264Q75M895K349k175m540j434
3460c741M696L058m008m152K018M338J392k370l432o32L578J758k230k212J275
3475f64J061j367n81J612J515J96k074k934J640L739j044l817m31L504J878j401
3491H32l449j213M019M270k747o187j04M566K388j840k927j113L485K901k301
3506E80l328J114K513k76j729r70P46J529L87k291m88L103J046l382j608K093
3522i61J928o63k174j898K121M561l78n165j695L894L082j164l112k479J859L809
$$ y = [1801, 3262, -467, -5288, -4307, 2592, 5650, 524, -4654, -3170, 1203, 3339, 701, -3970, -3479, 1846, 4101, 275, -2753, -747, 1743, 1585, 600, -1421, -1022, 887, 779, -1109, 70, 2443, 1439, -1125, -467, 1560, 2571, 771, -2492, -3227, 1489, 5127, 1553, -3711, -2836, 2059, 4408, 2233, -2307, -3741, 955, 4013, 5, -4147, -2129, 2209, 3601, 1231, -2201, -2833, 745, 2503, 273, -1939, -664, 397, -970, -1551, 61, 1576, 1772, -302, -3236, -1596, 2143, 1099, -2718, -3149, 355, 2233, 832, -2617, -3830, 189, 4459, 1712, -4475, -4579, -13, 2375, 535, -2392, -3505, -20, 2881, 580, -2748, -1634, 879, 603, -1126, -2096, -1350, 179, 566, -1725, -2213, 890, 1936, -1446, -3054, -961, 967, 304, -1870, -3768, -1647, 2914, 2536, -2629, -4324, -430, 2652, 1488, -1624, -4103, -2244, 1565]
3538A565k88l861o18L963J418j829k633K37J702J232j149k242J297K409j251j815
3554a863J273K125K22j626l026J60L952J979l807k987K694L705j26k948j978J505
3570g46M013K37m673k309K863L926q17k270j124J225K165j7k554p04K652K63j778
3587C52l87J492O78k64j153p37K502J930k629l556P81M181P29k430k193M36L987
3604C719J634l417m315K450M420l86l019k690Q43L244K243k539k495J651J848
3619C191j183k077M07J112P29o31j780l4K373K34k453M4K674J04k576k176p0L314
3637A202L239k586m790L96M779J616k715k771l48K802K057k677l800J458M387
3652B249J98k487j438M5J334J087j327j552P66J376j590j197J869J728r63j629
$$ y = [1565, 1277, -2584, -3202, 761, 2179, 350, -2283, -2046, -344, 888, -261, -2503, -1206, 1203, -48, -1863, -590, 1535, 1757, 131, -2895, -2735, 1217, 3196, -611, -3598, -904, 2801, 2675, -273, -2251, -746, 3267, 3504, -1169, -3478, -615, 3311, 2494, 224, -900, 325, 2490, 2473, -81, -785, 1867, 2130, 352, -35, 1457, 2135, 1871, 718, -19, 2483, 4413, 1784, -1772, -991, 3190, 3919, 1489, -704, -268, 3719, 5353, 1936, -2379, 71, 4491, 4105, 1086, -1604, -761, 2483, 4726, 2187, -308, 1343, 3191, 2008, -69, 338, 1450, 2179, 1548, -232, -266, 2107, 2341, -112, -68, 2606, 2710, 134, -2042, -2112, 1202, 4441, 1855, -2935, -2539, 2240, 3856, 1141, -1630, -1978, 824, 2881, 204, -3596, -2138, 2249, 2447, -40, -1478, -1433, -99, 988, -339, -1891, -1125, 251, -1339, -2536, -667, 1061, 98, -1531]
3668a531p74J346J847p50l729o20M122K085k115l146r1K989K527j579m484o50
3684d553M679J870l020k864M58K812K110n93l546l05K345N02j763j6J291K29j011
3701a375l46n05J895J424j790j652J623J727j768k504Q72K815K483j260m367j770
3717d498M267L814j792l559p10J718K046j01k813j43L605J763k753k595K89J824
3733C62J063R8j281j050J397j99r93R38K704r99k284j012J139J578N70j173k621
3750a763K081L289j405l366o4K399K067k21l748k953L038L881p61l064q39J868
3766D39J532n67j823j502J704J705j513j346J131L42k24n33L06O71M33r61k021
3783b227L59K793j48k509p73K223J691k01k736k279J782M249L5m169j766J409
$$ y = [-1531, -2305, -959, 888, 138, -3591, -4211, -89, 1996, -119, -3265, -3356, -367, 2160, 581, -3903, -4553, 126, 1996, -1024, -3888, -3430, -618, 1492, 899, -2647, -2952, -607, -105, -1868, -1884, -593, -364, -1375, -1721, -2226, -331, 1093, -697, -2349, -726, 1001, -767, -3271, -2399, 416, 2899, 1639, -2728, -4498, -231, 3583, 1791, -1768, -2478, -760, 1286, 1185, -1628, -1771, 1834, 3597, 844, -1751, -1462, 362, 1425, 1523, 242, -808, 589, 390, -603, 335, 3039, 2040, -244, -1256, -117, 1461, 2031, 858, -1763, 318, 3607, 2202, -1164, -1228, 1171, 3238, 3017, -731, -3684, -646, 3235, 2474, -590, -1429, 439, 1971, 1404, -419, -1921, -217, 1488, -25, -1371, -240, 102, -122, -655, -349, 322, 755, -206, -2227, -1868, 925, 777, -1732, -2505, -282, 1409, 1208, -1528, -3807, -2025, 2224, 2259, -1910, -3676, -2267]
3799b267K229J314j527j632J113K581j216l046J18K140R81k01j109j149N44J488
3815C61k76o25K081N4k570j792J376K466J175j305k485m11L095J238k260j021
3831h99J424J800j76k428k296J053M804J034l562k416J386J709N66m78j592M97
3847D26J158m74j962Q02K202L0j171o35N09L8J84j331n91K109J558k322k334O77
3865a127L010P81j564k521q72K964K094k343k964J101K524P63j530j810k24J981
3881B63J193k410j221J531Q98p45o31m59Q19N90k16j212P01J102j085k218N90
3898b510K471J100j110k384j083K342L115j547l165J06K391J086j787j724L6L142
3914D79K039k325l972P15K686J178q39j096m51N90Q83j206L0K178P35j913j352
$$ y = [-2267, -38, 1276, -251, -1883, -770, 1811, 595, -2451, -2333, -193, 788, 587, -522, -1671, -1127, 361, 85, -540, 1541, 1595, -975, -2767, -1391, 1075, 2250, 945, -1540, -1951, 1144, 2382, 122, -899, 525, 2325, 2149, -279, -2575, -1522, 3282, 4316, 754, -1662, -276, 1433, 1999, 1521, -71, 426, 1584, 1110, -852, -50, 2152, 2182, 1011, 376, 885, 923, 1107, -224, -815, 1294, 2852, 530, -1804, -1127, 1883, 2664, 1100, -1421, -2293, 671, 2765, 422, -2542, -1441, 1083, 1846, 316, -1494, -1718, 263, 1456, -954, -2175, -644, 254, -491, -1122, -1581, -762, -172, -388, -1600, -899, 203, -882, -3100, -2510, -39, 1061, -49, -2433, -3516, -1174, 1941, 394, -2771, -2665, -274, 812, -975, -2699, -2663, 479, 2518, 193, -3779, -3064, -378, 800, -39, -1135, -1586, -996, -113, -1319, -1289, 889, 1624, -289, -1641]
3931a641K47J044M07po19O59J610q93k887j08L597J456r31l257j637K172L290
3948B502J21l276m70K550O83j506j321L45J551J951j371l076M67K543L02q16o3
3965A116K51J20l67p24k23J846R57k467j408J656K081n51j802j182J395K534k18
3982C014l720j030K627K270j133k228o56J454K215j66l446r62K569J736j675j622
3998g53J57O55R68p5j057N58J160j461j929Q12J815J25r22j167j52J721P12j871
4016g04j926K683J884j001l072j140J878K375J332k950k197J784J782r63j393
4031a628K61J388L05n05k131m00K672J336j645p97M88q6r72L30L82J245J194j762
4049c25k748J012K884O70j772j116K30J177N60j528j060J822K695q43k780j038
$$ y = [-1641, -1394, -350, 57, 50, -569, 90, 1700, 807, -2080, -2188, 1409, 2865, 1934, -1323, -2960, -788, 2502, 2623, -653, -1123, 1427, 2110, 604, -717, -372, 1179, 3130, 1759, -1317, -850, 1693, 1995, 1179, 1116, 1367, 1487, 1120, 396, 173, 2019, 2976, 509, -899, 757, 2838, 2287, 485, -697, 698, 3232, 3014, -706, -1736, 891, 3161, 2028, -200, -856, 598, 2813, 2647, -799, -1761, 808, 2544, 869, -753, -596, 59, 1027, 952, -105, 453, 1613, 152, -1777, -965, 850, 975, 53, -1114, -1266, 455, 1167, -704, -2630, 53, 1937, 936, -2136, -3276, -1398, 977, 2309, -641, -2838, -1054, 728, -235, -1628, -1367, 21, 326, -179, -2310, -2710, -38, 1298, -347, -1144, -656, -742, -1714, -1384, -1002, 243, 1437, -325, -3073, -2061, 823, 1493, -279, -1395, -1165, 12, 572, -956, -2016, -194, 2501, 1658, -1122, -2160]
4065b160J844J716P40j783j976J125J807q78q94Q31J308m29p37o90k3J440N05
4082A746j549r97J642J054j219r75O34J084J228j365k562N27K518Q97k419j121
4098h77P60J736O94j179k216L95K532j28k091j99J026N09K7j044n08J255J524
4115B216j393k091R56J280o21p20J34L64P37j76j845q35K605K406k181k075p58
4132a997J350J643k68j655m27J957Q16k312j369J604J377J58p08j501n95J896
4148c1N63j056j09J608p64j419m12M46J676O15j266k244Q04K082k77j433J24J061
4166c2J052j003k074j085K768K006r12k620n54J080J281M30j207r59J196P75j473
4183a331j101J260J230l60o49m68K09Q21k0j412K63J784n04k013l22J723J051
$$ y = [-2160, -316, 1400, 2140, 357, -1619, -494, 1313, 435, -459, 372, 1680, 1251, 514, -176, -199, 1241, 1746, 197, -800, 842, 1896, 677, -298, 336, 1420, 2648, 1283, -1279, -752, 1766, 2663, 244, -877, -117, 1619, 2313, 1134, -1082, -687, 1845, 1717, -374, -573, 453, 962, 989, -55, -563, 692, 2216, 823, -1268, -312, 968, 347, -373, -239, 125, 862, 686, -1159, -1994, 611, 3017, 836, -1239, -1997, -647, 996, 728, -927, -1354, 603, 1419, -893, -2262, -658, 719, 877, 169, -1332, -1927, -31, 532, -524, -633, 975, 211, -1208, -1620, -1174, 502, 1117, -149, -2393, -1589, 493, 216, -1217, -1093, -32, 1020, 17, -2057, -3142, -374, 1632, 720, -1900, -2454, -1374, -93, 337, -870, -1829, -633, 142, -1331, -2432, -1172, 58, -302, -951, -1419, -1210, -389, -409, -1821, -1558, 226, -278, -2291, -2613, -890, 161]
4200A61J89j140j894Q64K558n6k733m68J552J463k34j157j443J099K128k21k314
4217a646l0J603K87m40q23m31R41J445n85p25M22O33j166q69J314J093J68r15
4235B76j566M76K292P05j687j190J367J001m39j743l20J246K480j1k992j541K065
4252D19J280O53r45j390p7J436l5j041L03J376J9j084o14l10Q76N38n7q58P19
4271A208L36j353q99J611J846o02j478k160N48K442R81k032j801J608J691o97
4287A249j065j139O87K324M63k794j612J344J611O2q25p13l12J023L22j062J51
4304b86P33j72j218M32P56j56k42m21L51O84R52j651j624J165J950l23j404j296
4322a770R82J681O74k109k172J690K192J6j678q69k55J618J043j464q86J097R90
$$ y = [161, 350, -790, -2684, -1820, 738, 682, -2051, -2519, -967, 496, 262, -895, -2338, -1239, 889, 668, -1646, -1676, -73, 214, -226, -1049, -1480, -539, 906, 321, -404, 18, 651, -515, -1384, -70, 1023, 1191, 276, -1290, -814, 1478, 2183, 496, -694, 673, 1674, 1235, -508, -828, 418, 2898, 2887, -105, -1646, 419, 1699, 2352, 1407, 17, -60, 1376, 1341, 300, 603, 1979, 1998, 914, 300, -10, 866, 1404, 1347, 489, 1208, 1544, 191, -708, 903, 2749, 2147, 669, -1491, -943, 1499, 2480, 448, -1353, 255, 1946, 1249, 184, -955, -268, 2056, 2519, -275, -1887, -543, 1068, 1130, 305, -408, -720, 303, 625, -437, -286, 447, 275, -943, -511, 245, 89, -153, -574, -223, 461, 1413, -238, -1862, -697, 1253, 930, -474, -1770, -788, 893, 1567, -542, -2714, -1024, 1168, 1184, -494, -1363, -1618, 0, 1043, -421, -1307, -210, 780]
4339G80j002n53j71N75M17K29m15q30Q65K00j025P89J296l05j483j086O26J095
4357BJ477q43k208K18K019L41j455m51L41J307M20j509k098J364K575J85j200
4374D85j406L1Q43O93o28n12O58O88r96j036P58J331j94k88m72m70Q69K90j309
4393f65K25J161N69j088j201L80R61J454r71j694j57J881K42j348o65L62J492
4410I38K94o41j662L04K144r3j854k8Q60J30L7l25l02j84J401n29j236N24J193
4429I71p49o69k04K87J141K62j561j163J705J475j218j166N12J043no96p65m9
4447h49J926M90j687j155J251M75K60n63o22O15R89m00j958L56K065J90q49j127
4465e93n8Q20J017o53r49M91J474n38j224J12O02R55j71r42j418J284J647j014
$$ y = [780, -222, -775, -946, -371, 46, 275, -140, -970, -105, 95, -930, -141, 1155, 850, -633, -1719, -1093, 2, 1479, 636, -1572, -1354, 665, 1006, -449, -900, -559, 748, 1168, -341, -2439, -1075, 1500, 1685, 485, -921, -890, -47, 646, 18, -494, 164, 852, -144, -1180, -422, 909, 715, 427, -45, -515, 354, 644, -665, -440, 721, 1290, 202, -999, -619, 342, 1796, 825, -869, -1026, 855, 1097, -251, -916, -554, 938, 1232, 591, -1071, -767, 1377, 1284, -570, -598, 262, 392, 429, 104, -198, -382, 1019, 490, -746, -222, 971, 222, -447, -651, -364, 777, 1039, -522, -1685, 20, 1495, 277, -889, -377, 666, 661, -35, -800, -849, 1077, 1567, -120, -1275, -24, 451, 711, 148, -474, 141, 1130, 730, -1228, -872, 1193, 1383, 534, -593, -651, 169, 1186, 533, -416, 75, 1549, 1011, -213, -101, 501, 1456, 1285, 343, -1075, 209, 1856, 842]
4483H42r28M33R74m86o10o59M63J269N58j757r49J672O55q42m01o2K57Q57j28
4502A158j893j68J852O87j329r08Q9Q39O34l16j323P6J325J05j507r6P25J89k74
4521a35k41n29M27J267r70j514R73J071q97n80l33N02Q39J68j426p10J699R85
4539E96j005j793J88R90J075L13j881j012J763J041j253r38N50Q58J02j39j305
4556a850j77J193O12o58m85R10l43o48J27N92K8K30m66p51J151J283q41j383J75
4575a301J280N96o22j304l93J679J689j284j954J07J643Q10p0j472q48J334J231
4592A121n19j605R10M31J27J34n21qK59K38o35K95N09J0q17N0J068K64o72l52
4612B87o57J323J296j181j975K7K042R00o52j424q19J281J904j022k136M55J207
$$ y = [842, -86, 347, 1321, 835, 225, -434, 29, 1298, 1856, 99, -850, 822, 1477, 635, 234, 172, 429, 1286, 1158, -735, -903, 949, 1636, 307, -601, -512, 327, 961, 645, -678, -602, 723, 828, -679, -775, -50, 139, -135, -376, -905, -478, 789, -181, -1695, -722, 349, -548, -1128, -1461, -959, -120, 48, -1378, -2088, -389, 596, -409, -2202, -2014, -1024, 51, 364, -1517, -2529, -766, 275, -978, -1916, -1366, -508, -406, -545, -1850, -2027, -834, -222, -880, -1365, -455, -798, -1446, -1319, -727, -699, -469, -935, -1686, -535, 748, -93, -1476, -1301, -21, 575, -47, -1351, -1744, -65, 1624, 340, -1614, -1507, 136, 946, 876, -596, -1444, -110, 1121, 602, -1003, -93, 338, 465, 599, 78, 70, 329, 567, -68, 227, 736, 746, -71, -21, 1047, 1311, 639, 287, -370, 953, 2249, 1068, -907, -880, 1162, 2062, 1410, -14, -833, 448, 2352, 1330, -806, -351, 856]
4629H56N17l30j027n88J291R62n40j157J17P90l43l43N40j51o67M95k48j45Q22
4648H51m7j375J01J309J20p32r82j15Q72J343k14k336NJ644R38r50j253q13J041
4667e93J790m24k182L9J503K87m14n42m69K49J207p24o74L69L70m05k48Q06L9
4686a6o48N1J21L59L87k48j526M77J172N54p90r26j75Q21J312k40j946p97K359
4705C01Q14q64j003j14Q17J212J5k123m68J806N10p30l57j15J64M06K07o25PQ63
4725G23n64p43P17P77n56m40L95O3M87J74j235o68J557J231j294j308M80N92R42
4744A330j50j810j71J361J187q37j032r6M81O01K78j312m75J112N27o06o04N70
4762C54j94J03M33n81jM18k26p49J021O10m55j061J28P32N5K31q98o38R32J202
$$ y = [856, 1373, 1043, 16, -572, 719, 1681, 1141, -16, 101, 891, 548, 205, 745, 594, -73, 422, 174, 29, 851, 804, -571, -470, 839, 959, 227, -755, -870, 2, 1345, 1131, -1205, -1200, 444, 1382, 432, -821, -1634, -593, 1197, 773, -1409, -1370, 133, 420, 6, -536, -1005, -756, 451, -273, -947, -578, -208, -613, -861, -55, -16, -664, -613, -492, -133, 254, 6, -1520, -1043, 129, 683, -107, -1033, -1208, -387, 925, 685, -1261, -2058, 301, 1115, 251, -752, -866, -49, 1163, 1178, -945, -1413, 393, 903, 173, -184, -299, -135, 271, 478, -147, -140, 723, 159, -584, 133, 910, 354, -86, 309, 372, 859, 1033, -202, -870, 687, 1918, 624, -684, -204, 388, 1330, 1180, -630, -801, 560, 1747, 910, -122, -218, 263, 864, 1142, -170, -645, 467, 994, 388, -216, 354, 160, 263, 696, 115, 114, 532, 306, -443, 578, 1188, 733, -328, -200, 532, 587, 818, -80, -718, 214, 1416]
4782A416r05p39J88Q84J82K6j633l10J535J023j117j333M31P98L77o1o57n64P77
4801C18Q34j133o70Q16M16j00M4m26l24N60k56k11N7Q53l23j229N56O88j24k49
4821I7l81n68P24J353j069j355O07J061p1p93k38k81P56J265n19j790m1R21N39
4840B17p47l05n06R57P56o59q00J03P52j32m51M92k21l25M88n21mO03J38j018
4860a183j71J304q2n31q12O35M80P73l05j568J99J373K17q25l35k44P75Q23p39
4879b16j217L68J504M41q62o84k75M68J059j33r63P5O93j20m57J52N04m87M16
4898B66j01n61L01L83l91k89J295l24r85j38L84P03M87o47j502K47J670N08r29
4917C77j026L83O68N88l83j485K87J521Q6q38o67K19K07Q45q1q88pO23J55q73
$$ y = [1416, 511, -228, -40, 844, 1026, 1052, -581, -891, 644, 1667, 550, -783, -352, 446, 823, 762, 105, -459, 318, 1152, 19, -651, 165, 581, 481, 525, 99, -225, 335, 79, -132, -75, 778, 455, -774, -218, 470, 346, 97, -284, -852, -128, 1225, 156, -1199, -592, 469, 398, -395, -633, -914, -158, 1107, 588, -1202, -1243, -322, 217, -530, -835, -1341, -384, 372, -287, -1087, -984, -232, -364, -815, -323, -544, -869, -381, -902, -906, -303, -165, -1183, -1354, -50, -132, -663, -1475, -840, -360, 413, 108, -1460, -1261, 112, 329, -496, -831, -1075, -300, 523, -216, -1433, -1065, 439, 880, 18, -666, -941, -473, 586, 453, -510, -435, 258, 138, -319, -167, 337, -150, 266, 165, -396, -95, 288, -103, -392, 903, 579, -406, -544, -160, 543, 1030, 383, -1119, -872, 798, 1306, 377, -649, -266, 402, 990, 607, -878, -591, 930, 1016, 178, -489, -270, -63, 782, 701, -187, -194, 429, 584, -289]
4937b89P03n4m54J5K94m8K46k8q68r0J118K42r28o35L49J031N1m42r86m43K008
4958G92L39j183j088L76J167P38n20j142o41J333Q88q63n90M1P42m6M1o06n55
4977g77J153k62k26K10L56o48k51M39M32l20k6r95N13O31R12j202p40M01R48L27
4997H75p57j008j03J650N98j338j323O11J143K59l44q86m76J210P23n94r64J5
5015g09P95l19j2M2r4K8L86l42J62K98m26q41L80J087l6q18l75K87N74O76j004
5036b61j077J197P09j95l72p19j67J260R24j379j259M86J311J29o05o96J13N98
5054cP70n68q49K68N13N7K8j72l49M5L61K33k29L71n20p87P25P50l03k84m99O7
5076c75R74M55j108r82N33J413J59q99n93q2R48J028j116j098K91J414l3p12n45
$$ y = [-289, 414, 360, -94, -79, 215, 167, 413, 385, -483, -573, 545, 787, -141, -776, -427, 604, 655, 213, -773, -1216, 792, 1131, -52, -1140, -764, 403, 1141, 621, -521, -1162, 171, 1059, 196, -394, -353, 389, 343, 384, -222, -777, 376, 114, -112, 98, 454, -194, -445, -6, 426, 106, 80, -915, -402, 229, 1141, -61, -801, -400, 548, 875, 118, -890, -993, 657, 1255, -83, -1406, -795, 348, 607, 263, -623, -1099, 111, 834, 240, -724, -709, 86, -233, -245, -203, -297, -269, 117, -225, -63, 235, -191, -1032, -652, 435, 399, -419, -794, -507, 67, 743, -261, -1338, -141, 568, 373, 1, -718, -885, 375, 1299, -80, -1339, -853, 458, 587, -18, -714, -601, -3, 767, 199, -650, -382, 131, 188, 216, 44, -305, -260, 101, 334, 105, 476, -44, -831, -106, 644, 341, 57, -442, -375, 599, 1054, -54, -1036, -503, 910, 1069, 170, -423, -505, 443, 1471, 355, -743, -452, 962, 929, 217, -328]
5095c28J84M70P48o80m33j14O59j16j53N85m00m90L37M62l46K93k05p20P27O55
5115A135k04q36k71P30O8N23q03j075L59J476J85j289n28M90J006K54p78p75K05
5134a28J197K00q53l48j12M22M02j9n41k27O27J4o19N20R2p45r4N26J10m6l16
5155F2l15q3J066k52q89l94R59N16j91p29o88L67J354L62j692m22O12J84N50o24
5175b47p39J78J132K42j087l37Q1M99M89n8n78k90N7M55r9K00J24j120j70J154
5195a14L33o43k11J61m04R57K03j079o21Q64R82p8q98q07M77J422K80j158j151
5214a485P12J176L9p92p03R1P83N17l20r26M57M55J80Q6k20l71J03M26j37K56
5234C27k25n24j07P78N93j008l71K6O17L17L74j177j87N22J374p13p97l44L06
$$ y = [-328, -144, 326, 1074, 394, -39, -153, 506, 390, 237, 822, 422, -68, 269, 731, 385, 678, 473, -247, 480, 1135, 931, 95, -176, 554, 622, 1145, 342, -733, -374, 1102, 1287, -2, -530, -40, 966, 1220, 442, -333, -128, 1069, 1269, 416, 68, -44, 378, 780, 761, 220, -7, 620, 634, 15, 535, 627, -118, -212, 314, 424, 378, 62, -253, -336, 730, 478, -411, -805, 154, 670, 479, -250, -938, -571, 783, 1145, -547, -969, -357, -173, 377, -247, -986, -808, 324, 566, -521, -858, -777, -278, 211, 153, -425, -715, -658, -203, -302, -102, 22, -1098, -1268, -114, 219, -424, -635, -474, -878, 79, 282, -797, -1418, -554, 428, 350, -548, -1355, -878, 544, 824, -334, -1485, -773, 403, 442, -350, -1053, -962, -179, 338, 18, -908, -451, 4, 184, 270, 50, -321, -218, 208, 71, 327, 102, -422, -529, 249, 842, -166, -537, -511, 106, 423, 797, -380, -567, -45, 1329, 616, -181, -525, -219]
5253b19P95L02q58j104J102O27K9n91m23n7N03J088q42p08J52K40QNJ01l08J67
5274IJ69R2l67P1l76JJ011K88q85j031M32O41N66J62j009q85M86J540m40r07n01
5295i33Q18N11J78r01p83P12J085k24q54l05k4R10N67m21r76M2M78J10p4j46J9
5316b11o40O34M54m27M2k24l15P62N39p53q66L54P40p1L53p63m89M25J027J14
5336F85j327l32O91Q02J00n38j061K21J479j14q00j29kR3Q4J51p32J91R22r8l19
5357c3j71N8l92J91Q77l8n39m36N3J3J099Qj355K88N30J09l02j80n53L93J533
5378A153l73j401k14P16R44o2n12o20k54Q71L87o42k53N82k66K00k15m2n2M27
5398C74K78m35J60l45l37l1J218l6n77p10K49L53L80L27j100l0P17M6j58m07o0
$$ y = [-219, 576, 878, 20, -1084, 18, 645, 674, 83, -340, -397, 106, 1194, 352, -356, -204, 36, 44, 49, 150, -158, 9, 178, 270, -97, -26, -402, -401, 610, 898, 13, -1018, -586, 55, 621, 783, -226, -1111, -625, 915, 475, -432, -933, -115, 396, 574, -327, -1110, -398, 687, 463, -391, -696, -720, 190, 757, 336, -640, -598, -120, -10, -84, -230, -211, -851, -217, 237, -190, -148, -372, -687, 75, 614, -139, -1005, -651, 89, 18, 371, -392, -881, -456, 571, 685, -642, -974, -283, 519, 619, 81, -980, -759, 720, 606, -194, -323, -325, -232, -148, 3, -729, -538, 384, 286, -33, -204, -146, -538, -347, 530, 492, -47, -483, -430, -417, 682, 690, -665, -377, 153, 262, -40, -220, -773, -380, 1153, 780, -621, -835, -119, 825, 763, 251, -369, -623, 248, 635, -7, -260, 322, 56, 256, 41, -1, -53, 374, 652, 217, 377, 32, -305, -336, 882, 846, 269, -441, -192, 161, 541, 868, -232, -262, 455, 501, 343, -64, -124]
5419a24K54Q82j74j460j54J168O78j47q98m74m0N88J128j283m05M89Q05n00j54
5438A79K5n63O27N73m16o73J76J31K15K91k4m97k88L75J10K96ln94l61J041M60
5459A080q42o13k05O86P88K24j389n01J007R19n08q06l56K79Q07N34j061q39N08
5478b88P46N6l16j03n50j44O82M65m91J05k67k85N59L92n58o74Q22L46J75l17
5498C55p93o79J301R74o92j286o6Q53N65L53j082n81O44J157k87j502j1O83L71
5517B77J90l23q07J90Q66r0L2m05j85l00O95M51n53l00m6p0O78L32j206j30N16
5538a88J042k72l88r82j13Q95J029q01j082qR90N52k29r04p83P38J102k20q48
5557d70l89M25N11K23l04n76j07O51M14m42l9l36l12P61L99n69n13j22M96Q62
$$ y = [-124, 130, 1012, 838, -622, -776, 392, 1070, 923, 25, -449, -489, 99, 1227, -56, -461, 28, 833, 333, 179, 204, -359, 268, 841, 425, -248, -72, 59, 274, 565, 541, 44, -244, 131, 241, 537, 534, -60, -421, 620, 1080, 238, -375, -580, 106, 894, 1118, -271, -772, 235, 1154, 646, -160, -516, -237, 570, 1104, 43, -796, -288, 458, 514, 198, 95, -455, -599, 83, 548, 57, 162, -105, -390, 169, 561, 3, -671, 151, 497, 672, 355, -438, -1117, 184, 1158, 466, -820, -886, -33, 532, 885, -197, -778, -134, 1023, 736, -766, -777, -94, 277, 467, 144, -663, -473, 393, 303, 335, -70, -255, -555, 140, 591, 38, -262, -308, -378, 300, 632, -574, -704, -188, 854, 582, 194, -788, -901, -6, 1023, 222, -860, -868, 122, 674, 445, -459, -1242, -504, 598, 378, -470, -859, -434, 77, 300, -4, -580, -687, -36, 378, -64, -103, -439, -751, 10, 409, -160, -673, -795, -299, 563]
5577E63L7o93q53N0J402J08p70p61q9Q92O84l47j184K61O71Q88o81m59q51O32
5597e00J339j79n14p83K14K33L96K53o46l65N03K20J72m84l43j49N78Q38o23o39
5617d79l88O10N66M04k81j155k04J583M45r62p83K16M70O71l46j131J26J301Q6
5636G49k88n38q70N06P61M78j060l39K05N55L32k21l88l92J38R55Lp71j86Q%J093
5658G30l77p43m68P72L58K20m65p84j68J390M81p42o47P7rR79j1j063l64P57M89
5679D12j67l40k69L6N68L45n04l14r9N76k45L67k97r47M77J023R7p53j75K29l02
5700b82P20L53j075j83N38L54l32N6p40J74J021K50m05j002O5N96N95J8p07m39
5720d25k0J273j93p57j39J37M96J09n27m79N58L40K61m84r0k49o4M72L37m97k94
$$ y = [563, 600, -93, -946, -896, 506, 614, -156, -917, -1006, -114, 570, 223, -961, -700, -29, 859, 178, -281, -1132, -500, 839, 660, 146, -637, -423, -190, 206, 459, -187, -552, -49, 171, 343, -141, -484, -633, -55, 783, 160, -479, -867, -257, 309, 713, 432, -723, -927, 656, 1101, 139, -644, -428, 42, 713, 367, -764, -638, 663, 749, 461, -77, -947, -441, 320, 798, -262, -601, -396, 159, 491, 270, -118, -510, -372, 583, 586, -185, -371, -363, -363, 730, 353, -390, -858, -86, 272, 492, 27, -757, -925, 465, 946, 204, -443, -366, -375, 604, 593, -470, -834, -77, 412, 245, -95, -364, -328, 240, 585, 81, -233, -332, 244, -1, 366, 69, -878, -401, 622, 719, -34, -209, 20, -282, 438, 791, -284, -467, 71, 425, 93, 149, -591, -417, 604, 854, 449, -553, -488, 108, 703, 721, 14, -425, -445, 828, 635, -122, -261, -124, 372, 481, -46, -525, 33, 373, 634, 150, 60, -189, -253, 219, 556, 59, -235]
5741b35M5mk9R08m27n94M80L45k13k81l79j37J008K24n91p57J97J024k09Pn50
5762a68l33M22O08K83r64k33O16j01K92j1r55K31O85k86n7k89J13K9L65L84m16
5783B15r17N82K62J82K14o23n04N69N12Op94OK11K95M46l67r24L08Q14J06o06
5804gm76L40K30Q67o56j067J50N36O24q6j95q06l24O62M66o15p7K35KJ98J83n53
5826c69k51N18M63k0n9p89m38N11J004k32j005p6L15N01k51K97j111K57J119J11
5846D95q64o09L21P34M04m3j186l80J019K89P6o59R7l74Q58L25k33o49O4M25Q3
5867A93N26o61p47J40J006m0m57l20k95L24J203j5j317p9L51R92L10q76r41M7
5887f56J391L34o98q59K94M85L11O89j181l88L23O44K4n52j84Q8K99N14l4j019
$$ y = [-235, -190, -194, -223, 685, 258, -336, 144, 489, 276, -5, -384, -521, 487, 711, 120, -637, -440, 584, 375, 382, -168, -501, -79, 529, 812, -152, -385, 231, 130, 422, 411, -544, -313, 372, 86, 29, -260, -147, -118, 247, 631, 215, -702, -120, 142, 324, 538, -85, -589, -20, 492, 498, -296, -290, -79, 216, 662, 295, -629, -321, 493, 599, -7, -483, -143, 87, 954, 298, -769, -619, -83, 541, 455, 260, -546, -870, -208, 258, -357, -434, -199, -197, 1, 184, -369, -620, -102, 361, 341, 282, -507, -945, -434, 570, 338, -667, -743, -428, 73, -178, 119, -992, -735, 384, 495, -369, -978, -657, 77, 481, 438, -748, -1128, -109, 180, 256, -403, -306, -680, 178, 503, 270, -379, -315, 110, 193, 719, 58, -689, -549, 457, 417, -40, -360, -655, -331, 872, 857, -460, -539, -188, 804, 1114, 238, -703, -656, 735, 1069, 371, -488, -194, 291, 602, 1291, 110, -278, 45, 689, 713, 161, -23, 65, 364, 878, 844, -175]
5907a75j37N70K04M73l37j140j00J017M70p05k96m0k85J212k46o25q23O57Q34
5926E28K35q29o17m65J425Q74p62j152J87K92O58J40r33n75O28P90k7l31o44K9
5946e49M64P04J66j493K0M93M78J58l01r62k43J050L92j54p62o7M50M55J11o31
5966b21o93L45J056R6m76r64N8N38J005m93q56k17P06M22J55n86o50L81J046j62
5986D90m55l03p11O24P56J21m37r50M32N40J85M6q65k61O79P39N9r78k43J18O38
6007B24M08o39q12L24O27M06l88o56p8O24O47k61q56k05O61O01l30l33p68m5R40
6028I1O49m12m80J5j20J99O97l80n40k25P46M26m42o93P8L31R70k94j156k3N33
6049c0O83J34k86q92k73J185J62l49k02k19K31M29J18q17m48O01K94j74r3l07
$$ y = [-175, -312, 258, 462, 935, 598, -542, -642, 375, 845, 140, -156, -196, -481, 731, 485, -140, -963, -306, 528, 763, -66, -683, -1148, 277, 1151, 389, -763, -576, -284, 374, 514, -419, -994, -366, 424, 397, 66, -578, -549, -85, 619, 785, -708, -688, -195, 283, 441, 140, -822, -1065, -15, 377, 223, -539, -606, -156, 299, 410, -221, -914, -569, 487, 583, 107, -857, -799, -261, 744, 251, -605, -822, -116, 306, 461, -125, -775, -394, 652, 490, 35, -268, -979, -355, 401, 522, 85, -865, -433, 107, 292, 338, -527, -788, -109, 630, 689, -289, -532, -414, 224, 632, -7, -819, -495, 132, 538, 150, -506, -584, 40, 687, 426, -430, -635, 26, 627, 297, -36, -804, -849, 91, 740, 328, -152, -137, -257, -58, 639, 259, -281, -506, 240, 666, 224, -469, -391, -60, 910, 616, -540, -563, -30, 653, 787, 501, -391, -664, 521, 683, 334, 132, -87, 144, 573, 691, -126, -574, 27, 321, 147, 54, -253]
6069b53J09K15O36l79n27J4R4R2O67m06n63k05P77L33l28m26n86P05L67K47o31
6090d8k85L07j1L46j35o98J48Q20J77p85k60J93K32M5J69n60k03M33N25j24m29
6111a43m1k30K63M02l17p2j45L5N45r6K5o72o0N23N72q63L0m9k10Q70K3p10k02
6134e22P82K38l16j57o01L40J68N93n09j96J08Q3O9J35k06l03L22M90j00n17r2
6155a91J39J18Q97n30p08J05K23N37j83m10O2j14O79l7k55p50L44N88J6l6m93
6176Am16Q84L86q07j41jl4O43J19l87q31O25L74N15n05m37n2J07N45j05p47j12
6198c76M25K62K54l3p47k03Q20J80j90n88KQN78Q5o47m75P14K97J10j7q23k56
6220f20O65O75n06o79k52N45K77L51l98n53qP88J74k41p39N8J61Q65N9j015m28
$$ y = [-253, -144, 71, 707, 328, -199, -185, -91, 1, 668, 262, -301, -506, 271, 604, 276, -150, -736, -31, 336, 583, -48, -333, -26, -37, 309, 174, -524, -376, 444, 621, -164, -424, -231, 1, 46, 215, -345, -548, -115, 410, 286, -143, -184, -414, -151, 251, -66, -138, -283, -248, 297, 201, 226, -446, -506, 17, 589, -274, -244, -293, -503, 367, 390, -320, -522, 260, 498, 182, 25, -576, -236, -68, 525, 16, -180, -72, 11, 80, 215, 9, -294, 28, 518, 418, -99, -191, -52, 66, 963, 433, -275, -170, 53, 590, 407, -3, 59, -55, 624, 587, 332, -418, -74, 514, 530, 494, 1, -415, 469, 855, 48, -93, -94, -128, 515, 634, 247, -584, 41, 415, 930, 425, -12, -64, 43, 588, 483, -264, -376, 49, 311, 565, 532, -215, -418, 402, 582, 392, -196, -194, -186, 392, 477, -170, -645, 69, 366, 476, 459, -364, -620, 45, 720, 214, -465, -717, -172, 105, 456, 58, -495, -503, 285, 459, 218, -521, -463, -302, 563, 622, -393, -821]
6241h21N03M20L39j81n98m63P32P27o24k80k23K20K72P77r51r66M42R63J74j97
6261B65n50n77N72P14J24j235k64O23L96M04k22j132jR70N29o77l39l22J2J098
6281C88J12p18p15N07M22M56k78m88o60P84Q26k43q12k37J53M70N55k89q95m01
6301a063J085K31j87n56m56J95R89L82j161l87M55M26L02k20p38j35Q53L94o7
6320C42q57j23N2N68K83O7j299N15O28J84q2n58o03M07J118o5o93l03O1K35N84
6341D61j18j045j93R65M89k05n81m56K95R43J81m41j186M44P70M09j64p37k49
6360d18M42Q36Qq19j68p1N07J8R6o36m59R05K97J1m11m49K2P03N81q93k65j54
6382c17K87P49p6p35n45P70N05q9o15m16J42P30O80m12r74J38K87J44L61m84n94
$$ y = [-821, -318, 102, 441, 260, -338, -801, -69, 658, 34, -246, -469, -249, 23, 800, -151, -1117, -675, 288, 462, 265, -285, -862, -290, 424, 548, -687, -951, -328, 68, 472, 250, -882, -883, 87, 616, -61, -400, -722, -710, 388, 500, -218, -933, -426, -4, 452, 174, -314, -974, -190, 636, 393, -419, -656, -503, -33, 522, 233, -662, -1063, 22, 253, 66, -490, -946, -751, 238, 620, -541, -928, -473, -47, 255, 35, -703, -838, 15, 409, 342, -515, -638, -586, -18, 265, 332, -967, -452, 176, 360, 278, -280, -883, -476, 642, 577, -116, -419, -358, -123, 461, 343, -702, -895, 70, 559, 354, -227, -683, -388, 555, 736, 295, -891, -447, 323, 732, 568, -169, -418, 24, 860, 868, 49, -119, -190, 317, 335, 431, -205, -664, 241, 538, 549, 138, -311, -289, 414, 995, 102, -163, -317, -30, 719, 643, -92, -637, 133, 638, 549, -66, -482, -340, 390, 1070, 658, -316, -178, 109, 253, 614, 130, -464]
6403d64M43L36M39o27l32M7K54O36P2j179k16J020L19l05l12m46N6O64Q5j46p05
6424c61J89l0M44K65m18o14M29O51l42m18m4l11P78L78l65m83j25L38L24o4n27
6445c06J39l14O78L24n99j52R9M55k04r8l46j59N51L96Lm31m83j95Q66o1n43J86
6467a94l0J90k3K53l95l62J44Q19j83n20p5J83L06j3l71j21k95L68M76m82j54
6488d79L74l57M89m7l81k85K52O15k29J58n66P5N0M51l29k89L21J69j6J46k52
6509a30m17L14O68l46J32m51j97R0N08J35o15M0L18M87l89j87l95J38P20L0l79
6530G4l46Q1J71K56J31m43l52P21P8k84j11j73K08K06O40n86n67J16L52nL76n49
6552fk57J19M93L86r65j15J5M90K21l33k86l29R58M10m47l33j15J22K13L19m93
$$ y = [-464, -21, 315, 754, 127, -205, -158, 96, 732, 804, -375, -591, 429, 748, 443, 131, -315, -259, 405, 490, 344, -361, -172, -202, 242, 507, 89, -525, -96, 555, 213, -205, -249, -560, 218, 596, 231, -252, -377, -39, 285, 221, -306, -167, -481, 197, 521, -78, -230, -131, 324, 120, 22, -324, -483, 68, 464, 467, 36, -447, -642, 224, 163, -380, -194, -224, -34, -57, 196, -199, -561, -417, 402, 219, -301, -376, -193, 113, 100, -271, -392, -687, -319, 157, -325, -479, -105, -462, 27, -20, -401, -686, -434, 181, -48, 110, -456, -381, -331, 120, -209, -498, -177, -8, -24, 122, -130, -547, -233, 435, 89, 221, -230, -427, -337, 171, 306, -309, -269, 49, 536, 147, -40, -435, -297, 423, 453, 74, -272, -191, -20, 236, 367, -76, -428, 293, 371, 87, -24, -197, 11, 217, 857, 271, -296, -180, 172, 167, 543, -6, -263, -144, 349, 735, -230, -345, -330, 160, 381, 48, -238, -567, 391, 801, 354, 21, -94, 28, 241, 560, 67]
6573F7l71J15L74K47l3o38k95N35N66k44m50k81L2M90N06j83o64k48L99P13k87
6594C50m07l26R1P08k51m17k82K73L05M95r1q84k25M95O98m94j52j43o6L28L37
6615C42k69n92j11J113j40k64n72k98P54N30K42p11m71M8N11O79k18j281m1O41
6635a08O04j00k88o17j96R79M82q81l82J95L88L90K02r46p05P26P89J20o92m60
6655e00q3N32R55m29j164K87O09L22L70r61m78j03R97K51q47l79K88L75M43l6
6675D49p95K2Q4P35k89l52p14L97P37K42j24r77J49N17O9K03n87J27l85O32O21
6696G61o54r67L08N86R72l14r77m27M48Q07J0m01n32k72Q48L98k80m33j78M61
6716A64K32J17n81n72M16P64K15p14o28J4L27R93n0p57l86K83M26J77o50k80k07
$$ y = [67, -304, -189, 185, 432, 399, -239, -534, 1, 567, 323, -127, -408, -376, 114, 620, 437, -227, -475, -76, 637, 350, -57, -383, -292, 416, 165, -252, -534, -261, 44, 539, 448, -436, -661, -166, 532, 38, -114, -257, -323, 5, 342, 73, -519, -630, 483, 343, 79, -493, -791, -37, 493, 735, 24, -447, -399, 112, 791, 573, -708, -749, -108, 496, 396, 108, -509, -705, 274, 756, -125, -507, -312, 76, 466, 668, -278, -983, -257, 532, 652, -40, -500, -583, -51, 904, 475, -689, -402, 207, 529, 899, -62, -540, -643, 354, 605, -242, -621, -333, 42, 485, 449, -346, -324, -240, 495, 206, -146, -860, -463, 274, 516, 392, -585, -436, 81, 150, 353, -234, -107, -492, 140, 761, 107, -860, -552, 34, 1006, 692, -285, -712, -264, 543, 553, 152, -380, -652, 196, 594, 314, -119, -297, 164, 396, 513, -68, -640, -224, 540, 755, 41, -587, -573, -246, 747, 697, -60, -446, -163, 263, 440, -210, -490, -697]
6737f97Q72M51n93o28KM16P58j05n62p03J32J206n1l80j82m83M08P48l12n46k1
6758b70J25M62J11n07n32N3P19L08k69l49j24J00K66L64n60n40L49O19k44j53
6778g2j9m08N92R4l7m77n8r6L81L45n98j24p1N69J39m06k37k40O71L44l69o21
6800f98R8O23Q9L21k02o96k37N17M07k86l88K08L2O1M72l10n24K28M01J41m59
6821b02j34k29N16L91m37j47j1L49k62L73k02j91P9J55L4j98r9K28P0N59m76j23
6843D3n69M12M27m4q3j4J00k87K05j86k09P1J97M5J96l38j17J34L94p2n85K50
6865c0r8L69K96l72m61P9L41K00k80K33m16L24J24Q9l76m4O5K49j94L3k11k0N38
6888D38j97j49l78K61K38J26j99j86l40J94L98J1J33k19q3K2K32n7m17K43J66
$$ y = [-697, 175, 626, 33, -595, -593, -177, 581, 476, -86, -789, -657, 549, 498, 118, -64, -547, -139, 609, 297, -249, -270, -145, 317, 428, -79, -611, -558, 161, 469, 200, -149, -273, -173, 93, 457, -103, -643, -294, 325, 81, -72, -91, -499, 93, 187, 150, -327, -385, -481, -100, 245, -353, -477, -548, 21, 160, -246, -483, -723, -52, 292, -77, -698, -600, 23, 112, 433, 231, -465, -702, -185, 222, -64, -452, -244, -212, -151, 321, 11, -513, -285, 116, 257, -202, -336, -565, -49, 342, -95, -242, -253, 96, -166, 207, 5, -186, -107, 48, 82, -116, -215, 13, 83, 642, 166, 43, -526, -114, 313, 269, 186, 172, 272, -15, 190, 4, -205, -134, 63, 108, 304, -34, -151, -17, 377, 305, -280, -30, -128, 241, 537, 165, -296, -217, 124, 324, 44, 277, -139, 185, 309, 398, 22, -22, 43, 292, 98, 131, -80, -100, 438, 241, 92, -286, -25, 213, 339, 140, -46, -386, -192, 206, 217, 350, 131, 48, 70, 302, 245, -172, 71, 237]
6909B37o4k3P5p18M19M76L0k55l15L0L15Q8k56q7l32J39P76l31k91Q6k45N60J89
6932E03o23l63L08K96M34q5p04l31M79J85M82m21l85j33M46K23J5n42k91J38O52
6953B83m2l82ml58Q39N2k80p15P4L57M38L28p94n36M45O12j53l88l11Q9N45M36
6975E35k53o69m9L24J78L30n24o33K80Q29m2m19o58K74O99K30m15m68l75N58P29
6996D61k51l8m91l66P80M95o41l02r0L02L42J10n04l63j16J170J42o88l51L2K26
7017a41M69K85p79r4j85P03O59p96n90L4Q40K77n70p03M00K32L76J76m77p78N93
7038f9P27m2n86j54k01J85P35k37m06l11M9P78J09j02p36k52O55N36l69n84k09
7059d84M83O33L96j018k84K65L35L63n86j30l60P21J77J52p45k14k03R00Q5j15
$$ y = [237, 173, 150, 225, -493, -74, 402, 432, 177, -138, -108, 207, 295, 39, -48, -380, -241, 535, 204, -87, -1, -246, 314, 503, -120, -483, -175, 121, 555, 470, -234, -565, -86, 99, 581, 160, -225, -358, 88, 311, 326, -216, -507, -369, 283, 241, -141, -145, -503, 336, 388, 108, -607, -533, -176, 262, 590, -204, -740, -295, 317, 164, -224, -535, -446, 99, 535, 282, -387, -436, -112, 66, 396, -128, -761, -481, 348, 306, -113, -771, -497, 202, 432, 17, -451, -826, -268, 461, 210, 172, -319, -685, 95, 590, -51, -353, -443, -141, 201, 311, -193, -556, -672, 498, 640, -48, -399, -367, -141, 328, 613, -166, -260, -445, 258, 917, 121, -469, -435, 405, 682, 112, -591, -191, 41, 417, 593, 116, -662, -69, 658, 616, 30, -124, -325, -140, 595, 358, -48, -359, -310, 468, 577, 475, -261, -513, 142, 678, 309, -275, -484, -1, 632, 1028, 10, -274, -9, 326, 689, 103, -27, -387, 334, 511, 663, -82, -296, -499, 401, 486, 371]
7079C71j008K26R07j84k21m95JK01R40o9p26m36L57N47J93n17m22j68O75M44k09
7100D07n50k31J81M61K1j38p09r0P30K45k11l95l75K37P48j3m19l49L00K16M85
7121E51n40l64p9Q57k10J88p72l6P8N25Oo00k56P2N85K09k28k27r2J34N69l51
7143A9l72k72M32MM39j33q33K41L74M28l76o0k23J46K34R3k34k40K49N1N05k7
7165D45p94l74O92M29j46o79K34N0J59L33j74m00J66Q2K51k27j02K81j38K05j13
7186A80j76j0k48L98Rj0l13J04M42n08O9L04o58L61K84K08j93o40K58L33M4l60
7208a22J5j69L03K02N8k27j06k32L47n3K5l50L11P7l49K44J80k47J4L56m81j58
7230c62L77j74N3J23J70k27r2J47K70k49l39J27K86j79j1k23o3K23L72k53k47
$$ y = [371, -637, -411, 496, 312, 91, -404, -403, -202, 738, 669, -57, -493, -136, 411, 604, 87, -335, -503, 172, 616, 407, -143, -374, -193, 268, 289, 151, -558, -648, 82, 327, 116, -279, -654, -417, 331, 318, -101, -450, -150, 66, 551, 11, -353, -432, 425, 215, 403, -369, -405, -327, 198, 204, -396, -652, -580, 5, 214, -14, -241, -333, -199, 370, 19, -353, -625, -193, -189, 250, 117, -716, -475, -101, 327, -49, -109, -332, -186, 48, 141, -93, -333, -84, -33, 472, 445, -349, -723, -31, 398, 252, -427, -193, -143, 16, 349, 175, -225, -59, 23, 274, 47, -55, 226, 88, 293, 180, 4, -6, -254, 144, 153, 143, -170, -66, 376, -132, -63, 241, -417, -56, 228, 436, 243, -397, -139, 194, 238, -122, -107, -276, 27, 229, 287, 60, -46, -278, 69, 16, 41, -309, 2, 79, -270, -26, 154, -93, -79, 277, -204, -362, 15, -159, -106, 17, 187, -40, -132, 15, 285, 36, -303, -176, 110, -69, -80, -303, -366, -143, 229, -24, -271]
7251b71j79J92J31K70k53mM9L65m81M72k00j54J03K86l33j84K05L8J56N6j56j94
7273h6K10pJ26k03Q8j61J71J85j08J69o94J66N31K72j68r69K48M24J98j81o2m75
7295c26L7P96k40l70m12O86M04j46n91m3J12L41J92k36k24l02K58J23K19j47m74
7316c43J64K54M63l55k32j90M4N45J1n70l26J15N41Q6l75k60k17M36O39k59m62
7337b91k21K42M90J49l59m62R1M53L78m02k95m42N81Q7M94p07j92J64K41L30l65
7358c6l22q7N13L55o8p56o0P6N08N76o78o22K54N06N85m42n97j65L37Q92l91n50
7380a72l32J87P46K44m60m73k41O95K75j26n03j73R5R65k4q22k92J19N35L64k46
7401C61m35k06J93L79L79p26l23J56L55M90l94o59j82Q08M03j74p95j64J71O63
$$ y = [-271, -450, -258, -127, 143, -110, -114, -65, 300, -181, 291, 91, -63, 40, 326, -7, -191, 14, 52, 208, 264, 108, -86, 124, 117, 243, 40, 128, -33, 138, 323, 215, 384, -310, -144, 387, 659, 491, -478, -230, 194, 392, 211, 149, -326, -289, 507, 267, -103, -515, 171, 575, 429, -162, -205, -93, 248, 440, 204, -20, -322, -64, 59, 278, 131, -343, -179, 75, 538, 183, -49, -239, -195, 350, 361, -209, -535, -420, 121, 207, -168, -428, -645, -209, 430, 171, -291, -512, -270, 220, 369, 10, -452, -361, 92, 470, 68, -227, -669, -88, -1, 493, -214, -406, -242, -1, 329, -36, -358, -445, 68, 423, 355, -401, -461, -385, 123, 699, 21, -601, -347, 159, 744, 302, -295, -460, -123, 769, 378, -172, -504, -317, 429, 673, 213, -260, -501, 194, 469, 343, -160, -333, -238, 727, 703, -119, -411, -292, 243, 607, 361, -74, -280, -87, 292, 671, -55, -378, -222, 133, 623, 229, -430, -612, 196, 599, 425, -370, -534, -363, 300]
7421C00L76q08k00J53N48J98m32m90k91O17N23j15o40R6J54L49pk88k94l03R42
7442C88k62P0m08j90j5P83n0p07p7J82K06K85J67q03j56M58N93j7o42m68K54P93
7464C84j95q8o39j76P47N2J00l89k18J61N90k42j12j58k84L26M43Pp20k35L38
7485c08L84J22m15l09J59N80J72k13q16J88O51K09Q1o34n03M92K74mj51o75K58
7506d58P50J97m29l13j08N82j11r5K38k46j61J27M88p22K5j75K70L01j37j45j30
7527b52l8L15J99j14k53k96M90K23j08k67j86L06L70j8k72n46K97K11L95j40l22
7548fm2K65K11k53m86N56M6J49n96J23J67m11M82j1Kk2j36o0j62L94l2P6l66M63
7572C51P1P8j00m24J82K52j86j22QJ95M48l77l18k59M30j40j6k56n0L67J33J26
$$ y = [300, 676, -132, -332, -179, 369, 567, 135, -355, -646, -29, 494, 379, -261, -165, -11, 338, 331, 43, -251, -554, 388, 126, 196, -212, -402, -417, 366, 316, -391, -468, -286, -80, 205, 372, -431, -587, -129, 464, 447, -195, -663, -409, 384, 189, 101, -538, -714, 33, 85, 185, -204, -422, -261, 329, 87, -25, -183, -467, -141, 302, 309, -411, -646, -308, 76, 198, -217, -526, -367, 213, 385, 172, -644, -456, 195, 404, 485, -149, -652, -160, 114, 110, -41, -716, -458, 292, 489, 60, -253, -361, 221, 110, 15, 253, 7, -154, -27, 461, -261, -236, -411, -141, 160, 23, -122, -252, -290, 25, 224, 110, -143, -439, 51, 274, 166, -101, -287, 19, 389, 371, 99, -447, -150, 61, 456, 316, -6, -48, 217, 428, 175, -311, 245, 291, 440, -156, -33, 134, -277, 205, 194, 196, 174, 38, -22, -184, 210, 178, 254, -112, 351, 422, 500, 400, -24, 158, 410, 224, 102, 110, 305, 753, 376, 58, -201, 229, 89, 73, -183, -233, 134, 267, 393]
7594C93k66jj65K19Q7n38K77j37K55j12Q4p3r8M45l05j38O2K07l23K0J07j2k25
7617b37k85M38j46L45m47J44n6N93k32k86k95Q1J43N24l47l13K4M50J08j99l50
7638c43No1M45J28n17J23N9J50k06N6p8j54Q0L58k20k11j53N7L97L03j61n44J27
7661c60K36l1J08r5m22O18J68Pj85l29ON06L6l03k36j29M52M00m34m41K46K10
7683B8J87R7l56l14K20J35M35m83R0k86K46L70Q1m69k01J12N37p7l24k15l7K02
7705b2K45mn67J46Q6O38J30p49j80J49L00L53j66o59k67R77J33j17m05j55j03
7726b37N57L57j86r16K23M97J41j99k39Q7QK55J04k76k97k27L84M03J3m31n96
7747e75K50O71p5k61l56j30O74L64n84n39M53K11L30K0p89k46K76O14k37l82k71
$$ y = [393, 127, 126, -39, 180, 267, -271, 6, -131, 124, 12, 96, 23, -75, 370, 65, -73, -11, 196, -127, -107, 0, -12, -237, -522, -84, -230, 115, -332, -188, -244, 349, 117, -169, -464, -383, -240, 284, -63, -376, -352, 98, 206, 7, -343, -338, -399, 46, 174, -343, -220, -161, -11, -217, -161, -239, -393, -313, 45, -175, -386, -539, -482, -85, 218, 57, -487, -360, -124, -155, -47, -142, -564, 54, 222, 229, 44, -285, -279, 227, 263, -40, -276, -405, 47, 447, 13, -428, -182, 28, 215, 312, -44, -358, -138, -3, 432, -51, 39, -247, -1, 369, 450, -19, -220, -108, 429, 352, 28, -187, -224, -22, 223, 219, -348, -202, -116, 522, 652, -97, -277, -128, 172, 525, 359, -300, -567, 410, 543, 426, 21, -134, -237, 320, 677, 491, -425, -202, 295, 436, 237, -2, 85, 93, 348, 452, 176, -121, -348, 36, 439, 452, 21, -575, -325, 346, 271, 10, -346, -476, 198, 562, -22, -561, -108, 103, 433, 453, -336, -582, -306, 308, 71, -311, -582]
7768e82K73M42L60k28p23rN56N7n0j51l92j58N62M04j05p74oO55M44k98n99l56
7790f78M51M19N19p79k11j5K68O60p62m38J49M0M05J64n22l41K50J036k20k87
7810A08m49j64L32L69J08m59q7O8K76J78k31j60j88J77P83l10o15k64N09L65L43
7831F89o06l96J99L14K85n14j71RJ38L87O2o11n6M22L73j91J04o84qK72L15p4
7853B58m22J17N4M03k93J87p10K44J58N40m95K42n90J25N35kl74j72L6K07J84
7874B32k68m81J73N66ok22k89l2j70O00L15k40m90J70K68l2q1j55K66j56N06n33
7896e9P4J12j1J03m19M20k00r7K97k99J70j39M5Q9M24m2l89m60L75J10J81O1k90
7919E6k16J88M24k07m81K27L2J63K70m07k97M00J0k17J07K06k27l2K38j14J4j75
$$ y = [-582, -309, 133, 493, 265, -458, -467, 89, 146, 96, -55, -447, -605, -43, 361, 256, -518, -524, 131, 575, 277, -322, -678, -227, 192, 711, -68, -279, -294, -26, 634, -128, -566, -417, -377, 28, 192, -330, -671, -421, 615, 395, 108, -341, -505, -173, 196, 304, -155, -242, -174, 102, 280, 49, -111, -299, -122, 661, 351, -264, -528, -19, 346, 689, 83, -313, -114, 200, 485, -29, -200, -191, -53, 334, 396, -215, -271, 151, 524, 333, 437, -247, -255, 17, 332, 258, -164, -47, 7, 410, 117, 304, -406, -162, -4, 536, 41, 283, -307, -182, 353, 351, -23, -195, -159, 48, 232, -36, -517, -344, 222, 216, -6, -295, -327, -497, 103, 418, 178, -312, -142, 126, 94, 13, -142, 124, -32, 474, -59, 15, 127, 116, 219, -200, 220, 20, -77, 220, -79, 91, -48, -3, 86, 510, 468, 79, -381, -6, 104, 285, 346, 56, -160, 28, 452, 245, -236, -9, 23, 186, 456, 49, -248, 152, 162, -55, 52, 258, 31, -1, 237, 123, 137, -38]
7941c8O6j77J11K39J6l72M5N2Q4L2l20J72M1K82l71J21j12K71q9m35O4K03J48
7964C3o8j08k66L82M7n0k2k96K11j07J95j67k28P8J60J34j37J48j26O8j48K19
7986d8j64Q2J17j90P5R8N9n3j77J89j50J7l5j84P3J37l8L8J17j28J84N4m01j9
8010c47L69M21k72l33n2K69J07j72q7M4K57k94M7M5j10j49J26K49K29j78k21J51
8032I9o0J84r7Ln61L17M46j11j24K8l83M92M34m85l95L55J37j50L2j87j72J19
8054g9M65q8l84R4o7L21N3l38l29J19O58J19n25q7k07K09J91J37m0l52n8J28l2
8077i2P63l71o20K22M40K08m26k16j73O23L46o45m81L50K77O9R6l77n27O3Q76
8098D05J45n68K2o3N6K94J08l10j96J10L44k84l14o5n2N21K82p9n09j69M17k2
$$ y = [-38, 28, -149, -38, 201, 217, -155, -110, -58, 26, 58, -262, -90, -49, 233, -138, -17, -129, 142, 53, -382, -318, -115, 33, -35, -143, -409, -27, 20, -30, -52, -348, -137, -244, -49, -216, -444, -366, -206, -72, -209, -61, -187, -119, -267, -48, -212, -130, -13, -203, -128, -30, 29, -24, -201, -12, -162, -145, -180, -364, -291, -154, -192, -154, -37, -165, 19, 73, -328, -347, 22, 443, 171, -162, -214, 55, 162, -10, -97, -53, 204, -90, -43, 2, -108, -257, -131, 118, 347, 169, -52, 99, 39, 223, 126, 129, -432, -115, 331, 220, 96, 124, -259, 233, 667, 182, -213, 142, 279, 129, 161, -26, -198, -79, 386, 298, -86, 8, -59, 262, 315, -23, -352, -233, 425, 544, 19, -68, -275, -66, 125, 262, 222, -130, -188, -60, -92, 671, 300, -320, -98, 342, 550, 124, -92, -265, 358, 704, 59, -422, -72, 205, 274, 370, -7, -534, -471, 405, 550, -18, 4, -59, -3, 291, 399, 89, -107, 3, 347, 63, -251, -316, -368, 153, 435, 356, -153, -322, 95, 73]
8120G3K74l20l63J26J98J53j93q9m84N40O28j16p32l07M05N62j25l71m47K36L24
8141b8O92n53l97j55N30J42M5k98p44O52M62j41Ln44p7M16M13l95k18l10K46L6
8163b23K97N0n80P5O42K05l09m40m32M57P07l48l19j89Q7N85J94k72n94N04k51
8184a54P39k63l94l86L77R7q5
$$ y = [73, 347, 27, -336, -210, -12, 141, -52, -141, -625, -85, 543, 427, -305, -612, -207, 355, 230, -141, -588, -352, -28, 664, 111, -286, -441, 89, 231, 276, -22, -766, -114, 348, 207, 210, -334, -411, 5, 418, 23, -195, -505, -259, -223, 74, 124, -456, -381, 261, 466, 157, -283, -715, -258, 449, 101, -218, -407, -320, 265, 459, 187, -407, 97, -154, 585, 322, -72, -458, -81, 16, -69]
8191f9
$$ Imaginary data points
##PAGE= N=2
##DATA TABLE= (X++(I..I)), XYDATA
0@%%%qJ6j6J6k4L2m0N6o6Q1j03J23j48J79k13K53k99L49m07M73n48O30p21Q24
27D39r37J065j205J356j527J716j919K144k392K660k955L282l638M027m458M938
43B596n469O057o718P460q300R268j0388J1695j3260J5171j7556K0642k4806L0773
57A7165m0113N6928r6686L58118L61367n54429k71690Q9728L47596R4729j37332
68B25381k03976L2966J28078L3062j25970n1826P4264J31775J8414j17596j76470
79c1898n7416O6373J22588J04051K8532j40355j94604j6281K03569J70506n9333
90A95732k30202j41631J08598K08110J336j99834q8650J68004J95811l3553k34254
101e0533j59206J13168K34244K8152k09222j51555Q5650J79879N8721j03949j22161
$$ y = [0, 0, 0, 0, -8, 8, -8, 8, -16, 16, -24, 32, -34, 47, -56, 67, -81, 98, -115, 138, -161, 188, -219, 254, -294, 336, -385, 439, -498, 567, -638, 718, -809, 907, -1012, 1132, -1260, 1400, -1555, 1727, -1911, 2116, -2342, 2596, -2873, 3184, -3534, 3926, -4374, 4894, -5494, 6201, -7059, 8112, -9444, 11198, -13608, 17165, -22948, 33980, -62706, 295412, 656779, 102350, -169340, -79612, 267984, 362713, 225381, 21405, 54371, 182449, 215511, 89541, 37715, 111979, 243754, 262168, 144572, -31898, -89314, -22941, 99647, 203698, 232230, 91875, -102729, -119010, 84559, 255065, 195732, -34470, -176101, -67503, 140607, 141943, -57891, -146541, 21463, 217274, 183721, -50533, -209739, -96571, 137673, 165825, -43397, -194952, -109302, 70577, 129298, 25349, -96812]
112i6812J2575J06909L1923p3651o4602j8813q871K6093P5920N0827l1174q0863
124g0539n6250L2002R0291J1243j09315o9453P8467J03323l4311j37552m9242
135b11336J54416K06769k0325k56615j76587J03773K14654P1988j03191j20616
145a37070R685J05722L5574p0125k1146R4381P0261o2322j26645o4227N8238J26263
157A8589P4563j8521m4895m1658n5663j0916R2027J10144m896j23789j21541N544
169a21012J29695R6838m0741o9031L1945N6622m9647j18621l9846J04985J45550
180A26737j556j73515j29871Q1716J72798N4574q2910r0287o897M2476n415n9552
192g1702l584Q5578N1290n2582o3290J1820N5580K8760k6409m2609O131L3264
$$ y = [-96812, -84237, 22672, 54595, -19056, -83658, -102471, -111342, -85249, -9329, 41498, 10324, -70539, -126789, -94787, -4496, 6747, -102568, -172021, -93554, 9769, -24542, -162094, -211336, -56920, 149849, 129524, -127091, -303678, -199905, 14749, 86737, -16454, -137070, -127385, -21663, 13911, -56214, -77360, 17021, 87282, 24960, -101685, -165912, -107674, 18589, 93152, 74631, 29736, -11922, -67585, -78501, 13526, 123670, 118774, -5015, -126556, -121012, 8683, 105521, 64780, -4251, 27694, 84316, 34669, -83952, -123798, -18813, 126737, 125181, -48334, -178205, -96489, 76309, 130883, 47973, -42314, -49211, -6735, -12150, -71702, -75286, 10292, 61582, 9000, -54290, -42470, 13110, 41870, 15461, -27148, -21017, 12247]
204A2247k7329o1406K1938R6792M0967n7854o5663J5468Q2335L2706r0985j01630
216a02414L6912J18977L0067p7782o1000L1249P7243K0553o4687m7209M8062M8552
228E8523n8443r3491J285R2006P7261j4945p8741l7802M4932L0917m4371l0054
240e2923M7339M2490m4526q6516k4359Q3929J15821J3387r7086o9845K3699L4902
252a3688j3311j6986K4667M4902O356o4186o1022M7578J11881L2000p0854o3636
264c6299m011J5385k656j0470K7612P3063K8751q3187r4358K8289J12205N0139
276A04463o3374r8232k3579O6540M6960m4326m2368N7364Q1877j7076r7306o3964
288i3021L5259Q7918K6103p1472o6580K4082N3432J0130r403R669J1631j0043
$$ y = [12247, -15082, -76488, -54550, 42242, 83209, 25355, -40308, -24840, 57495, 90201, -784, -102414, -65502, 53475, 83542, 5760, -55240, -23991, 53252, 73805, 9118, -38091, 9971, 58523, 80, -93411, -92126, -120, 77141, 62196, -16545, -54347, -9415, 21502, -22869, -52923, -5584, 36906, -7620, -94136, -118495, -34566, 81255, 94642, -2444, -72289, -48590, -13688, -26999, -43985, -19318, 25584, 31940, -32246, -93268, -45690, 66191, 98191, 27337, -36299, -40310, -24925, -27581, -38051, -10439, 62624, 91375, 8188, -86170, -57881, 54324, 104463, 41089, -57143, -80722, -14182, 32778, -11548, -53916, 3448, 85325, 68249, -29057, -93021, -57762, 30156, 56259, -15213, -81793, -57711, -4279, 5851, -3552, 6117, 17748, 7705]
300G705l3690k9060J9981M2087j1664n0565J0276P1711L0414m9274n6898J4766
312c4211P8551L6097p9761r8652K9120J17388M0265p7935p5993L0870J10148N2817
324A28704q4190j18633K102R8355M8433m4380n7920j945M7210L5012j9219l0370
336C159J3289K0738k3173l1035J28L603j0165M676L4531M1222J42o8814p0389
349h2088L6335J12385L0629j03254j08225J3806J14320P8038n4207j01735J1829
360e2167J12145L8705r7333j01269K0826J11512O6035o1916j08937q235R6876
371A6242P2127j7508n2204l1926k254J5326Q948k199L882J003j3619P390M3308
384D8516J1326n3149m3273L1670O5455Q607q4374r0849L2383J37324O4152r2210
$$ y = [7705, -25985, -55045, -35064, 7023, -4641, -55206, -44930, 26781, 57195, 7921, -48977, -34211, 44340, 80437, 676, -97976, -68856, 48532, 88797, 10862, -65131, -34261, 75887, 128704, 44514, -74119, -72017, 26338, 74771, 30391, -27529, -29474, 17736, 52748, 33529, 3159, 16448, 37186, 14013, -17022, -16894, -13291, -23456, -18780, 15751, 56973, 57115, -11699, -82088, -45753, 66632, 97261, -5993, -114218, -100412, 13908, 91946, 37739, -63996, -52167, 59978, 98683, 1350, -99919, -79093, 32419, 98454, 36538, -72399, -80634, 16242, 88369, 70861, 18657, -13269, -15523, -197, 8751, 6552, 10434, 11437, -2182, 5208, 48516, 59842, 6693, -36580, -4910, 60545, 69152, -15222, -106071, -73688, 63636, 127788, 35578]
396C5578j15152R798J10318O5736o8700j25528j8686J11552P9771n5304r5325
407f5942n376Q3301P0713k2040q5819m0660M0890M4502n268k1568j1085m730J4090
420h992L5920K4878j2246m2446l8368J6855O8620K3756p5766p7667L3479J09584
432E7607N5531o5091j07326p199J12117P0141q3665j25010j138J12317P8243m5310
444E1217j07134k6470R3958Q4321l7228r6989l6284L7795M7236N322l4503k3058
456d1817J8872K5634J948K030K324k8240l4382J3844M4731R656m6290n1630J8661
469f4659R3557N8043o6815j06584J200J00722O0891n8926j07934k0228J03358
480g375R3227m2633j06056j1757R0070O4141l7876q9945l6070N6133O5146j1725
$$ y = [35578, -79574, -69776, 40542, 106278, 37578, -87950, -106636, 4916, 84687, 29383, -65942, -71318, 11983, 82696, 60656, -25163, -65823, -24933, 19569, 14301, -7267, -18352, -23082, -8992, 26928, 51806, 39560, -2886, -41254, -24399, 44221, 67977, -7789, -85456, -51977, 57607, 113138, 48047, -59279, -66478, 45639, 115780, 32115, -92895, -94033, 18284, 96527, 51217, -55917, -82387, 11571, 95892, 58664, -38325, -74609, -36814, 10422, 15744, -18759, -41817, -22945, 2689, 4637, 6667, 8991, -19249, -53631, -39787, 4944, 14600, -31690, -83320, -64659, 28898, 86941, 20126, -86458, -85258, 15464, 76355, 17429, -90505, -110733, -7375, 85852, 43219, -62837, -74594, 15476, 79617, 41741, -48204, -84274, -28141, 37005, 25280]
492B5280n1652r411K9222K1264N137l582j2650j6454j5921m488K4707K9323k1708
505i33n0766R304P2703L9381m7608p7114j2258P5154O3260m9347j03941q905J00810
518I740P4849l4727q3980k2191O9166O5625l4305q7725j6271O4931M6613j9882
530C1843m0799n061L8871L4511j2853l1804J37J0713j6997j3809K3006K7621o377
543C9002k8795r365L4849M5210j4903o8992k4697N2983M4735l2340o4011j0626
555c6950O4753O6504k2018q4683k4344O4859M8964l6745o6597j4729M5574M3816
567D8404j6626m5725N694M9817J3233l8758k9349R943J9727j631k3440r277L0461
580A2473K7588k2237l0920K1771M2315m574m8838l3844K0312M8679N971n0431
$$ y = [25280, -26372, -35783, -6561, 14703, 19840, 16258, 3608, -12846, -28767, -33255, -8548, 20775, -933, -51699, -42395, 30308, 69689, 22081, -55033, -67291, 7863, 71123, 21776, -82165, -91070, 9740, 84589, 49862, -34118, -56309, 12857, 78482, 44177, -43548, -59819, 5112, 51725, 31843, -8956, -14017, 24854, 59365, 46512, 14708, 14845, 25558, 8561, -5248, 17758, 45379, 39002, 10207, 842, 35691, 80901, 65998, -2994, -27691, 25292, 70027, 37687, -26324, -36950, 27803, 94307, 72289, -12394, -36738, 28121, 77085, 40340, -26257, -40986, 4588, 48404, 31778, -13947, -8253, 41564, 54797, 16039, -13310, -3367, 16360, 14729, -8711, -17988, 12473, 40061, 17824, -13096, 8675, 50990, 46416, -2422, -36266, -15954, 32725, 38696, -11735]
592a1735k6591M7590N2724j6742n2441j7099L1563L2041k0611n4596j0025N1735
604E813L2391l1369l5439J5029L9743O800l9278m0592J3139M2714n111m9411j1250
617e6821M7457L5215j9996m3400j0201L7798L1451l1680n7361j049M8087K0845
629C45k4993k2717J4021L5226Q554l6848l1145K2763L1250j7767l6057M426L3309
642a9633J5286j7347k0913J6466M0802k811n9662l3146L9769N0353r791n1389
654e2016k3655M2256O0122n938o5972k5943M9445M1337k9323n7786j4684M4224
666c7933N0254n425m5694j1721L4960K0067j7072j9415q36N482k52p140K345K5122
680g258J5791k0218j7160K6867L1821j8425m7795j5217M0343N1560p486o3815
$$ y = [-11735, -38326, 9264, 61988, 45246, -7195, -24294, 7269, 39310, 18699, -35897, -45922, 5813, 38204, 6835, -28604, -13575, 26168, 32968, -6310, -46902, -33763, 8951, 3840, -45571, -56821, -9364, 25851, 5855, -37545, -47746, -9948, 21503, -10177, -67538, -68587, -20500, 345, -24648, -47365, -33344, 1882, 10436, -26412, -57557, -34794, -3544, -21311, -57368, -52942, -19633, -4347, -21694, -42607, -26141, 14661, 11850, -47812, -80958, -41189, 9164, -627, -52016, -75671, -33415, 26707, 20769, -45203, -71146, -21701, 19636, -9687, -67473, -82157, -37933, 12321, 6896, -38798, -50519, -15559, 4508, -12564, -31979, -32815, -27333, -27585, -34725, -32380, -7258, 8533, -11685, -28845, -1978, 29843, 11418, -36377, -51594, -11251, 40309, 32823, -30992]
692c0992k5164O4777P1446j5710p2374l4770M0452O1561k197o8134l5406N0583
704D072O5196k330m8833k6138K2950M0327M686l8911k9687J1450J9224L301N646
717C0953Q809q499j5804J196J9595J5942j4757m5948k3342M2509N2084j5828o0910
730a4000j8123N2406O1715q874q0852n1641M8481P6693o324p5457m1048M1626
742a5398P2349J7504n7574n2536K1845N3763N357m1683l2079L721K7611K3136
754B6016l040j5609m737K98p78J3006J3950k2068m3566o746M1284M1216r677n4607
768b5058k8669N0075O9570j4843q6078m5328M7348P2959O183p1235n6272M1576
780c9772Q8398J5664o9275n4828K1414N7911J8876m2672n1090P366N0152K6389
$$ y = [-30992, -56156, 8621, 80067, 64357, -8017, -42787, -2335, 59226, 57029, -11105, -46511, 4072, 69268, 66938, 18105, -8033, 14917, 55244, 59930, 21019, -8668, 2782, 22006, 25307, 30953, 39762, 31263, 15459, 16655, 36250, 52192, 37435, -8513, -31855, 10654, 62738, 46910, -14000, -32123, 20283, 81998, 73124, -7728, -59369, -10888, 65805, 59481, -15976, -57024, -15398, 56951, 74455, 16881, -35655, -13810, 39953, 45310, 3627, -28452, -24731, 2880, 26016, 22976, 7367, 2630, 2928, 2150, 15156, 29106, 7038, -36528, -43274, -1990, 39226, 29549, -25058, -53727, -3652, 65918, 51075, -35003, -80331, -32983, 39976, 46159, -25076, -81348, -39772, 48626, 64290, -4985, -59813, -38399, 19512, 38388, -4284, -55374, -48008, 2144, 28533]
792B8533j2758j7341p685n10J2219J4070k401j8316k1097m722K9984M0146p213
805C2909m8912j5090M7424M8695j6209p0299m4673M3156Q2668Q654p6711n3066
817f1454M0230P6216K0090n4799n9869J0406N8906J5723n0374l9802K0836M7606
829B3715K1361k1341l6881q681K3201J7624l206q854j5882k4030k459L4837L5282
842C4686l904l5401k7123J8876M4920J972n6932l6052L8071N9110K50n7207m1840
855f0574L5198P9404K0069o9952o6260J7121O1657K3608l4428m3533M964M7406
867A4680K4406k6733k8942P220J8708K556j1292j3086o870L723P948Q960J6080
880A7358M331k6897k3615J8775L4503k742m0906l2693J8626N4448K0790m7480
$$ y = [28533, 15775, -1566, -9251, -9761, 2458, 16528, 14127, -4189, -25286, -30008, -24, 40122, 32909, -16003, -31093, 16331, 65026, 48817, -21482, -66155, -22999, 59669, 68323, -8388, -61454, -21224, 54992, 75082, 20283, -39586, -29180, 29726, 45449, -4925, -44727, -23891, 23715, 45076, 23735, -13146, -21827, 1374, 18998, 15792, 6938, -8944, -32974, -35433, -596, 34686, 30782, -4619, -31742, -12866, 32054, 34026, -22906, -58958, -20887, 38223, 38473, -18734, -60574, -25376, 54028, 74097, 4145, -62115, -44994, 16663, 40271, 5843, -37690, -32726, 14680, 39086, 12353, -16589, -9369, 9339, 11895, 603, -12483, -19353, -15630, -7682, 1278, 17358, 21689, -5208, -28823, -10048, 24455, 21713, -19193, -51886, -33260, 21188, 41978, -5502]
892e502m6998K5460O2772J4013m8819n1128N699N1499K4667l8004l8539K3153
904b1727M9828Q701l4267l0177O566L1749J3266k3999k3219O900J1215k010N759
917a415K1206R999j6807k8371j0920K2534K5803j3168l3929K505L4576J0387k7929
930e529k2319J9181M4889J2409n1280n7242R856N7751K6490k5451l1166J906K5730
943E225J1077k1681j6291K2328K4744k0279m0736p886K8444L0057M516j7006q458
956e946J1889L08k3208p721K8118K2733j7241l5716j1722K9283M0245K175l3827
969f30j3427K2774R618k3130k1864R514L0098J3724k2887k8854J2681L9170N686
982C2473l1198j8290J3197J5942p466k4847o989K9517K7359j7217l1059O911L1823
$$ y = [-5502, -52500, -27040, 35732, 49745, 926, -50202, -44503, 6996, 31663, -6341, -44880, -21727, 28101, 36802, 2535, -27642, -21076, 10673, 23939, -60, -23279, -16379, -5164, -7174, -1415, 19791, 29790, 12983, -15388, -26308, -3774, 22029, 8861, -25068, -22563, 12013, 22400, -5529, -27848, -8667, 36222, 48631, -2649, -59891, -50035, 7716, 34206, 8755, -22411, -20505, 5225, 16302, -5379, -21670, 658, 25402, 5123, -35613, -43499, -15055, 15002, 19518, 2512, -5946, 5943, 6251, -16957, -24678, 3440, 26173, 8932, -26784, -38506, -9223, 31022, 33197, -630, -14057, 8717, 18335, -4795, -26659, -17145, 12953, 26677, 3790, -25064, -12383, 26787, 32473, 1275, -17015, -3818, 12124, 4658, -20189, -27178, 2339, 29698, 12481, -18578, -11667, 20156]
995B0156O007k9717l0157N627L7266J8268k9424l1172J5189L5189O639j9817j3456
1008i402P340J2413j0069k8046k779L3472K3674j3195j9550M45R884J488o881
1021a206j354J4880J0428k7060m0065P871N4143L5041j9875m4050j6021K6412
1033h56K6547j7546l3557R661L9622N022l9289l2354J8503N4205L0532l1914n5514
1046b6938j3365K6876J9951l00k963K16l39n963r241N151K3097Q863k1846j7528
1060a4329P396O755j3091j0001J7940L7229J4962l7028n1596N754O0508L1167
1072E5666l7728n4684o157M5457L8560j7741m5194M31M7971K2813l3981m2877
1084b7464k589L2585K5684j2193k9751l127K3984J2373o001m861k987r190m949
$$ y = [20156, 26163, -3554, -33711, -28084, 9182, 27450, -1974, -33146, -17957, 17232, 23871, 4054, -9402, -2062, 10351, 282, -27764, -30543, 2929, 26603, 13408, -6142, -5697, 4187, 5675, -1206, -2560, 12320, 22748, -4312, -44377, -36506, 17637, 52678, 32803, -11247, -27268, -856, 25691, 8145, -25412, -15751, 23871, 28893, -10396, -42750, -24247, 29958, 60490, 28576, -26938, -40303, -13427, 6524, 6224, 3261, 3477, 3138, -2825, -12066, -6915, 16182, 25045, 3199, -14329, -6933, -178, -13269, -23270, -5330, 31899, 46861, 9833, -41763, -36009, 24499, 55666, 17938, -36746, -42903, 2554, 41114, 23373, -21821, -21390, 26581, 49394, 15413, -27464, -30053, 2532, 28216, 16023, -13728, -16855, 7129, 19502, 13501, 8640, 5653, -3537, -8486]
1097h486O070J0685J399j7944k3077J1954M7713K2008l6552m9286j483M1491L0179
1110C4671k2341m8750l451M9871K9424l4451m5371R735N4405L2333l2810o6474
1122d3209k1313M5447M8875n6k9685j9028K312J4694R621k380j639J568q366j4090
1136a7249O98P676k619P4K0489K2544p347l9136l7529J4206O1255L2046m4089
1149A1019o6177o473N3571M7267q984m6697j7482L5962K8359l0293m7506J629
1161d5805M7011L5732j5828m8413k1051L2210M1563L485k3567j9691r642J598
1173b2398J3651J3476J872o906r716J109K0144J3600k1033l0338O119L5112J4983
1186B9675k6525l9262J16N1215M0611k6468n6533p134M5813L4139k1514n2471
$$ y = [-8486, -2416, 8269, 9668, -8276, -31353, -19399, 28314, 50322, 13770, -35516, -36999, 4492, 34671, 12330, -36420, -39871, 10000, 39424, 4973, -40398, -30663, 23742, 56075, 23265, -43209, -64522, -19075, 29800, 29744, 59, -18969, -16657, -1963, 7658, 5278, 3639, 5207, -3159, -17249, -16551, -8875, -11494, -11420, 9069, 31613, 24266, -14870, -52399, -38193, 23062, 55108, 11019, -55158, -61631, -8060, 39207, 30223, -16474, -33956, 2006, 30365, 72, -47434, -45805, 1206, 36938, 21110, -27303, -48354, -16144, 25419, 28904, 5337, -14354, -23996, -22398, -8747, 4729, 6601, -305, -10021, -8912, 11232, 24832, 3799, -26539, -20420, 14692, 29675, 3150, -36112, -35996, 15219, 55830, 29362, -27171, -34305, 11508, 45647, 24133, -28338]
1198b8338j8583M1458M8613o199m3250j8055K1738K5695L030j9193j7268M407
1210e945J1228l677p282O638Q186J26M700P188o797k0771j5329R278L3604K2136
1224D3283k7854n0289l934N0433M2383j0939m4651k3909K2398L2177j1987l8060
1236b0949j524M2112K7079k1313m1594j2845L3745M1933l193m0266k4915O913
1248a4817J4396R306P404K771l179q160r221K26J4639L902j6090r106J2107R091
1262A3269j3115j7250M478L0979K6420j7420m8857j8107L4390L5270q171l5320
1274a3434j6632K1046L2340j178l0907j0416K5082J8212j5290k6247q238J5144
1286a0518K0209l88j6532j563J3299L212r832k413N048j683q965p232N097J6999
$$ y = [-28338, -46921, -5463, 43150, 36951, -6299, -24354, -2616, 23079, 26109, 6916, -10352, -5945, 5283, 1606, -5676, 962, 9148, 9274, 13974, 21162, 14365, -6406, -21735, -12457, 21147, 43283, 15429, -34860, -38794, 11639, 54022, 43083, -1568, -25477, -3079, 29098, 17111, -20949, -22473, 19639, 46718, 25405, -16189, -29034, 4711, 46644, 43451, 3185, -21730, -14817, -421, 8885, 16289, 19060, 15881, 7721, -1500, -1274, 13365, 17267, 1177, -7929, 4178, 13269, 154, -17096, -12618, 18361, 44781, 27361, -21496, -39603, -5213, 30057, 21886, -13434, -30066, -9020, 23320, 22142, -8765, -19181, 5901, 24113, 8823, -17424, -25662, -10518, 9691, 9303, -7229, -8792, 4507, 7719, -2113, -4526, 522, -1161, -10126, -17358, -12261, 4738]
1300D738M916j9887j4007J9384K6558m701k8842j8832R597K3781M421k3527j1601
1313b8002K3014K2385j1392k6312m724K0412K0775q075l1441j3856K0370J9952
1325C106m358p483O376Q374m966j5709r632J4008K2560m613k6888q873J8203J6259
1339F364j620p690K99J1319L817k1201k1571J2284L0626O059k0236j6243O140
1352a1653J9371R131j1373j1432R752Q401j6237j9059Q007K4257J1248j1437j8662
1365i686Q92K1777O937k1727j5007J4836J7241p973k2320p790K0645K8934j175
1378B5584l0447j4559J9203J7322r206j9218n496J3590J4916m139j6090K525J7796
1391A1781K287j3702n718N645K486o245q630K319J7137R102j5963j4972J4092
$$ y = [4738, 9654, -10233, -24240, -4856, 21702, 17001, -11841, -30673, -21076, 2705, 7126, -16401, -28002, -4988, 17397, 6005, -20307, -25031, -4619, 16156, 8081, -23360, -37216, -16846, 3106, -1252, -8735, -2359, 6015, 1049, -14660, -24292, -10284, 12276, 7663, -19225, -28098, -9895, 6364, 4744, -2946, -2647, 8672, 12489, -8712, -30283, -17999, 12627, 18686, -1550, -17793, -11653, 7718, 16849, 5476, -5956, 3796, 12197, -4040, -23099, -15092, 9165, 20413, 8976, -9686, -8794, 12983, 19920, -1807, -16814, -1978, 15263, 7290, -15030, -22820, -2175, 26759, 25584, -4863, -19422, -219, 17103, 7897, -11321, -16817, -3227, 11689, 7550, -8540, -6015, 11781, 14068, 366, -5352, 293, 2779, -3466, -12096, -9777, 7360, 16462, 499, -14473, -381]
1404c81K2376n724k6497j5599J4609K8798K733l2144k0017K4684L4962j038k9755
1417b993j9256J0717K4835J804k6338j6144J8718K4247j252j6724q540O723J1768
1430G565L155r856q094J319l016l974J0579J6868j497j6621q871J0439J8983J575
1444A8554k5826k0660J8218L1369k237l1020j4467K2678L4797M735l6735l1650
1456c2244J6026L7421M759k8130k0911R322K6928J3102j6058j9674N162J5693
1468A1396N29j0830n915k157R52O072O882L916j725j0784r508J2269K0959o181
1482A5875l0765j4893J9491L0324M622k9726k5327J9344M1466L812m0308k9079
1494c5164J5070L5554J1808k8463l1508J1282L8993J2944k3227k2904J744J6793
$$ y = [-381, 21995, 16271, -10226, -25825, -11216, 17582, 20315, -11829, -31846, -7162, 27800, 26762, -2993, -22249, -11532, 13303, 15107, -11231, -27375, -8657, 15590, 14338, -2386, -10926, -4203, 7565, 10720, 864, -7230, -5911, -8927, -12901, -2322, 14546, 13049, -3572, -12443, -2004, 16979, 18554, -7272, -27932, -9714, 21655, 19418, -11602, -26069, -3391, 31406, 36141, -594, -32244, -16218, 21203, 25962, -2168, -23079, -13757, 13171, 26273, 10215, -9459, -4297, 11396, 11925, 1095, -4820, -6977, -6025, 47, 6929, 10845, 9120, -1664, -11172, 1097, 22056, 15875, -14890, -29783, -10292, 20032, 24654, -5072, -30399, -11055, 30411, 34223, -6085, -35164, -20094, 15460, 27268, -1195, -32703, -21421, 17572, 30516, 7289, -15615, -13871, 2922]
1506B922J0081q356j6863j988J0971N902K276M426l074j2161l098J3152J1200
1519A5390o545k2636j4698J7718L5035L360l4685k2355K0983L5310M794l3384
1531a713l2823J1252M0953J1913l2659k7286J4996L4714J2747k1977k9712m53
1543b0048K6495J2401j5183j5825O97Q584Q327N346k170m735l702m211K795J1219
1557I990L5k0050j1448J8005K4895Q48k3959k0239J2787L4966P120l6366l1221
1570c4637J4834L6896J1131k3993k8983P291L5795J5921k6323k9754M360K3376
1582E914J0072j1616j7932j964J6945J1364n412o397P52k899m173M073N768l813
1596F82r661o018Q421K1081P057k1898k2124J1723K8240M964k5515k4895N440
$$ y = [2922, 13003, 4647, -12216, -14204, -3233, 2669, 4945, 9371, 6297, -5864, -8962, 4190, 15390, 8845, -13791, -28489, -10771, 24264, 27624, -7061, -29416, -8433, 26877, 31671, -1713, -34536, -23284, 17669, 29582, -3077, -30363, -15367, 19347, 32094, 10117, -19595, -20048, 6447, 18848, 3665, -12160, -11463, -2879, 5448, 10794, 8624, 3889, 187, -4024, -1229, 9990, 10025, -10025, -21473, -3468, 21427, 22275, -1684, -21923, -9136, 25830, 32950, -3416, -34637, -19803, 17093, 28224, 4231, -24752, -17461, 18334, 34255, 7932, -21822, -17462, 5914, 15986, 4370, -13562, -15526, 1419, 12783, 7371, 974, 1726, -1173, -5346, -1273, 4495, 682, -8979, -14997, -6576, 14505, 21562, -336, -22460, -10737, 17503, 22467, -3048, -27943, -22503]
1609b2503L2569J6200k3075k7032J0988L1117Q672k2792k5411R98K5118J4731
1621A9580j5465k0633M488J7112O316m546n283j140Q51k157o335J409R106j547
1635A756r845K879J4694L665j2929j2591L217J8862R088k0362k7099O322L1267
1648H924J3746j6731k0669O85K0793J2210j7023k3271N199K2794M110j6641j1846
1661a7720P139J7418Q107j1826j2850L753Q010o442p018N222Q381j158p609l772
1675a0365Q193J4085k783j9100o590J4992R790j0854j4791Q46J7542J4290r134
1688F121k0243K02K0612O677j6176j4793L262J4449P284r605j1507P276J7078
1701A0637p52j4354m271Q616M340o197j0096n39J5823J0341j0711j3353O857J5152
$$ y = [-22503, 10066, 26266, 3191, -23841, -12853, 18264, 26936, 4144, -21267, -20269, 4849, 19580, 4115, -16518, -12030, 5082, 11398, 6852, 1569, 429, 1280, -877, -7212, -5803, 3303, 1756, -8089, -5210, 9484, 13149, 220, -12371, -9154, 9708, 18796, -1566, -28665, -22343, 8924, 22670, 5939, -14730, -14045, 6748, 18958, 1935, -21336, -16137, 6657, 10767, -5874, -17720, -10581, 6837, 14944, 3118, -9732, -5979, 2031, -4411, -11429, -6207, 2174, 1016, -6593, -10365, -2172, 11913, 9130, -9970, -16560, -1568, 8222, -2632, -17423, -16577, 965, 15255, 6121, -14122, -13920, 6692, 13369, -2807, -17600, -14338, 111, 7395, -2210, -13717, -6441, 10637, 9885, -4469, -8740, -124, 4216, -1981, -12077, -12616, 3207, 13548, 2837, -10516, -3659, 11493]
1715A1493K10j2501q846M129J2734R99j5161o260J6924J5416n075j4327m817O706
1729A624Q382k676j1620q58J1942K929j0727l574J1942J0626l745j3238q682Q096
1743D21J2438n714j6246K236J8605P172j1760j5066K322J8008J1217j4925k3646
1756a4938R43J9835Q608r318r762K567J1729N714j0954j1735N175J0037k702q933
1770c734j165M473K561m68p7M122O430o149j6338k119J6466R414j1714j5941P0
1785a4169J8020J5808r629k3354j525K2995J0747j7309k2280l80K0785J7796q694
1798H811k2313k817J9709J1753r904j3940m049O310P608j839p007J235N954q48
1812a337j559N881L175r189r797J144J0585Q175p737j7186M1K4121J4210j5605
$$ y = [11493, 11703, -798, -9644, -5515, 7219, 8218, -6943, -13203, 3721, 19137, 14062, -265, -5082, 1624, 10006, 7330, -4290, -5148, 6794, 9723, -1004, -4578, 7364, 17990, 14245, 1007, -7675, 421, 12859, 7145, -9101, -6865, 11740, 18912, 7152, -7914, -5592, 12416, 23633, 8708, -14938, -13995, 5840, 14448, 5130, -4632, -2065, 9664, 15378, 4424, -7311, -2136, 7901, 5199, -3734, -4899, -426, 2135, 1667, 1590, 5712, 12142, 5993, -10345, -12464, 4002, 13416, 1702, -14239, -14169, 3851, 19659, 10030, -13324, -14849, 8146, 18893, 1584, -20696, -21076, -291, 17505, 8811, -13502, -16319, 3390, 15143, 5239, -8701, -12750, -6440, 1168, -671, -7678, -6443, -489, -1337, -2896, 2985, 6160, -3029, -12826, -11682, -1097, 7078, -659, -17845, -17804, 6317, 20527, 4922]
1826D922k3403m83K0725J5892j2037k8114n977K6665K1644j0019k2226n005J5097
1839b319J5532l737j9849q968J2066J1554l306o644j511K501M481M813k60l904
1853D49o230p616J369J4383Q810j3049j6255M157K0410J3085j0474k4391o217
1866b1569K2848J9005j5405k7411j051K5183K2113p409k7551j1353K0656K3373
1878B1429o446k2891r874J0041J4265M392q867p434N788Q316r87l328j458m334
1892a388l755N145R063J172p824j0344J452J9619J5412j3862k6922m106K1177
1905D839J7798o904k3777r293K1455K4477p309k7536p273J9249J8849m912k4322
1918d659j4397J3859K3566J863j5216p982M425O647L198k764n704k355m50n51
$$ y = [4922, -18481, -18964, 1761, 17653, 5616, -22498, -28475, -1810, 19834, 9815, -12411, -17416, -2319, 13213, 9476, -10373, -19341, -7275, 4279, 973, -5671, -7182, -4681, -200, 4613, 4353, 449, -5781, -13397, -12028, 2355, 11165, -1884, -18139, -13982, 6428, 19513, 9039, -15352, -21569, 1279, 20284, 4879, -22532, -23583, 1600, 23713, 16304, -11247, -22600, -1944, 21429, 14983, -7908, -17782, -7741, 6524, 10916, 2049, -5385, 403, 8719, 7732, 4404, 2946, -1388, -5143, 2, 9065, 10237, 2413, -7931, -6479, 13140, 28552, 14690, -12232, -16338, 4839, 22637, 15733, -8044, -17337, 4118, 28595, 21286, -6250, -13523, 5726, 24575, 19663, -4659, -19056, -5197, 18369, 20232, 5016, -2966, 1459, 8106, 11304, 8540, 2836, 481, 31, -520]
1932e20L691P184l238j0634J417J3976P207j0375j9250n089J7293K0236q147k7493
1946a3742o574K2924K1451n462k4327j3628J4838K2607m128k4938r907J5078J6898
1959A1090P30j2522r524N523J1907r72j0608l758L453M66p72M024K355k783m253
1974e644q08P391R849n554j9936p752J6682J7285l511j7552r053J2544J9736p92
1988A2885k1923j0314J5559J6128o447j9434q466J3287K1894K526j8076j1206
2000a3587P627R570j000m994k002J079J469k865k644O495Q538k905p771R82N334
2015C326k959q635l244Q633J3507K37j8584j1372J4344K0787K24j7587j3303M292
2029a0334J4529L029j3678p063J3387J3340n383j4230l778Q782J0236j353j3072
$$ y = [-520, 3171, 10355, 7117, -3517, -2100, 11876, 19083, 8708, -10542, -15631, 1662, 21898, 13751, -13742, -20316, 2608, 24059, 18597, -5730, -19358, -4520, 18087, 13959, -10979, -20886, -5808, 11090, 11820, -702, -10226, -4703, 7204, 6232, -4376, -8134, -4681, -4215, -4987, -963, 1392, -1391, -5644, -6452, 939, 10788, 5234, -14702, -22454, -5772, 11513, 8002, -9550, -18603, -6059, 13677, 12885, -9038, -19352, -3793, 12335, 5888, -13546, -22012, -8725, 13169, 15695, -2381, -13587, -5960, 3610, 2610, -2384, -4386, -3307, -1838, -4703, -7347, -852, 7686, 4781, -2990, -2008, 3326, 367, -8268, -11512, -2879, 10628, 10865, -7719, -19091, -4747, 16040, 16264, -1323, -14626, -10334, 4195, 7224, -6454, -13517, -130, 13210, 7827, -6403, -10181, -1399, 8837, 7484, -5588]
2042e588n635P642N129l848j116O550M421m252q016l367P126Q263n896j3007J869
2057i725J3293M669q389p819L779J1236L940j2637j2717O051J3683J02j1343m221
2071a0098P755J0938P17j1409p601P842Q908o379q524K308Q072J503o656n466
2085h090O905J3749O16j6868j0138R043J0920j853q591k092P880Q012m765j2929
2099h201J215J5259O100j0919j3359k046R036R027j306n594K248N869n256r465
2113g392K451J1031L797q054j1114j679J0997P829o098o873P364R606o059j4988
2127i182o518J0407J6677K097j8905j2983J0640J6936J637j0259o709K929O657
2140C424j644j0598l106J1311P929m497o276k7K553J578k73j016J509O18p183
$$ y = [-5588, -11223, -3581, 1548, -2300, -3416, 3134, 7555, 3303, -4713, -8080, -954, 7309, 1413, -11594, -9725, 3568, 8237, -152, -7971, -4192, 7044, 10984, -1653, -14370, -8319, 5364, 5466, -5877, -10098, -2343, 8595, 9312, -2097, -9698, -1856, 7052, 673, -7851, -5543, 2529, 4032, -2624, -8090, -1185, 12564, 13180, -3688, -13826, -4783, 6137, 4284, -4307, -6399, 1481, 9493, 4728, -8201, -6986, 8273, 14373, 3454, -9905, -11951, -2915, 6112, 4806, -788, 1460, 7329, 2073, -7392, -4941, 6090, 9887, 1833, -9281, -10960, 37, 7866, 1768, -5105, 2259, 11865, 5806, -9182, -15700, -5293, 11384, 13481, -5424, -18407, -7767, 9169, 10806, 547, -6162, -3233, 3424, 1780, -8818, -11924, -613, 7316, 2819, -3457, -3484, -931, 647, 374, -642, 867, 1485, -5698]
2155e698p249P451J4205M99j1429p809O458J2848K526j5699j4049R842J9154M56
2169A1506j5994r453Q980J6256M008j4439j2908O845J4110j20j2392o917M942
2182e576J0555N946m417p402j18J896j583J790N833r98r137m922N719R576N210
2197A2372p552r878N387J2120k515j7188p355J2301J8595K310j8448j8342Q271
2210i922K4694Q558j6022j6666k98J1863O845o561r343M294J2477J416r697o369
2224d731J745N376M655j23n572n615k596O18Q374J1782n11j5146r946P082J3328
2239H720L076j1940j3648M879J8863M869j7253j2310J0027J8624N089j7083j9098
2252a7185K498K0624J0004j2447j3656J774J1695Q365l720j0526l351O722L585
$$ y = [-5698, -12947, -5496, 8709, 9208, -2221, -10030, -3572, 9276, 11802, -3897, -17946, -8104, 11050, 11506, -4488, -13941, -4961, 11295, 15303, 864, -12044, -5199, 8911, 8791, -3601, -10518, -5576, 4979, 10925, 6508, -894, -1012, 884, -699, 1091, 6924, 5926, -3211, -8133, -2414, 7162, 12372, 4820, -5058, 329, 12449, 9934, -7254, -14609, -2308, 16287, 18597, 149, -18193, -9922, 14772, 23330, 7308, -9358, -9656, 2207, 9052, 2491, -6852, -2558, 9919, 11335, 1638, -4731, -2986, 2390, 7045, 6922, 1350, -4265, -6861, -6243, 2131, 13913, 13402, -1744, -11690, -4608, 8720, 11796, -144, -13792, -8913, 9950, 14819, -2434, -14744, -4717, 13907, 18996, 1913, -17185, -14687, 5937, 15941, 3494, -10162, -8388, 3307, 11672, 7952, -2574, -5925, 797, 4382]
2265D382k862j918k94k587j62O480N839j269p050o682K692J1589K023j4038j0150
2280a4007R280J6838L092j4046j4909M516K0876R363j6784j9290J563J6051R500
2293A2043n983j2528j173J2435P634r085j0754J327P825L971k464o544m490K782
2307e004N494L394K994k92r840q496M882J1203K863q072j0125Q13J2618Q060j0256
2322B36j3250N197J5419L474j3643j6326J161J8743J3429j0249j7519m85J3292
2335e21Q181m563r649m060N948N608l977n875K816M896M33r1J72j437k203k173
2351f495P2M775M358n804r920L071J3724N582q201j1432n72J1786R493r403j5793
2366a4759M06J5472R029o770j0753j447J0419Q202o519j2647P11J0460L275n677
$$ y = [4382, 1520, -398, -692, -3279, -3441, 3039, 8878, 7609, 559, -6123, -3431, 8158, 10181, -3857, -14007, -4727, 12111, 15203, 1157, -13752, -9236, 11640, 21003, 4219, -15071, -13508, 2543, 12043, 6060, -6468, -7641, 4794, 12428, 3343, -7411, -6084, 1741, 5712, 3248, -3296, -7786, -5004, 490, 3884, 6878, 6586, -3254, -11750, -6868, 4335, 7198, -874, -10999, -10186, 2432, 10492, 236, -13014, -7817, 7602, 11076, -2567, -18893, -17732, 1011, 14440, 4191, -13328, -13813, -521, 7660, 3097, -6552, -10612, -4664, 944, -3033, -8908, -6092, -1196, -763, -854, -682, -2119, -4322, -6495, -6423, -1648, 2710, -3094, -13014, -9943, 3781, 9363, 1162, -10270, -10842, 944, 10437, 1034, -14759, -14353, 1119, 10148, 3378, -7375, -8822, 1597, 9799, 3280, -9367, -8656, 1804, 5079, -598]
2380e98m806J260N553L856k315l103K105M44o343k507P026O103l112o995k514
2395e946O718R502j967j1815l599R951O265p042r960l6J1241R679m862j3487j882
2410g240J1852O264o495q165k63N146L827l481n026M059P750j339p613j141N049
2425C184J646l231n184P12P150L677p383o040O823Q835j798r053n011M184Q198
2440F709K12r954m641R370Q696l598p713j507M972M288l235p255k23P956K414
2455F491o915l534N848N726j181o007m576M540O297m181r736J386J0873M107o650
2470B488p684P42R163N543p446j1221J817R883J537o227l200K884O042J448o046
2485b77n193M115M809l798n014J578M077K95l173k110M095O412k220j0519k735
$$ y = [-598, -5404, -4144, 1409, 5265, 2950, -153, 1952, 2396, -3947, -6454, 572, 6675, 3563, -3432, -5946, 772, 10274, 8307, -3508, -7107, 2844, 9109, 2067, -7893, -7929, 3312, 12991, 8129, -5358, -7240, 4612, 10876, 4381, -3784, -4047, 1099, 4926, 1445, -3581, 478, 8228, 6889, -724, -1865, 3184, 4830, 1599, -3585, -2873, 4277, 7954, 571, -5469, 1354, 10189, 8391, -662, -5673, -1489, 6709, 6921, -3033, -7674, 1696, 10392, 6794, -919, -2426, 2546, 6834, 3599, -3656, -3879, 4077, 6491, -424, -3958, 1890, 7616, 6435, 428, -4148, 392, 6689, 2508, -7228, -5842, 5031, 9138, 2488, -5196, -4454, 4709, 10252, 2806, -8415, -6598, 3285, 4822, -1405, -4605, -1721, 4321, 5769, -277, -5470, -1355, 3454, -344, -5358, -3780, 297, 592, -2581, -4691, -596, 5816, 3596, -6923, -9658]
2500i658R022N861n987r192l78R703R192m493j3586j684J1821O995p399j0275
2514a0058j051P752P318l531q909P97R629K799n911m660K12J778J586j83j161
2529c593K454J049n121j673P790O300m586r645k555O275Q537k421j0444k246J2669
2544B790Q746p795j2351j050J1115J0543m811j5433n122J1711J1088l045p434
2557a048k022M396M267j055o048j467N043J522k987m08K747j175j710K024L843
2572E922K082l166r461k959J0751R429o341j2332q25J1206J0241m205j4351n932
2586i941J1966J2277o244j3980l599R549J0686m90j0682n884P513Q499l422q602
2600b354k236L195M108J819j602l075K6N1m25M746M401n449j0307j356Q496P218
$$ y = [-9658, -636, 5225, -762, -9954, -10332, -629, 8563, 4070, -9516, -11200, 621, 7616, 217, -10058, -11109, -3357, 3961, 430, -8479, -7682, 1947, 4746, -1165, -5825, -5613, -3835, -2249, -2432, -3593, -1139, -90, -5211, -6884, 906, 7206, 2620, -7025, -9580, -3305, 5232, 2811, -7633, -9879, 2790, 11536, 3741, -8610, -9660, 1455, 11998, 7187, -8246, -13368, -1657, 9431, 6386, -1048, -3070, 1326, 5593, 4538, -1510, -2977, 2066, 3588, 601, 193, 2940, 1765, 55, 2079, 5922, 8004, 4838, -4623, -7582, 3169, 12598, 6257, -6075, -6900, 4306, 14547, 10342, -4009, -9941, 2025, 14302, 8058, -5922, -9521, 28, 10714, 10224, -458, -6342, 1171, 9670, 6248, -2354, -4590, -1395, 2713, 4532, 2930, -145, -119, -68, -493, 4253, 8654, 3205, -7102, -8458, 38, 7256]
2616G256j453r184m182Q896J0047n724j3788k023J1815J0173m785j5300p581J1440
2630d393J6673o2j3486o961M369O796J271n467m038L220N289j835m413J091K481
2645E35O06J398J066k259m104l803j12P463R252l686j3049l901J0852R941j973
2660H226j1391p265O843J1524j543j3759l710J0804J0934j445j1525q297N461
2673e143J2048Q04j0250n291M272N151J256j942k291M76K204q55j388J656j00
2688F07n565j778O178O107j693o672m087M819R169r00j1480n721R046R551k704
2703D877j0912n287P548J3425J576j3494q655N416Q635M96m355l901J232N724
2717B325n69m665l83N628J836l062k630q09j311M19J501K971M491m13q652n916
$$ y = [7256, 5803, -3381, -7563, 1333, 11380, 5656, -8132, -10155, 1660, 11833, 7048, -8252, -15833, -4393, 12280, 12218, -1268, -8229, -3860, 2936, 4207, -1260, -5298, -2078, 3211, 1376, -3037, -1946, 535, 1141, 2539, 3605, 1346, -2758, -6561, -6673, 790, 10042, 6356, -6693, -10594, 258, 10199, 8226, -3165, -10430, -3587, 7937, 6394, -7365, -11075, -271, 10663, 9218, -2307, -10604, -5143, 6905, 7709, -2541, -7832, -3560, 1591, 2847, 905, -1386, -910, 1294, 439, -949, 707, 607, -4958, -6736, -558, 5549, 3856, -2816, -6903, -2084, 7085, 6185, -5295, -11016, -1970, 7581, 4877, -6035, -11322, -3774, 9651, 11227, -2267, -10922, -5506, 3129, 3625, -730, -4631, -3399, 2325, 1756, -2909, -3292, 2336, 4172, 1110, -1520, -2329, -3640, -3221, -1720, 1251, 5742, 5329, -3323, -9239]
2733i239O899J0105M39q706p003O47Q790M009o809n147P088Q016l128r704n114
2748h857N180J0054K156r088p878M241O642J002j740m15K62R1k690l412J434N592
2764B574L74n399q80M665J733l233k796Q90M819K472o664q340L143R995K582n898
2780C7n939K070O347L129o467p215L144P049Q7n591k050K679L934Q57l917k333
2796d179M228K867n045m588K533M282M22j794k018K088M448j411p064j130P682
2811A321M504n123o970j744N916P674o33o885j239N223R28n036k749L105N198
2826C490J308m809n542K554P312Q92l639k92J410j323l536j972K884P600K904
2841I241q118p169M328Q157R57n030m014J725M330m27o867j987Q324P349l463
$$ y = [-9239, -2340, 7765, 8204, -502, -7505, -6858, 1932, 5941, -868, -6015, 1073, 9089, 5961, -3743, -8857, -3677, 6377, 8533, -555, -8433, -4192, 2450, 3452, 1712, 1297, 1559, 1650, -1040, -4452, -3018, 2574, 2948, -2451, -3331, 1334, 3067, -166, -2962, -2072, 2747, 5219, -1445, -9785, -6642, 3353, 5935, 37, -5902, -3832, 2515, 5644, -823, -8038, -4894, 2155, 2242, -3349, -5399, -2720, 1214, 2071, -1846, -4179, 49, 2916, -2129, -6717, -4184, 98, 520, -1274, -3292, -1204, 3244, 1833, -5231, -6361, 1321, 5825, 702, -6268, -8012, -2096, 5578, 4945, -1940, -3179, 2044, 2972, -2064, -4813, -1708, 3490, 4798, -11, -5553, -2999, 4313, 5205, 1566, 1274, 2684, 1361, -2175, -4147, -1263, 6337, 9241, 1123, -6046, -1718, 6439, 7396, 2366, -1648, 77, 4407, 3980, -2887, -4874, 3450, 10799, 7336]
2856G336q191k955L184N915Q49n024l122L520R57l067M84L851K205j752m125k225
2872b160K569L611k763n527K954O824l94o399l304L451P408J971q583q190L925
2887d607R511P34p183m358L478P098K307o662o588L316O099p07m396j663K114
2902a507J702O90j398n75K785J46l454r40L425M87m606j903L190N650K462o317
2918a63p959K977J0925K372q524p271J730P670L777m933o931L178R759O22q356
2933a127n971K412P007L732l645o812l05N206J321o13J116Q85k768k981J56K213
2949a74K553o32m369J27O302J714o795m248M714P836J256q265r989J792J2986
2964D808O128p917q743J208P688L652m270p119K30P862K202o655m127K282M492
$$ y = [7336, -855, -3810, -626, 5289, 6138, 1114, -2008, 1512, 2469, -598, -114, 3737, 5942, 4190, 65, -2160, 409, 4020, 1257, -4270, -1316, 5508, 5114, -1285, -4589, -1138, 6270, 8241, -342, -8532, -4607, 4904, 5638, -1545, -5903, -2425, 4673, 6980, 318, -6270, -2954, 3145, 2438, -1958, -3621, -1507, 195, 885, -513, -1088, 1697, 1843, -1611, -2551, 874, 1361, -3245, -5148, -1958, 3692, 6154, -163, -8122, -5145, 5780, 8152, -372, -7643, -5913, 1757, 5534, 601, -6330, -3152, 6607, 7229, -1127, -7098, -4686, 2321, 6053, 2408, -4404, -4709, 497, 1818, 1205, 2321, 3206, 438, -2543, -2387, -174, 2379, 1747, -2622, -2495, 3807, 5521, -1274, -5522, -808, 7028, 8284, 19, -9970, -8178, 4808, 10936, 3019, -5724, -4516, 3172, 6824, 2554, -4565, -4335, 3527, 5729, -926, -5053, -2771, 1721]
2979A721K612o68l455k129J131m51j41L239J912m503m312K408N499K451l619o340
2995d645l56P983L525p846p700L337R393L890n789q848j70R760N564p173q376
3010g451Q88O701L445k511n347j230N368L996l439k688Q01j28j615P42J734N21
3026b13j051j922q15M094M162m634o211J929P050J748n887o858J56J0091P014
3041H653o448r947k15Q375M649l220p135j381N879M835m601n520K471N952J824
3056D171k921l941j858J970K677k19l6J961j927m276J026N687K929k363n184k984
3072e288L638N511j848o766J386P309L142n170o805n05P409P332m294j0033j725
3087f707P169M639j679l245j308L136K563l256m137K052M162n10k835l16R50O78
$$ y = [1721, 4333, 3665, 210, -1919, -788, -1239, -1380, 1859, 3771, -732, -5044, -2636, 2863, 5314, 1695, -4645, -5001, 2982, 6507, -1339, -9039, -5702, 3691, 7581, 1792, -7056, -7226, 2534, 8098, 925, -7451, -6563, 138, 3583, 1072, -4275, -5505, -137, 3859, 420, -2268, -1467, -1595, -3210, -2468, -734, -213, -1264, -3186, -4001, 93, 4255, -379, -6590, -4661, 2389, 4137, -1750, -8608, -8452, 1639, 8653, 2205, -7742, -7957, 418, 5067, 1847, -5288, -6669, -790, 4045, -556, -6076, -3605, 2347, 4171, 1250, -2691, -4549, -2579, 98, -121, -157, 1804, -123, -4399, -3373, 2314, 5243, 2880, -2304, -5288, -1650, 3861, 2013, -4753, -3367, 3942, 7084, 1914, -4891, -5396, 2013, 9345, 5051, -4982, -6707, 462, 5101, 3422, 177, -1131, 2005, 4568, 1312, -2825, -773, 3389, 2879, 44, -272, 678, 1356]
3103A356O4p44J119L492j120o888k343O469M834k458n492k011M232O340r15p933
3119a998k107O593M005m001n688p53M518N477j453o334p11N509J814l758k755
3134a642P89J999P90j223k156K548K631k650l657K817M177j342l932l027J186
3149b692N264K265m936l931M483M336k167m765j535L478M780j101p059l144N477
3164a247O050j813l438p38O55Q37p69k783J663M229n08n108j357L857K632p94
3180A368j833j260J805J272l908m137L612P013L69n755m150J449N076L045l397
3195E69n030J382L756j590k986M19L511K189l88m171k507L476K950k430j995J518
3211a327J372j498j619J64L040L873j824o436j164N349L084l048m020K58L865
$$ y = [1356, 1420, 676, 1795, 5287, 4167, -2721, -5064, 1405, 6239, 3781, -1711, -3722, 510, 6850, 5935, -1998, -4105, 2488, 6493, 2492, -3196, -3949, 569, 6046, 4593, -1741, -2452, 3057, 4871, 1113, -1642, -853, 1146, 1936, 713, -1443, 1105, 3736, 1086, -2571, 246, 4423, 3081, -851, -3878, -2692, 2572, 4837, -99, -4030, 453, 4789, 2622, -2143, -3678, -200, 4580, 3479, -3580, -6724, -1247, 4803, 2990, -448, -1186, -531, 306, -463, -3246, -1583, 2646, 2138, -2970, -4327, -470, 2162, 1368, -465, -1725, 80, 1352, -2556, -6693, -3081, 3932, 4301, -1454, -5604, -4155, 921, 3966, 569, -4461, -3079, 677, -913, -3899, -3480, 31, 2220, 1832, -2339, -4846, -1370, 1580, -850, -2845, -1327, 45, -1453, -3072, -2908, 132, 4005, 2181, -4255, -5419, -70, 3014, -34, -4054, -3796, 69]
3226F9L478k112n795M57O481J819m635l869M96L305K915k046l801J319M594K3
3242B698l220m71J073o5m10q00O14K551J27l376k186M918L949k761m259j254K636
3259b36L771j351n144l53O226L943m494n853Q0M832M436j106o885k274M325L685
3275C602k000j498J335N65K5j701j765Q97K959j97k872M77J898j276j645R36L242
3292B982J945j617o362k953N585O703j943o379j391L077M297j05n015k491M888
3307A221M434l586n990n84M436M205K32m209l084K146L180j109j543Q44j20j552
3323a079J34Q38J253R42j360k376J427L965k066m723j082M007L442n62m753l342
3339e335M487O275j286o881k076L927M200j53m983m035L569O209l69m151j741
$$ y = [69, 3547, 1435, -4360, -3903, 2578, 4397, -238, -4107, -3611, -306, 2609, 563, -3238, -1919, 2675, 2698, -522, -993, 80, 15, -395, -1195, -581, 1970, 2097, -1279, -3465, 1453, 5402, 2641, -1618, -2872, -236, 3535, 2184, -2960, -3313, 2913, 6856, 2362, -3491, -3411, 1421, 5857, 4751, -2134, -4408, -83, 3602, 1602, 104, 1439, 2004, 2029, 328, -1437, -540, 2419, 2222, -650, -173, 1725, 449, -1196, -260, 2982, 4927, 3310, -3052, -6005, -420, 6283, 4340, -2039, -3430, -353, 3944, 3839, -1176, -3667, 1221, 5655, 2069, -3921, -4505, -69, 4136, 4368, 159, -2925, -779, 2401, 1292, -251, 593, 473, -1079, -945, -107, 1146, 2088, 728, -1648, -221, 3744, 1678, -3045, -4127, -120, 3322, 2760, -1993, -5335, -848, 5427, 4141, -2740, -4816, -889, 3311, 3158, -1825, -5860, -2291, 3918, 3549, -602, -2343]
3354b343J573J290L8j181j332J566J136j240j237K133O07j951l66K224J389j896
3370D10l210k288L173O266L08o573l327L715N103M91m180m130J988N354n61n784
3386c245j664M514M263K0l687m294J229M695Q09l331q80J086l90n12O45J743N05
3403A506n88k398r53L070J284l600k315K920L714p35l547l324K269O208J008o557
3419b038m738L674M996L02l250l880J861N034J283n083k645K760K361r67j888
3434b218l70K5K222k66j757P85K458j575k631J150K317k37k016j965M04M813K475
3451C614m463m867K810N008R40l695l790J09N043K704m291l642K807M836k41l679
3467g97k420J155L304J561k819k422K297J720j288m03J584J061o38j891j489J424
$$ y = [-2343, -770, 520, 558, -623, -1955, -389, 747, -493, -1730, 403, 1010, -941, -1307, 917, 2306, 410, -2800, -5088, -1915, 4351, 4659, -1914, -5241, -1526, 3577, 4068, -112, -4242, -2254, 3100, 2539, -3245, -4909, -395, 3868, 3888, 201, -4093, -2864, 1831, 2640, -691, -1571, -485, -875, -1387, -742, 1001, 1506, 918, -1480, -2433, 637, 1921, -1679, -3994, -1074, 2640, 1905, -1642, -4966, -2697, 3511, 4519, -2038, -6776, -3102, 1894, 2196, -1054, -4934, -3073, 1961, 3244, -1839, -4484, -1724, 637, -330, -2218, -2588, -2563, -341, -607, -2364, -1579, 879, -696, -3327, -2177, 140, -97, -2113, -4078, -3674, 1139, 3614, -849, -5716, -2906, 2102, 3042, -653, -4443, -4334, 709, 3413, -878, -4520, -1713, 3123, 2882, -797, -3217, -2062, 1242, 2803, -16, -2438, -141, 1579, 291, -112, 1472, 2533, 1895, 4, -1485, -61]
3483f1L515j042l809O86L848J520k860k745L29L814L042l951n172J119N495J388
3499E116k673k686K25L132K131l016l234J570K919m90k522Q8J090J289K14j818
3515A335p55K547N87l569j642K710K178j461k008q42K264L216j426m889p33M421
3531A933K363k582l651p90L023L332j150m582J84L830Q40l170j861P83J844R33
3547A279j507k204J420K438r76k080Q68J851q19k195j349J114L481P66l714k385
3563d012L133L609j587l516j205K120L256k89m692j602M338L119k213k556l83
3578b480J693J508k16k699l00K829L85k367k24K194K83q59j009k16K197R35k281
3595f27l337K324M368n65k867j840J949K900N20l433l548L325M273j070l945j578
$$ y = [-61, 3454, 2412, -1397, -711, 3137, 4657, 1797, -948, -619, 3195, 6237, 2286, -2886, -1767, 3728, 5116, 2443, -243, -18, 3114, 5245, 2229, -1005, 565, 3484, 2994, 472, 560, 1650, 2939, 3153, 1335, 580, 3127, 3714, 145, -1497, 1213, 3391, 1930, -78, -920, 1344, 4560, 3134, -1755, -2488, 1933, 4296, 1714, -1937, -2727, 296, 3628, 2478, -2104, -1920, 1910, 2750, -420, -2281, -1498, 346, 1279, -228, -2432, -1012, 1426, 450, -1630, -762, 1089, 270, -1925, -3274, -2160, 1321, 2087, -1627, -4012, -879, 2730, 1143, -2373, -3578, -1458, 1798, 1509, -3183, -4785, -447, 2672, 459, -2097, -2480, -787, 721, 505, -2194, -2494, 335, 720, -1647, -1871, 323, 606, -253, -1262, -1478, 719, 1654, -627, -3964, -1640, 2728, 2163, -704, -2544, -595, 2305, 2825, -608, -4156, -831, 3442, 2372, -1573, -3151]
3611c151K018L432J104l247k166J804K236j590j948J476J131K67o02j236oK413
3627A935Q4k398l09K459J86k803j680J902L149J336k780m232J440M653O26l641
3643g3k453J604K580R65k581l055K081M304m90l282j498N83K065P64j585j925
3659a996J499J593j085q52J129J365j452j624O2J352J242j035l055j23M473J692
3675C185l594k883R57L463R72k468l630O80M845O07l736k239J850L198Q49j910
3691A46l306J37K984N08j927m2J452p1q03m38r3J537Q27j505j948J547J618j780
3709a157j748J766K720J034k277l793l88M964K665l228m017M68L017J293n56k108
3725a345k98L143J298l575k067J438K281P24q80j626o21J538P40j004K26J946
$$ y = [-3151, -1133, 2299, 3403, 156, -2010, -206, 2030, 440, -1508, -32, 1099, 1366, 764, -472, -478, 1935, 2019, -379, -688, 1771, 1957, -846, -2526, -624, 2525, 3861, 1081, -3151, -1711, 2942, 3568, -73, -2526, -922, 1658, 2623, 42, -3013, -932, 3372, 2882, -400, -1898, -1315, 750, 1514, -71, -1996, -497, 1096, 11, -841, 288, 1653, 201, -1423, -1361, -9, 1233, 198, -2857, -2980, 1493, 3185, -409, -3292, -2335, 1128, 2100, -368, -3998, -3318, 1527, 2134, -1602, -3841, -1991, 1207, 2056, 146, -3160, -3023, -39, 469, -1458, -1500, -48, -119, -922, -1360, -1453, 84, 911, -594, -2542, -995, 623, -1157, -2905, -1139, 1581, 2615, 338, -3455, -3843, 1121, 3786, 558, -3459, -2991, 26, 1319, 763, -1345, -1643, 1500, 2798, -777, -2844, -1406, 875, 1599, 719, -907, -1528, 10, 750, -254, -28, 1918]
3741A918r46l027K77J622J521mj705j704K095K700j763l392P29L003J292k004
3757F12l080q66L255L553j898l707J88K965O44j294j502p76J876J862j471j753
3773a392J319J061o39n18L52K33K66r65j520P98K565K46k958o9K276J469j307
3790A217k307j280K648L590j102m774j087L302K627l44j688j338J187J658j010
3805A299k765O30K596P97j539j091l82J087J427k99q83P41Q7k463j149K715K218
3822C026k49j600k709L56L289J094k942j753K365J849j536k317j120K164L807
3837C724r5m546j818J721K605O0j419q78qJ415n16j568O12K308k77k147j13M40
3855e00L06j82n81l4J925R47k743k204J724K957k92k274k094P52K931J137k952
$$ y = [1918, 972, -2055, -1778, -156, 1365, 1361, -344, -2048, 47, 2747, 984, -2408, -1679, 1324, 2616, 612, -2468, -3334, -79, 3474, 1576, -2131, -1943, 1022, 1666, 372, -1130, -1906, -30, 1832, 361, -1392, -73, 988, 349, -169, 183, 416, 682, -283, -1803, -1005, 1560, 1806, -1152, -1221, 1055, 2524, 1217, -1090, -2370, 278, 3868, 2766, -2008, -3095, 207, 2834, 2490, 802, -536, 651, 2309, 1299, -1466, -836, 1760, 2557, 1018, -73, -455, 632, 2059, 1760, 877, 1618, 1705, -758, -1907, 808, 3026, 2777, 1177, -1532, -1176, 2113, 3207, 265, -1488, 877, 2726, 1190, -1127, -2247, -83, 3724, 3629, -917, -2735, -1014, 1591, 1651, 232, -646, -654, 761, 245, -1323, -711, 1597, 1320, -827, -940, -500, -194, -376, -957, -991, 934, 1881, -862, -3066, -1342, 1615, 1323, -951, -3045, -2293, 638, 1775, -1177]
3872a177k586K439K865q05k046j010O6K381Q75k212j692K312J520j284j170N28
3888i96M69P89l65j386K97J409o18k165J327K525L81k079j978k1K406K595k086
3905E04l513R87L220K60k256q51J047K341R77l048l152J430L424O16j934q43j53
3922i44O70R52q18k15J573L11k411j298J328J625l17m53k8M04Q30o92k524K36
3940a771M092N87k773k856K12K866K713q41l758k40K790Q84k034j268J119J410
3956A132J038j742k615P92L054rj124n16L39l23l47P2L36J261J68k161q31K355
3974H79J866j686j465m12J320J945q05l183n16L329K301k564k176L65K029J387
3990B614j163k631j63L020Q88j842j455R66Q52O88m05j193L59Q55j192j299J152
$$ y = [-1177, -3763, -1324, 1541, 736, -1310, -2320, -2254, 127, 1002, -1210, -2902, -590, 930, -354, -1524, -996, -527, 262, -103, -1489, -1192, 217, -401, -2566, -1239, 1286, 1667, -412, -2390, -2411, -5, 2590, 504, -3009, -2022, 1198, 1458, -798, -1649, -602, 1739, 2716, -332, -3484, -2054, 1370, 1986, 52, -791, -944, -274, 678, -140, -355, 1218, 1529, -882, -2180, -852, 773, 456, 3, -25, 379, 1209, 517, -2007, -1771, 2321, 2908, 135, -2721, -2509, 357, 3070, 2229, -1529, -1769, 1021, 1905, -129, -1397, -278, 1132, 2170, 428, -2187, -1395, 1659, 1650, 526, 10, 349, 26, -321, -249, 87, 1348, 1516, -645, -1476, 879, 2745, 1059, -406, -818, 502, 2447, 1642, -1541, -2057, 1272, 3573, 1009, -1167, -802, 1227, 2614, 1451, -1180, -1343, 1677, 2565, 723, -732, 234, 1086, 1774, 1369, 176, 535, 1390, 198, -1101, 51]
4007E1K046n9j762o31J053Q09K81j567j461K184J884k179k625L40K701K015k89
4024B791l061j868K284K362j515j743N86J403k88m71j686K25K552J207k286j396
4040i04O07Q5k40M13N45N74J23j359k057J299K851j63k280j339O57J176M74j632
4058a170o13J747K086j726l003j89K488J398m64k154j725J654J790m73j494P77
4074a071R22p64p44r24O36J407K31j789p39K079L61j383q31J004J162k48j129
4091a820j830O31L154k65j817j019R80J648k18r78j555P49K406j79k027k66J510
4108h96N71m73m37j51P71J254j335j861J352J646n63r28M68O00N30k79j401k77
4126a409K544J654k458k431Q54J988J121n20j552k57K085K17k079p71J773J582
$$ y = [51, 2097, 2038, 276, -355, 698, 1507, 1788, 221, -1240, 944, 2828, 649, -1976, -1636, 1065, 3080, 2791, -270, -2138, 146, 2508, 993, -750, -164, 1239, 951, 480, -1206, -981, 1571, 2778, 492, -904, -297, -212, -452, -39, 506, 1080, 1203, -156, -2213, -914, 1937, 1774, -506, -1845, -1188, -12, 462, -1170, -1783, -36, 2050, 324, -2679, -2868, -380, 1018, 554, -1600, -3325, -1671, 119, -354, -1848, -1071, -149, -913, -1657, -2581, -1945, -538, -307, -2096, -2835, -756, -395, -1778, -2609, -1605, -443, -691, -1820, -3650, -3019, 135, -130, -1947, -2966, -1986, -338, -556, -1534, -3089, -2340, 66, -113, -2140, -2406, -896, -325, -798, -1235, -1386, -615, 639, -696, -2557, -1205, 441, -122, -1050, -582, 18, 548, 269, -1132, -1409, 1135, 2789, 331, -2100, -1246, 742, 1863, 1343, -209, -466, 1619, 1836, -243, -1014, 759, 2341]
4142B341l78j527j141M16J989Q06j322m89J125m16j674K35J611P93N7j633j822
$$ y = [2341, 1963, 436, -705, -289, 1700, 2506, 1184, 695, 1820, 1404, -270, -35, 1576, 2369, 2426, 793, -1029]
$$ [...]
8191I7
##END NTUPLES=NMR FID
##END=
