##TITLE=1H_CA-8741-2
 CDCl3, 8 sc, 
 31.7.2020
##JCAMPDX= 6.0         $$ Bruker NMR JCAMP-DX V2.0
##DATA TYPE= NMR FID
##DATA CLASS= NTUPLES
##ORIGIN= UXNMR, Bruker Analytische Messtechnik GmbH
##OWNER= root
$$ XWIN-NMR		Version 3.5
$$ Fri Jul 31 11:26:00 2020 Russian Standard Time (UT+4h)  she@DPX200
##.OBSERVE FREQUENCY= 200.1314999998
##.OBSERVE NUCLEUS= ^1H
##.DELAY= (6, 6)
##.ACQUISITION MODE= SIMULTANEOUS
##.ACQUISITION SCHEME= undefined
##.AVERAGES= 8
##.DIGITISER RES= 18
##SPECTROMETER/DATA SYSTEM= spect
##.PULSE SEQUENCE= zg30
##.SOLVENT NAME= CDCl3
##.SHIFT REFERENCE= (INTERNAL, CDCl3, 0, 15.7039)
##AUDIT TRAIL= $$ (NUMBER, WHEN, WHO, WHERE, WHAT)
$$ ##TITLE= Audit trail, XWIN-NMR		Version 3.5
$$ ##JCAMPDX= 5.01
$$ ##ORIGIN= Bruker BioSpin GmbH
$$ ##OWNER= she
$$ F:/spectra/data/she/nmr/H-F/1/audita.txt
$$ ##AUDIT TRAIL=  $$ (NUMBER, WHEN, WHO, WHERE, WHAT)
(   1,<2020-07-31 11:24:47.37 +0400>,<she>,<DPX200>,
      <created by zg, POWCHK disabled, PULCHK disabled
       configuration hash MD5:
       00 E9 B6 7A A2 85 ED C7 34 08 36 98 17 FE 4E 26
       data hash MD5: 16K
       04 36 9B 5A 49 06 48 5D E1 4F 3E 0C E6 23 23 8C>)
$$ ##END=
$$ 
$$ hash MD5
$$ 6B 4F 24 FA 3E 0E A9 A4 03 B7 37 76 3C ED 0A 3E
##$RELAX= 
##$RELAX= 
##$RELAX= 
##$RELAX= 
##$RELAX= 
##$RELAX= 
$$ Bruker specific parameters
$$ --------------------------
##$DU= <F:/spectra>
##$EXPNO= 1
##$NAME= <H-F>
##$PROCNO= 1
##$TYPE= <nmr>
##$USER= <she>
##$AMP= (0..31)
100 100 100 100 100 100 100 100 100 100 100 100 100 100 100 100 100 100 
100 100 100 100 100 100 100 100 100 100 100 100 100 100 
##$AQSEQ= 0
##$AQ_mod= 1
##$AUNM= <au_zg>
##$AUTOPOS= <>
##$BF1= 200.13
##$BF2= 200.13
##$BF3= 200.13
##$BF4= 200.13
##$BF5= 200.13
##$BF6= 200.13
##$BF7= 200.13
##$BF8= 200.13
##$BYTORDA= 1
##$CFDGTYP= 0
##$CFRGTYP= 5
##$CHEMSTR= <none>
##$CNST= (0..31)
1 1 145 1 1 1 1 1 1 1 1 1 1 1 1 1 1 1 1 1 1 1 1 1 1 1 1 1 1 1 1 1 
##$CPDPRG= <>
##$CPDPRG1= <>
##$CPDPRG2= <>
##$CPDPRG3= <>
##$CPDPRG4= <mlev>
##$CPDPRG5= <mlev>
##$CPDPRG6= <mlev>
##$CPDPRG7= <mlev>
##$CPDPRG8= <mlev>
##$CPDPRGB= <>
##$CPDPRGT= <>
##$D= (0..31)
0 1.2 0 0 0 0 0 0 0 0.06 0 0.03 0 0 0 0 0.0002 0 0 0 0 0 0 0 0 0 0 0 0 
0 0 0 
##$DATE= 1596180286
##$DBL= (0..7)
120 120 120 120 120 120 120 120 
##$DBP= (0..7)
150 150 150 150 150 150 150 150 
##$DBP07= 0
##$DBPNAM0= <>
##$DBPNAM1= <>
##$DBPNAM2= <>
##$DBPNAM3= <>
##$DBPNAM4= <>
##$DBPNAM5= <>
##$DBPNAM6= <>
##$DBPNAM7= <>
##$DBPOAL= (0..7)
0.5 0.5 0.5 0.5 0.5 0.5 0.5 0.5 
##$DBPOFFS= (0..7)
0 0 0 0 0 0 0 0 
##$DE= 6
##$DECBNUC= <off>
##$DECIM= 24
##$DECNUC= <off>
##$DECSTAT= 4
##$DIGMOD= 1
##$DIGTYP= 9
##$DL= (0..7)
0 120 120 120 120 120 120 120 
##$DP= (0..7)
150 150 150 150 150 150 150 150 
##$DP07= 0
##$DPNAME0= <>
##$DPNAME1= <>
##$DPNAME2= <>
##$DPNAME3= <>
##$DPNAME4= <>
##$DPNAME5= <>
##$DPNAME6= <>
##$DPNAME7= <>
##$DPOAL= (0..7)
0.5 0.5 0.5 0.5 0.5 0.5 0.5 0.5 
##$DPOFFS= (0..7)
0 0 0 0 0 0 0 0 
##$DQDMODE= 0
##$DR= 18
##$DS= 0
##$DSLIST= <SSSSSSSSSSSSSSS>
$$ [...]
##$SUBNAM2= <"">
##$SUBNAM3= <"">
##$SUBNAM4= <"">
##$SUBNAM5= <"">
##$SUBNAM6= <"">
##$SUBNAM7= <"">
##$SUBNAM8= <"">
##$SUBNAM9= <"">
##$SW= 24.9337058888022
##$SWIBOX= (0..15)
0 0 2 0 0 0 0 0 0 0 0 0 0 0 0 0 
##$SW_h= 4990.01996007984
##$TD= 16384
##$TD0= 1
##$TE= 0
##$TE2= 300
##$TE3= 300
##$TEG= 300
##$TL= (0..7)
0 120 120 120 120 120 120 120 
##$TP= (0..7)
150 150 150 150 150 150 150 150 
##$TP07= 0
##$TPNAME0= <>
##$TPNAME1= <>
##$TPNAME2= <>
##$TPNAME3= <>
##$TPNAME4= <>
##$TPNAME5= <>
##$TPNAME6= <>
##$TPNAME7= <>
##$TPOAL= (0..7)
0.5 0.5 0.5 0.5 0.5 0.5 0.5 0.5 
##$TPOFFS= (0..7)
0 0 0 0 0 0 0 0 
##$TUNHIN= 0
##$TUNHOUT= 0
##$TUNXOUT= 0
##$USERA1= <user>
##$USERA2= <user>
##$USERA3= <user>
##$USERA4= <user>
##$USERA5= <user>
##$V9= 5
##$VALIST= <valist>
##$VCLIST= <CCCCCCCCCCCCCCC>
##$VD= 0
##$VDLIST= <DDDDDDDDDDDDDDD>
##$VPLIST= <PPPPPPPPPPPPPPP>
##$VTLIST= <TTTTTTTTTTTTTTT>
##$WBST= 1024
##$WBSW= 4
##$XGAIN= (0..3)
0 0 0 0 
##$XL= 0
##$YL= 0
##$YMAX_a= 525210
##$YMIN_a= -385837
##$ZGOPTNS= <>
##$ZL1= 120
##$ZL2= 120
##$ZL3= 120
##$ZL4= 120
##$ABSF1= 10
##$ABSF2= 0
##$ABSG= 5
##$ABSL= 3
##$ALPHA= 0
##$AQORDER= 0
##$ASSFAC= 0
##$ASSFACI= 0
##$ASSFACX= 0
##$ASSWID= 0
##$AUNMP= <proc_1d>
##$AZFE= 0.1
##$AZFW= 0.1
##$BCFW= 1
##$BC_mod= 2
##$BYTORDP= 1
##$COROFFS= 0
##$CY= 11.3945322036743
##$DATMOD= 1
##$DC= 2
##$DFILT= <>
##$DTYPP= 0
##$F1P= 16.9975609425685
##$F2P= -3.02152046262296
##$FCOR= 0.5
##$FTSIZE= 0
##$FT_mod= 4
##$GAMMA= 1
##$GB= 0.15
##$INTBC= 1
##$INTSCL= 1
##$ISEN= 128
##$LB= 0.24
##$LEV0= 0
##$LPBIN= 0
##$MAXI= 10000
##$MC2= 0
##$MEAN= 0
##$ME_mod= 0
##$MI= 1.114404
##$NCOEF= 0
##$NC_proc= 0
##$NLEV= 6
##$NOISF1= 3.799351
##$NOISF2= 2.8
##$NSP= 1
##$NTH_PI= 0
##$NZP= 0
##$OFFSET= 15.70392
##$PC= 1
##$PHC0= -9792.796
##$PHC1= 9.40092
##$PH_mod= 1
##$PKNL= yes
##$PPARMOD= 0
##$PSCAL= 0
##$PSIGN= 0
##$REVERSE= no
##$SF= 200.130013532006
##$SI= 16384
##$SIGF1= 3
##$SIGF2= 2
##$SINO= 400
##$SIOLD= 16384
##$SREGLST= <1H.CDCl3>
##$SSB= 0
##$STSI= 0
##$STSR= 0
##$SW_p= 3612.71676300578
##$SYMM= 0
##$S_DEV= 0
##$TDeff= 0
##$TDoff= 0
##$TI= <>
##$TILT= no
##$TM1= 0
##$TM2= 0
##$TOPLEV= 0
##$USERP1= <user>
##$USERP2= <user>
##$USERP3= <user>
##$USERP4= <user>
##$USERP5= <user>
##$WDW= 1
##$XDIM= 8192
##$YMAX_p= 0
##$YMIN_p= 0
$$ End of Bruker specific parameters
$$ ---------------------------------
##NTUPLES= NMR FID
##VAR_NAME=  TIME,          FID/REAL,        FID/IMAG
##SYMBOL=    X,             R,               I
##VAR_TYPE=  INDEPENDENT,   DEPENDENT,       DEPENDENT
##VAR_FORM=  AFFN,          ASDF,            ASDF
##VAR_DIM=   8192,          8192,            8192
##UNITS=     SECONDS,       ARBITRARY UNITS, ARBITRARY UNITS
##FACTOR=    0.0002004,     1,               1
##FIRST=     0,             0,               0
##LAST=      1.6414764,     0,               0
##MIN=       0,             -385837,         0
##MAX=       1.6414764,     525210,          0
$$ Real data points
##PAGE= N=1
##DATA TABLE= (X++(R..R)), XYDATA
0@%%%%%JjQj6J6k2L0l3M1n6O5p4R1j08J28j55J80k05K39k78L17l64M18m70N32
30B84o03O77p62Q56r54J064j190J322j465J628j805J996k212K451k709L003l335
47a754L705m127M617n186N856o667P665q930J0601j2912J6352k2099L3965j00702
61g9616K46973K06771l64013l65685l0267L42770K71752q6566l50912j47735J99087
72a57441K91346L4856k26993k31624O8390L05187J80489j62087k83331r0037J95150
83g6095K83640P4288k44005k65087N3725L10488J91513j31746k95582j08100K29040
94B2079K89717l1644l07671j88877J46529K96984J10006k16767k98462p011K85118
105A00001J97306j26572k75795j13788J60973K43946K7131k25609j92272N9520
$$ y = [0, 0, 0, 0, 0, 0, 1, 0, 8, -8, 8, -14, 16, -17, 24, -32, 33, -41, 50, -58, 70, -85, 95, -110, 129, -149, 168, -196, 222, -248, 284, -319, 358, -404, 452, -502, 562, -628, 694, -771, 857, -948, 1048, -1164, 1287, -1422, 1581, -1754, 1951, -2176, 2441, -2745, 3111, -3556, 4109, -4821, 5780, -7132, 9220, -12879, 21086, -79616, 167357, 374128, 10115, -355570, -385837, -43067, 228685, 142119, -208793, -356528, -157441, 133905, 168761, -58232, -289856, -221466, 83721, 264210, 102123, -181208, -271245, -76095, 207545, 281833, 37828, -227259, -173534, 136954, 328467, 196721, -98861, -206961, 22079, 311796, 280152, -27519, -216396, -69867, 227117, 337123, 120356, -178106, -185117, 100001, 297307, 170735, -105060, -218848, -57875, 186071, 213202, -12407, -204679, -145159]
115a45159K08189J23439q8723k21895j08866J48598K22285J7664j84475j55720
125a84663M1007J98932J39445j00751k24968n7406J84993K02267j2381k16617
135c0142j70848J03986K69168R5850j79180k02079M202J77293J46654n1056j92674
146b8826q8471J26902J60050l845j42238j16266L4405J54426R0040r5969j66231
157g6023n2258Q6334J23561M2034r9287j40902p891J25210Q5619m7168j09274
168g0045n1618O5356J06316o010j23696p0855P6742J27084M1338q5829j26683
179a17900j1431J31585J04494m6912j09209l8527N2121Q2627L0347n2120n2662
190b7587K3429N2968J1749k3800l6060k1180K8663M9991j087m2640k1798L915
$$ y = [-145159, 63030, 186469, 97746, -124149, -233015, -84417, 137868, 155532, -28943, -184663, -143656, 55276, 194721, 93970, -130998, -188404, -3411, 198856, 186475, -30142, -200990, -97004, 172164, 268014, 88834, -113245, -109043, 68250, 214904, 163848, -28826, -117297, 9605, 169655, 165810, 23572, -92694, -58289, 96137, 186177, 90208, -76023, -128281, -41947, 81614, 123648, 24361, -116541, -124432, 778, 86397, 39229, -70045, -121663, -56307, 50009, 43999, -79697, -150552, -73810, 53274, 94612, 8783, -117900, -129331, 2254, 106748, 59836, -49373, -87900, -35779, 46848, 77195, 25075, -27587, -4158, 48810, 60559, 36759, 699, -20481, 8182, 58173, 57086, 14446, -7352, -3437]
202c437J6815L1120L896m9741l9995J6582L0862L608k0531l0866o908L6461K3371
215A1237l0345l0223O579R480l106P26m065k597J5791L361k4868K064M2368J8273
229A4675k5481k5091K032K9013L1099j6117m5757J1075O5870K7572l6485m3716
241a1311q766L9000O0870N063o8430m9765K4535N3012K8856j3114m9656l0463
253b0169L2177M5440o652m4269l9639l848N1931N4587l7767j00617k9782P7588
265b1020Q9095K720r6308r9676K2096J22496N9352p7232j04849j0025R3237R4845
277G4731k3679j22846n2778R3454J12378k921j00249q7865K1497J22791Q7740
288A22253n3722j20203m0736P5080J11379L0372r8004j18163J5883J29261P7112
$$ y = [-3437, 13378, 44498, 48394, -1347, -41342, -24760, 6102, 9710, -10821, -41687, -48595, -12134, 11237, -19108, -49331, -42752, -33272, -36378, -35652, -39717, -42314, -26523, -23162, -48030, -45966, -3598, 14675, -10806, -35897, -33865, -4852, 26247, 10130, -35627, -24552, 41318, 68890, 32405, -11311, -20077, 18923, 79793, 84856, 16426, -33339, -8804, 44208, 73064, 59950, 10294, -20169, 12008, 57448, 50796, 6527, -33112, -36960, 14971, 69558, 31791, -68826, -98608, -21020, 68075, 70795, -25513, -125189, -103093, 19403, 78755, 1523, -103326, -113351, -20114, 74731, 51052, -71794, -124572, -31118, 81260, 78339, -21910, -109775, -88278, 34513, 122253, 68531, -51672, -92408, -17328, 94051, 124423, 26419, -91744, -75861, 53400, 130512]
299A30512n9221j23502n4103R2783J44293O588j56101j23134N6345J54864O9104
310A38428j04308j64770k1606J56052J30330n6525j61488p8754Q3269J52993M0172
321A13793j36776j45595K7178J56640R8913n6225j43012o9423R7254J53901J9647
332A16295j32576j21916K6520J51793J15493o6943j79398n8418J46442J69393
342A66685l528j66572j42043N1825J96395R8696j25540j83598j6639J60112J46640
353A82433l9936j87463j07461J10262J79049K0147j51397j44504J6368J61659
363C9157J24492o9262j82404p3932J08867J53645K6988j34440j49423J7682J69354
374C0724J07012p9726j61484n5840J16989J67834J3739j73421j44083O8815J91346
$$ y = [130512, 71291, -52211, -106314, -13531, 130762, 137350, -18751, -141885, -85540, 69324, 138428, 34120, -130650, -152256, 3796, 134126, 77601, -83887, -162641, -79372, 73621, 113793, -22983, -168578, -141400, 15240, 114153, 57928, -85084, -154507, -57253, 96648, 116295, -16281, -138197, -111677, 40116, 155609, 88666, -90732, -149150, -2708, 166685, 163157, -3415, -145458, -93633, 102762, 201458, 75918, -107680, -124319, 35793, 182433, 142497, -44966, -152427, -42165, 136884, 157031, 5634, -138870, -122502, 39157, 163649, 94387, -88017, -161949, -53082, 100563, 127551, -6889, -156312, -138630, 30724, 137736, 58010, -103474, -159314, -42325, 125509, 139248, -34173, -178256, -109441, 81905]
385H1905Q5440j10971j77134l0244J64925J60117m2635j79174r2558R0442J64195
396A14308M8935j32796j55950J9028J65667J02303o9535j51067o7821R2200J50479
407A15751K0681j39935j29705K4274J39910R8303o0180j61333o6730J16800J49757
418A07593k809j45070j21071L6977J59064R1621r9120j64653j9978J42516J29717
429A14787k7923j51408r4941Q3572J58475L1254j20803j13436J9509J26383R8132
440A23601m4132j33631n2984Q9631J12769J0280r3027r4904J1254J13208P8754
451A20819n1303j10015l8525O9060J03027J7413j05307j07117L0155J22942N8082
462A09231o8585j11238k8849R2373J04854k0759j19506o5122N7071R7778K6689
$$ y = [81905, 167345, 56374, -120760, -151004, 13921, 174038, 131403, -47771, -140329, -49887, 114308, 163243, 30447, -125503, -106475, 59192, 161495, 91960, -59107, -126928, -34728, 115751, 136432, -3503, -133208, -108934, 30976, 129279, 69099, -92234, -158964, -42164, 107593, 104784, -40286, -161357, -124380, 34684, 126305, 27185, -137468, -157446, -14930, 114787, 86864, -64544, -159485, -75913, 82562, 113816, -6987, -120423, -100914, 25469, 123601, 79469, -54162, -107146, -17515, 95254, 105534, 12507, -82397, -71143, 42065, 120819, 69516, -40499, -79024, -9964, 93063, 110476, 5169, -101948, -71793, 51149, 109231, 40646, -70592, -99441, -7068, 97786, 77027, -42479, -107601, -50530, 47248, 73937]
473G3937p5691r0898J1495J01760N6676m7099p8088k2415M7290O9613J3406o3470
485c484n8154J9075O4691M1019j5973n8019l4721M0863O7381O616n4981m8957
497c4644O583N6974M9255k7236p3562j7996N8246N2003j3545n7902m1154K3371
509a9607N8299J0333n0519l6741J4617L3210J6161j5271l4311j1880K4675J6576
521E542j3669j4718l552j501O550J3926J242r604n223l036M369J6799L578k0477
535a9774r857J5370J3229M39q24m057k095J2031P278j0326m086Q922k503q555
549d808M666J0101N062l256j4483r543K1909K6373j8528m0317q117K7323K7100
562B3482n42l5361l2135K1465N0022N944m2179l5569N636L8491K9828k2967n1390
$$ y = [73937, -1754, -92652, -81157, 20603, 77279, 30180, -47908, -70323, -23033, 46580, 59986, -3484, -61638, -42563, 22128, 63147, 47174, -10845, -45566, -4703, 62678, 69294, 14313, -34644, -28061, 28913, 78168, 50932, -22630, -40626, 17620, 69623, 56078, -1824, -42978, -19607, 38692, 49025, -1494, -38235, -23618, 9592, 25753, 10482, -23829, -35709, -11034, 5542, -8127, -22845, -26397, -27898, -21348, -7422, -6180, -15784, -21007, -24043, -19674, -2875, 703, -19774, -29631, -14261, -1032, -593, -1417, -5474, -7569, 4462, 11740, 1414, -2672, 6250, 3747, -4808, -142, 9959, 15021, 11765, -2718, -12261, 9648, 36021, 17493, -22824, -30941, -3618, 23482, 22940, -12421, -44556, -23091, 26931, 32875, -9304, -44873, -39237, -746, 29082, 6115, -45275]
575d5275r160M3773L8404k343l2552l4722L791M9179L3436k5849m8267j4753L3257
588a1081N4174J8399m8557n4207J7414O7341L5204l4190o7852k5891N8572P8939
600H8265p305q4009m8452M3111Q0154K6504o3045q4053k73Q4306N6006l8469q0304
613b7564l5342M9501Q2653J4673p9424p4149J8840P7244M5775l5360q4859l9742
625h7754O2506R0628N200q3007p2513J9034R5210O2565n7118j12110k3414R2456
637h317R2463j0841r8713p4738M6234J19665M0861q9313j03197M373J00079Q0591
649I9147l5324j14701n0686P7665J05094Q298q9114q7196R291J00930P1687n2148
661D2943j12582l6275P3832R6346J2019r2746r4270K3471J13902N9562o4909j12566
$$ y = [-45275, -54435, -10662, 27742, 25399, -7153, -41875, -38084, 11095, 44531, 18682, -29585, -44338, -11081, 43093, 61492, 12935, -41272, -23858, 43483, 78687, 44497, -23355, -49246, 9326, 88265, 80960, -3049, -51501, -8390, 71764, 98268, 35223, -48830, -49103, 35203, 91209, 52740, -27564, -62906, -13405, 69248, 83921, 4497, -69652, -50812, 26432, 72207, 36847, -48012, -87754, -25248, 65380, 70580, -12427, -84940, -65906, 29304, 91869, 34751, -77359, -100773, -8317, 84146, 73305, -25408, -100146, -53912, 65753, 106614, 17301, -85896, -81523, 18556, 99147, 63823, -50878, -101564, -23899, 81195, 89493, 379, -86817, -77526, 23404, 95091, 42943, -69639, -105914, -32082, 64264, 76283, -16463, -110733, -87262, 26640, 86202, 21293, -91273]
673i1273l4256Q7707J13416n051j22176q1851N8715J22130M2371q3325j14052
684a07645o377J14343R1872m2634j14261m6863P2010J11700K4063r6290r7741
695i7823K3310J09473O3963m6955j02890m5181P2443J12230J4470r9282q9714
706h5956K2597J06522P0158n6832j23828l5544R7499J06032j1785j09520q0705
717a01362M4077J23036M8934r2732j16018J800J06097Q1207l3426j09143n4396
728a01926P0181J05912J2540q5292p9764J0427Q9380O7950l8322r9319l4422O9248
740a3407Q8027J2804p4541q1219J1611R8327O2303n0884r7724l0391P1621R4972
752I1499L685r8292p4961M5068J01069L1437o9096q9573p765Q5788P2200l3961
$$ y = [-91273, -125529, -37822, 75594, 70543, -51633, -133484, -74769, 47361, 89732, 6407, -107645, -114022, 321, 92193, 49559, -64702, -111565, -39555, 72145, 96208, -82, -97823, -74513, 34960, 98923, 51968, -50922, -96103, -23660, 88570, 103040, 3758, -85956, -63359, 43163, 113321, 56489, -67339, -102883, -5384, 100648, 88863, -20657, -101362, -57285, 65751, 114685, 21953, -94065, -92265, 13832, 95039, 61613, -47530, -101926, -31745, 74167, 86707, 1415, -78349, -67922, 21458, 89408, 51086, -48233, -82655, -13407, 74620, 87424, 12883, -68336, -56725, 41602, 103905, 53021, -44703, -75094, -3473, 91499, 95184, -3108, -78069, -33001, 68068, 99505, 30409, -59164, -66929, 18859, 91059, 57098]
764E7098r2216l5042N4528P4197J1566o6133o8940J1637P2395L9731l3089o2714
776c6982k8993L9036O9141J5849o1687o0626J1182O5097M4759k6861p3613l0376
788g4074N6920P1457k070o4569m7793K2870P0185L3852n0363o8874K864O2061
800A2466M0192k0754n1381k5033L2438N0988L732m2981l2665P107L1289K4643
812C0041j2174l9871j6722K6185L1959M047k1939l1407q911L1161L1688j2939
824A1118l8504j6806K0214L3907J0536k9083l1939J3169L7122Q687k5196k4297
836c1072l32K6265K4938r417k8745l175K1678J3548k572q289p326J661P587r70
850C779l494P201O176p480l474P312L741l793l205l913n07Q988J841j2524o170
$$ y = [57098, -35118, -70160, -15632, 58565, 70131, 3998, -64942, -53305, 19090, 58821, 25732, -36982, -65975, -26939, 42202, 58051, -3636, -64262, -53080, 12017, 56776, 29915, -43698, -74074, -17154, 54303, 52233, -12336, -60129, -37259, 32926, 66778, 16415, -52459, -49595, 12466, 52658, 31904, -19477, -44510, -12072, 38916, 42648, -333, -32998, -25891, 5398, 30041, 17867, -22004, -38726, -12541, 19418, 23465, 1526, -29881, -38792, -7631, 24057, 11118, -27386, -44192, -23978, 9929, 20465, -8618, -40557, -27388, 9734, 18421, -6775, -31072, -31404, -5139, 19799, 10382, -18363, -21538, 140, 13688, 11116, 2827, -4499, -2838, 4749, 3779, 285, 7486, 13662, 6182, 2708, 10020, 13761, 9968, 6763, 2850, 2343, 11331, 13172, 648, -5522]
865e522R571P886L26k563q384o819L939M886j599J813N79j2688o145J6092J5533
880A6905n973j7025j1589P494K4462Q958k7021k6153J2928L3842J4393j7772l3074
893a9625o708L5357L2797j7591m1801j1066K6470L2019M711l1596l0989J1794
905a6228L9674J6334k1009l2483j5144J9306L6952O370l5305l1381P035L4170
917H291K7033j2402m7923k5313L5331N0481j032n1804m3838J5367O3101L6047
929E3339m2120o6853m811N7260M7613j5412o0695l5670L7877O4472P223n5118
941a2895m3646J6674N6692L6702k7920o3731k2310M4981N6282P685m5972n1838
953d9296J998O1715M7516k6576o4378k4339M1066N9402P284o3508n8598K6386
$$ y = [-5522, 4049, 11935, 12261, 9698, 1314, -5505, -1566, 3320, 1721, 3534, 4113, -8575, -14720, 1372, 16905, 10932, -6093, -17682, -10188, 14274, 23232, -3789, -29942, -17014, 16828, 31221, 13449, -19625, -26333, 9024, 41821, 24230, -17571, -28637, -2167, 29852, 34563, 2967, -28022, -16228, 23446, 39780, 18771, -13712, -28856, -9550, 27402, 33772, -1533, -32914, -25879, 8291, 35324, 22922, -25001, -50314, -14983, 35498, 34466, -17338, -61176, -45809, 17292, 53339, 11219, -55634, -60445, -3185, 44428, 29016, -31679, -67349, -29472, 35000, 42223, -12895, -56541, -39867, 16825, 53527, 25607, -38124, -60434, -15453, 40829, 48514, 2542, -49296, -47298, 14417, 61933, 35357, -29021, -53360, -12294, 47108, 54392, -9116, -67714, -41328]
965d1328Q0290L3066n1652p5091j2576O9185O9769k0032q5779m3443M5458P3263
977D1130J9746n4666o5975N058P2412M6464l3495o8434k6461M3499O7793J3309
989F0380o2719o0406J6176P2031M5878k8531p6056l5413N5222Q0609K688p6646
1001f787n9917K5222Q3191M6245m9820q8050j3834P5235O6545j9009p9014m8368
1013f8361M0170Q3032K0290o6865o6125J2168O9008M6703k9285p6658l5109N0100
1025b0932P2757Q558n9389o0410M208O8929N3443l0086p5857k8121M9212O4653
1037D6965O792o3324o0909K2559Q2833L9013n1939p6123j2533O4805O9236j1491
1049E5884p9818m7476M0570P0988K0010m7632n9434j17O2290M5777l0273o4893
$$ y = [-41328, 38962, 72028, 20376, -54715, -67291, 1894, 71663, 51631, -34148, -77591, -32133, 41130, 60876, 6210, -59765, -54707, 17705, 64169, 30674, -37760, -64221, -20722, 47071, 60380, -2339, -62745, -46569, 25462, 71340, 42809, -33247, -68660, -13438, 67171, 69859, -6787, -66704, -41482, 41709, 87954, 38134, -49916, -63750, 11485, 78030, 59021, -19993, -68361, -28191, 54841, 75131, 8266, -57859, -45691, 23317, 70020, 40735, -35923, -71032, -20932, 51825, 60383, 994, -59416, -55208, 13721, 67164, 37078, -38779, -66900, -17688, 46965, 53757, -9567, -70476, -47917, 34916, 73929, 21990, -54133, -66666, -1861, 67375, 55884, -23934, -71410, -30840, 40148, 60158, 12526, -46908, -47025, 15265, 61042, 30769, -34124]
1061c4124k2082M0900N8015J0282n4567n7240J0997O5019M0380k5774o2955l3394
1073f4543L8458O5329Q149n8881m8208J7570N9129L3220l3039o3349j3181N5962
1085c384N1199j5555n8765l3863K7980O0857K0931m4928m9912O783M7936L1160
1097D0439j4926m5107k5122K8296M6951P382l5228l3290L398L6977L2635j3673
1109B8732m5739j9155K8021L6616N222l1680l4766O095M6162K5940k8109m4320
1121b6981p453L2095L6342k812m1787k8303K0742L7568Q283k1711k4354j271K3501
1134C859J9206j3338k6273l672J7870J6891L103j5036j9402J603K2776J5318o207
1147A6698j7391j5235L393K2330J2998j4642j7221K597J4828R259m812j6802p681
$$ y = [-34124, -56206, -15306, 42709, 52991, -1576, -58816, -47819, 17200, 57580, 31806, -31149, -64543, -26085, 39244, 47393, -11488, -59696, -42126, 17003, 50223, 17184, -46165, -59346, -3384, 47815, 32260, -26505, -60368, -32388, 28469, 49400, 4472, -45440, -38657, 9279, 40439, 25513, -19594, -44716, -16420, 30531, 37913, 2685, -30605, -27207, 9770, 42405, 28732, -17007, -36162, -8141, 28475, 33697, 2017, -32749, -26654, 19508, 45448, 17339, -26981, -34434, -2339, 34003, 31191, -10596, -38899, -18157, 19411, 27694, 5983, -18371, -19642, 3859, 23065, 9727, -16546, -20218, -2348, 14543, 17646, 2610, -16792, -15189, 7587, 22905, 16698, -693, -15928, -12535, 9795, 22793, 8151, -9070, -6473, 8355, 17614, 12802, -4000, -11681]
1160a1681J5892J6105p958j8268n889P323J3528O349r380j1597K180N667l374
1173a103k026M454L33m168l185j848K641Q404Q26j0455l239Q141L427m807n282
1188g887l200L877J1095J868j0873n353N708N708L012R74p271q858L215J0325
1202B340M642j942q224q840P205J9355L500j8474j6256K946J8373J6465q741k8491
1216a6142q434K5460K3466p554k5562j4675J3265K8472O097k9406k6061J0351
1228b0723K9958J6454j1758k8965j4609K0210K9622J552k3526k0346N81K2420
1240H70K2664q327k9743j1038K2715K8512K606k8537l1901O708M3902K5052k6251
1253A7232m2449r704L3566M1762K52m5045l3570K1182M5165J0684l2013l7072
$$ y = [-11681, 4211, 20316, 12358, -5910, -11799, -4476, 9052, 15401, 6021, -5576, -3396, 2271, -1103, -3129, 1325, 1658, -2510, -5695, -7543, -4902, 3502, 4328, -6127, -9366, -1225, 2202, -2605, -7887, -11087, -7210, 3885, 5753, -5120, -10473, -4765, 943, 3955, 4929, -2342, -11200, -7985, 2340, 6982, 5040, -3184, -12024, -4819, 14536, 18036, -438, -16694, -13748, 4625, 21090, 12349, -16142, -24576, 884, 24350, 16796, -8766, -23441, -10176, 18296, 24393, -5013, -31074, -20723, 9235, 25689, 13931, -15034, -29643, -9433, 20189, 21741, -1785, -22131, -21550, 870, 23534, 15207, -14536, -25574, -2859, 25653, 28259, -278, -32179, -25471, 18431, 43483, 17232, -25217, -34921, -1355, 40407, 40659, -4386, -37956, -16774, 28391, 39075, 7062, -30010]
1265c0010O07M1811L3049j9976m6251j5381K9271L8940P244l6087m1980M855M5493
1278A1585K9070j8916m1003k0052K6002M5137P805m3363l9807J1692M7268K8308
1290D3726k3867n3246j6428M6013N1519q079n4334l4972K2241N4775K2834m0896
1302I286n3519J667N2751L7928j7041n0810k7655L0314N3000Q107m4595m0862
1314d1429O672M3505L3882j6249n0881k1999L4887M7130L456m2953m2737N862
1326d0854N3691L5923k9211n6726j5165M1509N0051J947n2533m4421K1098N9087
1338B4396J9854l9663m8842k120M9289M3572j6902n6976k4678L5288M9108R028
1350D1354l9737m6398L395N1055L5238k0153m6581j8590K7257M4356J0079m1472
$$ y = [-30010, -29403, 12408, 45457, 25481, -20770, -36151, -6880, 32060, 39304, 3217, -38763, -33908, 11585, 40655, 21739, -19264, -39316, -13314, 31823, 39628, -3735, -43542, -31850, 15418, 43726, 19859, -33387, -49815, -3802, 47717, 39638, -14696, -49668, -27427, 27348, 50182, 9286, -44233, -42566, 10185, 48113, 31072, -19738, -47393, -17079, 35921, 44028, -567, -41429, -34757, 8748, 42630, 26381, -24500, -46499, -11612, 35518, 38974, -3979, -46716, -40854, 12837, 48760, 19549, -37177, -52342, -10833, 39218, 41165, -11368, -55789, -34691, 24396, 44250, 4587, -44255, -46375, 2914, 46486, 29584, -27392, -52070, -16782, 32326, 41354, 1617, -44781, -41386, 9669, 44907, 24754, -21827, -40417, -13160, 31196, 41275, -197]
1362a97m2400J0723M7806K7941k2678m8593j8944L9727N1910k977n2321l6491
1374d6494J8644M9434K4563l1713n1367m275M6989L7260j4831m4322k3864K4185
1386a5791M4824R459l8209l5995P606L7503K6772j1308l8961k0959K5342L9688
1398B9971M579l1661l1396J873L6598K9542j6302m1933j2932K9244L5752J785
1410C5120l5247l3217J1661M3327J6895k8159l5366j458L0969K9547q197l7137
1422a1262j9254K1224L0337M004k2821k5665j78K7322K2176j1491k6931r908J3714
1435h733K1486P185j8721k5481K178K5416J6588r620k3116j2336J5775K7272L069
1448B0962k5921j9417Q063K2302J1883j0868k2973m929K1588J7662p805j7688
$$ y = [-197, -42597, -31874, 15932, 43873, 21195, -27398, -46342, -6615, 45295, 42318, -10003, -46494, -27850, 21584, 46147, 14434, -36933, -41208, 5781, 43041, 28210, -16112, -39976, -15791, 29033, 38492, 283, -35712, -28106, 9397, 36169, 24861, -14100, -35059, -9717, 29971, 34550, 2889, -28507, -26634, 9964, 39506, 23204, -18729, -31661, -2417, 33335, 35120, -127, -33344, -21683, 21644, 38539, 10380, -24986, -26444, 4525, 34072, 25875, -11262, -30516, -9292, 21045, 25049, 2228, -23437, -23615, 3707, 25883, 14392, -12539, -22447, -8733, 12753, 19938, 1217, -24264, -22086, 3330, 19918, 10298, -12818, -25154, -9379, 17893, 20962, -4959, -24376, -16313, 5989, 17872, 7004, -15969, -20898, 690, 18352, 10547, -7141]
1460g141p602P459J5373M778j3575j2905L986J1813N367p87p577q962L000J1229
1474D456L094o804o724k996L631J0093L425j0291o566M884P721K052l578q881
1488f484k885R537O293n560n046K058L193J883O80k407j814K255J01m041J585
1503f52O471j210n133p80L151M936L569o275j0409K865J1606K316p218o929j080
1518d772O828J0514r88j2835n181N656O889K462l387j0004m337R459R884j335
1532H853q138p288n35J0268J0907o850j7776m739J3056J4798J880j5868j7282
1545a8714O877K4690Q712j7693k0482j682J9008J9388n610k5874j1143J8075K1738
1558A7290R38j8079j8225K175K2377J4642j2676k2938o081J4626K0516N741j9294
$$ y = [-7141, -14743, -7284, 8089, 12867, -708, -13613, -9627, 2186, 7553, 6766, -811, -9773, -6773, 4456, 7550, 746, -5978, -8974, -5343, 4750, 8175, -2116, -8682, -3798, 3923, 5975, 2397, -6484, -9369, 168, 6461, 901, -4145, -2087, 1106, 2989, 3669, 1262, -552, 1703, 1804, -2237, -652, 5819, 4609, -524, -1304, 1847, 6783, 10352, 4077, -6332, -3467, 8139, 10455, 3237, -3692, -4772, 2056, 12570, 11582, -1253, -6434, -778, 6111, 8573, 5186, -4818, -9155, 304, 10188, 8853, 715, -6573, -7108, 3160, 14067, 7217, -10559, -15298, -2242, 12556, 14436, -1432, -18714, -11837, 12853, 21565, 3872, -16610, -18292, 716, 20104, 14494, -11380, -22523, -4448, 17290, 18228, 149, -18076, -15901, 6476, 21118, 8442, -14496, -20577, -5951, 14565, 20306, 1012]
1571A012k2951L420K5784J4508j1894k5482j2963J8615L0755K076l0610k2933
1583c0663J1889L1041J6055k0682l5448n505L3436K7140j1168l2482j5716J8104
1595a3999L3316R053k9146k9171O499L0188J8009j1375k9756j4583K0532L2505
1607B2072L880k6523k4250K985K7863K4195j2383l7021j4483K6472L3840K363
1619B9010l0950k9810Q626M0310K1231k6254l9597m798L2133L2660n790l9555
1631a2784k3424K3836L9103N982k9850l0525J943L3295K6138j4654l6746j3256
1643c0942K2954L1928P286k5744l2018K301L4783K2989j5012l4154j4576K1541
1655h664L7508O294l5609l1807J2369L9291J9392k2398m0829j0207L5542L6581
$$ y = [1012, -21939, -18519, 7265, 21773, 9879, -15603, -28566, -9951, 20804, 22880, -7730, -30663, -18774, 12267, 28322, 7640, -27808, -33313, 123, 27263, 16095, -16387, -32103, -13999, 19317, 28370, -776, -29947, -23448, 6740, 24749, 13374, -16382, -30965, -10433, 22072, 25952, -571, -24821, -21836, 6027, 30222, 17839, -19182, -33665, -7193, 26647, 29010, -1940, -31750, -23124, 17186, 38417, 12163, -27434, -32232, -99, 32561, 26771, -12784, -36208, -12372, 26731, 32713, 2863, -27662, -25719, 7576, 33714, 19060, -17686, -30942, -7988, 23940, 31226, 5482, -26536, -24235, 10548, 33537, 18525, -15629, -30205, -8664, 28844, 35138, -471, -32278, -19909, 19382, 38774, 16376, -24453, -34660, 882, 37463]
1667C7463r293l9059k1100J8732L5891J2790k8509l4899K762L3613K0934j2599
1679A6726l0660j5566J8979L2818O421k7497k7096K695K7261K3151q638l5108
1691a6514j7418K2631L3792M304k8209k7891M477L4997K2054k1061l6870o298
1703c2006K8680K8798l727l2278k2143J6909L5351P178k5977k5380J150K5267
1715A822K1528q987k9452j2196J8444K4232N058j8447k2721j274K4311J9284j0320
1728A1282k4668j0921J3474K4927Q085k2136k4287N333K7166J4109j3114k5517
1740a6267r896K1021K5805k585k5591j4426J1973K1438Q648j4764k1425l28K0201
1753C804J3146p984j5229p274Q589J6843N491j3330j4630J160J1855J0613o00
$$ y = [37463, 28170, -10889, -31989, -13257, 22634, 35424, 6915, -27984, -25222, 8391, 29325, 16726, -13934, -29500, -10521, 22297, 28718, 1221, -25875, -23180, 4081, 27232, 18594, -16514, -33932, -11301, 22491, 26795, -1414, -29305, -24828, 10169, 32223, 11162, -25708, -32006, -3326, 25472, 21745, -10533, -32676, -15767, 19584, 26762, 785, -24595, -23445, 1822, 23350, 14363, -15089, -27285, -8841, 15391, 20449, 2002, -20719, -21993, 2318, 21602, 11282, -13386, -24307, -10833, 14094, 22179, 43, -24244, -18911, 8255, 22364, 9250, -16267, -26163, -5142, 20663, 18078, -7513, -21939, -9966, 11472, 20120, 5356, -16069, -16397, 3804, 16950, 8966, -6263, -13537, -4948, 11895, 17386, 4056, -10574, -9414, 2441, 13054, 12454]
1766A2454j4141j1528P714J6768M488j0229j2803j510J2488J2535n888j7515n045
1779a2212J2173J2514m8j1479j0801M061J4618M560j0595q722O94N970N631k43
1793F121p324l587N272M220n13j547k293l992J758N691P77m218k967j303L123
1808g82O846O79p688m626L954M474N14k408m488j317N624K821l241j812J044n15
1824i21n14J108L21q54p48k171j527N608M824m897p561R98O459M674j826r003
1840f030n846P264J0445j079r719m794L391Q582N400o286j0820o61R263N913k072
1855B951n690o546J640J0330O510o465r690l203O022J1126L189j2742j2578N434
1869i712J6072P396p970j5740n034J4106J6962m194j9925q818J0401J7243M880
$$ y = [12454, -1687, -13215, -5501, 11267, 15755, 5526, -7277, -8787, 3701, 16236, 10348, -7167, -12212, -39, 12475, 12427, 948, -9853, -5792, 8826, 13386, 2791, -5931, -5237, 733, 6364, 6121, -1203, -4790, 482, 4702, 4189, 2642, 349, -3643, -1885, 3806, 4583, 365, -2602, -3905, -782, 6064, 6743, -945, -5571, -1617, 2857, 3371, 963, -3525, -4842, 782, 3603, 362, -1450, -406, -921, -1435, -327, -6, -860, -1608, -3779, -5306, 302, 5126, 229, -7332, -6334, 125, 4799, 2973, -6030, -11876, -4612, 5833, 4754, -4965, -9759, -6368, 2214, 7614, 1328, -9492, -10153, -890, 5023, 2951, -2739, -9285, -7645, 2685, 9195, 2730, -6960, -10163, -4141, 6985, 10174, -2568, -15146, -9712, 6360, 13756, 5786, -9954, -14988, -882, 16080, 11886, -8039, -16857, -6456, 10787, 15667]
1882A5667j3820j7112L283J9553R926r898j6123o438J0413J7405K962j6101j4017
1895a4300M687J5960J0928n305j8642r940J3116J9775R36j7582j5585L535K2128
1908I711J5562j3096k6079m811K1214K0499l937k2972j7758J1006K7736P938k0028
1921D985k0865J535K0752J6724p796k4733j1215J6549K1532J998j8172j8243J243
1934a5706K2852J7121j0615k5372r406J4840K2206N151k0760k3357N619K7472
1946A0045J4352j4660k6076p829K0901K6042k932k9649j8561J4644K7121R725
1958B3123j8192k6508j581K5721J9961r586k5511j1757J3226K3500P464k0267
1970d07k2117L441K3210J5255q414k3202j3358J4549K6449L591k2194k0849M552
$$ y = [15667, 1847, -15265, -11982, 7571, 17497, 7599, -8524, -14962, -4549, 12856, 15818, -283, -14300, -9613, 6347, 17275, 11970, -6672, -16612, -3496, 16279, 17215, -367, -15952, -12417, 9711, 25273, 12177, -13902, -18713, 2501, 23000, 19063, -3909, -21667, -10661, 17075, 25013, 4985, -15880, -14345, 6407, 23131, 15335, -9398, -20613, -4064, 17468, 19466, 1294, -16949, -15706, 7146, 24267, 13652, -11720, -21126, -6286, 15920, 21071, 311, -23046, -17427, 10045, 24397, 9737, -16339, -24168, -3267, 22775, 19843, -9806, -28367, -13723, 13398, 23123, 4931, -21577, -23158, 2563, 22524, 12938, -12573, -24330, -11104, 12396, 19860, -407, -22524, -19083, 4127, 19382, 10968, -12234, -25592, -11043, 15406, 18997, -3197, -24046, -19494]
1983a9494K4016J8233j1519k9116r470K2304K4454k067k4359j9682Q949K9012
1995A1261J2920k0212k4690J16K2146J7975n882k4522j3446J5230K4317L672j8228
2008F57j8399Q05K0563J8031p414k3818j1289J3742K0701N866j6039k0859J095
2021a6358K3471J5475j0849k2061p961J5054K2494J042k3782j8080J0230K4265
2033A2940R612j3504k1904m607J9258J8682n866k0467r701R442J6656O739j2856
2046D424j6871J185J6411J1197n771j4753j0090O938J8381N982j3567j5609L99
2059a1744J4606J3120l303j8195j0151J1930J6335N68j4213j2082L458J6390R403
2072A6122j0232j6978r97J3397J0120k612j2486r167O269J3262L064q647q136
$$ y = [-19494, 4522, 22755, 11236, -17880, -27350, -5046, 19408, 17341, -7018, -26700, -17751, 11261, 24181, 3969, -20721, -20605, 1541, 19516, 13634, -10888, -24334, -9104, 15213, 18885, 657, -17742, -16937, 3626, 21657, 14243, -9575, -20864, -7122, 13579, 19445, 3406, -17453, -16358, 7113, 22588, 11739, -10322, -18283, -3229, 19265, 20307, -3475, -21555, -11325, 12940, 22552, 9048, -12856, -17463, 1795, 20477, 14611, -5856, -15557, -6115, 10541, 17280, 4424, -12447, -11262, 5149, 16346, 10575, -4178, -14268, -7330, 11051, 17033, 3466, -12143, -11744, 2862, 15982, 12679, -5516, -15667, -3737, 12598, 13166, -1047, -13129, -9671, 6719, 16122, 5890, -11088, -12085, 1312, 11432, 8820, -3666, -12833, -6564, 6698, 9762, 1115, -7021]
2085g021o78P214Q149p42j0509o575M278Q405L748l502q900l761Q397R058j945
2100E616r470n247L424Q945M322p772j0180K263J0014M832l833o767l611M207
2114c257O905o8o179j832J916K043J627j23k637n73K215R75j223K08j168l173
2130d344K089M622J125l207k877j182K793N421K94n763k810J802K444J155N22
2145B084k445j172K455J666j209p56j69j537P45L840L1l575k429K7L698O362o43
2162F973q034m771N206O711J150n149o672j14Q578N979n428q612J05O195O002
2177H119o86q304o486M618Q975K389n509o316k197N570Q521o69r454o075K890
2192d614Q256N553l592j1562m252R993J0984j469j1125q886L071J3520O992j0656
$$ y = [-7021, -7699, -485, 7664, 6922, -3587, -10162, -5884, 2521, 6269, 2767, -6133, -9894, -1497, 7561, 5616, -3854, -9101, -5677, 3268, 7590, -182, -10362, -8099, 1915, 6747, 2914, -3853, -7464, -3257, 3648, 3580, -2599, -4431, -2515, -472, 1155, 1032, -1605, -2178, 37, 1012, -211, -3, -1171, -4344, -2255, 2367, 3492, 285, -2592, -3774, -981, 4440, 4734, -1029, -3839, -2037, 407, 1562, 2084, -361, -1533, 922, 2588, 1379, 623, 454, -1083, -338, 3502, 3533, -42, -2471, -2444, 1254, 7616, 6973, -1061, -5832, -626, 6085, 7235, 2086, -4586, -4700, 3878, 9857, 4429, -4183, -4078, 2117, 8119, 7433, -871, -7357, -2739, 6236, 8625, 3116, -3200, -5397, 173, 8694, 8025, -1429, -7504, -4614, 3642, 9195, 5603, -5959, -10211, -218, 10766, 9297, -1828, -10714, -7643, 5877, 12869, 2213]
2206B213j4085J262J3238R343m309j3912p821R569J5177N57j3417j1039K938J2292
2220B006R697n187j4761m811R880J1292O80j0323j1550J639J5213Q836q691j5359
2234a1439l252J0997J5550J191j6766j5038O554J8883P925j1185j6636l310J5018
2247a508J6230m693j8584p932J0536J5627L307j3587j5770K440J8184J0998p643
2260G605j5977o864R551J6818L732j4981j4793K878J5957J0517n506j7235q237
2273a6535J3216J8659L34j7566j4041M800J8593J1225j0986k1324k556J7781J5841
2286A7441l685j8340j2089R096K0578M500j6030j5336J847J5852J2692m882j7770
2299f126r024J1410J5944K337j2963j4030J75J5927J3192p392j8090o437J2300
$$ y = [2213, -11872, -10610, 2628, 11971, 7662, -6250, -14071, -4502, 10675, 11232, -2185, -13224, -10286, 2006, 11703, 6516, -8245, -13056, -3176, 8116, 8796, -1527, -13077, -11438, 3775, 12611, 3920, -11439, -14691, -3694, 11856, 13047, -3719, -18757, -12203, 6680, 14605, 3420, -13216, -16526, -1508, 14722, 10029, -8555, -16487, -5951, 9676, 12983, -604, -16374, -13934, 4250, 15248, 7605, -8372, -15236, -5685, 11133, 14865, -116, -14909, -12031, 3926, 14443, 8937, -8298, -16535, -3319, 15340, 15674, -1892, -15933, -11133, 7460, 18685, 7699, -13625, -16181, 1600, 17441, 13756, -4584, -16673, -7577, 13001, 17501, 1471, -13865, -12018, 3834, 16526, 11644, -6126, -15150, -3740, 12204, 14541, 1578, -12452, -12277, 3650, 16842, 9450, -8640, -15077, -2777]
2312b777J6045L000j5983j6576L537K0107J0356j0718j7983m489J3842J7318j978
2325A3701j8835j1285R358J6309M504j1348j5403j188J6267J2508n720j5540o583
2338a3255O996J3978N034j1096j4116N13J2976J0009l676j2634q622P724J6143
2351I974K910j3939j3055K726J4586J0330o586j7255m936J3472J3896k238j2974
2364c089j0034M636J4456N946j0160j2648J326J0771Q017k039j0625p136N860
2377d719J1333K051p588q554j309Q351R755j985j1239n642N694R986L438o896
2391B676j1050r29J1321Q306m692j0565l560O529R789J544r830p792M141R057
2405D945K304m682o668k121O658P056j823o623l015J972M052L517j739o176k126
$$ y = [-2777, 13268, 16268, 285, -16291, -12754, 7353, 17709, 6991, -10992, -15481, -1639, 15679, 13701, -5134, -16419, -7061, 9248, 13752, 2404, -12999, -14187, 2080, 14588, 8868, -6672, -13255, -6259, 7719, 12753, 1657, -12459, -11946, 1030, 11039, 7363, -5271, -13893, -6169, 9974, 12884, -1055, -14110, -11384, 3202, 13532, 6946, -10309, -15245, -1773, 12123, 9885, -3089, -13123, -8487, 5969, 11915, 1755, -10893, -9567, 1204, 9221, 7182, -3443, -10579, -4719, 6614, 8665, 1077, -7477, -8786, -435, 9320, 7335, -3904, -9546, -3852, 6134, 9572, 2676, -8374, -9303, 2018, 10324, 5632, -4933, -8493, -1964, 7825, 9369, -461, -8253, -4112, 4945, 7249, 2567, -4101, -6222, 436, 7492, 5669, -954, -3969, -1997, 2055, 5572, 3833, -2343, -4469]
2420d469M392M193M44k424m927n12N821M254l949n780q72L250M836Q41n199m436
2436d537L364N409L23l454l090o61K977L116j831l626M85J895J58P87J191k602
2452i6j373K78J039Q85J194k106l399J565M183P38k892k505o35K549L489j198
2468A716n307p07L275K754k84j812k723p6L150J447j167j587j380j004K102L726
2484B123o71m033k064K135L541K726l121o901r6P060M185l083n725l190M265P892
2500E043P52q048n615L913O453K294l629o375j345O461O170k250n695l388J937
2515c322N691M055l674p700j455N729O379M98n874p192J558J0085N005o811r295
2530f323j374Q047R282j362j1292o800P586J0847J161q163r095Q08J0640P047
$$ y = [-4469, -77, 4116, 4560, 2136, -2791, -3303, 2518, 6772, 2823, -2957, -3829, -579, 4257, 5098, -101, -4537, -1173, 4236, 4559, 1105, -1985, -2646, 331, 3447, 1616, -2010, -1525, 370, 528, 1315, 2506, -96, -1469, -1191, -152, 733, 1927, -179, -3578, -2013, 2170, 2908, 16, -2489, -3124, -575, 2914, 1716, -3591, -4298, -1023, 1731, 1447, -365, -3088, -3164, -14, 1433, 266, -1321, -2701, -3705, -1603, 2123, 1452, -2581, -4645, -2510, 1031, 3757, 636, -6265, -6361, 699, 4884, 1801, -3924, -7114, -2849, 5043, 5795, -2253, -7868, -3955, 2498, 4792, 1163, -5212, -6557, -96, 6074, 3824, -1871, -5259, -3322, 2369, 6424, 2750, -4950, -6405, -676, 5703, 6201, 327, -6865, -5307, 4778, 9783, 2972, -6323, -7697, 350, 9632, 8270, -3022, -9822, -2236, 8611, 9772, 1609, -7486, -6678, 3962, 11009]
2544A1009o092j0590j410P102Q335R29q332q476K236R900N402m802q777m900O030
2559b436J1139J714j0271q529K899J0522O440o060j2886l571J1184J2104l129
2572I120j2778p621N755J3277N235j0759j2759J207J1976P663m619j1182n625
2585a1110P833J1971N49j0695p950J827R852P496m385j2259n352Q757J1003J734
2599I271r609j0439R58J2885Q539p460j3480l278J0243J1419N68j3428j0364O644
2613g531J4391L997r388j1732j237J1281J0450l842j3502m463P492J0372K901
2626I189q528j0864L58J2076P548m590j0574n278N657J1066M074r616j0345J732
2640h095J0838P281m760j2168n084R490J2658q73j2252q010M398J2209O276p752
$$ y = [11009, 4917, -5673, -7083, 19, 8354, 9283, 951, -7525, -5289, 4611, 10013, 5211, -3566, -8466, -2436, 8703, 10417, 146, -8383, -5484, 5038, 11478, 5418, -7468, -11039, 145, 12249, 9120, -3658, -11279, -5524, 7753, 12988, 2229, -10530, -9323, 2653, 10316, 5697, -5485, -11110, -3277, 8694, 9243, -1452, -9402, -7575, 2277, 9773, 5388, -6871, -12223, -3466, 7537, 9271, -338, -10777, -9819, 3066, 11605, 4145, -9335, -12613, -2370, 9049, 9617, -3811, -14175, -7531, 6860, 10857, 1469, -10263, -11500, -219, 10231, 6389, -7113, -11576, -4084, 6288, 9189, 661, -10203, -9845, 2231, 9779, 5189, -5385, -10663, -5006, 6060, 10134, 518, -9827, -8095, 2743, 10024, 5264, -6904, -11988, -2498, 10160, 9287, -2965, -10975, -6577, 5632, 11908, 4156]
2654D156j3067j191J1018Q512l112r275n821N080J0138K620q237q132J276P798
2668A763O606j883r797n965N727J0471K070o389q682j222Q543Q902l870j0425
2682d151l986O326Q890J585p991q997L052J0778M317o939q559j499P094P817o12
2697G125q839m976M684O511J570l219o317j815N410N743j348n991l104J473N785
2712B692M452l952p448j252N998M774p99o110m821L140Q253J462o494n156J453
2727c808N158M269k155p222k400N055M394q30l093k127n5L829K159k728l142k5
2743b721J466J760J457j589m429p3M273K836q20l199l578P36N178J960l483l444
2759c670J099K434K071q48l211j115L098K525j492k410o51K30J554K180q81j642
$$ y = [4156, -8911, -10102, 916, 9428, 6316, -2959, -8780, -3700, 6438, 9058, 821, -7311, -6035, 1763, 8369, 6486, -3311, -9276, -3549, 6922, 8992, 2603, -6079, -7301, 1242, 10144, 6274, -4151, -8137, -1811, 7079, 8664, 673, -8324, -5272, 5506, 9823, 2884, -5675, -7174, -80, 7737, 7125, -1714, -6690, -2006, 4505, 6075, 2856, -3461, -5276, 134, 5877, 4529, -1462, -4566, -3093, 2692, 7144, 3192, -4256, -5508, 490, 5264, 4465, -1645, -6466, -3326, 4927, 6389, -105, -5261, -3808, 1350, 5619, 3464, -3758, -6158, -1103, 3291, 2461, -632, -2759, -2814, 1015, 3174, 446, -2696, -2721, -1255, 505, 1962, 373, -4056, -4129, 144, 2980, 2160, -1039, -4617, -3881, 1297, 3257, -226, -3670, -2571, -137, 1934, 1086, -2125, -3240, -142, 2383, 891, -1519, -2170, -1940, -386, 1794, 913, -729]
2775g29m20j29J14K399J127k564k286Q20K033J636j19k651j931K698L837j674
2791B161l366q85R79K984J752k288l693K59L700J194n58j086k602j71L307J559
2807C246k025j821l90L25L172K145l279m054P67L486K633o41m804k961K967O038
2823D804J06n021l442J612N060L078l687o467j091N959M099j302m639l443J770
2838b604N908K101l991m428l38L195L472N56m978m408K758N835J707l272n929
2853d416j656N340O888j032q506l846L566O716L347n239p587L72P612M839m052
2868B346o953k221M793P021O95p507n861L208O933L214k908p034l333N240P220
2883D853m11n692m761R03O103N248l630q033j875O659O223l56p419o318K738R886
$$ y = [-729, -1149, -1278, -1164, 1235, 2362, -202, -2488, -1668, 365, 2001, 1882, -769, -2700, -2, 3835, 2161, -1205, -2090, -1111, 1873, 3625, 1337, -2356, -2097, 1603, 2797, 2239, 1153, -1449, -1620, 1687, 3246, 1221, -600, -990, -665, 2507, 4652, 1373, -2681, -1914, 1572, 4205, 3564, -1240, -4201, -1234, 4804, 4910, -111, -3553, -1941, 3119, 6197, 2510, -3957, -5048, 911, 5010, 3708, -931, -4374, -2604, 3304, 5405, 1414, -3014, -3352, -157, 3315, 3871, -1107, -5515, -2757, 3078, 4785, 1513, -4416, -6072, -732, 6156, 5124, -3382, -7228, -3662, 3054, 6401, 1162, -6425, -6053, 1559, 6398, 2346, -4607, -6828, -2035, 4986, 5681, -1826, -7687, -4479, 2454, 5668, 2760, -4274, -7607, -2367, 4853, 4442, -1250, -6011, -5108, 995, 6243, 2613, -5420, -7295, -636, 5587, 5231, -2188, -8506, -5768, 4118]
2899D118L959o821p989k09P185O871j771r083m956N942Q118M45o070n859O58P378
2915A916N314l667p784k187M376O805J211n370p218Q81Q417M700l718p122l451
2930f897M788Q753Q55q611o670L119Q315M516m322r126j691P849P496k912q073
2945b611l985L979P517K651o166p314R92P497M197k212o551m426L588P721J980
2960F857n868n914M39N365N893j658q006l818N261P184O35o311o337Q75Q472N590
2976H659m892q353j970O159N985J10o553n943L208P215J525m377m609p14M675
2991A25N380j469o758l000L113N175K006k706o142j488N616N162j357n419l413
3006e175J923N522L074m973n998J236N605L710k179n721k933M050O256j26n901
$$ y = [4118, 8077, 1256, -6733, -6942, 243, 7114, 5343, -3740, -8696, -2754, 5364, 5809, -261, -6120, -5462, 1916, 7230, 3563, -4221, -6408, -2032, 4773, 5984, 614, -6604, -5723, 2694, 7394, 3676, -3446, -6897, -2109, 6644, 7499, -1112, -7782, -4663, 3652, 8168, 3846, -5280, -6971, 878, 8374, 5462, -2611, -6596, -2617, 4900, 7551, 1385, -5929, -4937, 2560, 6757, 4545, -2006, -6432, -2844, 4877, 6857, 989, -4925, -4486, 879, 6772, 5114, -2892, -6710, -1449, 5735, 6370, 59, -6278, -5403, 3069, 8659, 3767, -4586, -6556, -397, 5588, 5698, -855, -6798, -3590, 3625, 5150, 773, -3836, -4550, 125, 5505, 4036, -2722, -5722, -2609, 2566, 4572, 1866, -4276, -5764, -148, 5014, 3657, -1762, -5175, -3252, 2270, 5344, 371, -5627, -4391, 1214, 4924, 2745, -2976, -5909, -1859, 4397, 4271, -1630]
3021a630l104J173M591L085j941n307q29M055K672q8l384k615J07M207K532k724
3037H00l407l70K273L150J210l549m004J544L937J428j659l502j573L074M609
3052C961q01m530j863K254L006J470k028l889j94L667J978j521j416j145N97J940
3068A486J067j814k341N43J343Q95J332j584k742N59K633J071n65j658k299P83
3084a291L238Q60k830j503R45J700Q75k23k995n97K356J358o86j449r01o6J515
3101C06J943j044j913k94P0N42J464L18k634j070J790J789k70p93k326k57L245
3118H66K011k627l045LK150K374J29k884k279J551K840K80j497j494p33R93K219
3135H57K50k466r70Q51J201J888k39l488j858K424L169M75k703k407o81M115L299
$$ y = [-1630, -4734, -3561, 1030, 4115, 2174, -3133, -3962, 93, 2765, 2677, -707, -3322, -3215, 992, 3524, 800, -2607, -2977, -704, 2446, 3656, 107, -3897, -2353, 1584, 3012, 1353, -2149, -3722, -648, 3961, 3160, -1370, -3233, -979, 2027, 3497, 1469, -2420, -2614, 1053, 3031, 1510, 94, -1051, -454, 1486, 2553, 739, -1602, -1059, 284, 1179, 2511, 927, -1815, -1256, 1377, 2448, 1883, 225, -2074, -1291, 1947, 2807, -23, -1526, -581, 1119, 1994, 1771, -1224, -1821, 535, 1893, 1207, -242, -1143, -1209, 306, 2249, 1205, -708, -1002, -932, -390, 1074, 1392, -1242, -2312, -522, 1267, 997, 204, -2122, -2379, 866, 2877, 250, -2795, -2792, -642, 1732, 1861, -1023, -3302, -1751, 1089, 1369, -128, -1622, -2355, -1362, 857, 1107, -1359, -2329, -1478, -277, 1611, 1372, -2116, -3974, -1550, 1619, 2094, -609, -3016, -3697, 418, 3717]
3152C717k401m343o70K848L213K36m088l086K167M583R40l171k612q9K867L038
3168C149n75m401j707K619K451J523j707l758p34L776L120o28l933k268N36M447
3184A910L248l402n311N04M299L177j286m128k966L263N396j26n332l306K070
3199a990M218L388k641n663j068M467L555m05l223l369m4M707K975k922l865o53
3215b533K746L811L97m282m666K020N687K180l352m875j802M419N971r93o357
3230a629l306L346M517J475l468n210N7N964L258l082m796j528L236M465N11m698
3246h88l915J402M274K140j088m029k798K768N284J98m163l508J91M370L825k160
3262A903n895j926M908M660o46m567m113J748N766K383m230m967R07L659L856
$$ y = [3717, 1316, -3027, -3697, -849, 2364, 2600, -1488, -4574, -2407, 2176, 3116, -55, -2667, -2756, 111, 3149, 2574, -1827, -3534, -915, 1536, 3059, 1352, -2406, -3140, 636, 3756, 3128, -805, -3073, -2537, 1910, 5158, 1756, -3555, -3051, 1248, 4425, 3139, -989, -3955, -692, 4704, 4578, -754, -4060, -1990, 2228, 5616, 2975, -2688, -3756, 711, 4266, 3861, 638, -2731, -2775, 1932, 4907, 1985, -1880, -2533, 213, 4024, 4421, 139, -4527, -2507, 3180, 5360, 2008, -2867, -4669, -250, 5721, 4728, -1629, -4935, -1589, 2928, 4403, 935, -4275, -4218, 1746, 5004, 1922, -2874, -4402, -1166, 3299, 3810, -888, -4803, -3401, 873, 3013, 1925, -2104, -4902, -2134, 3150, 3348, -815, -4323, -4132, 238, 4063, 1903, -3992, -5918, -1010, 3650, 3004, -1563, -5676, -3928, 1838, 4221, -9, -4976, -4069, -410, 3446]
3277C446o52n129k947L174M175M13k646l172q98L630L890r69m378j522J917L397
3293A729J285k433m654j20M840L469j704m292k363K534M949J291m405m275J798
3308b351M064J862j686l934j161L731L554j389l662j467J302L149K181k765l753
3323b325r9L226K109M16k314l320P41L695J939k299l123n88J827L613Q8m153k433
3340c000K535L434P27k422l522k86L790L194k189l732m81K006K160N52k210k401
3356a845K85K853L74p03j516j359R57K195J028k005j924J79J035J889K59k553
3372h51k349J601L239K72k183j722m39K493K229j212l380m26J886J831J02j673
3388e82j896O54K096L14q74r83k25K49J620M79j542r95L02M78J498O45j512k229
$$ y = [3446, 2794, -2335, -5282, -2108, 2067, 2480, -166, -3338, -4236, -606, 3284, 2315, -2063, -3585, -1668, 1729, 3014, 581, -4073, -4193, 647, 4116, 2412, -1880, -4243, -1709, 3240, 4531, 126, -4149, -2351, 1713, 3575, 1889, -2045, -3206, 525, 4079, 2690, -972, -2439, -1137, 2012, 4193, 1428, -2325, -2424, 802, 2911, 3327, 1013, -2307, -1566, 2129, 4068, 1769, -1354, -1942, -115, 3498, 3586, -567, -3000, -465, 2969, 3696, 1274, -2248, -2534, 1256, 4450, 2261, -1471, -1952, 54, 2214, 2766, 556, -1845, -1560, 1293, 1667, 964, -552, -1911, -954, 1241, 2269, 264, -1660, -1481, -446, 1443, 1702, -851, -3200, -1599, 1640, 1912, -271, -1993, -2432, 61, 2290, 1078, -2302, -2728, -842, 989, 1091, -582, -2478, -1824, 272, 586, -288, -1271, -1496, -1247, 373, 852, -690, -1685, -1383, -905, 593, 1238, -274, -2503]
3406b503N37K565N92j326j557l66J806K232p82k751j45J338J661J91j454j781
3422a743K70K144J013q06j371k00P0R43J166o53j341J8L80Q77J224j039k091m8
3440a187K626J000r93j825j113J539K572j05l108j315J745J860P89j337j949o25
3456a426K180J820j294j812j08L09J057J744j303j960N8Q95J284L69r91k241j27
3473a546K819J140j357k240n82J564K759K26l364k372J730K767Q45j765k439p31
3489b546K444K336r62k768m62J207J811R52k104k262k93K744J335o77j440j577
3505b262N32L014Q06k399k363L86J403K602r1l541j922K358L344q3k344k634j6
3522c210L365K307j845l261j45K128K073J13k564j826Q46L109O05j891j871m87
$$ y = [-2503, -1966, 599, 1191, -135, -1692, -2058, -252, 1980, 1198, -1553, -1698, -360, 1301, 1492, 38, -1743, -1473, 671, 1684, 878, -493, -693, -623, 320, 1486, 833, -508, -490, -110, 767, 1991, 952, -1139, -1187, 1439, 2439, 1446, -379, -1492, 47, 2619, 2514, -594, -1909, -164, 1696, 2485, 1148, -801, -1426, 754, 2574, 1280, -532, -640, -331, 726, 2470, 1167, -793, -735, 160, 1444, 1813, 822, -1419, -1546, 1273, 2413, 1056, -1184, -1766, -202, 2557, 2783, -581, -2953, -1223, 1544, 2389, 624, -1815, -2546, -102, 2234, 1272, -1496, -1958, -751, 1060, 2012, -92, -2354, -2647, 97, 1432, 755, -685, -2262, -1730, 1284, 2090, -309, -2672, -2286, -883, 1719, 1628, -1913, -3835, -1477, 1867, 1784, -560, -3194, -3210, 155, 2462, 617, -2644, -2789, -661, 1412, 1525, -1039, -2865, -2019, 1090, 1695, -196, -2067, -2554]
3538b554J661K445J91k443k381J267K338J463o90l151j606K775L148n65k719j954
3554b775J343K944J791k476l808O38L106J870r24k534j565J623L181M95k950j716
3570a757M91J766K022q82k442j215K248J952K21j461j973o87K618K330j006k999
3586g74j017J277K743J209k580l110J038L565P30j630k641o64K031L088o45l239
3602f19j684K143K018Q19j588k403j70J965J772r82k002n11K94J704J623j413
3618I66k420k40J556J418P65k414k182J035K843P97j984k032j31J887K468q61
3634A471l353j218K404K154l2j588j789k13K487J525j726j496n18J030Q88J143
3650A169j502k127N83K223R20o42j643j661J038K647O04k054j867N28J489J900
$$ y = [-2554, -893, 1552, 1743, -700, -3081, -1814, 524, 1987, 1297, -1854, -3460, -685, 2463, 1898, -821, -2775, -1432, 1512, 3303, 827, -2981, -2343, 763, 2633, 1709, -825, -2390, -767, 2414, 2909, -41, -1757, -1266, 500, 2522, 1640, -802, -2017, 231, 2183, 2404, 943, -1030, -1717, 901, 3231, 2225, -774, -1791, -514, 2229, 3438, 858, -2252, -1214, 2351, 3081, 1451, -1190, -1854, 177, 3265, 2620, -619, -2303, -160, 1858, 2677, 1089, -1314, -1484, 481, 2253, 1271, -731, -1242, -948, 756, 2379, 966, -1454, -1694, -138, 1280, 2045, -369, -2551, -1516, 1327, 2124, 140, -1892, -2023, -136, 2332, 1471, -1882, -3100, -696, 1458, 1426, -162, -1951, -2164, 323, 1848, 122, -1374, -1892, -862, 26, 1169, -333, -2460, -1877, 346, 1266, 624, -1019, -2680, -1642, 1005, 1609, -445, -2312, -1784, -295, 1605]
3666A605o50k517q52J956K016o47j801q08M56J730J411j838j727L77J441J187
3682A339k64j090j749R28J507M95n04j181n82N28J914K72j463j328N12J157J102
3699A593k84j811j368K135J965o32j448j009M59J636P80j131j853M90J241Q36
3715A599k01j067j270P30J322O47j269m04o80L75J246M16j016j273M01R62J137
3732A655l87j547j082J445J794l75j909r68N29J451J413j525j559j59J494N72
3748H42j97j035q29M98J490K53j491o46oP27J002M08j696j235J056R63O78m16
3766C66j410q65R47J770P3j546r49K48J086J220p16k274J35J965Q48m95j501r08
3784b006O73J942J04j060j319O36Q92P72K46j364j253P48J462j08k54p79r16J202
$$ y = [1605, 955, -1562, -2414, -458, 1558, 911, -890, -1698, -1242, 488, 1899, 61, -1666, -1289, 152, 1339, 1075, -15, -1764, -836, 671, 1166, 662, -519, -1101, -573, 1341, 1613, 150, -1178, -666, 491, 1593, 1309, -502, -1870, 265, 2230, 1598, 150, -859, -400, 1236, 2016, 885, -968, -478, 763, 1599, 1398, 331, -939, -209, 1113, 1760, 491, 87, -593, -218, 1028, 1444, 428, -845, -444, 518, 1655, 1268, -279, -1361, 84, 1878, 1503, -406, -1374, -845, 606, 2019, 494, -1065, -1224, 270, 842, 645, -390, -1219, -721, 769, 1022, -469, -1115, -1121, -394, 608, 1016, -680, -1915, -859, 104, 782, 366, -1044, -1909, -962, 808, 881, -665, -1614, -1366, -280, 940, 224, -2050, -1915, 50, 898, 403, -1098, -2006, -1333, 609, 713, -347, -1666, -1030, -138, 634, 880, -484, -1737, -989, 473, 365, 111, -668, -1584, -382]
3802c82J810o13j515l44M26J365R18j184k313J24K273J224j029j410q24J228J605
3819A359N82j903j318R47J182M44m34j420q19J419J349l07o32o17j93R63J236
3836A838l17k242k19J090J110Q09j312k013J78K214R80j191j379o15R21J957L00
3853B109k261j240R59J993O1j292j034l73J195J717m93j475o01K56O66J034l85
3870H36j810k65J334O50m3p27j161n2K173J070j886j543L76J068J375j22j782
3887e09j344R89J918J11j422j128J24J124J363p85j544k27J006O94J12k58j333
3904a109j82J405O57k55j120p98N15J304O98j399j331M34J168P10N9j499j363
3921b106J532J518j33j308r60J1J464J213r71j442j07J257N93j34n50j391M50
$$ y = [-382, 1428, 815, -700, -1044, -618, 747, 1665, 481, -1832, -1708, 565, 1789, 760, -650, -1474, -246, 1359, 1941, 38, -1280, -333, 849, 1293, 859, -561, -1380, 39, 1388, 1081, 449, -168, -361, 602, 1838, 1521, -721, -940, 150, 1260, 2069, 757, -1256, -1078, 1136, 2116, 925, -454, -1069, -148, 1809, 2109, -152, -1392, -433, 1560, 1621, 329, -705, -1078, 117, 1834, 1341, -134, -735, -479, 187, 1221, 836, -974, -1239, 95, 745, 702, -25, -1186, -1238, 935, 2005, 119, -1424, -1048, 20, 1395, 1273, -509, -1853, -864, 1054, 1165, -257, -1385, -1261, -137, 1226, 441, -1103, -1330, -324, 370, 482, 224, -1109, -1291, 114, 771, 516, -604, -1402, -887, 417, 1115, -284, -1615, -1181, -13, 697, 756, -743, -2106, -574, 944, 811, -497, -1457, -1446, 18, 1231, 260, -1182, -1289, -32, 561, 427, -123, -1514, -1064]
3938a064J647L34n71j175P5M64O89Q90j336r42M90O63M67J18j062r24Q86J761
3956A410l41j542n54M11J246J175r01j974j03J404J169l39q73r61L43J097P48
3973A415j226q51L02L65Q46K44r87j111Q61J245J76m23j017j008R68J741Nj565
3991b0j072O08Q99J150o00j986r5J690P04l76j109m99M81J300O21j724r96M42
4009e82J037M69m37o43r58P57J325k44m27n46n95N59J393J35j915p91P78J048
4027C63M65o01j287n02J803J055j064j148k94O29J673J83j569j451Q89J166M74
4044G84m71j249j04P45J100k90j070p7j9P17P00k7j820q4J031N80L31q16j414
4063a453O4J770J400j241j919K12P26J321Q8j290j419J030J735j71j239l69k73
$$ y = [-1064, 583, 917, 346, -829, -754, -290, 399, 1289, -47, -989, -499, 164, 631, 749, -313, -1237, -351, 1410, 1069, -473, -1027, -616, 630, 1805, 904, -1070, -1173, 231, 1400, 1061, 188, -773, -430, 667, 1415, 189, -662, -360, 5, 851, 1095, 108, -1003, -142, 1103, 1279, 856, -161, -1169, -201, 1540, 1545, -20, -1092, -484, 415, 1565, 965, -1021, -1116, 574, 1278, 902, -207, -706, -225, 1075, 1696, -28, -1024, -582, 455, 924, 487, -156, -1114, -357, 968, 724, 297, -249, -844, -285, 1108, 1243, -672, -1463, -685, 363, 828, 227, -1060, -1562, 241, 1296, 232, -916, -1210, -581, 1092, 1275, -294, -1745, -856, 310, 784, 313, -936, -1040, -295, 805, 515, -555, -632, -651, 66, 766, 739, -1081, -1165, -134, 446, 777, -39, -1453, -1389, 381, 1781, 540, -1379, -1167, -441, 880, 968, -322, -1741, -711, 1024, 853, -386, -755, -1028]
4080a028J515R43p02j538k45P96M43Q21n95j034m08J268O87o6o40q45j78J549
4098G43N97j018j248n2J397R21n88j249p74J202J583l30j248m67r9R73J067p08
4116G02j508M45Q60K28Q1p02o99J77R90L57o57l78k23p8R28O25q91j417O45P66
4136B51N23k85q55q94J049J426l92j424o7L88Q09L13q52j011j27J416J60n37o37
4155g46j35M23P67N1o86o97L62K16M09K95q55o73O69O23L69k65r92m82P92J263
4175G08m16j035m21O77N07N22m56j288J92J261K84n56o17K6j73J152K99j239j73
4194g46O90L5j7M59l74l87J9N87L92o11k5k64j4Q80K40j072m06L78N20P00m77
4215E07q39j57Q21P55o06o66K68j79P05L02p46m78L32N95q8N8j27o49j2P27o0
$$ y = [-1028, 487, 1430, 728, -810, -1055, -259, 184, 1005, 410, -624, -1032, 236, 923, 857, 217, -628, -806, 743, 1340, 322, -926, -978, 419, 1340, 752, -497, -1271, -69, 1514, 1184, -64, -531, -630, 343, 1410, 702, -806, -361, 499, 727, 808, 106, -593, -416, 574, 931, 274, -104, -327, -405, 523, 1148, 257, -1160, -515, 251, 774, 489, -366, -1260, -211, 1215, 823, -601, -668, -280, 529, 842, -10, -1021, -1148, 268, 428, -109, -746, -881, -458, 309, 360, -326, -1023, -661, -445, -36, 259, -596, -1269, -600, 23, 392, 127, -865, -1347, -555, 708, 292, -743, -1164, -487, 20, 542, 86, -1202, -1010, 251, 535, -21, -638, -612, -785, 367, 666, -573, -746, -56, -21, -38, 421, 47, -340, -321, 266, 658, 47, 22, -242, -256, 624, 864, -208, -614, -236, 284, 984, 507, -332, -489, 332, 1087, 481, -185, 83, -96, 609, 911, 165, -313, 19, 614, 526, 584, 457, -192, -204, 523, 463]
4236D63M7j53n80l4P60L44q88o17O54L19O31p4j164m38R87O71n54o94j15K82M11
4257B58M12l92r74K27P41o7j01L46r17N8N99K76k63k45k73l00O83P73p35j080
4277i74L50P18N9M03o35j118R23Q35k76j075k71M68P14Q28r69j342L61R20L88
4296C07k13j48q23P1Q32L32o01l50J16K5P50L76q61j046O91Q34K35k93p92n63
4316a121R18J155m01j001p45J070M66N67j112p37K52J151M27m66p33o66P80J083
4334H87P0j478l30L79J121R7j04p93n93N87R90j72m49p09m2Q00J193q01j401J4
4354g34J252O27J15j069j130L52J626J80j310m85J38J020P68m78j250o89R84J098
4372A015k39m25q62j08J114O32p27r49J47J69R44K48j043r85M16J544J36p17p08
$$ y = [463, 510, 357, -223, -257, 503, 847, -41, -658, -4, 315, 946, 872, -292, -730, 257, 928, 374, -320, -435, -153, 258, 670, 278, -696, -469, 272, 205, 104, 450, -467, -409, 190, 466, 203, -42, -315, -615, 68, 841, 106, -974, -624, 94, 153, 556, -79, -1197, -274, 561, 285, -790, -1061, -593, 121, 949, -20, -1362, -1001, -81, 307, 94, -54, -877, -806, 26, 358, -243, -593, -477, -452, 298, 674, -187, -1233, -542, 292, 527, 234, -558, -1121, -203, 952, 551, -450, -1195, -125, 341, 908, -204, -941, -689, 462, 889, 423, -310, -976, -196, 887, 957, -521, -851, -472, 649, 746, 642, -151, -744, -157, 833, 661, 212, -497, -539, 261, 1454, 653, -748, -734, 518, 1145, 1260, 191, -939, -587, 1039, 1219, -91, -576, -438, 582, 1350, 872, -378, -1067, -83, 1015, 776, 351, -511, -619, 495, 1127, 400, -549, -402, -233, 711, 959, -84, -1069, -653, 891, 1027, 310, -398]
4391c98o52O26J586j69j418j026R44Q24N70q94q19j07J232O62p75q36j95L18O82
4410A55P40r68q39L03P13K36j1n30j058N61J232k05n65m09k80N95J093j82j436
4429h55m28J198Q07l42m48j021K73J362L56j008q34L75K97P81J38j257m73R61
4447a18P24k45m86k71k37O29N03m20l45j79N21R5M83m28o89j09Q65M03l75n16
4467a95m63M07R51L58j113o70O84N23L36m29m51l07P28O68m55r42J31N50J77J0
4487D98j34p96M16P00l34k22P7l49J0Q21n0m48j63L39l38N44o6m27n93O64J41
4508B90p6k86lk61O97L72l90q69P28J90m05P9L5l57R6M78n92m48Q62M5l94J23
4530h6N1j78l6K28k02l21M15J46j45k71M33o06K15N13m69o4M69m88j98N08m3n74
$$ y = [-398, -1050, -424, 1162, 993, -425, -1451, -507, 317, 887, -7, -826, -933, 299, 961, 186, -650, -845, -527, 155, 895, -73, -912, -609, 104, 340, 329, -201, -1259, -698, 534, 329, -236, -645, -925, -330, 763, 581, -855, -1283, -85, 722, 380, -68, -1089, -816, 546, 902, -106, -940, -565, -268, 513, 651, -606, -1079, -118, 606, 361, -125, -396, -633, -4, 499, 79, -266, -445, 76, 171, 654, 226, -463, -572, 293, 696, 321, -195, -658, -251, 700, 1058, -55, -725, -41, 482, 818, 389, -62, -369, 359, 1027, 572, -370, -239, 311, 488, 498, 364, -432, -16, 684, 350, 128, 205, -144, -134, 687, 637, 189, 26, 365, 27, 571, 505, 78, -515, 149, 290, 214, -72, -75, -336, 361, 733, 343, -526, 202, 392, -13, 66, 101, -256, -160, 318, -274, -722, 140, 185, -209, -86, -35, -213, -249, -21, -223, -544, -129, 17, -128, -399, 34, -572, -357, 156, -313, -377, 92, -396, -594, -86, -129, -703]
4552g03J20P84m40J68j96n40J82O98K13p64l48O82MQ4L7o67q2P82K81n78m56L98
4574c41K41J22M72j026j1J48O13M9l82m2m06J37Q36O1o01k74N79R2K39q4q56j06
4596e40J008L74l88l49k96j30J158J57q85m68M27M37J26o8n34m91Q52N84j66o65
4616A43j33j29N10P68m94r48O8M48M70M6o82n18J71J084K36o40r66K11P87N80
4636A012p2j008o64J030N68J39q53n75o8J120M83p29j037N4P43N16J44j034p71
4655a002M88J372m41l49p34j21Q28M42l62r44J05P27M48j75m04j072K75P39Q71
4674F91n80r33k19N16N75M59p19j178O52J275J36o15j076J7Q54Q72j46j444n34
4693a397R17O15O25p57j141N4J151L92m55p25j30L91R77J60q06p89K72Q72M88
$$ y = [-703, -583, 201, -239, -71, -267, -807, -625, 73, 286, -478, -826, -144, -140, -56, -19, -686, -768, 14, 295, -283, -739, -341, -100, 22, 494, -532, -543, -395, 218, 267, -115, -157, -563, -426, 410, 471, -130, -404, 175, 267, 506, 422, -434, -540, 468, 842, 454, 105, -191, -321, 837, 994, 109, -359, 68, 505, 631, 563, 29, -462, 390, 974, 808, 143, 10, -119, 391, 1159, 665, -283, -215, 233, 703, 749, 67, -451, -280, 804, 1040, 400, -566, -355, 432, 1012, 940, -68, -732, 298, 866, 1005, 152, -423, -491, 629, 1112, 383, -654, -600, 143, 659, 803, -231, -1002, -514, 858, 417, 68, -666, -787, 41, 483, 121, -823, -718, 9, 457, 282, -122, -1194, -919, -180, 691, 111, -822, -1041, -525, 50, 509, -210, -1388, -736, 539, 675, 60, -1016, -999, -145, 727, 581, -863, -1397, -480, 135, 760, 3, -1138, -1084, 67, 459, 4, -721, -851, -460, 517, 677, -129, -918, -646, 226, 714]
4712G14k40r63k11P07O43p6j044j14N3J126N08o94j028k0J208L11k66r41k55O21
4732C9J068l67q05k58N28L63L40k47q87k21P97O80m78n12k63m2Q31P67r99m48
4752a14L3N07J10K15o72q44N51J214m01q32l56m6P80Q28o67q38m26J261P08l90
4772F21q49k19k91J241M72r88p67L68M51L87Pr07j99O08O23n04q3n45K01K41P23
4793E91m10q45O8L93L89j19rp04l2J073J09r66j96K20J46M62M5o74n15R86K48
4814B60j64k70p15N00O56J09q12l48L67M58k28K97k32n97P94nj0n72K48R9K08
4835D3K50k46m86K2N45P5K82l47p88K10R27K24p34j14K61J70L03l40n67k03O14
4856A01P97o95m19j22K10N89K03o93l82M35L38j78j66J15k41J92P87o11j95j15
$$ y = [714, 474, -489, -700, 7, 650, 574, -470, -584, -531, 595, 1103, 409, -619, -639, 569, 880, 614, -327, -582, 39, 1107, 740, -65, -323, 205, 568, 908, 661, -226, -447, 350, 1030, 552, 40, -223, -265, 566, 1333, 334, -114, -81, 426, 536, 751, 79, -765, -214, 1000, 599, -233, -589, -635, 145, 973, 306, -532, -958, 303, 1011, 621, -228, -447, -738, 503, 975, -13, -780, -412, 39, 426, 433, -474, -673, -65, 558, 54, -29, -574, -373, -132, 591, 181, -664, -596, -203, 186, 67, 58, -646, -678, 395, 504, -462, -658, -438, -292, 170, 215, -459, -974, 12, 260, 96, -174, -889, -389, 267, 376, -436, -784, -417, 41, -187, 110, -122, -719, 75, 70, 60, -512, -264, -165, 43, 293, 47, -439, -417, 128, 203, 485, 138, -650, -440, 487, 711, -23, -137, 124, 294, 597, 257, -310, -513, 101, 898, 203, -216, -338, -128, 461, 664, -29, -411, 24, 362, 184, 18, 133, -108, 84, 871, 260, 65, -50]
4876e0L12J84P9o3m61j2O76J7k81n06o0K61N79K47j262k84P00N27P8n13m20R3
4898a59M56M82n83p21J73N42M37k60k18q95N98O31k03k86k13l70Q57L22p34l28
4918d72p4O49k64M27k66q04j9R07L40n48l18n56P63R61k40r13l61M35M88J98m41
4939a08o48JN99O87o13p50K45M23L32R5n95n34K17Q04m2j36o83o9L77J118k54
4960D66r33l10J75N89P92n27r68l68J118N64o74m64p5L81R42K32j315m69P36P87
4980F79p8l04p90j48R55P00n76p75k53L82O92M49n57q69K12R99J24k99n55k34
5000b46J46P53K93q43k92J49M07O16l56r02m93J047J123p61l90n22L43R45q5n90
5020C42j191O06R02K56l17q58k60M33O81p0n85o25N75L74N5K9j167P3R70K65J14
$$ y = [-50, 262, 446, 525, 462, 1, -11, 665, 682, 401, -105, -165, 96, 675, 922, -340, -624, 76, 603, 681, 168, -252, -159, 297, 779, 196, -525, -352, 190, 627, 367, 149, -746, -148, 483, 280, -6, -219, -589, 268, 590, -144, -472, -546, 103, -161, 266, 0, -804, -823, 84, 424, -124, -442, -998, -235, 726, 486, -427, -788, -353, 135, 333, -108, -756, -755, -156, 531, -82, -832, -587, -164, 168, 263, -332, -866, -649, 155, 113, -23, -706, -775, -398, 720, 466, -467, -777, -602, -13, 779, 252, -716, -1084, 34, 598, -76, -540, -615, -234, 708, 940, -375, -844, -108, 679, 601, 297, -493, -641, 314, 1014, 438, -337, -590, -208, 484, 933, 376, -493, -281, 718, 842, 543, -12, -246, -100, 653, 946, 103, -189, -40, 367, 983, 627, -275, -768, 279, 1402, 641, 251, -271, 72, 1017, 932, 342, -849, -243, 659, 915, 598, -260, -520, -87, 594, 524, -61, -686, -111, 263, 318, 347, -820, -747, 223, 488, 602]
5041F02p52m27j1Q90M03o49o27J03R20j5K0n67r58R76O22O8r64l10J34M20O52
5062E30l52j141L13M81N27l98j71n60O67L03j09j62n35N6M12N01Q7r40n31J031
5082IM06r3m75l97L5Q98L70j081l83J08O96Q85p08o47n35P47N79Q9n75o12R2Q64
5104B72M14l31j059K1J002M34n19k25l12M8R49j36j035J86N31K18J9nq64LO61
5125B72P12m19m23k42k74R24N02n12r82L05M62K95j88o44m25N19Q08R6q71l59
5145d44J81Q12M04n34p74k59J123N8k35m62k41J0R33n4l42p33K65N22J03J10q29
5166c86j72K34J137l52o58q1j67P30L82o83r36M65O71K89p0q53m28O73Q34j7j061
5187d49j43M53K36M12l85r06j81R24M63m57o82J67K14M80L80o25m97j05P05K32
$$ y = [602, -150, -577, -588, 302, 705, 56, -571, -468, 452, 437, 457, -110, -1068, -92, 530, 598, -366, -676, -542, -122, 530, 178, -963, -650, -169, 358, -40, -211, -771, -104, 199, 90, -72, -607, -551, -139, 362, 449, -491, -1022, 9, 415, 322, -153, -550, -515, 383, 753, -328, -711, -603, 93, 978, 270, -377, -912, -165, 414, 503, -72, -684, -592, 272, 686, 355, -704, -683, 319, 753, 234, 9, -303, -255, 694, 558, -477, -291, 240, 458, 477, 472, -392, -389, 272, 984, 565, 142, -100, -374, 550, 1052, 540, -442, -137, 325, 620, 432, -212, -637, -118, 690, 786, -85, -444, -263, 549, 953, 419, -355, -614, 509, 567, 332, -130, -371, -361, 572, 518, 176, -557, -292, 230, 333, 443, -386, -558, -324, 813, 461, -197, -278, -445, 285, 667, -16, -952, -487, 184, 473, 403, -450, -878, -205, 629, 612, -449, -592, -139, 97, 509, 124, -782, -963, -39, 424, -33, -715, -548, -334, 146, 526, -99, -596, -701, 4, 236]
5207B36J06o24n71O56P20k06l21q10N15M09O45m33j221N73N83L99m26l91p66N72
5227c55J047P4j083n04N12O60K31r3q53k99P88M96l70j55l72j05Q74L80l94q86
5247d07J02P15K68j69n49o69O75R04m46j54o29P2N94N24o52n14l80J073N40j30
5267G68q55m56N72J58Q18j001k08r1N66L94k83o49l51P55M97m8p87k0QO79K44
5288G10j38j191L4J026r3J79p93m74M75J026Q7q20o25J02Q09O15o24q56k75O78
5308a48O80k23n34k48L44O08j03m27o89K49O69L38l85o69k11N37O75l5n19k94
5328c85k51P68M76o15q07L21L89M67K05p69l32j91O83O41r55l63K52N11L31j16
5348B60p77k35N70Q47n33m56L9p8O83N13j024n14K95O96J29r2n74l33N31M41O2
$$ y = [236, 342, -282, -853, -197, 523, 317, -4, -814, -299, 110, 755, 322, -899, -326, 257, 656, 230, -161, -927, -355, 692, 766, -317, -821, -309, 351, 582, 489, -364, -663, 125, 621, 251, 96, -276, -381, 493, 873, 479, -407, -305, 410, 678, 509, -40, -709, -34, 870, 424, 270, -359, -287, 307, 831, 179, -335, -715, 358, 898, 768, -87, -543, 29, 187, 1005, 4, -204, -295, 271, 665, 382, -267, -618, 137, 634, 586, -201, -221, -213, 466, 710, 572, -619, -585, 441, 348, 527, -266, -740, -265, 761, 848, 28, -597, -495, 314, 929, 305, -551, -826, -148, 532, 309, -225, -473, -129, 479, 376, -51, -740, -491, 178, 516, 131, -538, -749, -212, 463, 428, -91, -385, -636, 132, 608, -7, -814, -493, -104, 363, 568, -201, -533, -724, -41, 600, -355, -718, -466, 45, 376, 260, -517, -752, -182, 665, 132, -324, -285, -363, 320, 833, -191, -705, -410, 286, 415, 323, -251, -584, -53, 388, 450]
5369D50m31o05L15N15M21l20r26J8O42N76l04m4q04o5Q33O60q08p36M96M57L02
5390F42K2j197j91Q84O85k08q98j12J34M71O57n90p55J93Q63K58o36l54o01O46
5410h7N88K46q71k10J92L89O15k76j048m51R24O21Jq76m08K62N39R15r49q64K85
5431d63N89M34l73p17k73O36Q25k35p38l44K6R57L81q08n67p6P24J94J29r32l33
5452i64L96R78K44j020n75R6N82Q95m56m03p23L82J133k56p42j05m3Q38L14n30
5472D1r58J88R94K67k15m54o84N93Q89j36o52n56K25N07O52l83n09m96Q89L56
5492E58J75p99m46o7P80O95p04n54j11M61P03j47p72K9K29P35l1o59m74j14Q62
5513C49N09m69q19j76R50L65O0o57p71N84O58K07m04p28m50Q77O74m2q29n18M90
$$ y = [450, 19, -586, -271, 244, 665, 345, -581, -563, 79, 655, 351, 307, -497, -562, 271, 931, 123, -613, -117, 340, 642, 664, -533, -724, 160, 845, 637, -261, -373, -239, 232, 889, 299, -456, -263, 600, 858, 222, -132, -733, -87, 501, 747, -124, -334, -142, 247, 862, 586, -462, -913, 11, 632, 633, -243, -651, -389, 150, 1065, 116, -748, -463, 126, 560, 187, -530, -803, -167, 658, 423, -315, -659, -633, 324, 705, -103, -670, -746, -22, 172, 301, -631, -964, -568, 410, 654, -366, -941, -845, -263, 632, 176, -227, -950, -568, 565, 309, -433, -538, -581, 257, 571, 41, -917, -729, 265, 532, 317, -137, -821, -228, 661, 525, -127, -683, -458, 49, 701, 318, -191, -687, 202, 558, 733, -66, -512, -579, 201, 896, 192, -362, -473, -12, 691, 544, -228, -199, 30, 765, 734, 75, -399, -513, 349, 858, 389, -430, -606, 344, 709, 769, 112, -659, -75, 583, 790, 386, -342, -792, 85, 759, 717, -112, -630, -140]
5534a40P18J08o35m79k66J239J1k24p74k03M85P97j9p68n28O21M24M61n74q65
5554f11J36N74N75j12r72j52L16P13K39q78p93M53P24N49m01q66j61N70Q15l60
5574C58q46p0J53P09J22k45m02o24Q10O62m20r07j14P81M23M31j002o41M44M32
5594E4N77q00m67j18O63N47p5q86k53O24N04lk44q61K93O40M27m28l34k01o6O28
5616B21N10r42m57K84P64L35m86k99l74N71N64l81o45j31Q29QM05n30p96K50O50
5637C50K55k79l33j55J64N91k87l87l43N09M82l4p7p54K8Q17j5j43n17J09K03
5658A84L68J50m48r01N72O76j35l66n47Q5O89M22l88p39k6M85M59L7p16m13K75
5679b77P26j82q1o80L85J33M10O8j043J36K25P30k45m27j62j09L14P03q18l07
$$ y = [-140, 578, 686, 51, -428, -694, 545, 556, 332, -442, -645, -160, 637, 618, -150, -678, -57, 367, 828, 254, -611, -475, 99, 674, 562, -410, -562, -246, 467, 706, -172, -965, -512, 212, 761, 360, -506, -667, -97, 718, 358, -488, -558, -405, 304, 426, 181, -221, -845, -35, 627, 207, -700, -814, -33, 390, 821, -181, -822, -378, 54, 631, -169, -636, -754, -91, 456, 381, -505, -758, -134, 370, 367, 123, -738, -445, 195, 622, 194, -140, -341, -407, 221, 731, -211, -668, -384, 380, 715, 229, -70, -444, 127, 691, 310, -335, -466, 363, 371, 776, 246, -550, -300, 350, 605, 326, -7, -162, 2, 593, 306, -81, -424, 85, 567, 533, 456, -298, -270, 547, 532, 389, -128, -19, 184, 552, 702, 254, -647, -75, 601, 466, 100, -447, -362, 327, 749, 361, -378, -404, 81, 540, 577, -139, -552, -277, 449, 267, 186, -494, -109, 24, 434, 502, -541, -405, -180, 550, 305, -122, -284, -393, -79, 624, -194, -501]
5699e01Q5M05K22K83j064l88O25K24P44p75o38K35M34N36l61q26o6P27M84K55
5719F40j030l73L87P15J39p58j24r3L44P68j38j033m71O65P71J53o87o84L46P51
5739B88L61n88p02m2N65M98L03p82o42O58K07N69p00k75j78L89O96n25o66Q4L99
5760h3R55k35p12m45J54P13N99q33n37p5N98M87J27r36n10P41P61j80n13l85j14
5781d23P13P20k47j185K52J73M42K50k68j168K26J084K37n13o81k60J020J47K70
5800G89j035n23N33R75L4o24q58K5Q84P38o66p91j45K80P59J19l66q42L1J014
5820C31J38j17r67l83J081N69j25p66p47L62J021J3J1j201o2J087L42n57m68l34
5840g72N07P10J18p40r84N32Q40M5k69o18j66O05Q07m39q08l06O39P72j67m93
$$ y = [-501, -416, -11, 211, 494, -570, -958, -333, -109, 635, -140, -778, -543, -109, 427, 66, -760, -826, -99, 385, 640, -390, -763, -376, 339, 478, -280, -404, -497, -153, 615, 477, -556, -1027, -362, 409, 562, -125, -809, -463, 288, 649, 61, -641, -683, -118, 380, 683, -99, -741, -83, 124, 693, -7, -282, -460, -71, 625, 100, -566, -482, -83, 872, 637, -75, -520, -366, 347, 946, 113, -424, -499, 99, 586, 713, -223, -733, 8, 769, 589, 76, -309, -423, 290, 1010, 763, -422, -170, 3, 445, 695, 427, -741, -515, 569, 806, 293, -388, -648, 372, 519, 789, -246, -769, -236, 739, 773, 149, -709, -684, 200, 938, 272, -519, -664, -384, 375, 494, 128, -714, -683, 331, 469, 352, -615, -998, 83, 652, 527, -239, -986, -624, 397, 410, 421, -780, -842, 245, 587, 30, -438, -772, -265, 445, 563, -177, -1161, -629, 211, 256, -13, -631, -797, -192, 615, 176, -632, -938, -299, 473, 306, -187]
5860a87m94%O35N67l9q76k27O78O92j89r53m32K65J040j16p7q29j88Q59Q69l12
5881F86j047k11L81L66P09o85o57P3O21M41m35m33m03N36O80rn80n08L79O15k8
5902D91r5n95M2J50Q55l21o47k59P1O61M08n85o91M21L57K82k18n98k62P09M29
5923F05j96n00k44R9R05o0l99o38J77K47L57k50o78J86m9J010r0q01j50J69N41
5944B41M13l38m88m30R36O6m0n40jJ8M36j56l50m16O49K66m4Lp17L3L27M81k50
5967I9m04k65K86N11Q2k29o97K43O73K49l82o19k72O24K66K23o43J24k83M89L23
5988C98k80m47n3L56O08o18m20k16M69N45L94o59n17J71K96K60j45n28P0M79N78
6009G41o10l48L5R7O41j2j27r16K80N18M59p11m19J14N12N08n98l35m13Q23J95
$$ y = [-187, -681, -681, -46, 521, 482, -394, -621, 57, 749, 560, -393, -825, -560, 480, 364, 287, -542, -730, 129, 998, 686, -361, -572, -191, 175, 884, 199, -458, -385, 236, 677, 242, -191, -594, -58, 622, 613, 33, -475, -96, 519, 491, 396, -199, -157, -7, 848, 527, -120, -379, -308, 353, 761, 176, -515, -94, 263, 545, 327, -271, -533, 176, 605, 409, -91, -335, -236, 669, 609, 210, -428, -251, -4, 353, 103, -575, -389, -438, 572, 482, -319, -469, -300, 241, 654, 316, -172, -602, 334, 400, 360, -180, -181, -163, 273, 117, -233, -649, 0, 266, 222, 225, -492, -459, -132, 349, 99, -305, -570, -284, 227, 309, 80, -617, -374, 299, 548, 166, -453, -725, -101, 165, 388, -255, -131, -414, 75, 398, 118, -329, -382, -26, 582, -36, -456, -672, -203, 342, 736, 77, -440, -269, 27, 287, 142, -386, -316, 163, 741, 131, -217, -182, -85, 556, 544, 417, -499, -219, 299, 758, 47, -372, -258, 254, 762, 164, -171, -584, 239, 434]
6030D34j17o2p92K50N81J47j97m56j86O59LK37m76o66N74O04J2n09k72J43L60
6051B71K50R5j084L2M53O46j65o75l21J87O21L10m55n27k12M36P65j34o14o27
6071g48M81Q69m51m35l20j41Q56N95m65j259K33M92R22o8n61j072M70R86K63m00
6091B47r86j37N77R96l32j053n6L92Q41j70j24r39J30O37O58o35p17J54K77P25
6111D85Q0p44o11K03J257Oo01m14l01P35J065n50j140k58N70M11J39j74p69J96
6131d15Q19K73p03m52j99N54Q91k45q22k50K14P20M58m30o40n16P48O85k8n16
6151A46r01N62M05P36m53j017K90L86O46m35o47l77M57J159Mj185j77J52N94J59
6171E04Mj000P5M34M65K1r96J11M73L70L55l01j082L30J40P29l5n10p37N44J002
$$ y = [434, 317, 255, -537, -287, 294, 441, 244, -212, -398, 261, 264, 501, 25, -641, -67, 537, 549, 40, -232, -89, 271, 521, 616, -468, -436, 17, 663, 498, -177, -498, -311, 310, 620, 165, -362, -574, -138, 627, 493, -121, -748, -267, 602, 151, -284, -604, -745, 111, 706, 241, -1018, -785, -293, 629, 561, 0, -1072, -602, 384, 647, 247, -739, -876, -299, 697, 365, -688, -744, -352, 489, 319, 195, -744, -614, 23, 681, 46, -671, -517, -240, 485, 565, -179, -790, -587, 670, 676, 75, -339, -640, 95, 1160, 610, -530, -788, -218, 193, 332, 158, -611, -415, 404, 677, -26, -478, -677, -123, 768, 523, -299, -549, -335, 385, 843, 413, -227, -743, 5, 690, 662, 146, -755, -193, 212, 948, 495, -522, -232, 154, 800, 365, -282, -659, -202, 957, 961, -224, -401, -249, 345, 504, 508, -492, -417, 17, 482, 503, -493, -382, 91, 461, 816, 515, -567, -237, -97, 632, 597, 87, -650, -106, 896]
6192H96n48m18k41k92J100N5m32p14j60Q37M61k61m97l49K77O31M47o82n55r3
6212e38L49O07l80l65j54O40R8J82n04k14j55M47N75n14n99kN02M75j22j89o95
6233e56K09O32o3k96m04R8L26M51k53q41J01N55L00j6k6p05J4P87J48j49o01J3
6255b76L75J82Q4l29m22J08O55o5n8l46J8K57K46m52k58M8L41K24J2j29k62j81
6277b28N78L39p36n0m9M8N91j71p52K08M06M51l69k06k48o5N17J78m58m39J84
6298b71M51N3J06k15m46M35J05o9j17k19K62K0K49l46k56p2N89j08J35l32l09
6319c55O01R6J46o28j52R2M74K13l60k99j06L97J82j36n29j07K11N25q7k34m44
6340e00J68Q79o76J88o62J05N35M87o98m24K44k3N98J04o23l26L05L76L25n19
$$ y = [896, 348, -70, -311, -603, 497, 552, 120, -594, -754, 83, 544, 283, -214, -563, -286, 345, 792, 110, -445, -538, -189, 418, 38, -327, -481, 159, 257, 439, -65, -279, -434, 13, 588, 74, -525, -527, -25, 450, 328, 139, -556, -347, 285, 222, -74, -478, -380, -54, 397, 144, -697, -596, -41, 259, 243, 217, -488, -474, 313, 461, 312, -289, -276, 99, 281, 365, 36, -386, -278, 377, 312, 254, -92, -74, 183, 429, -23, -281, -233, 108, 332, 344, 215, -47, -228, 350, 689, -47, -97, -146, -98, 493, 322, -430, -222, 184, 635, 266, 60, -188, -253, 264, 442, -16, -455, -271, 180, 233, 339, 124, -322, 113, 218, 149, 32, -187, 75, 95, 344, -2, -258, -330, 259, 151, 286, -46, -355, 246, 342, 488, -140, -292, -200, 274, 487, 127, -172, -278, 119, 301, 165, -364, -471, -260, 265, 178, -56, -500, -332, 547, -129, 59, -603, -498, 37, 524, -174, -598, -354, -377, 221, 325, -298, -624, -319, 57, 382, -137]
6360a37m86O5P43K79l00p35j53J63R20J23m11n69%O61K68j85l58m74L49N30o0
6381B33n40m14K17N90K18l12l59j47L31P12o9q10m13O26N61J01l72j057M82O63
6401B41J49J45j191K28M03L99N58r72o84P24N20J12J53j117j26R53K51l58m75
6420h7m42J76M93P22j070k62L25N22J74l5q98j26K19J202l02m70o07L94O06l9
6440D95j45r13k52J206K46j69p28m85M96P02N75r24r07K25R10K45l86m77o26Q87
6460b5M24J16p15l22p4P23N92o55o52j5O11O69l81m63m92M0J027j8o73m02J85
6481e00M80N50l32o35m43O17N82K68p04l53k87N65N92q3q96O8J38O24J36p08p16
6502a037N60Q49om23o34L52M06O07m65n17m92N76Q36j09q12j24oO73M40j83p80
$$ y = [-137, -623, -558, 185, 464, 164, -571, -724, -561, 359, 482, 71, -498, -498, 163, 431, 246, -112, -586, -237, 293, 233, -307, -721, -504, 86, 304, -8, -367, -514, -183, 529, 460, -350, -763, -137, 424, 525, 153, -904, -422, 241, 390, 535, -656, -428, -25, 374, 932, -40, -724, 0, 520, 632, 785, -332, -458, 495, 746, 388, -87, -529, -353, 140, 862, -208, -470, -145, 377, 551, 516, -382, -508, -289, 913, 611, 141, -466, -72, 534, 495, 350, -563, -815, 391, 637, 468, -260, -745, -249, 453, 1028, 104, -803, -578, 332, 577, 191, -286, -912, -25, 399, 515, -200, -522, -596, 127, 719, 64, -588, -603, 8, 677, 296, -167, -659, -619, 408, 390, -283, -685, -500, -20, 530, 198, -437, -880, -263, 319, 587, -117, -470, -757, -192, 400, 317, -579, -511, -373, 251, 387, -321, -1037, -477, 372, 366, -57, -691, -339, 67, 674, 209, -308, -800, -224, 612, 503, -309, -433, -439, 234, 674, 491, -289]
6523b89k75N86J04O65r29k55jO85l9r8m68l60P68M8O3n92j01M49K32M78o45m34
6545d08j79P59M48n11m57K55R7L72K9n72m13K14R98j83k59n47q9M33O29l93l08
6566h5j56J90M34Qk71p43O16J88J00k55k61P8q6R61k47o60k61L53K93J65k13n10
6588c62K03K74J26N4q02J56M28J50k28k51L6n1O26k56l16M7j07J43J82j93k38
6609c79K35R9j0l7L92q11L03N26k58m65p5K71J41j31n8K60l97N48q0o2k17k61
6631d66M31K46J27n40j41P4N15p1j93p3QJ70J04L1n40K35P8L28j69k75q3q1L88
6654A03J78k2l50r9K31L27j22p64M12k5P28j95l83m00p9O04L58k76m83K06J03
6675E2L48J28o79l31O03J36J52j50n87L9M51J90Q3m88j97N9Q19p2l98o46M37L72
$$ y = [-289, -564, 22, 126, 791, -138, -393, -394, 291, 252, 154, -314, -674, 94, 142, 205, -387, -488, -39, 193, 671, 26, -408, -587, 172, 620, 109, -348, -93, 4, 376, 405, -167, -580, -366, 632, 449, 190, -357, -446, -13, 616, 223, -85, -241, -51, 383, 391, 120, -623, -7, 181, 281, 26, -235, -157, -243, 718, 471, -189, -450, -97, 196, 361, 148, -362, -159, 115, 241, 295, -507, -351, 77, 227, -1, -252, -216, -267, 359, 103, -213, -166, -273, -130, 52, -141, -379, -144, -45, -55, -92, 300, -511, -208, 318, 60, -405, -480, -209, -68, -199, -257, 3, -394, 154, 74, 12, -205, -466, -35, 211, 338, -202, -343, -269, 246, 175, -18, -91, -83, 87, 191, 222, -318, -83, -5, 323, 154, -121, -204, -285, 103, 281, 259, -91, -190, 41, 368, 246, -518, -106, -131, 597, 402, 19, -381, -460, 144, 502, 226, -257, -51, 52, 400, 528, -151, -482, 121, 257, 409, 259, -328, -289, 162, 352, 435, -53, -250, -191, 628, 556, 158, -488, -51, 321]
6697C21M7k20j68n46O18L67K98r14n20M68L48M54l60n26p9P87K12k04p03k97N44
6718g3M71O6k71n14r9R63J7o94l99K75L20L61k41n47J16q6N86J60l87o53Q9Q23
6740B83K71j25p42k20M28K88L89q11m02J71L22N25m04l50n81P95P57l29k06q70
6760h11N36Q08k90j78p27J99N49L95k24m91o91M65Q46J32q65O4j30M31O17k45
6780C90o43m61R91J67j26m59l03J93O41L27m58p05R4M33N76l7r28O5Q0N57N93
6801I87r64m03k36Q20L08k15q36k4P59L55j67m76j01k22O50M92o42k73j4M02N24
6822G24p0p34j62J39N07p6k2q31J99J92P41l53p69J66J57P41J09q38k33K04N08
6843B99L94n37m53j88P59j48J48m99k68J82M36K11l76m24J96K75K27P8n25m3Q1
$$ y = [321, 368, 148, -20, -566, 52, 419, 717, -197, -717, -249, 99, 553, 193, -333, -412, 375, 587, 383, -320, -617, -73, 398, 464, 193, -321, -420, 543, 560, -134, -533, -258, 62, 423, 182, -365, -249, -335, 251, 411, 24, -629, -540, 283, 554, 429, -313, -533, -105, 183, 572, -239, -641, -470, -148, 377, -27, -377, -958, -163, 594, 265, 59, -811, -275, 533, 243, 65, -662, -463, 86, 481, 257, -234, -925, -460, 386, 518, -347, -283, -413, 18, 635, 390, -253, -714, 277, 444, 318, -141, -444, -251, 390, 717, 259, -446, -352, 81, 657, 620, -308, -243, -163, 394, 987, 23, -380, -616, 204, 512, 297, -539, -563, 196, 551, 384, -92, -193, -415, 235, 727, 85, -188, -202, 200, 724, 654, -80, -242, -103, 404, 328, 306, -525, -326, -134, 607, 254, -515, -349, -192, 549, 658, -180, -413, -209, 299, 693, 156, -297, -485, 274, 126, 274, -225, -493, -311, 125, 336, -40, -464, -268, 7, 234, 312, -213, -256, -175]
6864a75L12j56q3l33J69L98K57l70J24o82M75M35n02K6r5J04K37K93m85n22J19
6885d54M13M9J25k90m5J40L13k22J82n10k0M56k16m0j14j03N03LK15k79j99l2
6907a25L44K3m23k32L19J6M23k11k10L24k55L40l76j74J31J47m6L44j50m0n64
6928c95O04j28l29M43j35P2J6m7m07J66Q2N18l87k91J30m0N11J41p26K1J24K66
6950B09q6l7J08o02L60M53j62l65O9J07K27Ql98k29L93J12j6q6o6j53K00K77l41
6973a8J93o00K22L95j39o8l49n7N21J05l91qn18M33K80K48l04k14K38L61K83m77
6995A36j54j72K27K81Nm23l16K67K18Om4l67p1N93K58j85m25N9q5L18L03m74m25
7018d70L14O83j79k67k18j07J68N02j13n18l78L56O18M9m81m68O3O47q7O3l24
$$ y = [-175, 137, -19, -102, -435, -266, 132, 389, 19, 143, -539, -64, 371, -131, -105, -200, -96, 141, 434, -51, -573, -454, -41, 8, 133, -157, -202, -62, 251, 29, 211, -299, -319, 137, -79, -119, -233, -336, 167, 170, 385, 106, -93, -125, 219, 242, -181, -413, -94, -78, 345, 134, -76, 248, -7, 333, -43, -217, -86, 61, 15, 359, 209, 169, -395, 209, 81, -248, 195, 60, 132, 148, 101, -306, -140, -58, 460, 73, -218, -88, -128, 383, 524, -202, -181, -57, 209, 123, 86, 194, -408, -48, 405, 243, -122, -53, 54, 281, 289, -109, -338, 55, 167, 151, 65, -1, -154, 46, 323, -18, 175, -425, -203, 192, 53, -15, -364, -421, 100, 205, -186, -194, -712, -279, 1, 249, -55, -269, -31, 330, 613, 136, -18, -190, 37, 318, 323, -100, -416, -149, 69, 75, 31, -336, -407, 186, 444, 259, -166, -107, -192, 126, 429, -45, -470, -156, 527, 348, 81, -137, -244, -76, 426, 313, -205, -583, -227, 391, 440, -41, -509, -446, 201, 114, 177, -147]
7039a47j59P5M61K22o05o72O12N14N3Kp50Q7K94L96J70q82l11K30N22L33m60m77
7061d92N9P67J30j77l88l04L88L42J58n19l72J39M69M33l5p29m50Q78J25j13m69
7082a60k38N8N95L89p21l63R0L16N53qq30k0J86L82j91n0l34m6O77j69J01k71
7104e4l13N40L06j54m22m84M45P29m46n3l33J27J49L45k7p04k70L72O39R6n45
7125e7l81p6N57O39m52n50o5Q7L84K83m84k99K68K76L88l09o59m8L95N43l6n94
7147a90m6O5K52L97m18m97J19K77K28p9k50j56J51K83L49n96l54M62L48n3j17
7168A75j78l44L87M75o7n74j50j17P82j0l10n23M25M71l37o2M0m21K40N61k45
7189B18j55j87Q2L53q6j06j02l56L41K13N8k47j96M9K80Q3P6l19k12K90L62l14
$$ y = [-147, -306, -231, 230, 452, -153, -825, -213, 301, 354, 356, -394, -307, -13, 383, 553, -329, -640, -410, 112, 445, -15, -492, -433, 334, 464, 287, -101, -405, -17, 325, 483, -36, -408, -269, 200, 633, 598, -131, -581, 297, 422, 309, -160, -398, -340, 255, 644, -77, -440, -350, -34, 519, 511, -319, -339, -153, 229, 38, -12, -346, -392, 285, 116, 217, -54, -367, 173, 479, 325, -97, -581, -136, 593, 147, 94, -239, -112, 37, 382, 355, -349, -619, -247, 392, 488, -57, -438, -514, 43, 682, 230, -320, -385, -298, 86, 369, -115, -414, -146, 130, 518, 209, -450, -498, -103, 440, 404, -190, -236, -171, 81, 478, 60, -437, -318, -41, 187, 108, -142, -298, -147, 136, 485, -111, -465, -3, 345, 292, 175, -3, -347, 40, 515, 448, -126, -276, -393, 389, 379, 69, -454, -29, 442, 105, 43, 83, -338, -98, 463, 218, 63, -124, -42, 311, 225, 119, 17, -339, 2, 215, 273, 26, -170, -121, 159, 242, 318, -1, -213, 77, 439, 125]
7211A25j19k72L75J24Q0k68l42L83J12J39l48K55m62M87j50k13Q1j94L51k83K69
7232A30k95rq0L93Q4j9n18K28J19O3K8l0j27q1K54Rj16k01L6K04j35nJ40l54L05
7257B3J60l27K4J9M43l58j96K65k54K74P6J46l14K7nl5J95K29p15L32J61k4k77
7280a31J47j76oL80k05J80k93rL04K6k55p9m9J09L63jn51l4J16M36rj28m60K16
7304a09L88R0l24o0k86N22K18j27k60n85O25Q6J23k49j30jL05J13j57j69l08K72
7326b3L11M2l55k5M9K89J49k64j29m28K53M76j36k02l05J53N38P0n56o2j83L05
7348c3L47m38J59j34m8L69L72k95p16K03L54M40o77l05l2N54K58k93k81j14K31
7369g9MM00j46k95k09N91J8j15n25J3P6M69K13l91k49j55K00N16j44o82j76M61
$$ y = [125, 6, -266, 109, 233, 313, 45, -297, 86, 198, 337, -11, 244, -218, 269, 119, -94, -13, -207, 144, -139, 130, -165, -174, -254, 139, 223, 204, -314, -86, 33, 96, 124, 94, -33, -114, 140, 149, 33, -168, -132, 72, -63, -68, 72, -282, 23, 183, -144, -120, -101, 342, -16, -212, 53, -201, 73, 149, 295, -19, 8, 3, -32, 163, 392, -323, 9, 170, 146, -131, 16, -160, -166, 214, 9, 189, -104, -113, 191, 217, -38, -117, -166, -57, 306, 305, -246, -280, -164, 272, 263, 135, -325, -109, 279, 369, 45, -15, -301, 221, 439, 312, 52, -533, 92, 178, 301, 52, -78, -79, 226, 339, 182, 13, -295, -23, 288, 330, -25, -50, -1, 288, 437, 173, 44, -384, -131, 345, 209, 7, -298, -145, 393, 463, -93, -155, -338, -33, 314, -124, 35, -99, -147, 222, 594, 299, -417, -214, 140, 580, -97, -402, -434, 120, 378, 85, -196, -310, -79, -75, 325, 179, -116, -325, 266, 284, 169, -356, -343, -267, 202, 415, 24, -225, -380, -180, 336, 192, -490, -666, -205]
7391b05N33j89j19n43K07N30K70m57j79m37N07N36n4n29l28L90N05j94k02j80
7411a38n77Q53K82j23m19l9k2M14N2k41l94k2M77M36o79l93M24J54N24l81m25
7432b37r3J01P30j20k95p21M14K84M17o38j63N2K11L34J03l74j65p8M17L6J13
7453C28o81K33L4M87J53n12o20O70K04K20oq85L31J15N99l54p83K20j28N92R9
7474C16l7p25J20N81P1Pm20l19L03N00j59j03l64J64J83r8J33m29qL01L58j82
7496A93l07l0k09M90K62m25o23K46J90J87K20l47o8j53O16k17k83L2j94O40k07
7517A3J00l30p8Q9K65L6k89O5O6K13q3K24n29J38J54j48P4J24l86K59K80l75J38
7540B0k31O1M52k29j10Rk21M29J20k91k2k04Q0J88J21N7k76J8q4L17j63m84N45
$$ y = [-205, 328, 139, 20, -523, -316, 214, 484, 27, -152, -589, -82, 454, 400, -129, -457, -67, 438, 244, 42, -138, -715, 138, 420, 297, -122, -161, -183, 231, 283, 42, -352, -374, 103, 539, -140, -533, -109, 45, 569, 188, -237, -330, -229, 501, 381, 86, -635, -221, 63, 480, -158, -321, -269, -58, 276, 379, 5, -160, -238, 179, 215, 328, -353, -120, -86, 401, 554, 42, -578, 92, 296, 516, 510, -375, -44, 71, 670, 316, -467, -247, -375, 217, 316, 279, -446, -326, 255, 326, 333, -87, -406, -103, 397, 238, 135, -229, -65, 118, 20, 153, -276, -284, 17, 375, 193, -114, -144, -353, 137, 399, -26, -649, -403, -213, -26, 194, -153, -221, -374, 242, 25, -258, -226, -420, 220, 13, 113, -217, -295, -206, 59, 95, -194, -129, -63, 150, 67, 291, -238, -100, 54, -94, -20, 104, -282, -23, 257, -118, 20, -211, -150, 302, 73, -37, -28, -249, 180, 300, 9, -13, -217, -137, 51, 172, 229, -47, -29, -113, 204, 41, -443, 102]
7563A02p4J51l50K11j38k49L49J19l41L1N34k61j4J13j03k42L92J7m30jJ31lL49
7586B93N6k58k87K21j47J78q7m3M18p0k2j76q9j91K25L97k9j11l08j75K16K53
7608B64l40j83K63j32J46l40K94j70K10j49N74o70K31J08l74M47l31K3J2J97n4
7629B6Q6r6n44M37N95m88k30k3L23Ll9p8P6l47M49l2p7j37k20K22L64j99o4L5
7653D2j44J27p5N07m82k11M7J76K25m85J15j00L97K91j85m28k5K20j32P6l12J6
7675c40M02K55P1l85l47K57L92j74p0j82j91J41O65k86l29n10M48M68J4k67m27
7696c95O7L92M91j48n17j31J25M41o9L3l91q8M31K65k62p13K30L34M6J93k50m31
7718c47K61J04J35o1j31j65L11K09l4p16O6J77O02j52j44k69j67N92p4j03k77
$$ y = [102, 28, 179, -171, 40, -98, -347, 2, 121, -220, -189, 345, 84, 70, 183, 80, -162, 230, 247, -183, -184, -53, -56, 293, 349, 91, -196, 25, -122, 56, -31, -74, 344, 274, 252, 76, -13, -204, 21, 418, 389, 278, -30, -205, 11, 264, -76, -259, 4, -128, 18, -322, -28, -198, 12, -137, 437, -233, -2, 106, -268, 179, -152, -129, -117, 80, 26, 112, 16, -528, -91, 504, 16, -214, -237, 86, 89, 50, -28, 48, -299, 150, 118, 41, -96, -316, -94, 270, 71, 7, 42, -102, 25, -50, 457, -25, -236, -189, -13, 212, -273, -158, -258, 139, 430, 245, -183, -208, 12, -120, -44, -356, -340, 62, 317, 388, 3, -344, -87, 305, 131, 61, -121, -312, -171, 494, 208, -121, -631, -183, 285, 299, 32, -395, -328, 64, 555, 407, -110, -241, -116, 325, 256, 289, -102, -190, 241, 506, 244, -469, -239, 95, 141, 334, 84, -347, -86, 18, 153, 92, -39, -204, 107, 316, 282, -434, -368, -191, 411, 259, 115, -154, -321, 271, 197, 94, -183]
7739a83J19m8N06Q5k98o66K12L77N5k29o8PR5O10m25p5k23o4K17L00j73l57j61
7762c87K93M26k45J84n00L0L26Q5n4n18L66pM33m20k95j8K99K56l85nk02L3N14
7785B09o5o7j46QJ93k32K71k8k52j08L57Q3l59m63L18J52K21J24m30k35M99J18
7807A68J03n46j7J04N01Q7o7l27j08P3J31J34l47l9R5L49O8k23r4k9j25J98J21
7830B10l12L34k54M42m93K03m81N5M52j32N60n43j17k3L31k43J49n44L92K99q1
7851B04k21j77k5K81j16J78o5J37n05J77K75J7j06k18J80J36k80o6mL32J05j23
7873A16n8j22L0J62J33l60J95k98K94P3j13Mk55K44mj78P5l1p7m4P4p8rR1K11
7898G5q7j12J74k63L98O0m13K43j40L58k71k07J43M6K21k53m54L94J80m8K14j67
$$ y = [-183, -64, -112, 394, 479, 181, -485, -273, 104, 159, -70, -138, -131, -36, 574, 149, 74, -149, -213, 4, 304, 131, -226, -387, -94, 332, 87, 271, -229, -199, 127, 212, 158, -360, 6, -1, 432, 12, -283, -301, -2, 254, -131, -136, -338, -305, 209, 144, 77, -69, -61, 132, -100, 171, 143, -109, -217, 140, 223, -136, -599, -281, -129, 92, 216, -214, -449, 50, 168, 271, -275, -292, -188, 313, 400, 333, 6, -102, -29, 102, 236, -111, -150, -55, 294, 362, 139, 45, 16, -109, 89, 210, -102, 232, -22, 420, -73, 130, -351, -296, 156, 24, 584, 41, -76, -99, 232, -11, 138, -406, -14, 285, 204, -17, -194, -219, 62, -54, 124, 59, 196, -309, -132, 143, 160, 54, -164, 16, 152, -128, -194, -198, 134, 239, 116, 58, -64, -34, 128, 261, -99, 96, -202, 92, 165, 52, 56, -199, 45, 41, -137, -62, -93, -170, -214, -140, -218, -227, -136, 75, -12, -124, 50, -213, 185, 245, -168, 75, -65, 293, 22, -185, -42, 4, 225, -28, -482, -88, 92, 44, 258, 91]
7920I1j1m87N49l9j55l9j00j64N60k72P2KJ09m43K54L60M5m79j85N94k58j18L22
7943B08k82J55J48n0j92l23M57j38J28m3j9l01K08J60P7l03r4J13M24R8j37m38
7965a44q3K12N26m23k1j54K83J99j84n07J47K71QN3j51n12M44J93p6k20k62j93
7987e94N93K25%m53M15o90M35K25L0m69k23K90M71l1l13k44K71L63j68Rm32P8
8009b12J37M45n0m90Q5j77O30l2o33l7J61L80J35l45j86k64L90L12m5k95j94m1
8031c26O54q0k20j79k04L71J65k28j05j95K48M40k49J27n34K3N90J15n25p8J81
8052ik9L59M2k94l30M6L13O4Q4n71N82l91J03L26o63K33Q5L49o1j81K6q4K15n6
8076A58J53m18l37M87k4K05k95l99M24J20K90l05j3l91M40K31j90k35NrL66r3
$$ y = [91, 80, -407, 142, 103, -52, -91, -191, -355, 205, -67, 5, 7, 116, -327, -73, 287, 332, -147, -332, 262, 4, -114, 208, -74, 81, 229, 179, -13, -336, 121, -17, 111, 68, 49, -252, -44, 116, 193, -110, -204, -91, 333, 431, 294, -144, -227, -15, 511, 88, 67, -87, 196, 395, 211, -296, -149, 122, 130, 183, 32, -480, -36, 157, 81, -139, -401, -594, -1, 224, 224, -229, 186, -504, -69, 156, 186, -283, -506, -216, 255, 224, -89, -333, -62, 301, 133, 142, -290, -212, -75, 370, 320, -170, -85, -262, 368, 336, -297, -334, -173, 207, 342, -3, -189, -453, -63, 249, 204, -91, -285, -326, 328, 248, 28, -151, -355, 16, 181, -47, -152, -347, -99, 341, 92, 219, -315, -292, 298, 413, -112, -190, -9, -38, 321, 363, 69, -261, -215, 98, 162, 246, -325, 257, -134, -31, 295, -368, -135, -50, 299, 238, 57, 83, -1, 214, 158, 311, -107, -444, 43, 19, 224, -71, -470, -46, 74, 364, 59, 46, -345, 95, 326, 136, -99, -94, -103, 263, 170]
8098A70l21m9k28O99n3j33j57q9M9K60O83p84Pk70K36J92M3j19m63M40k91L20
8120A42j88j25n4J3Q09n26p4J34k00K20j59J00m96L53L9K36m1k91%O0K42j9j9
8143A56j74j12L60m04m0L99k70K17K0K38o14K69j46p9M09m67o3K48K58m31M93
8164B67k54q0K55l09N28n68J63O0J26j72j54Q4Q9L5j68Ko5J11K90k56J21K54m61
8187a02O3J39L2p6
$$ y = [170, -151, -200, -428, 271, 218, 85, -72, -161, -112, 148, 831, 47, 54, -216, 20, 212, 255, 136, -327, 113, -178, 142, -46, -171, -225, -212, 597, 71, -3, 131, -69, 151, -8, 92, -404, -51, -12, 224, 183, -108, -108, -48, 194, 175, 156, -18, -130, 230, -174, -214, 185, -85, 132, 152, 390, -224, 45, -101, -180, 229, -238, -301, -53, 205, -226, 267, 13, -67, 188, -121, 407, -161, 2, 62, 188, 16, -138, -54, 35, 70, -98, -96, -161, -50, 240, -16, 105, 359, -102, -39, 100, 132, 56]
8191E6
$$ Imaginary data points
##PAGE= N=2
##DATA TABLE= (X++(I..I)), XYDATA
0@%%%qJ6qQk4L2l2M0n6P2q8J04j22J49j81K12k52K97l41L96m61N29o07O96p89
28d18Q93j014J144j284J443j617J803k013K243k489K762l065L393l755M161m605
44b418N100n660O285o991P807q751R854j1173J2779j4787J7387k0897K5924l3788
58a9329M7938q1338K99957K77982n30713k66206J27017M07594J42393k16851l63801
69a75357l3366K76408K43401j01790k79023j58376J60209K78258N7005k69014
79a645k56367L2762K68075K04483o4841k94064j83083J62224L17839P5889k36724
90B4548k64742J6533K85905K20295j37087l15988p8899K52475K68365j6237k78581
101b3413k20579J14246L17557J13643k21412k58265L197K36632J95443p3378k59006
$$ y = [0, 0, 0, 0, -8, 8, 0, 8, -16, 16, -16, 24, -32, 40, -48, 56, -66, 83, -98, 114, -138, 159, -182, 214, -247, 282, -325, 371, -418, 475, -539, 605, -679, 764, -853, 950, -1063, 1180, -1309, 1453, -1612, 1781, -1974, 2187, -2418, 2682, -2978, 3307, -3684, 4123, -4628, 5226, -5947, 6832, -7955, 9432, -11465, 14459, -19329, 28609, -52729, 247228, 525210, -5503, -271709, -144692, 262902, 405295, 188444, -175357, -208723, 67685, 311086, 209296, -69727, -228103, -67894, 210364, 267369, -1645, -258012, -225250, 42825, 247308, 182467, -111597, -294680, -132456, 185383, 261272, 24548, -240194, -223661, 62244, 282539, 145452, -170536, -249435, 3040, 271405, 255168, -23413, -243992, -129746, 187811, 301454, 80042, -178223, -175026, 61606, 257049, 183671, -75335]
112g5335j27052J48512K14580K9503j71371j97814j7803J98297J76539p5430k27329
123a24703j01492J17027J88588M8265j68423k00964K1712K21014J38602j08836
133C0790k26357q2244J79369K43273n89k39916j62084R9934K11207Q6544j15779
144B4148j77956j6144J78344J42142o2122j57440n6065J00476J52532L2604j36891
155B3628j40331K5445J43661J03152k2455j24639j03456M6848J43334M9836r5659
166D9364j10507r298Q7386P9690m1600j25919l5607J06749J03171k5564j22564
177d4699r6150L7658J39294O2780r6565j18161Q31Q8912P1278n533o9509m4815
189g4679M0061N8048k558l7322k2267O566M0907M5549j1219m6492q479K8871K5978
$$ y = [-75335, -202387, -53875, 160705, 190208, 18837, -178977, -196780, 1517, 178056, 102626, -124703, -226195, -109168, 79420, 127685, -40738, -241702, -219990, 1024, 139626, 30790, -195567, -277811, -98442, 144831, 144242, -95674, -257758, -157824, 53383, 139927, 24148, -153808, -169952, 8392, 150534, 88412, -69028, -125093, -24617, 127915, 160519, 23628, -116703, -91258, 52403, 155555, 133100, 8461, -94995, -48147, 95187, 145023, 49364, -61143, -70441, 16945, 96635, 55035, -70884, -106491, 258, 103429, 77865, -44699, -140849, -103191, 36103, 98883, 2318, -115843, -115012, -26100, 45178, 39645, -29864, -74679, -34618, 23430, 20872, -16450, -38717, -32151, 8756, 54305, 43086, -3406, -11885, 16986, 42964]
202D2964J7542o837m4287k2644L7040L9884n232k6717j8805N841L3627J3140l9468
215B6048l4443J3665J5897q500o965m464o802N355o13k4196l492L1016K687m0819
229c5626k6477J2260K6835J4710k3210l8276J6631N9480Q908n4585l6782J7829
241e8303M8771M0521j6976o8098k6183N5538O2594Q332l2260m0859p978M6078
253A1177M3257j8949m7419j5298K4584N1358K9030n0594q3142O685R7103O0659
265A08451m6475j05935n9020O2253J18054J7509j09989r2021L2170J04208N3470
276H2675o6395j19149j7845J13402Q6509n4465j16808m5720O9224J18288L8060
287H7776r5733j13452P952J10282Q6507k2760j11903p7547O6529J39517L8041
$$ y = [42964, 60506, 53669, 9382, -13262, 23778, 63662, 58430, 31713, 12908, 18749, 52376, 65516, 26048, -8395, 5270, 21167, 12667, 5702, 1238, -5564, -209, -822, -25018, -28510, 2506, 5193, -35626, -62103, -49843, -23008, -8298, -31508, -69784, -53153, 6327, 15235, -39350, -76132, -58303, -9532, 30989, 14013, -54085, -80268, -24730, 37864, 46196, 13936, -26923, -34901, 11177, 54434, 35485, -11934, -27232, -2648, 48710, 77740, 27146, -55996, -49311, 47792, 108451, 61976, -43959, -102979, -40726, 77328, 94837, -15152, -107173, -75003, 29205, 82675, 16280, -102869, -120714, -7312, 79197, 24732, -92076, -137796, -68572, 49716, 87776, -7957, -121409, -113457, -3175, 83332, 60572, -51331, -128878, -62349, 77168, 115209]
298A15209r8198j05047Q287J22129J08368m6798j61628o7830J17828J52903Q277
309A53500j39317j25230M5245J74545Q0973j17435j61531j5521J30169J23741
319A49139k6904j60610j03517Q7368J63301L7087j18916j37007j0760J27914J19086
330A26181m4999j58636p8055Q7803J49749M7791j19751j58915O880J78712J24289
341A61049q1996j83228p3277J22371J88051K8971j71363j50721O1633J89495R0714
352A81699j06519j80235l5763J61893J56916m7166j78873q9859R3613J68218N8536
363A82460j28532j70546o206J56804J22995m7016j61057r9282Q0601J71251M6554
374A48026j38075j49910J0613J49488J17760o1322j88370q6958J31862J81969
$$ y = [115209, 17011, -88036, -79749, 42380, 150748, 103950, -57678, -125508, -7680, 145223, 153500, 14183, -111047, -65802, 108743, 189716, 72281, -89250, -104771, 25398, 149139, 122235, -38375, -141892, -54524, 108777, 145864, 26948, -110059, -120819, 7095, 126181, 81182, -77454, -155509, -67706, 82043, 129834, 10083, -148832, -141952, 36760, 161049, 79053, -104175, -177452, -55081, 132970, 161941, -9422, -160143, -98510, 90985, 181699, 75180, -105055, -140818, 21075, 177991, 130825, -48048, -137907, -44294, 123924, 182460, 53928, -116618, -122824, 33980, 156975, 109959, -51098, -150380, -69779, 101472, 148026, 9951, -139959, -129346, 20142, 137902, 76580, -111790, -198748, -66886, 115083]
384A15083Q425j65014j42495M4478J86680J04822j11411j84086k7422J47593J43105
395A19758j9676j58208j08459Q5613J78126M8865j25074j37833K193J34971J20865
406A41141l7547j57353q1311R1159J49670M1316j09232j41741m419J50345J15603
417A57631o7205j63140o6733R7802J51562K7612j41878j41225M1221J64667P9234
428A39548r4687j55466l9562J25205J37291k7845j51343p9531P6242J32925M4533
439A07310r2479j26360n044J22362R2893l9841j10856n6081O0376J17639M0684
450A10603q7208j01221Q403R9579P9017k8285j12782o5231P5657J26473J6880
461A21885j02964r1908K1380J09408P1780o2726j23988k7128R3515Q7631j7054
$$ y = [115083, 123508, -41506, -184001, -139523, 47157, 151979, 40568, -143518, -170940, -23347, 119758, 100082, -58126, -166585, -80972, 97154, 146019, 20945, -116888, -114695, 20276, 141141, 103594, -53759, -135070, -43911, 105759, 147075, 37843, -103898, -108317, 42028, 157631, 90426, -72714, -139447, -41645, 109917, 137529, -4349, -145574, -104353, 60314, 139548, 44861, -110605, -150167, -24962, 112329, 84484, -66859, -146390, -70148, 62777, 107310, 14831, -111529, -116573, 5789, 98682, 58841, -52015, -108096, -47720, 69919, 110603, 23395, -77826, -69423, 30156, 109173, 80888, -31894, -97125, -21468, 105005, 121885, 18921, -72987, -51607, 57801, 129581, 66855, -57133, -84261, 9254, 96885, 79831]
472G9831r4951o5933M4440J02438K3741q2901p7074R202O5956M9878j9506p3918
484c8797m0192M4713O7934J3313m4464n4657j1078N4616N6463j7536o6043k8652
496f4380L5933O0482K5552m4202o4266O682P2667L9079l7386n8923j4378M4598
508A458N5111m898n6923k5677L4183L8440J144k6711k9966j068K9711J4556k0786
521H574j8832K534N698M657P837n366j6011n953J405L406Q246j691k1351q239
535c5086J9489J2464o962p207k897q26R257N274j1004n375J1067K875o146O361
549h716J2510J625n475p988r85K0627J8925k1440l4146P996L8180K0150j4376
562B6887l2434j6003L1359M3037r799n1012k3099K4540L9006J1777l4105m4705
$$ y = [79831, -15120, -81053, -36613, 65825, 89566, 6665, -70409, -61207, 4749, 54627, 35121, -38797, -78989, -34276, 33658, 46971, 2507, -52150, -63228, -8612, 47851, 30315, -35728, -64380, -28447, 32035, 57587, 13385, -50881, -44199, 28468, 67547, 30161, -28762, -43140, 1458, 56569, 51671, -5252, -30929, 3254, 41694, 42838, 16127, -13839, -14907, 14804, 29360, 8574, -10258, -7724, -2026, 2631, 10468, 5102, -10909, -16862, -15457, -12051, -3805, -5496, -26847, -35086, -15597, -3133, -10095, -17302, -20199, -21025, -11768, -6494, -17498, -22873, -11806, -8931, -15077, -8716, 3794, 5419, -56, -8044, -9029, 11598, 30523, 9083, -25063, -17067, 21113, 41263, 26887, -5547, -21550, 9809, 52846, 43047, -7965, -31064, -6524, 32482, 44259, 10154, -34551]
574c4551O951N1166K4242k6870m1351k0834J9066M4730J4392m2453m5610O713
586d4409M5900L7988r217n6218l9139L6524O6234R281n5068n4802O858P1841N7961
599G3734l4455q6579k0455P0588P0917q888p7284n9687L5527R2803L1460o5354
611B2327p3988K322P1797O3892j9883q9925n0226N1890Q1761J4220o3348p2631
623f1792l184Q0213O9426l3608r7167m3632N3762Q9362K1024q5025r6176J8370
635h8427J11482O2474n6530j04432l4746P9350J05297l362j13095p8139N1605
646f8523J11780M3359p1739j04499o593J06287Q6859l6504j05284n2343N4985
657d2215J04621L5333q2749r9431J0119J02825P3896l4162j03421n8589O3344
$$ y = [-34551, -27600, 23566, 47808, 20938, -20413, -41247, -22181, 22549, 36941, -5512, -51122, -44409, 1491, 39479, 30262, -25956, -65095, -28571, 37663, 46944, -8124, -62926, -56068, 15773, 73734, 39279, -47300, -67755, 2833, 73750, 64862, -12422, -72109, -36582, 56221, 87681, 22327, -51661, -49339, 22458, 86350, 66467, -23458, -73684, -21794, 59967, 74187, 10839, -61792, -64976, 15237, 84663, 51055, -46112, -89744, -35982, 53380, 74404, -10621, -106797, -88427, 23055, 85529, 28999, -75433, -110179, -30829, 74468, 71106, -41989, -120128, -68523, 43257, 86616, 14877, -89622, -96215, 10072, 96931, 60427, -44857, -97200, -42215, 62406, 97739, 14990, -84441, -74322, 28503, 102399, 68237, -35184, -93773, -30429]
668c0429J12881J8207r8600r4579J6836J09326P9470n1964j28410m3079R6602
679a3739J09947j0657j13461q6266M0569J23848N3383q4890j12285k500J01722
690E671Q6547k6176j13809o6603O5204J14248K3869q4086r0546L071R8370Q7977
702A03737l1016j14840n6137O7451J08435K6032q8913j03388J2552J22376P8093
713A24382n8749j17014l7524Q3169J10056J528j17833r0681N0104J20477M3969
724A11884p6124j04878j3006R6334Q6629l2479j06304n2637N0436R2086L1081
735H3022p0269r1981K086R2321O7395l1206r0284n2123M7295R8301K7890q0424
747B023q6485J2251R3937O9772l6137j04181m2018P7868R5871n839r2023o5647
$$ y = [-30429, 82452, 100659, 2059, -92520, -75684, 33642, 113112, 61148, -67262, -110341, -13739, 96208, 85551, -27910, -114176, -73607, 50241, 103624, 18734, -93551, -96051, 5671, 92218, 66042, -47767, -114370, -49166, 65082, 88951, 4865, -85681, -82610, 15760, 103737, 72721, -42119, -98256, -30805, 77630, 103662, 14749, -88639, -76087, 46289, 124382, 65633, -51381, -88905, -5736, 104320, 105848, -11985, -102666, -52562, 67915, 111884, 35760, -69118, -82124, 14210, 100839, 68360, -37944, -90581, -40145, 51941, 83022, 12753, -79228, -77142, 15179, 82574, 51368, -38916, -91039, -43744, 54557, 82447, 2023, -84462, -72211, 21726, 91498, 55361, -48820, -90838, -12970, 82901, 77062, -14961, -80608]
759h0608L4084R6200M5043o3910q9610j289P9902N9246k3053p7548m5562M1022
771b6083P6837J5436n7660n7788Q90N5564N3035j4467p3460m3750L8829O7672
783C5055J6922n1325o5170k299P0985N5279l1979p4613k5714M7422O4021N588
795D4172o4741n5782K9086P2101K2385m3178m8885k881M6571M2869j4572n0505
807b3360k0396K7510L6482J1192k2951l4475j683L6898K7508j1917l0514k0495
819b6201P088L4101K1912k4295l8187k305L1667K7011n314l4517k3896K1154L5452
832B3670l010l4011j8328J2688K8019J3963j8876k9160K364K6622J0126j2630
844A437j1838l793N414R236L42m359N848N853p411m029Q681L950n809k729Q27
$$ y = [-80608, -46524, 49676, 94719, 30809, -58801, -60090, 19812, 79058, 56005, -21543, -67105, -26083, 50754, 66190, 8530, -49258, -48368, 7196, 60231, 45764, -27696, -71446, -32617, 35055, 51977, 652, -64518, -66817, 4168, 59447, 27468, -47145, -72859, -25437, 38584, 44172, -20569, -76351, -47265, 24836, 47221, 4043, -44842, -47723, -1152, 41717, 27145, -23360, -43756, -16246, 20236, 31428, 8477, -25998, -27681, 9217, 36725, 24808, -5706, -26201, -19113, 14988, 36900, 12605, -25582, -27887, 3780, 30791, 25477, -9040, -32936, -11782, 23670, 20660, -13351, -31679, -18991, 9028, 22991, 4115, -25045, -22681, 3941, 14067, 1437, -10401, -14194, -8780, 456, 798, -3561, 2287, 8140, 729, -3300, 5381, 9331, 3522, 793, 1620]
859A620K103P649K039j0440l600J2665P802n177o693n770l207O602O838l246k539
874F646m37q256k595J5199R629j3712j8768l899J2284J8066o15k8262j8768K1530
888a1958L2004L70k9168k5668O036L6240K0273k8544l9948L570L7769K4693j1561
901A4108l4008j8675K4227L9202K845l2883k7008L651K9856K9656o649l8963k0106
914c4747K3920L6586J0655k6466m0761o289M5602L9985k1000n5827k2336L7018
926a3660N8501J0071n7939n6621J9469O6661K7572m0209n9076j1118N2882N4608
938E1141j6391o4840k7525L9112N4544J0440m6767n5528L545O0669M4239j9545
950C3094n5418l2129K7283O3038K5729m7441o1175J835N7838M5794j8064o5781
$$ y = [1620, 3723, 11372, 13411, 2971, -629, 12036, 19838, 14661, 7968, 2198, -1009, 5593, 12431, 9185, 6646, 6209, -2047, -4642, 10557, 20186, 6474, -12294, -16193, -3909, 14157, 13542, -14720, -33488, -11958, 20046, 20416, -8752, -34420, -28384, 7856, 28129, -415, -40363, -36793, 976, 25669, 14108, -19900, -38575, -14348, 24854, 27699, -5184, -32192, -28541, 1315, 30971, 24322, -14641, -34747, -10827, 25759, 36414, 9948, -30813, -37102, 8500, 48485, 27485, -28342, -50678, -13660, 44841, 54912, -3027, -59648, -40179, 26482, 54054, 13845, -45231, -56349, -3467, 51141, 34750, -30090, -57615, -18503, 36041, 46481, -286, -55814, -52269, 8400, 52639, 33094, -22324, -54453, -27170, 35868, 61597, 14156, -47019, -45184, 12654, 58448, 40384, -25397]
962b5397l3546N0379P5253L226p2125n8467K0882P9161M4130m8788q5380j3088
974f3760P1085O3934j3020p0218m7721L1396P3815K1835n8088o4092L271O0846
986I283N1535j7144p1704m0774M3402P2486J5661n6591o7113l598P1687O3114
998G0244k8595q5062l3076N6011P8406J1732p2731p2938K0211Q8393M3930n0292
1010B6233p8879j6240O5595P2060j0010q0844m7234M2686P2777J9077n4573o7918
1022e7270l926P0082N9297k2548p3186l8647L4472P0441K6313n4765p1889K94
1034f1332O7684M9952k3591o9552l6007M6766P7964P819p3958o2842K1249P6805
1046B0957M5124m1541q0968j9594O5481O5922r039o4034m3090K5294O5849K6017
$$ y = [-25397, -58943, -8564, 66689, 69915, -2210, -60677, -39795, 39366, 83496, 34708, -50672, -63760, 7325, 71259, 58239, -11979, -59700, -28304, 45511, 67346, 9258, -54834, -51563, 9283, 60818, 43674, -28030, -68804, -25402, 47084, 62745, 6154, -60959, -64557, 7130, 70244, 41649, -43413, -76489, -20478, 57928, 69660, -3071, -76009, -55798, 32595, 76525, 26233, -52646, -68886, -3291, 68769, 58759, -22085, -69319, -26633, 46144, 65221, 10648, -57270, -61196, 8886, 68183, 45635, -27551, -66198, -31726, 38715, 65028, 10263, -61626, -61332, 6352, 56304, 32713, -36839, -72846, -26080, 51884, 59703, -14255, -77097, -55848, 20957, 66081, 24540, -56428, -76022, -10541, 55381, 46342, -17692, -60782, -35488, 30361, 56378]
1058E6378m9641n9523M684N9102M4342j6018o1422l6510L7146O7285J6528m9979
1070A2372n7935m046N5209N3937j4941o7714l0500M1166N8202Q089n0707n2703
$$ y = [56378, 6737, -52786, -48102, 11000, 55342, 39324, -22098, -58608, -21462, 45823, 62351, 12372, -45563, -49609, 5600, 59537, 44596, -23118, -53618, -12452, 45750, 53839, 3132, -49571]
$$ [...]
8191D3
##END NTUPLES=NMR FID
##END=
