##TITLE=1H_CA-8741-1
 CDCl3, 108 sc, 
 31.7.2020
##JCAMPDX= 6.0         $$ Bruker NMR JCAMP-DX V2.0
##DATA TYPE= NMR FID
##DATA CLASS= NTUPLES
##ORIGIN= UXNMR, Bruker Analytische Messtechnik GmbH
##OWNER= root
$$ XWIN-NMR		Version 3.5
$$ Fri Jul 31 09:59:10 2020 Russian Standard Time (UT+4h)  she@DPX200
##.OBSERVE FREQUENCY= 200.1314999998
##.OBSERVE NUCLEUS= ^1H
##.DELAY= (6, 6)
##.ACQUISITION MODE= SIMULTANEOUS
##.ACQUISITION SCHEME= undefined
##.AVERAGES= 8
##.DIGITISER RES= 18
##SPECTROMETER/DATA SYSTEM= spect
##.PULSE SEQUENCE= zg30
##.SOLVENT NAME= CDCl3
##.SHIFT REFERENCE= (INTERNAL, CDCl3, 0, 15.7039)
##AUDIT TRAIL= $$ (NUMBER, WHEN, WHO, WHERE, WHAT)
$$ ##TITLE= Audit trail, XWIN-NMR		Version 3.5
$$ ##JCAMPDX= 5.01
$$ ##ORIGIN= Bruker BioSpin GmbH
$$ ##OWNER= she
$$ F:/spectra/data/she/nmr/H-F/1/audita.txt
$$ ##AUDIT TRAIL=  $$ (NUMBER, WHEN, WHO, WHERE, WHAT)
(   1,<2020-07-31 09:57:23.57 +0400>,<she>,<DPX200>,
      <created by zg, POWCHK disabled, PULCHK disabled
       configuration hash MD5:
       00 E9 B6 7A A2 85 ED C7 34 08 36 98 17 FE 4E 26
       data hash MD5: 16K
       C9 3B 11 A5 A8 A9 54 4D D3 55 2C E9 03 90 8C 04>)
$$ ##END=
$$ 
$$ hash MD5
$$ FD AD D9 97 50 3F C7 F7 B7 38 E6 7D C4 46 81 14
##$RELAX= 
##$RELAX= 
##$RELAX= 
##$RELAX= 
##$RELAX= 
##$RELAX= 
$$ Bruker specific parameters
$$ --------------------------
##$DU= <F:/spectra>
##$EXPNO= 1
##$NAME= <H-F>
##$PROCNO= 1
##$TYPE= <nmr>
##$USER= <she>
##$AMP= (0..31)
100 100 100 100 100 100 100 100 100 100 100 100 100 100 100 100 100 100 
100 100 100 100 100 100 100 100 100 100 100 100 100 100 
##$AQSEQ= 0
##$AQ_mod= 1
##$AUNM= <au_zg>
##$AUTOPOS= <>
##$BF1= 200.13
##$BF2= 200.13
##$BF3= 200.13
##$BF4= 200.13
##$BF5= 200.13
##$BF6= 200.13
##$BF7= 200.13
##$BF8= 200.13
##$BYTORDA= 1
##$CFDGTYP= 0
##$CFRGTYP= 5
##$CHEMSTR= <none>
##$CNST= (0..31)
1 1 145 1 1 1 1 1 1 1 1 1 1 1 1 1 1 1 1 1 1 1 1 1 1 1 1 1 1 1 1 1 
##$CPDPRG= <>
##$CPDPRG1= <>
##$CPDPRG2= <>
##$CPDPRG3= <>
##$CPDPRG4= <mlev>
##$CPDPRG5= <mlev>
##$CPDPRG6= <mlev>
##$CPDPRG7= <mlev>
##$CPDPRG8= <mlev>
##$CPDPRGB= <>
##$CPDPRGT= <>
##$D= (0..31)
0 1.2 0 0 0 0 0 0 0 0.06 0 0.03 0 0 0 0 0.0002 0 0 0 0 0 0 0 0 0 0 0 0 
0 0 0 
##$DATE= 1596175043
##$DBL= (0..7)
120 120 120 120 120 120 120 120 
##$DBP= (0..7)
150 150 150 150 150 150 150 150 
##$DBP07= 0
##$DBPNAM0= <>
##$DBPNAM1= <>
##$DBPNAM2= <>
##$DBPNAM3= <>
##$DBPNAM4= <>
##$DBPNAM5= <>
##$DBPNAM6= <>
##$DBPNAM7= <>
##$DBPOAL= (0..7)
0.5 0.5 0.5 0.5 0.5 0.5 0.5 0.5 
##$DBPOFFS= (0..7)
0 0 0 0 0 0 0 0 
##$DE= 6
##$DECBNUC= <off>
##$DECIM= 24
##$DECNUC= <off>
##$DECSTAT= 4
##$DIGMOD= 1
##$DIGTYP= 9
##$DL= (0..7)
0 120 120 120 120 120 120 120 
##$DP= (0..7)
150 150 150 150 150 150 150 150 
##$DP07= 0
##$DPNAME0= <>
##$DPNAME1= <>
##$DPNAME2= <>
##$DPNAME3= <>
##$DPNAME4= <>
##$DPNAME5= <>
##$DPNAME6= <>
##$DPNAME7= <>
##$DPOAL= (0..7)
0.5 0.5 0.5 0.5 0.5 0.5 0.5 0.5 
##$DPOFFS= (0..7)
0 0 0 0 0 0 0 0 
##$DQDMODE= 0
##$DR= 18
##$DS= 0
##$DSLIST= <SSSSSSSSSSSSSSS>
$$ [...]
##$SUBNAM2= <"">
##$SUBNAM3= <"">
##$SUBNAM4= <"">
##$SUBNAM5= <"">
##$SUBNAM6= <"">
##$SUBNAM7= <"">
##$SUBNAM8= <"">
##$SUBNAM9= <"">
##$SW= 24.9337058888022
##$SWIBOX= (0..15)
0 0 2 0 0 0 0 0 0 0 0 0 0 0 0 0 
##$SW_h= 4990.01996007984
##$TD= 16384
##$TD0= 1
##$TE= 0
##$TE2= 300
##$TE3= 300
##$TEG= 300
##$TL= (0..7)
0 120 120 120 120 120 120 120 
##$TP= (0..7)
150 150 150 150 150 150 150 150 
##$TP07= 0
##$TPNAME0= <>
##$TPNAME1= <>
##$TPNAME2= <>
##$TPNAME3= <>
##$TPNAME4= <>
##$TPNAME5= <>
##$TPNAME6= <>
##$TPNAME7= <>
##$TPOAL= (0..7)
0.5 0.5 0.5 0.5 0.5 0.5 0.5 0.5 
##$TPOFFS= (0..7)
0 0 0 0 0 0 0 0 
##$TUNHIN= 0
##$TUNHOUT= 0
##$TUNXOUT= 0
##$USERA1= <user>
##$USERA2= <user>
##$USERA3= <user>
##$USERA4= <user>
##$USERA5= <user>
##$V9= 5
##$VALIST= <valist>
##$VCLIST= <CCCCCCCCCCCCCCC>
##$VD= 0
##$VDLIST= <DDDDDDDDDDDDDDD>
##$VPLIST= <PPPPPPPPPPPPPPP>
##$VTLIST= <TTTTTTTTTTTTTTT>
##$WBST= 1024
##$WBSW= 4
##$XGAIN= (0..3)
0 0 0 0 
##$XL= 0
##$YL= 0
##$YMAX_a= 601784
##$YMIN_a= -270079
##$ZGOPTNS= <>
##$ZL1= 120
##$ZL2= 120
##$ZL3= 120
##$ZL4= 120
##$ABSF1= 10
##$ABSF2= 0
##$ABSG= 5
##$ABSL= 3
##$ALPHA= 0
##$AQORDER= 0
##$ASSFAC= 0
##$ASSFACI= 0
##$ASSFACX= 0
##$ASSWID= 0
##$AUNMP= <proc_1d>
##$AZFE= 0.1
##$AZFW= 0.1
##$BCFW= 1
##$BC_mod= 2
##$BYTORDP= 1
##$COROFFS= 0
##$CY= 11.3945322036743
##$DATMOD= 1
##$DC= 2
##$DFILT= <>
##$DTYPP= 0
##$F1P= 16.9975609425685
##$F2P= -3.02152046262296
##$FCOR= 0.5
##$FTSIZE= 0
##$FT_mod= 4
##$GAMMA= 1
##$GB= 0.15
##$INTBC= 1
##$INTSCL= 1
##$ISEN= 128
##$LB= 0.24
##$LEV0= 0
##$LPBIN= 0
##$MAXI= 10000
##$MC2= 0
##$MEAN= 0
##$ME_mod= 0
##$MI= 1.114404
##$NCOEF= 0
##$NC_proc= 0
##$NLEV= 6
##$NOISF1= 3.799351
##$NOISF2= 2.8
##$NSP= 1
##$NTH_PI= 0
##$NZP= 0
##$OFFSET= 15.70392
##$PC= 1
##$PHC0= -9796.524
##$PHC1= 20.80092
##$PH_mod= 1
##$PKNL= yes
##$PPARMOD= 0
##$PSCAL= 0
##$PSIGN= 0
##$REVERSE= no
##$SF= 200.130013532006
##$SI= 16384
##$SIGF1= 3
##$SIGF2= 2
##$SINO= 400
##$SIOLD= 16384
##$SREGLST= <1H.CDCl3>
##$SSB= 0
##$STSI= 0
##$STSR= 0
##$SW_p= 3612.71676300578
##$SYMM= 0
##$S_DEV= 0
##$TDeff= 0
##$TDoff= 0
##$TI= <>
##$TILT= no
##$TM1= 0
##$TM2= 0
##$TOPLEV= 0
##$USERP1= <user>
##$USERP2= <user>
##$USERP3= <user>
##$USERP4= <user>
##$USERP5= <user>
##$WDW= 1
##$XDIM= 8192
##$YMAX_p= 0
##$YMIN_p= 0
$$ End of Bruker specific parameters
$$ ---------------------------------
##NTUPLES= NMR FID
##VAR_NAME=  TIME,          FID/REAL,        FID/IMAG
##SYMBOL=    X,             R,               I
##VAR_TYPE=  INDEPENDENT,   DEPENDENT,       DEPENDENT
##VAR_FORM=  AFFN,          ASDF,            ASDF
##VAR_DIM=   8192,          8192,            8192
##UNITS=     SECONDS,       ARBITRARY UNITS, ARBITRARY UNITS
##FACTOR=    0.0002004,     1,               1
##FIRST=     0,             0,               0
##LAST=      1.6414764,     0,               0
##MIN=       0,             -270079,         0
##MAX=       1.6414764,     601784,          0
$$ Real data points
##PAGE= N=1
##DATA TABLE= (X++(R..R)), XYDATA
0@%%%%%QqQj6J7k5L3m1N5o6P7r3J14j37J62j92K24k58K98l46L97m55N20n88O65
30C53p52Q47r53J068j190J330j484J649j832K032k251K492k759L058l386L751
46A973m164M627n155N765o474P312q323R569j1147J3231j6120K0420k7609M2560
60B6465j27352K57490J81228m05467k02443R4823J34938k8411k145P028o951j1412
72h2209L1805m0272q2972K3358J90225J12126j01516j54822j8235K0460n050P0849
84c6253J38152p405j55564q5886Q0334J35165P6962n5594j41578m1840J24858
95C1351P3432j17898j16867Q6723J82532M9775j30573j43725J5157J49114Q7809
106A66830q8643j56123k9274J32152J12232o6186j24861K8684J22928Q521p2426
$$ y = [0, 0, 0, 0, 0, 0, 8, 0, 8, -8, 9, -16, 17, -24, 31, -35, 42, -51, 63, -74, 88, -104, 120, -138, 160, -186, 211, -244, 276, -312, 353, -399, 448, -505, 563, -627, 703, -781, 868, -964, 1068, -1183, 1309, -1450, 1608, -1778, 1973, -2191, 2436, -2719, 3046, -3428, 3884, -4439, 5130, -6017, 7214, -8906, 11514, -16095, 26465, -100887, 156603, 337831, -67636, -270079, -175256, -40318, -68729, -70874, -63846, -70797, -82209, -50404, -90676, -173648, -150290, 39935, 152061, 50545, -104277, -122512, -102052, -107102, -36253, 101899, 94494, -61070, -146956, -66622, 68543, 145505, 89911, -51667, -93507, 31351, 104783, -13115, -129982, -43259, 139273, 189048, 58475, -85250, -70093, 79021, 166830, 78187, -77936, -107210, 24942, 137174, 70988, -53873, -25189, 97739, 106260, 33834]
117C3834j961J5137o3104m2364N6109N8849P100K06j6622m3898J0706P2535P044
130I3571q5946k8291R7406O1877j18349j55408O0834K39175J11962j33645j77626
141c4440l3650Q9672J00675J2031q6382n0096O7184M7002q1625o4813Q9168J31179
153A85905J2619r8512j10681m2796M5158P7475L9014K261j3797m4611o1369j2546
165b1880P7926J08547J1806j28085j21643L1134R6989L036m6269L2198P7318Q423
177A29500p8941r8927j7538J15583J26948m6670j73387p1374R8357J09877j166
188I2262n7579k971M7881k606q1181n2028M6323O6091K540m5836l8796Q642N1961
201C4703K1170m4522j9865N0729J2825q5269o4745M3581P6984P996o1220m7177
$$ y = [33834, 31873, 47010, -16094, -58458, -2349, 56500, 63600, 63806, 47184, 3286, 13992, 86527, 93571, 7625, -20666, 76740, 138617, 20268, -135140, -74306, 164869, 276831, 143186, -34440, -68090, 21582, 122257, 134288, 47906, -2190, 64994, 111996, 30371, -34442, 54726, 185905, 198524, 100012, -10669, -53465, -8307, 69168, 108182, 110443, 96646, 52035, -9334, -21880, 56046, 164593, 176399, 48314, -73329, -42195, 54794, 57830, 11561, 43759, 121077, 129500, 50559, -48368, -65906, 49677, 176625, 129955, -43432, -114806, -16449, 93428, 92262, 34683, 31712, 79593, 76987, -4194, -56222, -9899, 56192, 58732, 12896, -25900, -17258, 34703, 55873, 11351, -8514, 42215, 55040, -30229, -94974, -51393, 25591, 33587, -27633, -74810]
213g4810M3824R0614J546j07627p0763N2352Q1850m297p9037m4981N2407P2508
225A3586j7491o7591Q521P5399K6143o3350q5179k3162O9416Q4001j3272o9799
237f2778M897O0802q304o2288N670P7230L9008n7950r7905l0043P3094Q8811J1767
250D2011m0990k0996J2513P577l1176l8809L1301R0866R155j15819p7027O8782
262f2612J00600J4124l3320j4330j184j3393l6016l0605K8329P9702L3960o1489
274C766q1516j84Q7705P3562l1553q3765n488N8613p361p6290j4020Q1970P6950
287H2389q955p5462n3112L8392P8249O654o2688l2000K3419J7673j2939j4006
299a2386J7728M8845K3166m5014n1450K1237M7978j7017n8825j1403N0693M3755
$$ y = [-74810, -30986, 59628, 61174, -46453, -117216, -64864, 16986, 12689, -66348, -111329, -58922, 13586, -3905, -71496, -62975, 12424, 38567, -24783, -109962, -133124, -63708, 20293, 7021, -62778, -57881, 2921, -5383, -67671, -62001, 15229, 54237, -3713, -101618, -131661, -58567, 30244, 42011, 1021, -19975, -7462, 115, -31061, -69870, -38569, 52297, 61452, -54367, -131394, -62612, 37988, 52112, 18792, 4462, 3278, -10115, -46131, -76736, -48407, 31295, 65255, 3766, -77750, -77934, 9771, 83333, 51780, -31985, -37473, 21140, 13779, -62511, -76531, 5439, 82389, 73434, -2028, -55140, -16748, 61501, 68155, 5467, -26533, -3114, 14559, 1620, -12386, 5342, 54187, 77353, 32339, -19111, 2126, 50104, 33087, -25738, -37141, 13552, 57307]
311E7307k7231o4736M504Q5767L7718p3750p6855J8440O5635J9537n2248o6259
323g2171J0671R4310N6488n5608p7734K930N4382J9857l5670m0192R746M2446
335I455J685m0061k101M8980K7051k0597k2436l552k370j6025k2210J0807O0532
348B9158L7978n1527p3995J2040Q2278N2890l4517q7155m0829N7744O7099l5727
360A5437q0479J5137J01022M7567o9428r7082l786R0540N7278n2250q0436j0348
372f6828M0448L0999Q386o149n792J0047J664l1257k0973K4683J9131k5897k0242
385d1780K7484L5784j0736m5400q272O6508O0690n1364j12398k0028R1555P1366
397F3409k9737p8465k4660O8424Q1017j8190r4018l6452O2344O2446k3020p8914
$$ y = [57307, 30076, -34660, -30156, 55611, 93329, 19579, -57276, -38836, 26799, 46336, -5912, -72171, -61500, 32810, 89298, 33690, -44044, -41114, 13268, 33125, -2545, -42737, -32991, 9455, 11140, -28921, -31022, 17958, 45009, 24412, 1976, -1576, -3946, -19971, -42181, -31374, 29158, 67136, 15609, -58386, -46346, 35932, 88822, 54305, -32850, -73679, -15935, 51164, 15437, -65042, -49905, 51117, 98684, 29256, -67826, -71612, 18928, 76206, 23956, -56480, -66828, -26380, 4619, 13005, 6856, 1064, 11111, 12775, -18482, -39455, -14772, 4359, -21538, -41780, -14296, 21488, 10752, -34648, -42920, 23588, 84278, 32914, -79484, -99512, -7957, 63409, 33672, -44793, -69453, -1029, 79988, 61798, -32220, -68672, -6328, 56118, 33098, -45816]
409d5816l5317N7367P6312n762o0677j2165L5347R093k0753r941k10r018j0231
422c1771J899K3193L0164m774m4483j7057M4957M5065k1277p3033m3592M7552
434d3157Q9571L490r3400m3767Q1391Q9865k2462r5072m7802N0654Q0875K847
446E3033q1941n0509M8143P8213J7281m3688m0882J0930M1486J984m2957j6431
458b5338K8172R727j6475Q893K9401P5k7193j1553K2161L2460j0650o3517l9952
471f3789M5627P4256P221o2971m8671L2685Q3678K0998q5647p6801M0658Q5956
483E3200J878p2938m1536L7743P1712K3866m9776n1426J2838M1592M381k6999
495D535k1099K136J7401J1009l542O952J8875r012l3673J821L6459K379m7478
$$ y = [-45816, -81133, -23766, 52546, 46784, -13893, -26058, 9289, 18382, -2371, -12312, -12522, -21540, -31771, -29872, -6679, 23485, 18711, -25772, -42829, 2128, 47193, 25916, -47117, -90709, -43157, 46414, 49904, -43496, -87263, -5872, 83993, 61531, -33541, -81343, -30689, 50186, 53033, -28908, -79417, -31274, 46939, 64220, 20532, -20350, -9420, 32066, 34050, -8907, -25338, 2834, 12561, -3914, 4979, 34380, 34455, 7262, -4291, 17870, 50330, 39680, -23837, -63789, -18162, 56094, 63315, 344, -48327, -15642, 68036, 89034, 3387, -73414, -32756, 53200, 55078, -17860, -59396, -21653, 50059, 73925, 24149, -27277, -14439, 27153, 31534, 4535, -16564, -14428, 2973, 13982, 10440, 17392, 36267, 27255, -6418, -4597, 31862, 34241, -13237]
508a3237l4977K5007O0636K3972n1964n9694K7468Q1565J5515p4095o7432J3268
520e3968O8255L3859m9346o5051K0455P9239K4017n5801n2186J0049M4370J5380
532A9272l9808m2182J5206M1053L189j8558O601J7863p340k3417j0178J4183J8765
545e351j2616l9526k780N0371L2403k8210m0494N826M5186K8740l7081p1440q678
558h3650P3089M9198m2825o0573R620O3765L4446l6862n6143L385M7409R235m1939
571c1845k4799K0843L2329J3191j3140j9978P598K5430q851l6208j568L3303N212
584A517l4066j8686L1567M8968K728n0508k5765M1931M0601k9334n4705m662M3622
597f792L6465r497m2142j0675M8103M2635k7029n5087o773M0217K5471k5508m0809
$$ y = [-13237, -48214, -23207, 37429, 61401, 9437, -50257, -22789, 58776, 74291, 196, -67236, -53968, 14287, 48146, -1200, -66251, -45796, 33443, 57460, 1659, -50527, -40478, 3892, 19272, -20536, -62718, -47512, -6459, -3270, -21828, -15227, 2636, -4704, -28121, -38299, -24116, -5351, -17967, -57493, -60273, -9902, 22501, -5709, -46203, -40377, 4809, 33549, -3532, -74972, -83650, -10561, 38637, -4188, -64761, -55141, 8624, 43070, 6208, -49935, -46550, 859, 10094, -31845, -56644, -35801, -3472, 9719, -3421, -23399, -15801, 9629, 778, -35430, -36998, -3695, 1517, -32549, -51235, -19668, 29300, 32028, -18480, -44245, -2314, 38287, 8953, -45752, -50414, -6792, 29673, 20176, -21966, -32641, 15462, 58097, 31068, -24019, -30792, 9425, 34896, 9388, -31421]
610c1421Q572N4964K0818l9143k4454K9814K6296k0892l4294n891K3137K2121
622B9627r410k8535J460L7377K1794j9983l1521m151K6326J5535l2398m0745K2373
635a2251N8926L671m8049j4401L7243K7596j7208l4395r854K5251J7452k3428
647A0553k7030J8128M2500J3784k6409l1136N193L8674J1179m5866l4998L2030
659F602M5443j2472m0565l953L9042L4798j3885m9460k0688L1367K6261j9715
671B2775k9956L341K6271J6042j1948k2554N735K8204j856l8267j8494K1068J6295
684A6656j3167j7996O553L0902J6879k9477l8166J3803M4249J208m8147l3980
696e0683J9512M7678J7499l6231l6768K5214N2815j259n2833l1445K1906L8469
$$ y = [-31421, -22849, 32115, 52933, 13790, -10664, 19150, 45446, 24554, -9740, -15631, 7506, 29627, 20217, -8318, -6858, 30519, 52313, 32330, 809, -3342, 22984, 38519, 6121, -34624, -12251, 46675, 50346, 2297, -12104, 25139, 52735, 35527, 1132, -8722, 16529, 33981, 10553, -16477, 1651, 44151, 57935, 31526, 390, 5583, 44257, 55436, 9570, -25428, 6602, 52045, 39573, -992, -4945, 34097, 68895, 55010, 5550, -15138, 16229, 42490, 22775, -7181, -3840, 22431, 38473, 26525, 3971, 9706, 37910, 36054, -2213, -20707, 361, 16656, 3489, -14507, -7954, 22948, 39827, 10350, -27816, -14013, 30236, 31444, -16703, -50683, -31171, 16507, 34006, -2225, -38993, -13779, 39036, 37777, -15056, -46501, -24595, 13874]
708A3874M109l5701k4179K6153L8539k088k4801m320J0141j37j1854j1160M281
721a7143J6786k25k2954J419L8006J7440l2698l3651J2087L7075Q713m0203m4143
734e9491J7779O3175K2729m4380m2328J6410N1509K1600m1703n7006O177N8146
746A2617K1720l9542l2175J9925M0399J5755k1742k9757J799K2891R80k0899j482
759i511J6148K224r940K963K1390J6042j5567l5430n060L9238K0395l7677m2898
772c7683J2882N1619K9782k5820n2640o796N6132L7417m3456o5829r18N4269L4624
785D3583k5270m7191l674M6134L0653k2637l6251q963J1193J0424q0j1141o494
798a9714R747P357l438N277J1487j0703k5459k642K2042J3273k0375l6380k244
$$ y = [13874, 17983, -17718, -41897, -15744, 22795, 20707, -4094, -8414, 1727, 1590, -10264, -21424, -17143, -357, -582, -23536, -22117, 15889, 33329, 631, -33020, -20933, 16142, 24855, -15348, -59491, -41712, 21463, 44192, -188, -42516, -26106, 25403, 47003, 5300, -51706, -45529, 12617, 34337, -5205, -37380, -17455, 22944, 38699, 16957, -12800, -11001, 11890, 12870, -8029, -9511, 6637, 8861, -1079, 1884, 23274, 39316, 23749, -11681, -16741, 22497, 42892, 5215, -37683, -24801, 26818, 56600, 30780, -21860, -28656, 27476, 64893, 21437, -44392, -45310, 8959, 43583, 18313, -28878, -32552, 13582, 44235, 21598, -14653, -23616, -12423, -1999, -2079, -13220, -19714, -9967, -2610, -6048, -771, 10716, 13, -25446, -28088, -6046, 7227, -13148, -49528, -51772]
811e1772N2264M4443k9355o2563p673N0029L6794k2707n5605k2018M1689M8526
823B2052j3309m9642q661M4073L6783j5802n0942k5050K8984L5489o898k5473
835b8396j540J0410L27M145J3701O979r541k0532j4194J1396K4004k633k8071
848c3945k864L6185K7991j6580m2568j4418M0841M7175j6976o6601k6103M5877
860b1986N5055K738m0987k7188K5182M2894m561m5652j8160K7325K6087n478k0719
873e450j1465J3217K5339O505j2514o015O71j1862j0984J0867J8684N75k0619
886c051j5678J9171M0364L696m5919l0533K9181M1255o249m6042k9287K6388N4252
899C7548J0301m7326l0504L1664M2069p448m4149k7921J7090M0457J1386l0241
$$ y = [-51772, 492, 44935, 15580, -46983, -54656, -4627, 32167, 9460, -46145, -68163, -26474, 22052, 8743, -40899, -49560, -5487, 31296, 15494, -35448, -60498, -31514, 3975, -2923, -28396, -29936, -19526, -19199, -15054, -1353, 5626, -3915, -24447, -38641, -27245, -3241, -5874, -33945, -36809, -624, 27367, 10787, -31781, -46199, -5358, 41817, 24841, -41760, -67863, -21986, 33069, 35807, -5180, -32368, -7186, 35708, 31147, -14505, -32665, -5340, 20747, 15269, -5450, -16915, -3698, 21641, 28146, 15632, 9617, 10288, -1574, -12558, -1691, 16993, 17568, -3051, -18729, 442, 40806, 44502, -1417, -31950, -2769, 38486, 32237, -13805, -43092, -16704, 37548, 47849, 523, -29981, 1683, 43752, 36304, -7845, -35766, -18676, 21781, 33167, 2926]
911B926k2719J6502K3575J155r878k580K906n184j7905r900J9184K4280q073j9971
925e682P082K0770l113k1649j2571J1771K7051N969l9114m1160J7473N8831K6637
938E2295l1536m2151j309L2570J2734k9664k3697K1276L0218q015l1481j2220
950c0980K0670L4506J1756k5889k9094J985J1287n995l578J7121J6749p142k3776
963a2380j0887K1868L1427l882l5209j4339K0108J2444j5657j6944J0292L4157
975B0998J9618k6033m1192J625M0138J8118k6529l1704k37K6867J7751j5348k1043
988a6971J4535L0134m362l0870j1965J3929J3161n154j7153m682K1155K0206j1661
1001A0302k2493L475K1553L786j9667j8454Q279K3696j141k9652o881L5372K7934
$$ y = [2926, -19793, -3291, 20284, 21439, 11561, 8981, 11887, 6703, -11202, -21102, -1918, 22362, 14289, -5682, 1400, 22170, 19057, -2592, -15163, -3392, 23659, 29628, -9486, -50646, -33173, 25658, 52295, 20759, -21392, -22701, 9869, 22603, -7061, -30758, -9482, 20736, 12721, -18760, -30980, -10310, 24196, 35952, 10063, -19031, -17046, -5759, -11754, -15332, 1789, 18538, 11396, -12380, -23267, -1399, 30028, 26146, -9063, -23402, -3294, 9150, -6507, -23451, -13159, 20998, 40616, 14583, -26609, -24984, 15154, 33272, 6743, -24961, -25198, 1669, 19420, 4072, -16971, -2436, 27698, 23336, -7534, -19499, -5570, 7591, 2437, -14716, -19398, 1757, 21963, 10302, -12191, -8716, 12837, 16623, -3044, -21498, -13219, 10477, 9336, -20316, -27197, 8175, 36109]
1014C6109j4231k9318j0289R049J4485K64j4787l082J8532P183k1148j4902J9921
1027b214L3215N368l2840l3373N696K8032K411j7263M836K3667L328k3922k1113
1040b4172O191L1637K3392k0165m3750j3085K4105K2695P42o510K916J0392l483
1053A0905k6207j5935K4328L1170p402l1775j2888J3131J6356L759l702P433J4698
1066B3871j0081l5985j5568K6777L2694P31k6361k1920J0578L4097R094k8904
1078i77j6442K3876K1904k0228l6961o397L4375L2417p883l2962p313K3692J3973
1091B1074j1177j4743l840N604O109m168q834P007J5528l305j3951M868J7881
1104A8053J95k2179k0549N435K7920J2226k2519k0090K0031L1443o575l4841j5151
$$ y = [36109, 21878, -7440, -17729, -8680, 5805, 6069, -8718, -11800, 6732, 13915, -7233, -22135, -2214, 31001, 36369, 3529, -29844, -24148, 3884, 6295, -10968, -6132, 17535, 20863, -3059, -24172, -17981, 13656, 37048, 16883, -26867, -39952, -15847, 6848, 7590, 1080, 3996, 14388, 10905, -15302, -31237, -6909, 24261, 16859, -14916, -27804, -14673, 1683, 5442, 1740, 9173, 23871, 13790, -22195, -37763, -10986, 21708, 22439, -3922, -25842, -15264, 18833, 27927, -977, -17419, 6457, 28361, 8133, -28828, -35225, -850, 31567, 23684, -9278, -16591, 7101, 21074, 9897, -4846, -8686, -3082, 3027, -1141, -9975, -2968, 12560, 9255, -4696, 172, 18053, 18248, -3931, -24480, -19045, 8875, 21101, -1418, -21508, -1477, 29966, 23391, -11450, -26601]
1117b6601K4743L5017l284m5554l1097K4686M5285J2917k1019k2456q81J6237
1129G993M760j9284j0197K0518J8079j5238k4602o83J8553J5908L104m491m434
1142I986q953k1679j3611K3298L7880L989l2528k8347N913L2615K2390j6435l1406
1155a6888J111K5941l63l2443j7877K6157M5467J2579m0283m3536Q785M2870J5880
1168B7400k0193k1462m847O705P869J624M02R005P471q439j1485m15K370l739
1182g734l051N168J1163N654j5809k1072J1578L9960J0893l5848l4590P872L3267
1195G451J6648k3058l3620N477M2407K2286k5195l4412q9K7045J8122j6595k9346
1208b2879m70K7377J2641j4960j2304O193J3688P746m402j4099p871O77j096L677
$$ y = [-26601, -1858, 33159, 29875, -15679, -46776, -22090, 23195, 36112, 15093, -7363, -8244, 7993, 12753, -6531, -16728, 3790, 21869, 6631, -17971, -18654, -101, 15807, 18911, 14420, 9986, 1033, -20646, -34257, -10959, 26921, 30910, -1618, -29965, -24052, 8563, 30953, 14518, -16888, -15777, 10164, 9801, -22642, -40519, -14362, 31105, 43684, 3401, -40135, -31350, 11520, 27400, 7207, -14255, -19102, -12397, -4528, -2904, -2502, 6503, 13974, 5535, -5950, -6365, -3995, -7734, -10785, -5617, 5546, 11200, -4609, -25681, -14103, 25857, 36750, 902, -33688, -25816, 7451, 24099, 1041, -32579, -27102, 15305, 37591, 12396, -22016, -22105, 4940, 23062, 6467, -22879, -23349, 4028, 16669, 1709, -10595, -4402, 9286, 17032, 12630, -1469, -9340, -8663, -9759, -6082]
1222f082J9687J3378j7914k7160K179K9195K1573j2168l3192j0235K4239J7957
1234B1457j8627k1978J2316L4635J7331k3508m3278j0458L9616L6511j5107l9124
1246a0214j3573J8065J9510L289p620M65R870k315j8443j0176Q420R791J013P14
1260H796m63k864l288n886K204K1174J7459k0136l9139r458K8085K9168j690k7709
1274c747j5035K2013K7539j0919l3243o295K6386J9702j3942l2635j1309K6862
1286d623L1330m512k5048q571J0862R009l588j1599o658P363O470o935m636J2083
1300I47Q502j1786j1140P737J3691k810j9921j6053J2186K5306R41k3266q623
1313b4289K0777J9895o545k7477j8044J6350L1595J68l2294j7351J8782K4934
$$ y = [-6082, 13605, 26983, 9069, -18091, -15912, 13283, 34856, 22688, -10504, -20739, 3500, 21457, 2830, -19148, -6832, 27803, 45134, 21626, -21652, -32110, 7506, 44017, 28910, -10214, -23787, -5722, 13788, 17077, 9457, 9922, 19792, 17477, -966, -11142, -2722, 7069, 8082, 8796, 8333, 5469, 2181, -3705, -1501, 19673, 37132, 16996, -22143, -31601, -3516, 25652, 23962, -3747, -18782, 3231, 30770, 19851, -13392, -19687, 6699, 26401, 12459, -20176, -31485, -4623, 26707, 22195, -2853, -11424, -562, 8447, 4859, -6740, -13398, -6035, 435, -6500, -11136, 947, 9449, -2337, -13477, -5740, 7951, 5141, -14780, -30833, -18647, 6659, 7600, -15666, -24289, -3512, 16383, 9838, -17639, -35683, -19333, 12262, 12430, -19864, -37215, -18433, 6501]
1325F501L892j3826j0582O718J0879r242j8981J829K0237P681r515q426J961Q247
1339b627L956n262j636R240J295k0216j5725J2038K4796J0895j1021k0444k634
1352a7345K1335J2451j8147j8819J0307J9791k618k2177j0993J7777K8940L967
1364B4469k4842j6799J0046J2627k903q658k546N737Q146k708j1917K448J9884
1377A2984P284j5986j4921L880J0374J286j1487o136J4725J7054q720j9806K373
1390g096J8678O355j2436j5571l247J3184J1671q610j4127O862J8990K916j4681
1403B888j1269M570J3577r28j8692q643J8127J7168j0263j6202L371J6137P048
1416A6889j0995j7235j385J7200O571j7131j1356J3251J9426K482j4611j3990
$$ y = [6501, 10393, -3433, -14015, -7297, 3582, -5660, -24641, -22812, -2575, 5106, -4409, -12835, -10874, -2627, 1329, -3933, -5569, 3671, 4966, -15250, -30975, -18937, 5859, 16754, 5733, -14711, -17345, 3990, 16441, -1706, -20525, -10218, 9573, 6955, -15222, -26215, -8438, 20502, 24469, -373, -17172, -7126, 5501, 2598, -6060, -8606, -2869, 5277, 2569, -9348, -6900, 12984, 20268, 4282, -10639, -6759, 3615, 4901, -6586, -12722, 2003, 19057, 10337, -9469, -7096, 11582, 17937, 5501, -10070, -13317, -133, 11538, 2928, -11199, -4337, 14653, 17569, 2888, -8381, -3811, 9766, 8838, -9854, -18497, -370, 16798, 6535, -9667, -6296, 9841, 16889, 5894, -11341, -12726, 4474, 11045, -6086, -17442, -4191, 15235, 17717, 3106, -10884]
1428a0884N275J7538P77j8835q298J2138R961m930q181K910J2359Q036j0947j7005
1442a0086K824J5796m40j5410m224J2785J1968l633j4706m262J8068J5871j3737
1455A0814k5518l692J8237J4207n342j7615m550J9709J7873j2903k2950J875J8235
1468H380N240j3618j3551J401J5357Q104q435n696P859M799p918o993K804N260
1482B993K79q304q625Q909J9370M18k0314o895J7004J4441r860k3098q832J7627
1496d887K2687n722k5311n110K1874J8203o737k1274j1171J2452J6980n342j9748
1509a3106k796J5593R716k925o941k671M071L487m615o410M175M263q499n574
1523a2232J0585J4353p66j3746r715Q587J7803j369k4587j3086J8163K2860j985
$$ y = [-10884, -5609, 11929, 12706, -6129, -14427, -2289, 7672, 2742, -5439, -2529, 9830, 17866, 6919, -10086, -7262, 8534, 8094, -7316, -11540, 1245, 13213, 9580, -5126, -9388, 8680, 24551, 10814, -14704, -18396, -159, 14048, 8706, -8909, -13459, 6250, 24123, 11220, -11730, -9855, 8380, 13620, 2, -13549, -12148, 3209, 11313, 2878, -2818, 5041, 9840, 1922, -5071, -2267, 2993, 3272, -5032, -13657, -4748, 14622, 15040, -5274, -12169, 4835, 19276, 9416, -13682, -22514, -4887, 17800, 12078, -13233, -18343, 3531, 21734, 14997, -6277, -17448, -4996, 11984, 6642, -13106, -15902, -309, 9407, 6482, -459, -3130, 941, 4428, -187, -6597, -2422, 1841, -6658, -12232, -1647, 12706, 11940, -1806, -11521, -2934, 14869, 13500, -11087, -24173, -6010, 16850, 14865]
1536A4865k0928j2194J5462K6527R43k9099j8377J4932K0644o82j5523r626P991
1549e065J6563M093j2694p149P461M635n804m683J250R19j795j245N110J1463
1563A3059J969j6040j2065J2617J7419m122k0512j1891R313K2728Q457j9579j9549
1576a8196J1876K7623K051k5663k0296Q516K5304P525k0835j7065J1820K0296
1588A2956K655j1200q395p80N659M068n872o476L444M088k135J285Q236K943q921
1603A555r829O43J2947P243j5326j9498Q388K6684N887k0133j5473Q802K1422
1616A3312P933j9766k5346L401K5697J1893j3858j7042J055J7761J2097r888j7344
1629a0095J303J3264N82j0329m309M428M779L309J229L43R96m343r455N20J3778
$$ y = [14865, -6063, -18257, -2795, 23732, 24675, -4424, -22801, -7869, 12775, 12093, -3430, -13056, -5065, 11498, 15591, 2897, -4252, 3209, 7844, 2040, -2643, -1393, -474, -2269, -3514, 1596, 13059, 15028, -1012, -13077, -460, 16959, 12837, -7675, -19566, -10253, 12475, 20932, 1353, -18196, -6320, 21303, 23354, -2309, -22605, -14089, 11215, 18740, -2095, -19160, -7340, 12956, 15611, 4411, -3984, -4764, 895, 4963, -909, -7385, -3941, 147, -1988, -703, 7533, 10476, 1555, -8274, -7631, 5316, 12559, -2767, -22265, -13877, 12807, 18694, -1439, -16912, -8110, 13312, 21245, 1479, -23867, -20466, 5231, 17124, 3266, -13776, -12721, 5040, 17137, 7249, -10095, -8792, 4472, 5054, -5275, -9584, -5156, -377, 2932, 4161, 4504, 5500, 1157, -8298, -7778, 6000]
1644F000N814j3611j4253K320J7150J4675p129k0579l518K1062J1112j7533k1782
1657b0272J886K2475J5579j2267k4314o91K4221J3833j2235j6673k209P442N438
1670B213k846q056J554J0542K655p240k460N418J344n289m349J578O423q97j2018
1685a1428m536J7088J5999q681j9152l046J3400J1141n583j8532p687J6352J7691
1698A3026o461j6578k927J3947J2719n178j7754o900J2529J0310p457r994L365
1711g353R129M136k964m936k84M803j418q716j33J0746J307j0263m686Q844J2923
1726A1135K131j2591j1838O671J4267k935j5755m658J2971J3025j232j4073q678
1739a1560J3054J7263n617j8703m946R447P203k714n537L24R700N709q688r380
$$ y = [6000, 11814, -1797, -16050, -13730, 3420, 18095, 10966, -9613, -13131, 7931, 19043, 1510, -20272, -18386, 4089, 19668, 7401, -16913, -17604, 6617, 20450, 8215, -8458, -10667, -3225, 2213, -633, -8689, -7135, 3407, 6062, -1178, -3638, 1780, 3124, -2165, -6514, -4936, 1487, 590, -11428, -15964, 1124, 17123, 8442, -10710, -13756, -356, 10785, 5202, -13330, -21017, -4665, 13026, 6565, -10013, -12940, 1007, 13726, 8548, -9206, -16106, -3577, 6733, -724, -10718, -7353, 1776, 5912, 2948, -1988, -2272, 2531, 1113, -7603, -7736, 3010, 4317, -5946, -10632, -1788, 11135, 13266, 675, -11163, -4492, 9775, 6840, -8915, -13573, -602, 12423, 11191, -2882, -11560, 1494, 18757, 13140, -5563, -10509, -1062, 6141, 3427, -2110, -1786, 7914, 13623, 4935, -4445]
1753d445N063R550k079q531m954M006P130M24p675L76J2960M965j2547j2173K819
1768e111J0702M986p055j2022J629J4719M868j1099o208Q146Q728m696j2809o262
1782a1484Q020J1629j758j1585m21J0503M564o312p403Q40P654L561j1082j2348
1796a5622P377J6937J304j3315n039Q468R426k836j2982o500R704R806o451j1413
1810a1136J477J0852O665l547q591k617P803M225r970p889O404R150j480p099
1824e753j923P943Q963m667j4609j727J3925N549j2210j0491N108J2882O695p544
1838B141j2276K745J5019K648j3943j0761N443J1561L754p862q942N619J2450
1851G596P22r690k678M788M63m347l172J765O007K919o068m019Q530P713p279
$$ y = [-4445, 618, 10168, 8089, -442, -5396, -1390, 5740, 6164, -1511, -1135, 11825, 16790, 4243, -7930, -5111, 5591, 10577, 3522, -8500, -6871, 7848, 12716, 1617, -4591, 3555, 12283, 7587, -5222, -11484, -3464, 8165, 6407, -5178, -5599, 4904, 9468, 3156, -4247, -3407, 4247, 7808, -3274, -15622, -8245, 8692, 9996, -3319, -8358, 110, 9536, 6700, -6282, -12782, -3078, 6728, 277, -11136, -9659, 1193, 7858, 4311, -4280, -6897, 906, 5131, -4839, -12728, -6324, 2826, 1346, -5753, -7676, 267, 9230, 4563, -10046, -11773, 2152, 7701, -4509, -15000, -9892, 2990, 9685, 2141, -10135, -7390, 7629, 10277, -3666, -14427, -8984, 2577, 6331, -1531, -10473, -4854, 7596, 8318, -1372, -4050, 738, 1201, -3146, -6318, -4553, 1454, 4373, -1695, -5714, 2816, 10529, 3250]
1866C250j0946J151R415M681q047j2465J096J7488J0859j0490j5536M89J3038
1879C983P835q172j5479j564J5553Q986j0656j0527O031J1167L186o162q932k206
1893f957N580K736l610k00M120K6l930n77M849N746j093j0393p609Q533J0837
1908H058n407j3618J425J4997R462p066j6477n045J5667J4376q841j9815l795
1921a6079J3742J2227j780j0628m688Q874R241n873j1275j450P076L795j557m179
1935b554j043L615K288j757K298N425m063j2600k614J0839Q287m118j0501m355
1949a0853J0741J4140l491j6844o147J2201J2421m540j7135q489J3434J8684j511
1962A2611j7473o224J1224R754k686r928p297L232R201J134o205q03M302J303
$$ y = [3250, -7696, -6545, 2870, 7551, -496, -12961, -11865, 5623, 16482, 5992, -9544, -9055, 3983, 11818, 3646, -11833, -13397, 2156, 11142, 486, -10041, -4010, 7157, 10343, 4181, -4751, -6957, -1377, 1359, -2251, -2451, 1669, 1695, -2235, -2812, 2037, 7783, 6690, -3703, -11312, -2779, 8058, 2651, -10967, -9542, 5455, 14917, 7851, -8626, -13671, 1996, 16372, 7531, -12284, -16079, -2337, 9890, 8110, -2518, -7206, 1668, 10909, 5036, -6239, -7689, -613, 3182, 1625, -2554, -3597, 18, 2306, 549, 2847, 8272, 4209, -8391, -11005, -166, 8121, 4003, -6498, -10853, -112, 14028, 10537, -6307, -12454, -253, 12168, 7628, -9507, -17996, -4562, 14122, 12611, -4862, -11086, 138, 9892, 7206, -2722, -10019, -6787, 2414, 3548, -2657, -3460, 842, 2145]
1976B145j668O24J924j237m660n605K334J0153K363j0609n556J0247J1654k737
1990I372j3891q725Q115J6432J333j8803j2771J1058J8623L864j2069j0627L488
2003d601J2651J756j2955p419P780J0126j021o510l976K911O926L154l453k293
2017C076m50m828n017N778J0090J768p264p962J756J1900O077j0422j1730M836
2031b392J2801n81j3005p724P650J7606O483j4280j6429L426J4711N838q427j0761
2045e084r52R464N474n959o218P109P461l478p557j599J468J303q64r19K729L601
2061E979l263p630K507J0819L210q668j0614j385R432Q827n912j3762J728J4547
2075E815P294r635j1674P7J0251O202q342j1886K408J1884L339p060m819K722
$$ y = [2145, 477, 1101, 3025, 1788, -2872, -8477, -6143, 4010, 6373, -4236, -9792, 455, 12109, 9372, -4519, -13244, -5129, 11303, 12636, -6167, -18938, -7880, 10743, 14607, 2538, -8089, -4601, 8050, 9806, -3149, -10568, -2788, 7338, 6317, -193, -4169, -1258, 5668, 8822, 5369, 3076, 2626, -2202, -7219, -1441, 8649, 10417, 3153, -4809, -3053, 8847, 14924, 4502, -7228, -2392, 10409, 9828, -3177, -10901, -3251, 14355, 20838, 6558, -9871, -6445, 8266, 14104, 5677, -5084, -6036, 3428, 8902, 2943, -3275, 3834, 11295, 7817, 260, -1339, 129, 1432, 568, -351, 2378, 5979, 2716, -4914, -2407, 8412, 11622, 2954, -7660, -9045, 387, 9214, 3302, -10460, -8732, 5815, 13109, 3474, -8200, -8123, 2128, 8330, -12, -11898, -9490, 2394, 5733, -1327, -6146, -3424]
2089c424N395J729m173n317K69K444k300j457N125N367j681o150m026M640Q889
2104E330j31j1624n906Q562P382n863p411L136J0945O505p384j4104k579J2054
2118a088R446m944j0253k476N790O443j101n553K992Q735o65j2090o314O283Q002
2133C207J024m705l110L424M182l507m824N371Q191k226j1216o261L752J0371
2147C673N295n805p453L172P708j550p024k981N407O706k633j1162l973J1526
2161I06R327m475q207J393M791j25n600l124K555N913L44p068k956O571O934j994
2177E185p311m271N001P373m059j1225o06J1283M887o251n292K938N573J342o185
2192a618p717L012R263qp608l039M362N015L19l597j285M382J947p899q037N181
$$ y = [-3424, 1971, 3700, -473, -5790, -5521, -3077, -5377, -6834, -1709, 3658, 1977, -4173, -8199, -3559, 5330, 5199, -6425, -12331, -3769, 3613, -2250, -9661, -6525, 4420, 10925, 3541, -10563, -13142, -1088, 8358, 3414, -6839, -9315, -3525, 2918, 1817, -3736, -744, 7991, 7326, -4764, -11078, -4795, 3207, 4231, -474, -3584, -160, 4022, 515, -4309, 1062, 9253, 7027, -4189, -10450, -6698, 3673, 8968, 3163, -4290, -1118, 6590, 5040, -1984, -4965, 442, 7148, 4515, -6647, -10620, 906, 10233, 5758, -2449, -1056, 3735, 3610, -1990, -5114, -2559, 3354, 3698, -3370, -6326, 245, 7179, 5185, -2126, -6397, -1396, 5977, 1918, -9307, -9913, 1370, 6257, 6, -5286, -2348, 3225, 4567, -1618, -9335, -6323, 2940, 2932, -4676, -7715, -3353, 1662, 1981, -1616, -2901, 1481, 3428, -4471, -12508, -7327]
2208g327J0218K630o358o948J590Q426L423p522n639O066O336n103r721j410Q439
2223b900J0654J175r886p665M389P153p43m331j165K046J255k779l911L749Q841
2238E882J553p789l488L142J333l912k010K815O382K288q285q311O316J3153K427
2253A1496j1019q833J536Q636L714o588p156N308J0521M39r021n423L771P316
2267D697K208p666p268L723O868l84l535K003K574j146k370m24J575J576k833
2282d02n579R50Q080M060n632o641J365Q071M891n506j1576K87J1122M938r098
2297f70q858M208J1687O073p264j2329r42J0585N934o088o318K68L357K548k58
2312A933j638K179L318k510m997J09K601o04k356J223M556K774l967p973N43J1975
$$ y = [-7327, 2891, 5521, -837, -7785, -6195, 2231, 5654, -1868, -7507, -1441, 4895, -208, -9929, -11339, -2900, 7754, 8929, -957, -8622, -4233, 2920, 2177, -2154, -3319, -1273, -18, -2797, -6708, -2959, 5882, 7435, -354, -3842, -700, 633, -3279, -5289, -2474, 3908, 6196, -2089, -10400, -4084, 9069, 11496, 477, -8356, -6820, 1816, 5530, -1058, -8214, -2906, 7615, 8054, -967, -6390, -2619, 4697, 6905, -761, -8029, -4306, 2562, 2178, -1357, 646, 3220, 2074, -296, -720, 855, 2431, -402, -5981, -5031, 3049, 7109, 1477, -5164, -3799, 4272, 9163, 3657, -7919, -7632, 3490, 8428, -670, -9528, -5320, 6367, 12440, 5176, -7153, -8095, 2490, 8424, 2336, -3982, -3714, -357, 2191, 1933, 295, 2474, 5792, 3282, -1715, -1606, 995, 391, -1965, -742, 3814, 6588, 2621, -5352, -4809, 7166]
2328G166P347r760j3246q01J0757P631l508r281j540J0066O737o712j0408L68
2342e184Q395O269m235j0605l125R323P709k840n087L58J411m70j666N1P49Q22
2358A875k415k728L665O151j956o377q56N913L897k801r369m613Q671J0743l033
2373F767j1753l391J0237R170k488j1932o540P431J0865k785j0399k236O453N738
2387E137K44m499k912J981K943j990l790J086J257n82M38J959J335N0l205l437
2403c985L375P660j681j1479m499Q264Q980j43q027n183N183R254r35j0354n100
2418h670O010P842k89p891n712M914J0308P92q154l584L072K672j182k237q07
2433b916J755J718j954j308M034L174m400m928K780M503n36n367m804L232Q564
$$ y = [7166, 14513, 4753, -8493, -9294, 1463, 9094, 5586, -3695, -5235, 4831, 11568, 4856, -5552, -5184, 3211, 9480, 5245, -5360, -8485, 838, 8547, 5707, 620, 978, 2389, 1919, 253, 304, 1053, 1875, -540, -3268, 397, 6548, 4592, -1785, -2641, 3272, 7169, 4368, -5001, -9614, -943, 9800, 6767, -4986, -8377, 1860, 11030, 8542, -3390, -9930, -2499, 8366, 5581, -4818, -7054, -601, 5137, 5381, 882, -2030, -49, 2894, 904, -2886, -1800, -543, -1125, -687, 1272, 2607, 2657, -548, -3985, -610, 7050, 5369, -6110, -10609, -2345, 6635, 6492, -1535, -6718, -1535, 7719, 6784, -3570, -8670, -2660, 5182, 4893, -2998, -8710, -3796, 6512, 7304, -850, -4434, -1362, 1310, 128, -2109, -2916, -1161, 557, -1397, -2705, 1329, 4503, 103, -4825, -2045, 2458, 1922, -3445, -8249, -5017, 3547]
2448C547K411p362o451M633Q254Q37p960p194J442J0244L606q759o683N178P891
2463C634M26n145l775J428L859l25m852j067M307J931j826j116J767J131j1k561
2479b195k341L167M074l917o852J297Q672M509m290p639l51P854N215p490q729
2494i016L660Q543J688n797l995J918P084L689n686o870J981O425n60m844j742
2509c522L617M665p83m644j96N650J569o332l112L668L835p61l904k552L350P428
2525G976r6p403k833N371L657l331n388j154N249N495k294p224p61P442L428l788
2541D346n089L1K798J575l336l400M775N850k201o476p80M483K477j723m552j994
2557c216M680K919n019m163M380P282o0n977n783J303O095J962n482m117L881
$$ y = [3547, 5958, -1404, -7855, -3222, 5032, 5869, -2091, -9285, -7843, 2401, 6007, -2752, -9435, -4257, 3634, 4060, -1085, -4860, -3432, 427, 102, -4750, -5817, -1510, 421, -1405, -2521, -754, 377, 366, -2195, -4536, -1369, 2705, -1212, -8064, -6767, 1905, 6414, 2124, -5515, -5866, 1988, 7203, -287, -9016, -5356, 3187, 4875, -922, -4917, -2999, 4085, 7774, 2088, -4782, -2801, 3624, 3064, -1780, -3522, 95, 4760, 3977, -667, -863, 4787, 6356, 24, -3088, 580, 4415, 3654, -250, -2802, 548, 7976, 7880, 477, -2356, 3015, 6672, 3341, -2047, -3201, 2048, 7543, 5249, -1975, -2736, 4706, 8134, 4346, -743, -712, 2086, 3661, 325, -3075, 1700, 7550, 5349, -1127, -1907, 2576, 5053, 3330, -1222, -3216, 1464, 4383, -636, -4799, -419, 6863, 6803, 826, -4957, -3654, 2441, 4403, -1079, -5196, -1315]
2572a315M389j851m002M49L582L263k728o894j269O080J898m437j763L720L161
2587B283j003l495k817L425N550k234p755j756N633N075j660n338j822N883N760
2602E729m051p341l93N786K295l415l216O71M217K266k915l228K615L305j643
2617F82l162p96J291J075m94j788J750N792Q52p395m427M735O863l55o759m139
2633f275L486O379l84n866j050O788M239m269p053k624L956P676P24p553l351
2648e177M038L881j252j279J453R74j015m246k422L534M742j488l912J970K901
2663B702o50l963j666K693N798N23q874o486N738R230J492o241n096J465O435
2678C100J976p409n104M699P104j259o302k666L557N401J305m445l269K081J130
$$ y = [-1315, 3074, 1223, -2779, -2330, 1252, 4515, 1787, -5107, -6376, -296, 1602, -2835, -4598, -878, 2283, 1280, -2215, -5032, -1607, 3943, 1709, -6046, -7802, -2169, 2906, 1246, -4092, -5914, -31, 5729, 1678, -5663, -6056, -270, 2025, -1390, -4606, -3935, 282, 2548, -367, -3595, -980, 2325, 682, -2480, -3276, -1985, -910, -1404, -3192, -1442, 4350, 5202, -2193, -6620, -1885, 4978, 4623, -2136, -6275, -2789, 3590, 3206, -2660, -3710, 3078, 7317, 3048, -4005, -6629, -2673, 5003, 5727, -1826, -5177, -1139, 2742, 1490, 211, 1664, 2638, 1623, -2623, -5045, -1511, 3231, 1743, -2169, -199, 2702, 2052, -1911, -3577, -884, 4914, 5437, -3437, -9923, -4185, 5045, 6537, 296, -4800, -3335, 3100, 5076, -2333, -7437, -2738, 4366, 3107, -3195, -5861, -2304, 3097, 4402, -43, -3312, -1231, -101]
2693a01j721m33J669q2m48n59Q7K601K621l016n988J192O699K190o842n236K352
2710e015P341L830n387o850K737P866L69o798n482K237P999L920n519p604J394
2725d962P193K751k903l208k6K56N05j565r26M199K662k770k926J724J990j698
2741B96k159J064L581J248m746o297J626R640N230n189p441j928M589N665j733
2756C446o717j023O964L193n701m765J859O119L971k895p164k731M492K567p88
2771H27l22J188r35j641m1J854K495L2l938k701K985K823k323l131Q77M835L224
2788F108k122p554k487P852O294m896q118l47N800M523j353n403j856N193M351
2803E985l350m590q55K371K417r23k104M36L173N37l189m44K578K62k542j091
$$ y = [-101, -1822, -2255, -586, -668, -1116, -1675, -1588, 1013, 3634, 618, -5370, -4178, 2521, 4711, -2131, -7367, -5015, 2326, 6156, 769, -6081, -3344, 4522, 4891, -1907, -7389, -5152, 2847, 6767, 1248, -6356, -4962, 2231, 4982, 2079, -1129, -1155, -899, -394, -1959, -2885, 1314, 3976, 1206, -1720, 4, 1994, 296, -1863, -799, 2782, 4030, -716, -7013, -5387, 4253, 9483, 4294, -3147, -5075, -486, 5179, 3446, -3271, -4294, 2670, 5863, 162, -4603, -2744, 3375, 7346, 4451, -2713, -5444, -952, 1615, 827, 505, 1693, 758, -883, -924, 930, 3425, 3457, -481, -3182, -197, 2626, 303, -2828, -1951, 2884, 6108, 3986, -3568, -6055, 1797, 8091, 3195, -4923, -5270, 530, 5053, 3700, -1703, -3559, 1634, 5985, 2635, -1955, -2810, -439, 1978, 1055, -1049, -613, 2560, 3097, -92, -536, 2042, 2304, -238, -1329]
2819a329J095K010Ol012k797M661O953j630q301l686M511N193L24n109l581L472
2835a220N252j138n067p52M547L845j757o177m529M626O079j082l375J38J820
2850A210j477j283J369J726J364j900m231j427L804L059j307k126J565K282k36
2865B392l996m007L214P162K7p066m395L290N641K203k317m205K94M442l42n645
2881c308j012M730L715j741l585j743K726L648q53l161J97K366j520k813k10K617
2897E3L469J97m188k593M316L877l197m934P60M009J578k345l675K25N092L117
2913E761l809m312J554L613j15l055k285P74M346R64l458j631K956J690k009k216
2929a232P17J914R59k870l703K049N815M45m488j874J775K244p61k454k148K763
$$ y = [-1329, -234, 1776, 1782, -1230, -4027, 634, 7587, 5957, -2344, -6030, -1519, 3674, 3998, -1111, -4692, -1220, 4032, 2894, -2173, -2925, 1622, 5467, 3710, -2467, -6996, -2370, 3709, 2627, -748, -610, 1210, -267, -1550, -181, 1545, 2909, 1009, -3222, -4649, -845, 2214, 907, -1219, 346, 2628, 2392, -1604, -5611, -2397, 4765, 4792, -2274, -6669, -3379, 2262, 4465, 2148, -2057, -1763, 2679, 2337, -3308, -4320, 410, 4125, 2384, -1201, -2944, -218, 3430, 2577, -584, -387, 1979, 459, -2354, -2564, 53, 3522, 3719, -469, -3062, 1254, 5131, 1934, -3000, -2240, 1769, 3347, 1002, -2673, -2448, 2644, 5761, 1952, -2360, -806, 2807, 2692, -363, -2648, -1874, 2472, 3436, -22, -1653, 1303, 2993, 984, -1232, -515, 1399, 2358, -512, -4215, -2166, 3649, 4094, -394, -2268, -493, 1751, 990, -1464, -3612, -849]
2945h49M200k105n257l90M174L879j028l672k899K094K323j970k655K903L337
2960B085j606l604q19K082L128N02l610k407K403J781k987j992K577M370N01k944
2976e40n112M88N925K303m624l386J235K753O30j355j528J692L921n85n416j369
2992d968L127K471j036j049q74P77J680q55j636K345L143j883m446q03K852K823
3008A668j84l760j045L732M148l283m631N91M654J827k824m354p49N217L921l179
3024A749m229J506L710L66k566k077M82K309R46k535j233L236J055j884j225J192
3040H02K105j64k712l014K066M683o07m943l40M374L089k180m579k369L688N506
3056E405j134o246k083M039M111l99l111k140K544K882j563m763L70L889J067
$$ y = [-849, 3351, 1246, -4011, -4401, -227, 3652, 2624, -1048, -3947, -1853, 470, -1500, -4155, -1252, 2085, 479, -3125, -3944, -1862, 1266, 1768, -1842, -4249, -1846, -65, -3052, -5044, -2467, 1903, 2404, -540, -5652, -5164, 761, 3064, -1560, -4946, -3711, -958, -328, -1683, -3211, -1519, 2402, 1817, -3599, -4968, -1841, 630, -406, -1455, -2329, -1552, 128, -727, -2363, -18, 3125, 1242, -3204, -4007, -1155, 1668, 1484, -2276, -3321, 411, 4559, 1276, -3355, -2764, 1890, 3717, 893, -3461, -4210, 1007, 4928, 1749, -2480, -974, 2736, 3102, 536, -1541, -1059, 1250, 2196, -339, -1572, 1664, 2719, 835, -390, 802, 2907, 2743, 31, -2983, -917, 3766, 3159, -1784, -2124, 2250, 5339, 3159, -1420, -3789, -101, 5405, 4271, -1975, -4058, -19, 4092, 3693, 582, -1558, 986, 3868, 2305, -2458, -2088, 1801, 2868]
3071B868j805j432j63J118N45K15o18J519k39l585k438K902L809Q06k930l243
3087b671J178M359N53m918k198L787L559j829n069k034L594N967P25n552l681
3102d230K431L129q8j798j471J049J533l23k361P30K841L37k110j43L44r41o25
3119a696kP44K293J291l112l853K517N075Q95m267l997R44M704J989m363l471
3135d309K972M743l2l603k314M76L812J803l599l433J754L644M4j897m78J167
3151G50N43o4j681N07J320j066k866J266L587Q53k202k602L28L185K253k719m750
3168c358J134M534R01l705k637J252M556K937l591n732J25N079J598k658k304
3183a869L21K121R56j626j557K268J876j279k661k61J213K79l4j61M30J598m23
$$ y = [2868, 1063, -369, -532, 586, 1131, 1346, 728, 2247, 2008, -1577, -4015, -1113, 2696, 3502, 572, -2671, -1493, 2866, 3419, -1499, -3697, 90, 3649, 1820, -3249, -5283, -1689, 4278, 5003, -549, -4230, -1799, 1330, 1242, -556, -2027, -978, 555, 232, -2129, -1399, 1442, 1779, -331, -474, -130, -1071, -1696, -1698, -954, 1339, 2630, -482, -4335, -1818, 3257, 4152, -115, -4112, -3168, 1536, 3525, -838, -4309, -1337, 3406, 3374, -229, -2543, -2067, 1745, 3548, -51, -3484, -1730, 1914, 1958, 61, -417, 750, 1293, 1229, -452, 55, 1375, 309, -2557, -1291, 2296, 3149, 947, -1655, -1327, 1858, 4111, 1392, -3358, -2224, 2310, 3211, -494, -3131, -1879, 2677, 5614, 2023, -3709, -3584, 1495, 3093, 435, -1869, -1548, 573, 1529, -97, -1654, 614, 2490, 1211, -1450, -1711, -498, -219, -253, -414, 16, 1614, 1191]
3200A191l993o93M519L222k811m951j293L146L859m46l900q08M082J746l348l394
3216c872R61L102K731j962m663o00L832K425j362j144J49J24p6j299r29J846K100
3233A363j461k798J087K653L01j523r89J027J912k38l658k051L974L672j260l298
3249a287r06J694K894J43l479k606K901L303j604k730j80K365J812k98k747n75
3265a300K734O34k954j324J817K021o52r14l77J317J281j195k676J000L370J70
3281B952l080k555R95L444K085j792l647Q76L192n68k621q03K146J930k71k917
3297f34j896K170L502j39k511k56L89k86o36j78O52J577Q75k763k268K542K846
3314B986r28j784q86J90J728o37k799M55M038J928l670l250Q98K891J445j456
$$ y = [1191, -2802, -3495, 1024, 4246, 1435, -3516, -4809, -1663, 2196, 1750, -2150, -2958, 1124, 2870, -478, -3872, -2911, 191, 2922, 960, -3703, -4303, -471, 1954, 592, -552, -403, -279, -355, -1654, -2583, -737, 1363, -98, -2896, -1809, 844, 1145, -378, -1367, -340, 1572, 1334, -2324, -4375, -401, 3271, 2011, -1287, -2193, -499, 2395, 2538, -941, -3547, -646, 2657, 1053, -1677, -1857, 508, 2320, 2022, -725, -1300, 1434, 2068, -886, -2210, -393, 1628, 976, 62, -315, 1002, 2283, 1088, -1588, -588, 2782, 2952, -128, -2683, -1688, 1756, 3841, 2049, -1598, -722, 2470, 1902, -719, -1522, 624, 2554, 2283, -634, -2530, -360, 3142, 3003, 492, 236, 625, 339, -297, -475, 177, 1754, 2629, -134, -2402, 140, 2986, 2058, 274, -612, -422, 1306, 669, -2130, -1675, 2363, 4291, 621, -2629, -1731, 1160, 2605, 1149]
3330A149k419m07K084K99j464l21J694J348n07j839j840J156K501o09l407P27
3346a855L104K46k468q51J401K612L2l579k076K580K671q27k836m00J568K205
3362A527Q16l060k197K318K764j457k907K23J860R42p43j504K64K407N92k028
3378a83j284J030P73p87p66O09J350J035j345k877P44L529J293l169k752R82K321
3395E03J496j792k457J196L879k16m186r85J813K328M31k336j990Q65K260L4j255
3412d12M12J260l63j185j475M74J713J112k200j786K088K036j156j858K17K321
3428A198M98j683l237m53L992K261k016l319N64K227J827j496k526m83K698R12
3444I64k007j971J080J641P37p43j333l52K248k99j988k00J854j71j269J07J017
$$ y = [1149, -1270, -1677, 407, 706, -758, -1079, 615, 1963, 1456, -383, -2223, -1067, 1434, 825, -2582, -1855, 1249, 1495, -973, -1824, -423, 2189, 2221, -1358, -3434, -854, 1817, 990, -1846, -2246, -678, 1527, 2343, -717, -2914, -596, 2168, 711, -2196, -1973, -113, 829, 86, -1418, -1154, 1253, 1845, -183, -1467, -437, 336, -451, -1217, -608, 742, 1777, 432, -2445, -1701, 1828, 3121, -48, -2800, -1818, 503, 1999, 207, -2250, -1054, 2825, 2609, -1577, -2562, -749, 1579, 2010, -326, -2316, -1451, 809, 843, -412, 0, 1260, 897, -288, -1763, -1289, 424, 1536, -664, -2450, -362, 1674, 518, -1340, -1123, 1198, 1696, 13, -3224, -3677, 315, 2576, 560, -2759, -2195, 32, 1859, 363, -2163, -2646, 52, 964, -1043, -3014, -1934, -293, 444, -299, -1632, -1984, 264, -35, -2023, -2223, -369, -540, -1809, -1702, -685]
3461f85J349l83k099q46K329J838j526l165lK317J708k26k270j138K497K833j994
3478E36l456J67K693J683j120k382k83K416J907j390j556R88M96j015n42N20Q78
3495E40O22n82j107P3K209M17k318m15J441J552l59k490j842K257M030n20l762
3512b54j027K553K091q33k438j285J324K870p49k638j85K209R97k76j659r71Q33
3529E62J399j164j187Q63J428r86j152O98J214J67p19k032K6K320Q59k720j969
3546b393J795K858J54k382j753Q33K981J84l157k114K193K517l93j524j756R18
3562a039K735M37k746j372J920M58q39o50P51L33M61j112r49J309J739j220j762
3579a546J1J557N71r57j790Q7K729J959k271k841M44K768R38k018j824r4K405
$$ y = [-685, 664, 281, -1818, -2664, -335, 1503, -23, -3188, -3191, -874, 834, 608, -1662, -2800, -303, 2530, 536, -2920, -2753, -60, 1623, 503, -1879, -2162, 254, 2161, 771, -785, 203, 699, -316, -858, -338, 540, 1162, 580, -527, -454, 1755, 2172, -146, -561, 880, 2432, 2073, -417, -2259, -2, 4028, 3508, -254, -1281, 1272, 3363, 2530, 92, -1193, 131, 3001, 2252, -386, -571, 1638, 2635, 2359, 700, -271, 562, 1961, 797, -390, 473, 1901, 915, -237, 461, 1675, 1842, 1123, -909, -883, 1437, 2296, -424, -2393, -598, 2260, 2414, 32, -1721, -888, 2093, 2277, -880, -2994, -801, 1716, 1323, -201, -1957, -1039, 1696, 2133, -613, -1985, -65, 393, -446, -1096, -345, -12, 449, -663, -1612, -303, 1436, 216, -1546, -1535, 22, 593, -364, -2154, -2067, 662, 2621, 350, -2491, -2047, 721, 1659, -359, -2183, -2277, 128]
3596A28J939k089k332J491K222j67j535p12J96J059L82j211n65J847M85j045o14
3613e21Q76N95J36j004j003R79J839n57k666m2K582J337j213j765o27J413K227
3630B586j165k520N2K496O28j199q68j22J551J409j327k472N00J453j36n11O2
3647D17Q32L95q38j109K39J971O71k100j989J428J311J99j187o50P59J800O8k806
3665e89j311J703K476p79k220q59J262J800J33k180o00K296N03j718j381O36P16
3682a12O09o86r93N14J302k48j685L46J296p1q08j189l6J562R44j149j977Q10
3700a571K497K72k149j613N25K279P97k232j432J592J622o27j233k2O56J182m39
3717A04j655j049J650J555j206r60Q63J117n79j122o24J318J917n01k991k96K091
$$ y = [128, 2067, -22, -2354, -863, 1359, 1192, -343, -1055, -859, 200, 582, -629, -1194, 653, 1138, 93, -521, 355, 950, 1086, 82, -921, 58, 1897, 1340, -1326, -1368, 1214, 2551, 1338, -427, -1054, 359, 2586, 1421, -1099, -1047, 1449, 2077, 878, 10, -112, 1439, 2848, 1521, -951, -451, 1002, 866, 355, 417, 1249, 1644, 806, -303, -64, 1907, 2578, 478, -1511, -83, 1228, 1427, 240, -410, 349, 2149, 2217, -589, -1900, -197, 2279, 1500, -720, -1579, -317, 1483, 1616, -564, -1164, 1132, 1635, -83, -1464, -828, -112, 497, -189, -1182, -668, 634, 386, -1299, -953, 343, 272, -536, -1725, -1761, -199, 745, -404, -2381, -1571, 926, 1198, -951, -2564, -2039, 240, 1037, -1195, -2627, -1035, 587, -40, -1273, -1295, -639, 543, 104, -1551, -2600, -950, 605, -601, -1561, -698, 419, -160, -1282, -1906, -588, 1329, 828, -2163, -2459, -368]
3734c68J348m06j030n52R08J508j355k372P05K586R56k057j361n1J788J319o10
3751I56j353j18Q01o0r53P8R52O64k48j077m74J089J206j158r96P62J319r30j433
3770i73k26J043J646K86k251j362J614J917o76j638o93J149J402l13k195j20J898
3787E08J051j168j259j54O12O75k80j213J45J494J51j031m06J215R6j117k47J23
3805h05R64P07j265j746R27K344N26j834j234N53J455L02j696j016J593J556o05
3822G26j929J12R27R08R09j056k019M07J404o52j51P90O78j29q44n88M63J448
3840A404J46j614n68J440Oq28n20Q78J203R88j684k515L46K780Q11j585r92R3
3858b11Q22M59m07r87R58J377j96k258m54Q89J090j12n25o98P12J030j362l93
$$ y = [-368, 980, 574, -456, -1008, -100, 1408, 53, -2319, -1614, 972, 1928, -129, -1490, -1541, 247, 1566, 956, -397, -515, 286, 226, -727, -649, 303, 967, 719, -358, -832, 257, 1463, 305, -691, 71, 1390, 460, -973, -1199, -156, 1490, 1776, -475, -1837, -223, 1694, 1018, -620, -1313, -164, 1238, 925, -1270, -1390, 508, 1559, 391, -868, -1022, -410, 265, -15, -1228, -1083, 411, 562, -469, -875, 340, 436, -681, -928, -805, 159, 866, -399, -2145, -1218, 1126, 1652, -182, -1416, -863, 592, 894, -802, -1818, -225, 1331, 726, -1203, -1091, -164, 744, 1653, 597, -1422, -1015, 389, -263, -414, 376, 1054, 925, 81, -507, -44, 1404, 1550, -64, -632, 808, 814, -14, -534, 344, 1547, 2535, 851, -1664, -1318, 1462, 2273, 688, -304, -211, 611, 1070, 663, -324, 634, 2011, 1815, -443, -897, -8, 1082, 970, 445, -253, 459, 1489, 127, -266]
3876b66R27P95p94j498r2O59J333k42j050r54J358J194j019j425k17J459Q59m37
3894E90j901o19J795J479j248j472N59R49K30l68j147o51J471L73r17k39J019
3911i7J67n13m79k15J328L51o94j878K00J828M9j113l49J415N58k55j678j261
3929b636J922J943o82k000o33J014J214L89r56o11P51Q93j124j312O48J372M86
3946F78l30j245j53Q15P08j120K40J003P1j643q47R03J101J000j74j913k44J492
3964C42O39j090q56J054R64J49j390j122O01K730J65k013p89N32P49N5l15j77
3982B28J99Q67p02j092L44J803o91m16p75P04P9J47o98n20J495R98j263j299N00
4001i2J006M37k34j657k84J761O22j205j268P43J110J89n85p96m64J219K73r27
$$ y = [-266, 661, 1456, 662, -836, -928, -269, 1064, 822, -228, -1182, 176, 1370, 351, -1074, -1291, 168, 1027, 590, -1311, -1930, -135, 1344, 96, -1376, -817, 132, 362, -6, -1153, -1804, -333, 40, -877, -1116, -97, 70, -443, -922, -1137, 191, 542, -152, -2030, -1830, -2, 47, -1066, -1415, 0, 558, 303, -1375, -2636, -714, 1229, 547, -1453, -2086, -1072, 142, 531, -425, -1036, -285, 608, -516, -1828, -1180, 192, 678, 348, -897, -1050, -235, 473, -647, -407, 596, 667, -976, -1823, -920, 181, 1181, 1007, -906, -1150, 342, 981, -109, -965, 89, 1053, 1202, -188, -1310, -709, 2021, 2186, 173, -616, -84, 665, 720, 405, 228, 427, 1294, 592, -500, -156, 1647, 956, 540, -235, 469, 548, 695, -3, -523, 972, 1970, 707, -592, -92, 914, 1351, 1117, -540, -824, 937, 1559, 354, -914, -171, 939, 1128, 543, -253, -717, 502, 775, -152]
4019a52o82R49M58l71m16J20J21M94J5j377m2J767o85j519m7J465R70K9j568j322
4039a793J141J727o65j845M16N76Q78j148k07o23J458J470j273j485k87J396M09
4056A45l48l79o5L24L70j209M26R86P91j336q68M11O32K09J96p83m2J236M0j467
4076g31r20J776J052K93j879j293J013J768K73j591l57J601J31n53o39n54J141
4093E31J254o47j618O1J463P5n15J05J53J04P3m76r10J356R04j132j010L69R91
4112A131L64n60j056k05J739M33j433j369J255J267J28p14j462J99J620M78j740
4129G5r32J043Q91m14l80j23pK14J22m84r3O31o5r98k66Q43J48M42q30l08O78
4150A87L70o31j162P21J180J8r72r66Q4J122J088k95j842N37R25k87n86n55O57
$$ y = [-152, -834, 115, 573, 202, -214, -94, 27, 521, 536, -841, -883, 884, 199, -1320, -1367, 98, 1068, 1097, -471, -1793, -652, 1075, 410, -1435, -1019, -443, 435, -713, -920, -1543, -85, 1385, 112, -1373, -1660, -264, 145, -203, -582, -647, -323, 47, -1162, -736, 250, 1041, -295, -1163, -752, -120, 89, 285, -498, -540, 696, 736, -731, -1651, 125, 1177, 1470, -409, -1702, -689, 1079, 1352, -239, -596, 1005, 1136, 583, -56, -610, 531, 1785, 1138, -480, -419, 1044, 1119, 604, 709, 862, 966, 1039, 563, -347, 1009, 1913, 781, -229, 140, 1131, 1495, 935, -121, -326, 1413, 1846, 413, -956, 299, 1566, 1694, 980, -482, -283, 1337, 1815, 75, -857, 186, 1077, 663, 283, 160, 153, 367, 489, 5, -88, 543, 478, -520, -786, 57, 205, 647, -183, -491, 187, 557, -74, -1236, -515, 665, 683, -289, -1255, -1171, -49, 1039, 744, -1098, -561, 364, 77, -509, -1064, -407]
4169d07O68K21j032j053Q24J192j35p19J22j46J9j26l20L89J055K55j666n46O41
4188g64J008J06p09o23L45Q11k36j234L2J729M29j129p99r1O67J346n39j510k75
4207a436J479L7q63J72L61N51l17m07q50N92J135q08m32L28M26j38j86k83l08
4226i47J151N71j631r39J436J059n81o86l29L48J334j76j407k92J173J36m66k82
4244e28m0J38N86K85j332K62J601L5j440j11L78K75j21k26m73R38Q78r43r02L21
4264d19R89M11o21j160MO80R16m08j016O87R71n27q52m12M02R86L31p56r17L61
4284c50J025j88p32M43O74J79j002p59J51J314M86j387l80P25M46o32k01L88j66
4303C4K93L62j607l80J690P13o70q59k30R0J033k1j203K50J111r1q46m85O59O60
$$ y = [-407, 261, 482, -550, -1603, -779, 413, 278, -441, -319, -465, -446, -572, -892, -503, 552, 807, -859, -1405, -764, 244, 350, -359, -982, -637, 174, -62, -1296, -1264, 465, 894, -235, -1034, -1125, -458, 888, 349, -1161, -1436, 43, 80, -783, -611, -250, 301, -16, -423, -1273, -681, 454, -354, -786, -458, -32, -170, -356, -639, -947, 204, 775, -856, -1795, -359, 700, 119, -567, -896, -548, 786, 610, -797, -1089, 84, 220, -246, -528, -568, -430, 156, 441, -891, -629, 972, 1007, -433, -544, -166, 109, -12, -238, -711, 227, 1105, 162, -740, -419, 570, 981, 360, -800, -796, -116, 800, 392, -624, 63, 1034, 507, -345, -757, -355, 631, 962, 206, -711, -350, 675, 487, -245, 198, 872, 1051, 49, -710, -559, 755, 1241, -146, -526, 199, 645, 13, -188, 200, 34, 327, 689, -918, -1298, 392, 1105, 435, -424, -654, -564, 469, 448, -755, -505, 606, 515, -331, -816, -157, 503]
4323E03J49q61l82L35Q80p84n15N92N65m3p42nk48R09Q84q94j425Q02Q76L3j059
4344d30j77N90P71M9r48o09P84Q78p48n49r7M18K31L94j081k50Q40P05q14k42
4364b85M34m0k05o45j6J090M19m11j294J72J298r6p05k4J6M62j92m38p11L52J514
4385F95j46o18q99K37O91M87m81n34M32L51m18n83N14N35P8n47n70j35O37N87
4405C13p27l16P31N76r21m35M29O10Q33n41j343l47J104O50p89m46L06O43J27
4424D57j83j409L51J306M26j086l59J45K87K97j67n68K79O26p5o01J43N42Rl41
4444G9k25K24J27K41p11l76J064O73r21o76k1O54M16n6p40k62R13R23j060p62
4464d96J45N20M97r4o49o55P39R03r52l15N77J71K39o24j50k2M29L30n50q7M77
$$ y = [503, 652, -209, -591, -256, 624, -160, -675, -83, 482, 439, -303, -308, -556, 353, 1237, 343, -1082, -280, 596, 629, -430, -607, -17, 754, 803, -145, -754, 30, 908, 160, -389, -486, -68, 163, 557, -524, -774, 66, 771, -43, -285, 149, 109, -96, -741, -757, 333, 752, 341, -953, -781, 517, 421, -284, -308, -292, 170, -22, -460, -1171, -819, 695, 549, -69, -968, -731, -40, 447, -34, -568, -136, 215, -203, -786, -272, 263, 341, -206, -776, -911, -274, 313, -414, -730, 1, 577, -344, -779, -350, 260, 1093, 552, -791, -1138, -34, 616, -173, -619, -313, 330, 457, 274, -1135, -784, 522, 948, -138, -497, -352, -65, 232, 65, -503, -224, 402, 327, -274, -131, 411, 420, 79, -146, 78, 205, 446, -265, -641, 423, 1096, 175, -501, -522, 132, 548, 492, -248, -510, 403, 1326, 266, -496, -351, 169, 666, 572, -77, -732, 7, 910, -42, -357, 220, 391, 630, 6, -144, -166, 263, 593, 43, -44, 433]
4485D33m3q20J57O39K76L69j128o90K45J228r9q19l46Q24K94J6p77q13J136J133
4505A215r07r00L6N18O47Q0m48p81L20M31mm37L6L14j36k71K8K08N35j00p18j28
4527d62J083J00j021j64O25K58j65l77n77L38Q69M58j434l22O66O94k28l84k77
4546c20L3P97L69j424J46P73J82k30o51j24M42O42l46p86M74K19M9p06M80N27
4566E46j76Q2q97o8Q88L58n41o47K93M33K72k74n42k28Q96N51j187o83Q91P21
4586F88j41m52m22M50N35j19o23m16J063k6Ln69K01O0K16J46n74k01R15l59n43
4607a68L47K65J88m08l98k30O15Q31n58r22L92Q30l73k64n0j11P29J04r53l80
4627e14N73R15m44n87j23p7O35L33j008j23O00O19p72o46L84J43L48l57l92J56
$$ y = [433, 390, -430, -273, 366, 642, 1011, -117, -807, -562, 666, 567, -252, -598, 226, 520, 536, -241, -1054, 82, 1215, 308, -592, -556, -38, 609, 689, 241, -540, -220, 211, 207, -230, -194, 120, -16, -287, -259, -51, 484, 384, -334, -462, 621, 721, -300, -464, 161, 419, 254, -123, -700, -362, 507, 965, -469, -791, -125, 569, 341, -43, -320, -287, 510, 879, -545, -399, 374, 556, 326, -325, -449, -7, 635, 289, -497, -23, 196, 245, -461, 19, 546, 370, 452, -445, -513, 375, 733, 192, -455, -162, 271, 543, 269, -273, -501, 395, 946, -241, -924, -33, 688, 547, 95, -327, 123, 658, 539, -84, -500, 563, 537, 540, -29, 172, 232, 448, 594, 20, -181, 734, 375, -168, 179, 444, 632, 224, -174, -404, 211, 1042, 484, -438, -46, 784, 411, 147, 97, -14, 715, 819, -134, -514, 59, 974, 530, -57, -180, -257, 378, 711, -297, -420, 180, 799, 27, -619, -235, -92, 256, -101, -493, -337]
4647c37N94O97j114k16M81K04k41l72m10M17N70k48o33L9O85J00k47j68l33L16
4667b16N48o67p01J45J011K63j065K86M43qJ93r32L9L41L42m51l48K59L89P5J25
4688G1l75j23L16M17o99p03R06K70m80l60J78L73N49o74l61J59N52K15o92l26
4708g87L96N21jq6p35M30P79r7q22m29N08O15l9o42o7L28Q02l63o23j9M44J94
4730C07l25l8k60N19O6j55m56L97L54k73o31L61L11M7L9j78k45O51K24p53n28
4751e66N99P60l93m06l58L74P81n4o55n01N78N98l48j03l30M3N38j86l94k13P00
4772D64K17n25k4k14K50J59j78k06N2K58P0n00K62M99l67k99k03L4M10L58q12
4793b95n51M94O28J7n31k06M8O92N22q90q20M67P01K01p85j72k20M41M95l24k44
$$ y = [-337, 257, 954, -160, -376, 105, 309, 68, -304, -714, -297, 273, 25, -608, -569, 116, 216, -31, -199, -532, -216, 332, -335, -1036, -891, 120, 383, -682, -396, 47, 39, 232, -700, -661, -320, 22, -429, -777, -518, -129, -54, 71, -304, -427, -111, 306, -393, -1096, -190, 80, -400, -760, -582, -209, 340, -334, -695, -536, 16, 231, -461, -787, -391, 130, 129, 43, -692, -262, 517, 420, -402, -831, -323, 292, 253, -389, -456, -128, 674, 311, -312, -331, 113, 307, -18, -56, -316, 203, 269, 114, -342, 55, 409, 136, -495, -134, 177, 224, 263, 85, -160, 491, 715, -38, -566, 33, 793, 400, -6, -364, 10, 791, 737, 82, -419, 159, 757, 409, 306, -24, 19, 557, 371, -23, -236, 464, 681, 156, 132, -82, 168, 327, 149, -57, -5, 253, 323, -177, 85, 584, 217, -82, -285, -251, 159, 517, -295, -846, -352, 276, 293, -238, -444, -396, 296, 818, -72, -892, -425, 276, 477, -308, -480, -700, -259, 236, -88, -332]
4814c32Q2N18n71j0R3P2J02m9j97l01M67J45n38l9P60m3m45k53n30R47L78m04
4836a48o73M1J238k60l13p34M84L35P39n11q18L68P72N0n03k00m4m8M98q5n65
4857c77N60L12m03m50K65N77m07r7j6J11K40L45r99j34Q16K17n69O4K52j86N07
4878F28n62k64q7P69O40r90j33q4M72M52j61m97k01L02L18m45p2J29n9J74K91
4899F20m22l55O53r9k2j42L69q78J88M04q1K58J39r80J4O80N19o65n15K69N78
4920E32k78l00l13k23P85K06l15m82r8M24K00K81o31j47L37N59n54j76J16M0O2
4941B5p1q4K61K6j37m60N29M98n37l88R2K50j05J89n80N1K71P34m58n75K1P43
4963B95o0Pn14l78N74J97k29k20J27L39j21k98j63k61L88P02l94j44J23K95n13
$$ y = [-332, -250, 268, -303, -313, -220, -148, -46, -95, -292, -593, -126, 19, -519, -558, 202, 159, -286, -539, -1069, -122, 256, -148, -821, -780, 458, 198, -115, -849, -365, -30, 709, 198, -620, -252, 520, 570, 67, -133, -177, -225, 273, 188, -377, 183, 495, 92, -358, -93, 484, 77, -20, -36, 75, 315, 660, -339, -473, 343, 560, -9, 55, 307, 121, 628, 66, -198, -285, 484, 1124, 134, 1, -83, 389, 841, 680, 183, -18, 284, 602, 157, 85, 214, 155, 329, 620, 198, -157, 496, 397, 375, 233, 602, -276, -88, 316, 235, 493, 632, -348, -334, 346, 865, 200, -315, -46, 532, 254, -46, -359, -582, 203, 409, 94, -388, -486, -62, 138, 419, -212, -359, -22, 537, -17, -193, -77, -37, 25, -46, -130, 131, 157, 20, -440, 89, 587, 50, -338, -246, 4, -101, 88, -492, -441, -170, 564, 106, -469, -448, 295, 235, 242, -272, -650, -76, 121, -108, -328, -201, 138, 17, -281, -444, -705, -317, 385, -9, -153, -30, 265, -248]
4984b48J00N0k19M91j06n76M12P11k97n85j73N79l7J46l29k18J39O32r7q95oO97
5006A71K90k27m41j64M15P09m29n93K29J62L3pm14R1J85L68n9l53J86J05l62K
5028a03R0J27K61k77k08J1M62J12k93j32M71n5m95K21m10M8N64J9o42l8L85N99
5050G17l55p86K18L02O69j02r06rQ56k22k69Q1j34k56J94J98n54N30qk29m6L27
5072B16j33j37j4n4j17L23J86q12o5O98K32m6p75M02Q8J70K6m81m35R63M49p30
5094d6k97mN59o5L90q59j65Q26o7k39k97K51J02K9j26j63l3J97J51n41M65L15
5116C83n71L9k28L97J48K3m42k31J75O47L6j085M01P0M88N8o10n33O60O81k93
5137B13n53J52j14L77J81k27m61O3N71k72j11j43J84R1Om2K35l53Q9l49M7N96
$$ y = [-248, -148, -98, -317, 174, 68, -508, -96, 615, 318, -267, -440, 139, 102, 248, -81, -299, -160, 472, 375, -520, -526, 171, 461, 234, -207, -371, 44, 753, 324, -269, -40, 122, 155, 148, -266, -175, 10, 378, 319, -34, 152, 257, -105, -103, -13, 114, 375, 98, -110, -99, 363, 475, 182, 50, 521, 466, -29, 192, -218, -170, 394, 413, -229, -267, 118, 717, 362, -424, -206, 96, 765, 663, -243, -252, 604, 382, 113, 194, 60, -196, -2, 196, -358, 172, 164, -65, -111, 216, 83, -54, -68, -122, -239, 84, 270, -542, -607, 91, 323, 277, -498, -96, -8, 162, 188, -293, -728, 235, 684, -46, -343, -347, 212, 147, 537, -322, -487, 339, 272, 33, -264, -13, 89, 118, -8, -171, -204, -7, 144, -397, 68, 383, -188, -149, -377, 20, 168, 191, -251, -482, -307, 340, 376, -709, -308, -238, 250, 308, -302, -835, -175, 506, 213, -340, -188, -302, 75, 256, 29, -432, -369, 202, -70, -181, -324, -140, -49, -43, -85, 150, -203, -114, -463, -416, 180]
5159A80m4k96o4K88k30q9j94Q6j41R70l44o64K15K11L0J12m17j13M24M56k27m32
5181b83j67O23O0K31l07p16K30Q88l46m64P6J03r1P1K63j70J65k80J70k94L27
5202H9J40l32l88L58K62L09n59l33L47M78K21k49o12L15K85L12o88n02P46J51
5222C50J65o00m35J111k48r1l18L66m16L58Q2l24K02l46K41q2m2K34m19J65Q0
5243C3r9J39J59j13n40N70q3J60m71k37N36K49Q1m50n46N46O06K9l81o09R2K76
5265e3L75o43j23K60M32J49m13j95j54M58K36n28K71k62R0k7O0M45q50J70%J67
5287a35L34pk86l82J58O35k47l4n4n8M18n3n58k4J24O64ln66J0j63N3N15l52m18
5311d29L97J76O0l84m7M39j01j77o8j29K76N8J1K25m4ln06k00M72n4M42q6o98
$$ y = [180, 136, -160, -224, 64, -166, -255, -449, -363, -504, 466, 122, -542, -327, -116, -86, 26, -391, -504, -80, 376, 149, -283, -450, 173, 233, 464, 157, -559, -329, 559, 213, -251, -175, -72, -163, -92, 171, 1, 166, -114, 56, -238, 89, 229, -103, -491, -133, 129, 438, -121, -454, -107, 371, 592, 343, -269, 46, 331, 643, -45, -547, 199, 350, 515, -85, -520, 591, 343, 252, -66, 300, -116, 242, 324, 0, 202, -144, 97, 15, -27, 207, -212, -47, 33, -66, 73, 232, 119, -421, 149, 66, 226, -245, -482, 54, 303, 384, -66, -612, -66, 540, 569, 188, -421, -329, -53, 322, -321, -444, -184, 248, 397, -16, -211, -365, 93, 329, -199, 72, -190, -100, -127, -67, 378, -472, -302, -302, -135, 199, 192, -94, -476, -318, 317, 70, 36, -18, -76, 342, 289, -269, -293, -169, 495, 492, -74, -64, -227, -174, 341, -11, -429, -32, 144, 204, -180, -227, 212, 111, -66, -134, -263, 13, 71, 82, 307, 263, 260, -246, -446, 26, -28, 414, 328, -370]
5334c70j57P27K80m88q5L00J39k5n07l27M89K66J30l51k42K6J45N60k32m04o2
5355a88M60J2k68k99M30p4J22j01j26O9R2J87n03L42N8j80m18O52k9M8j99l89
5377c02K57K72L56l85q05O04J82O0j90Q3m95O42J25m24j46O4L89j07J30m79K51
5398H2N67m42J27m03K29j74r0K17M6j12O3L1l07J39K77j46O2o1J09l57J80n49
5420e12K66K64M16l01p21K65O13J89k15J21q60M81J64J5k67J09J41O3Q2l61l34
5441c82N13K07k47n5j53K13j52R4K64j55m7k27J16j03L75k40K7o5K05k78J14k99
5463b75Q6K14K92k3o02p9L66O57m62l90r3L00M43rn70l95P26p8j89J97j17j86
5485a87J85P8m33P4L04L16n78L39k51J54K3K61k10L31m85l07L94K94J23n87P2
$$ y = [-370, -527, 200, 480, -8, -93, 207, 346, 321, -186, -513, -24, 242, 372, 21, -221, -195, -50, 510, 278, -126, -188, 272, 284, 16, -283, 147, 73, 195, 94, -32, 37, 129, 316, -187, 155, 213, 33, -385, 267, 238, 286, 87, -302, -45, 227, 583, 198, -607, -3, 179, 239, 49, 132, -363, 279, 404, -20, -166, -102, 287, 180, 310, -169, 82, 649, 207, 334, -69, 160, -14, -104, 113, 159, 47, 110, 141, -166, -27, 250, 104, 166, 105, 214, -143, 37, -512, -246, 18, 434, 133, -588, -323, 290, 479, 264, 385, -475, 6, 170, 185, -82, 27, 168, 231, 313, -48, -382, 131, 338, 91, 36, -117, 96, -56, 38, 302, 147, 100, -127, -11, -114, 261, 21, 48, -17, 188, -90, 24, -275, -189, 25, 317, 294, -308, -387, -21, 636, 174, -216, -309, -9, 434, 425, -145, -540, 186, 108, -81, 116, -1, -187, -2, 76, -357, -283, 21, 337, -241, 98, -153, 1, 24, 285, 75, 406, -79, -386, 8, 302, 425, -162, -90]
5506i0L54n43L13K59n03K64M93j67n04R5l58L54L63J16m17l29L01J33j9J30k14
5527C1k38L34k4m88O19j38O5k61L57p5o06J96J8N79m73j89K39l65N06K99n36j20
5549b70O2L17L0M4n39Q5J98K5l09J55j88L09R6J20m67p2K95K53k9m96M79m47N24
5572A75r2J6j89M7j13l47N91p0J75r16M60j44M33J28n0m31K62K99l87k97K57j35
5594c28K85K61l96k30Q9M73j88k67O0N5K92j3k02k63K27K88k27p2j0r3Q2J93M02
5617D18m87R9q1q9J87J91j65k89j77N99k65K18n7m61L51K09l34J92k92K93K74
5638C34l7l06o14O96J29j15L9k28K54K9k82J67j17k06P30k72q1l17L56j38O6K28
5660C15l44r0J00n1Q8L13P8l86k69O08pm6k23j56K17m7j4l84J07J55L80j54l54
$$ y = [-90, 264, -279, 34, 293, -210, 54, 547, 380, -124, -29, -387, -33, 330, 446, 29, -300, 1, 134, 115, 245, 31, -207, 127, 103, -385, 234, 96, 161, -100, 257, 182, -424, -228, -210, 369, -104, -293, -54, -419, 87, 386, -150, -270, -208, 109, 139, 183, -356, -271, -73, -48, -357, -202, -390, -81, 15, 135, -332, -404, -109, 144, 115, -381, 98, -349, 175, 83, 99, -90, -43, -156, -503, 88, 18, 193, -723, -263, -407, 26, 154, 104, -327, -65, 234, -153, -450, -193, -328, -43, 218, -178, -408, -319, 154, -34, -301, -241, -186, 106, 93, -109, -372, -145, 143, -84, -156, -166, -259, -177, 16, 418, -69, 30, -51, -140, 47, 238, 73, -216, -393, 206, -59, 159, 102, -359, -8, 201, -133, 59, -233, 60, 334, 297, -9, -623, 73, 202, 87, 126, -102, 152, 181, -101, 66, -51, -257, 473, 201, 120, -197, 159, 21, 87, 315, -29, -119, -19, -70, 18, 331, 409, 23, -246, 362, 355, 309, 86, -70, 147, 100, 86, -298, -191, -36, 344, 190, -164]
5683a64J21k21O09N0n98J72L60k54q9M6K02l59L59j6M0k15J4j80L0M13m23j26
5705b29P4K15K0J09R6m11l26Q25l7k57l43J17P1J06r9J00k41Q4M31k67k00J34
5727b8l47N74K09n07l61K82J52J40J83p0k43l4L18J4m80J41J19j41J34K79l14
5748B0q0K2L74j81j78j76O4K19O08k60m81M9j48K52k1j47j52K93M47m28o92N58
5770c8J62J07r8l09j74M05M26n36P3j64J11K69j6q4j93k07M98k24J75oj07k13
5792a43K44J06k91J82j65j88K16O50k78m84J99N0J53j83J02l99M18L47m76l11
5812b51J82K16j22L07k81l02J99N4L8O1l94K19q7J77M6J09n49K58L1K32j95J66
5834A14k18k14L08J73k14K44n09pK36K01m52N9K15L45lk40o22K89M66K11n48j11
$$ y = [-164, -43, -264, 345, 395, -203, -31, 329, 75, -14, 32, 234, -125, 234, 218, 258, 43, 57, -123, -93, 320, -103, -229, -155, 60, 80, 189, 285, -126, -452, 373, 336, 79, -264, -147, -76, 30, -69, 31, -210, -126, 305, 38, -162, -28, -375, 199, 408, -99, -460, -178, -26, 114, 297, 227, -16, -50, 268, 282, -198, -57, 62, -79, 55, 334, 20, -60, -38, 336, 155, -23, -199, -135, 84, 692, 432, -49, 0, -148, 104, 83, -64, -216, 77, 524, 96, -596, -38, 124, 231, 133, -176, -350, 55, 481, -55, 18, -146, -35, 234, 218, 134, -59, -266, 232, 8, 183, 177, 70, -143, 101, 207, -84, 98, -67, -255, -39, 611, 333, -151, 48, 98, 251, 68, 170, -229, 189, 536, 60, -251, -69, 147, 25, 332, 51, -251, -52, 2, 40, 101, -293, -74, -161, 16, 62, 171, -378, -120, -89, 143, -52, 114, -104, -318, -10, 163, -51, 193, -316, -323, -87, 114, -338, -279, -64, 281, 278, 38, -584, -295, 171, 382, -166, -277]
5856b77Q8K8J96n9j28o6K73J07j20j20L92k41l19M12j47M3j68k11J49N47m89O1
5878d9m7j12j0M31l45K48l53M29J2j49m11M28K26l15K62l26k5J74K67M7m41k43
5900c02M25J60m50J67N7Q0J59l29K01p5o8j47M6P8R1q9L09l22J85J57m96k10N18
5923A45n5J58l09m4j16M64J4n6m92J49J75K34k53l8m80O43O4j61k27M15r1l04
5945a65K02M0l8k66K27K13j02k20J52o42M43lK56l58L74k91j5K5K60k50J96L4
5967G2j3k33k7K54j91J94K74o26m3L34J9p4m91N38kl93P05m45n2K79J72l48K21
5990A24l32J29J36oJ39k22J52l37l7M07L11n18j95K38j15J29K41n63L88J48j51
6011F6l14K83p5q5L50m1k42J2K08J8l04J09j08J45K8J58l31Q8L9J16J54k61j27
$$ y = [-277, -189, -161, 35, -24, -152, -218, 55, 162, 42, -78, 314, 73, -246, 166, 19, 62, -106, -317, -168, 379, -110, -49, -96, -208, -218, 213, -132, 116, -237, 192, 204, 55, -356, 72, 298, -17, 245, -81, -106, 68, 335, 382, -59, -302, 123, 283, -167, 0, 57, 137, 296, -33, 168, 93, 25, -122, -76, 2, 93, 4, 313, -9, 176, 333, -163, -373, 145, 90, 248, -61, -105, -221, 243, 257, 201, -291, -142, 33, 267, 14, -24, -504, 139, 203, 42, -185, 230, 139, -165, 37, 77, 39, -227, 0, 213, 111, -109, 43, -599, -156, -159, 97, -261, 113, -178, -193, -168, 92, -158, 38, 72, 59, -174, -201, 53, -138, 56, 330, -296, -339, -5, 14, -60, -551, -13, -15, -408, 297, -148, -200, 79, 251, -97, 124, -208, -79, 57, 51, 190, -32, 120, -217, -254, 153, 464, -54, -249, -11, -126, 3, 244, -319, 69, 217, 66, -248, 35, -40, -125, 225, 184, -58, -46, 162, 180, -124, -15, -123, 22, 50, 208, -123, -35, 4, 120, 274, 13, -114]
6034a14j10R4j82L68k79rL06q8j43K32p9k32K64jL55l55O4l27K32K47l16j33J8
6057a88L20l8j50O3k60L23R7pm83L42J10j49K01j43k65K86J79j07m94J95J79j24
6079a13P0P5k51P1K04j12K3n2L71l50J48O7Pn2k94J25J85N5q5n11L24J11K38m80
6103b26J13k13J63N63k26n04j6N05J6q6k05P8J8J2J60k21j27K87m34O3O85m41
6125c6m4R2j39K13pJ5l59K35N3J71k96l89L59MM92k08j14k33J49J54j08J15k56
6148a37J67J61J68p43L0L84L67m00J16l98l5J90K59J0j20k61K22O2m3n4j11M0
6170a26R4j36L00K55n60J56L09J2l58j11N2J21L35k60l07k53P39j65j95L75m64
6191a87J74J58M3J00m07N86k61k12O1k39j24M9O25j83J74l54l00L11J67J61m18
$$ y = [-114, -224, -130, -312, 56, -223, -232, 74, -14, -157, 75, -4, -236, 28, 27, 382, 27, 91, -236, -4, 243, -73, -206, -188, 132, 94, -56, 7, -253, 70, 167, 160, -323, 19, 129, -20, 181, 38, -227, 59, 238, 131, -363, -168, 11, -113, -43, 32, -219, -148, 56, -56, -33, -85, 286, -64, 84, 151, 158, 106, -188, -63, 122, 177, 92, -419, -95, 16, 254, -226, -113, -326, -163, 400, 174, -330, -346, 159, 175, 89, -116, -38, -20, -8, 152, -69, -196, 91, -343, -280, 405, -36, -80, 12, -127, 86, 79, 94, -265, -30, 23, 194, -102, -491, -132, -128, 364, 156, 42, -191, -42, 112, 4, 119, -137, 30, 191, 359, -384, -354, 30, 397, -3, 113, -285, -320, -130, 129, 139, 19, -242, -20, 42, -1, -55, -166, -126, -32, -168, 132, 387, -173, -17, 292, 304, -54, -165, -113, 8, 343, 83, -224, -477, 262, 97, -98, 277, -187, -13, 145, 188, 288, -119, 467, 206, -6, 55, -184, -308, -259, 366, 183, 357, 3, -297, 14, 181, 342, -76]
6212g6J5L2K10%n7k99R4K05J44o0p61M70J16J13Ok92j99M48O1j32l20p2J21K58
6236B5K50l00K2k85O44j10r4kp5l3Q7K5j34J29r0k1L0K86l18j94M25k08p1Q2l57
6261b87J72M49rj51q9j06j57L99J40k65K09m61O07m66j96K18kj19M34l75J36j38
6283e7J06J42l44L50k66j33L71l13K99Q6j84k00J9P3R9l9k78O12J9m45j41P4L14
6306A64J11o1l87j50O34m02K12m9l16q4J45L10k46J5J17m7Q1r9j52j74L53N3J18
6329A46p7k97K14J25k16oj93K32j7P8K62n07M64n72K97K89l80L1j10j79K80K25
6351H9m71K54j11K3K81K05l38r9M2J41j74j08M9P7J08J29k47L75l25L84j58l50
6373b24j5K64j18Q0J14j72J21j15k30L93O2m35N3J37J95j65j38N1j69L31L26l13
$$ y = [-76, -61, -29, 181, 181, 124, -175, -81, 124, 268, 208, -553, -83, 33, 146, 152, -140, -339, 109, 170, 38, -282, -354, -233, 25, 275, -25, -3, -288, 356, 246, 152, 150, 75, 42, 129, 154, 20, 149, 59, 38, 68, 354, 36, -158, 267, 59, -12, 70, -287, -115, 334, 325, 174, 85, -21, -178, 221, 361, 96, 305, -156, 451, -15, -211, 7, 5, -114, 320, -55, 81, -57, 49, 191, -153, 197, -69, -202, 169, -144, 155, 241, 57, -143, -124, -51, 48, 9, -269, 343, 362, -83, -224, -150, 164, 275, 214, -173, -323, 311, -91, 121, 72, -244, -328, -183, 127, -119, -104, 13, -34, 47, -52, -204, -378, -25, 28, 146, 69, -228, -14, 111, -105, -111, -304, -72, -89, -11, 251, -256, 208, -364, -67, 222, -158, -127, -237, -416, -136, 89, -382, -128, -239, -216, 65, 270, -68, -167, -125, 16, -158, -266, -217, -140, -32, 97, -150, 225, -100, 284, 126, -224, -239, 25, -93, -13, 101, -71, 50, -65, -295, 98, 160, -275, -222, -85, 110, -55, -193, -142, -311, 20, 346, 33]
6395C3lP8N3J41k04P9n39O46r1j80k71L37K10l03j47N8K94n99O90k01J58j83k29
6418a73J11J59j54j13J59pJ33k00N3PM1K0J17l3l07J77L9J15k34J93l8k56N96
6441D05k38m59M43j42j2k46K44M5j13J4J14l3L4J19l26M1Q4K9j67j7J85k6nk84
6465c11N6J48J18J77m43K41l58K93K22q6l49N1L03k51K56J31q2l88O41k56m5l41
6487b73L54r2m9K57p3j76j8N06l53m6j17k67M33N0k07J1n8M2K29ll33k83L46J44
6511B4K75o52L21J61K4K4l59L2L31l59K45M6o9k09p8L42J90m40j39K48l4J55J59
6534B38l83k00J00N10k77k3j46K84j07K88k5m42J05N5M29j55k39k19J87J6LQ2
6556H1J43n34J81K11l42K30l02N61mk98o7j01j45L42M68j66k21k15J4K72M38m33
$$ y = [33, 30, 108, 161, 302, 98, 177, -362, 284, 193, 13, -258, 79, 289, -14, -161, -103, 191, -408, 282, 81, 239, 56, -173, -62, 97, -57, -170, -11, -18, 115, -85, -32, -25, 16, 36, 153, 120, -187, -10, 29, 144, -90, 103, 65, -191, 405, 167, -292, 151, 9, -3, -249, -5, 40, -73, -59, 55, 22, 56, 175, -151, -110, -26, 3, -164, -181, 4, -22, -27, -311, -255, -107, 11, 188, -255, -14, -372, -79, 143, 57, -292, -241, 62, -189, 67, 198, 116, -272, 369, 113, 68, -273, 81, -11, -60, 197, 124, -52, -70, 436, 83, 37, -80, -347, 86, 136, -71, -60, -118, -76, 153, 150, -183, -466, -120, 24, 299, -353, -32, 129, 153, 177, -182, -150, 181, -178, 67, 113, 44, -165, -243, 99, 289, -151, -290, -42, -76, 79, 238, -145, -345, -245, 265, -12, -35, -181, 103, -4, 284, 259, -183, -78, -23, 406, 251, 12, -207, -20, -4, -1, 81, 224, -310, -129, 82, -260, -30, -332, 229, 225, -73, -140, -241, -386, -44, 424, 258, 37, -178, -164, 108, 546, 113]
6578A13k30J10m2J20%k51K34K4K81j46m24K86l25K15k38N24n06K17l57P18k29
6599I4k6j48J03K77m09L17o41K06L18L30m20Q0j01k20L97l45m4J41J77m3j71J68
6621D0l51L2L66M6J52n04j5K05J81j13n4r6q0J49q4J89l06j02L80J80K14n71p1
6644b13J38K4O60o35j41j14K11J38k29N8K07n50N35J74k58P7M3L6k3k29J87k0
6666G6j56M06k40J17k04l52M71j16M3m0j00M15j93j34j02K65k44J62k91K94P7
6687A54M7r0J9l17N2k84N16O1k74J95lP4k01K08k48n6L99l4j62K3o2m00K16L52
6711A85P3k55k38K42M24j36j24n35N46L7Q6k76k71R5J01rL87L2n19j80J42J74
6733a9J36P5l66L82m5n01K41R6j61K48J84k29j18K1P8P2K34m26J21j72L9L09m16
$$ y = [113, -117, -7, -49, 71, 71, -180, 54, 78, 359, 213, -211, 75, -250, -35, -273, 251, -255, -38, -395, 323, 94, 68, -80, 23, 300, -109, 208, -433, -227, 91, 421, 1, 81, -20, -240, 157, -188, -232, -91, 86, 43, -128, 40, -311, -279, 87, 133, 285, -219, -234, -29, 152, 39, -15, -111, -191, -42, -126, 63, -243, -345, 35, 215, 429, -142, -213, -75, -51, 609, -26, -167, -281, -70, 68, -161, -103, 104, -446, 89, 263, 5, 82, 125, 161, 138, -91, 96, 76, -80, 326, 86, 203, -1, -353, 118, 2, 45, 5, -95, 320, 127, -7, -109, 156, -88, 74, -217, 77, 154, 201, 111, 130, -187, -135, -419, 97, 158, -116, 79, 76, 150, -51, 157, -91, -147, 252, 218, 56, 79, 17, -383, -167, 185, 258, 3, -235, 7, 431, 295, 171, -364, 182, 219, 305, 29, -242, -147, -46, -55, 332, 364, -155, -335, -193, -19, 117, 192, -174, 208, 163, -338, -97, -1, -162, 86, 270, 41, -77, -56, 22, 94, 328, -98, 23, -149, -110, 199, -217]
6756b17K69J93j45l07l1j97N71j87pK85j70l37p6M19L58l97j05l7K16l61K02k6
6778h7jL11J01l84m6K54O6j64q1P3k08L69k67J88j67nj49J02J08N0j36J94l54
6801b33M79j90P6L07k47k39J36j28Q1l29o2M14l2J1J14j83r9K08q8r5n6o2M60
6824B43j27j19J09k41K55l68J93K37j37l04J69Pp2K2O8M42q9j41l44J56J08N2
6846A19j86Q5pj61K83q8k54J98j1Q6o8j93J05k18O23m29J14j28m5L40K8J23j33
6869A83n17K95M9p7O0K50k54o5K83l03Mk35M78k03R9j8k15R2q2K03j24M2l12J94
6893a73R9J18p4j76R6J71k07J18J52k73J25M59m14J23k8l36K85K51j39l25q0J58
6915g0M8k2L44l54M3P9Ln1j13j83K16J96Mk56k08M51L3J31q19M58n9J84K35l94
$$ y = [-217, 52, 245, 100, -207, -238, -435, 136, -51, -58, 227, 57, -280, -356, 63, 421, 24, -81, -118, 98, -263, -61, -87, -88, 223, 324, -60, -106, 148, 214, 50, -31, 42, -166, 203, -64, 124, -43, -48, -197, -95, 13, 63, -73, 121, -233, 246, 56, 132, 439, 192, -47, 89, -39, 42, -287, -349, 65, 33, 44, 158, -25, -124, 84, -4, -99, -155, -217, 243, 116, -3, 106, -135, 120, -248, -55, 182, 45, -259, -90, -83, -155, -133, -65, 377, 288, 147, -197, -41, 67, 119, -67, 18, 11, -150, 133, 45, -209, -11, -22, 64, -4, -197, -92, -310, 313, -116, -2, -130, -175, 165, 193, 316, 183, -334, -39, 10, -67, -7, 243, -11, -76, 207, -96, -92, -327, 151, -52, 47, 29, -186, -94, -176, 27, -97, -55, -367, -173, -74, 44, -30, -206, -110, 61, -146, -28, 124, -149, -24, 435, 21, 144, 116, -220, 65, 316, 177, -148, -228, -70, -22, -44, 300, -54, -11, 68, 71, 20, -93, -276, -60, 136, 140, -116, -324, 127, 160, 291, -528, -70, -129, 55, 290, -104]
6939a04j93J74J48jj28R8R0q7J30j28l47J37L53q4L56l03k99j28K73J01R3l26
6961a75J08l9K62k5k95J43J45oo4n8m2l17L42O2P1K2l31K86O1j28L91k68m52K97
6985a0k04K53K19m64J8N27J3l25k15l5J65J59J45k61q5QK66L5qn22J65L58L8j19
7009A21k68O3J23K16p1pl18q6P17j97k07j57L67k69J63k61L32k41j52K71K70k02
7031B07j83j86L45P6l45q3K64j34q3O63o58o8L13N5j68N2j22M9q7M62r1l44J52
7054H6l28L77n4j95J50K6O3M6Q2j48j96k80M11k4k7k00J32M32j9n31J91l5J77
7077A36J8J00r4m59L80k5j17N3k18J49M46j98K31k02o4l27J65j68P3o0J16K2P7
7100C4q4Rk96K29J27J54l47J82j19j1K36q5l3m17M31l02j1L29l29K52Ro2R9p0
$$ y = [-104, -297, -123, 25, 24, -104, -6, 84, -3, 127, -1, -348, -211, 142, 58, 414, 111, -188, -316, -43, 58, 151, -175, -67, -106, 156, 131, -164, -21, 124, 118, 54, -4, -46, -363, -21, 41, 112, 134, -197, 89, 150, 22, 413, 145, -307, -10, -214, 39, 258, -206, -188, 339, 352, 27, -188, -223, -58, 101, 246, -15, -100, -92, 174, 209, 201, -321, -156, 202, 240, 121, -147, -84, 39, 255, 184, 177, -141, -227, 490, 293, 86, -71, 296, 27, 190, -71, 261, 20, -132, 139, 409, 207, 24, -162, 183, 259, -86, -169, 95, -39, -122, 541, -117, -185, 128, 183, 15, 67, -55, -6, -93, 369, 278, -66, 86, -242, 135, 81, -114, 36, 62, 125, 171, 253, 105, -91, -371, 40, 16, -11, -211, -79, 353, 334, -197, -6, -41, 136, 154, 254, 160, -299, 81, 56, -61, -8, -226, -77, 369, 171, 402, 200, 136, -191, -26, -194, -121, -181, -65, -43, 34, -50, -41, -337, -108, 19, 173, -174, 8, -111, -122, 114, 29, -4, -421, 10, -292, -303, 26, -303, -51, -42, -104, -5, -75]
7124g5j57J05K99J84n49p6M1L39nl01K13k88M67l52P7K60Ql64J37L23l20o0O3
7147c1j9J83k21K63l29L32k03J06K35l60K93j93k68J88J77k81M10j19l4j42P0
7168E7lr8L35j57j65M37m22K64m21L01n8l07L97j09k3J28j79J48q7L0N8qJ53k08
7192F3Oj6j25L03j47K66k57l11N88k57m31J51J41r8J16J15j04j48N2M96n5n36
7214a88L39l71K69Rl14L32j48J42K8j91N1j8j89K73K51l75J53k25J11L89l48k43
7236b63k5L24L8R0J8k76k7J78k04J56q8J33p2j4L02j5k76k59M46j50j36K07k55
7259a68L14n8k12Q8p8Q8K55n1j77r1n0J61n1j10r3N27k92J90l83J77k3o5K92k19
7283b9Q6k42K65K1J5J00k23l34L37n0M6Lj32j10L00K07l47r9j09L59N8q2m1l78
$$ y = [-75, -232, -127, 172, 356, -193, -269, -228, 111, 106, -195, 18, -270, 197, -155, -78, 182, 190, -174, -37, 286, -34, -94, -31, -50, 133, -88, 175, -154, 178, -25, 81, 316, -44, 249, 56, -212, -24, 153, -128, 282, 163, 129, -13, 57, 54, -44, 291, 134, -31, 406, -16, 248, -173, 128, 70, -237, 160, 51, 28, 156, -23, 125, 38, 68, 126, 118, 271, 63, 69, 53, -72, 231, 84, 350, 93, -218, 370, 113, -318, -167, -26, -124, -8, 107, 3, -145, -93, 403, 348, -188, 151, -220, 49, 58, -256, 76, -72, 70, 98, -93, -42, -60, -249, 24, 275, -100, 53, -172, -61, 328, -20, -263, -288, 36, 74, 164, 182, -94, -121, 57, -147, 9, -79, 54, -18, -32, 270, 255, -21, -280, 166, 16, -120, 87, -168, 146, 88, -124, -36, -114, -26, 229, 178, 1, -90, -140, 21, -30, -140, -233, 294, 2, 192, -191, -14, -37, -102, 190, -29, 57, -185, 80, 101, 116, 216, -7, -341, -4, -54, -8, -5, -137, -247, 53, 260, -87, -186, -295, 64, 122, 40, -1, -379]
7307c79J55M68j13k15p8J26J19J32p3n49L95P8M9n9m5l2K96o3k97J41l2l22Q3
7330b15K70J05J1l62M27O0k86j17q2j16Q9M01o3k08k38O7M47N0k01l03LK86K55
7353B80m27k11L44J82k12K98n45K53J35k85M03k49o5J20q4L06j50k34L14m0k42
7374a09L74n9p04P19Kl25J20J6l26J74L54J58l30q7j57J89J59j94j25k37P49m9
7396C12j2l24k6J99j72M1P0P7l03j2K55K01l61J57m16R2J81K07l55J09j68K77
7418B9k50J70j08K37K2O0j88j33K5L54k3l62j75L33j84J35l7K34j3j37K11r9k14
7441a13Q4j07n6L40J7j99J02j91L36J71j68n87K54K3J5k7O8R8l00lL18m90J55
7464b60L58k99K35k85J44J84o3m1J19l71j04K85J17J11l39m0M07rn6k99K77K90
$$ y = [-379, -224, 244, 131, -84, -162, -36, 83, 215, 142, -407, -12, 66, 115, 56, 11, -21, 275, 212, -85, 56, 24, -298, -215, 55, 160, 171, -191, 236, 296, 10, -107, -189, -305, -216, 185, 122, -86, -324, -257, 190, 240, 39, -264, -261, 25, 280, -147, -358, -14, 168, -44, 254, -291, -38, 97, -188, 215, -34, -99, 21, -63, 243, 93, -141, 173, 133, -109, 265, 206, -498, 221, 223, -102, 18, 34, -292, -118, 236, 394, 64, -23, -180, 9, 168, -26, -151, -388, 361, 312, 300, -24, -50, 149, -23, 18, 88, 165, -138, -150, 105, 306, -55, 102, -314, -222, -41, 166, -189, -80, -248, 29, -221, -51, -159, 78, 100, 160, -28, -161, -136, 218, 195, -167, -342, -9, -193, -58, -95, 139, 126, -11, 200, 101, -113, -29, -136, -192, 148, 165, -34, 68, -123, 213, 384, 216, -371, -117, -94, -79, -106, -38, 60, -240, -243, 75, -415, -260, 98, -201, 34, -251, -107, 77, 14, -27, 92, -279, -383, -98, 19, 130, -209, -249, 158, 149, 93, -206, 71, 361]
7486C61l63k57N14R2p53K85M1r8J34Ok83M83j22K42j34j37r2j1M63n03p3K77R7
7509A69O3J07m97J30j6J24J57l71J44R3m3J18nq1j94K34J56k03l32N00j01r9n8
7532eJ00n0J09j00j65K5O5Q4p1k7K57l11j06j4M4L26k27K70m17N18Q3j48l1j20
7556H9l44N01m72j79O65l91J17j36P0J63p6l4L3k13J98J99l39K47J42n25K91j40
7578a34J58k05L54m0j70j48K42J9k31J71OJ73k72l6K8Q2l19O42n91K75J13J17
7600B34P0l10j23k68M45k0J98j08RQ1j83j53J4j6K09N5K48o07K41o5Ok7J57q8
7624ap0L37r2o5J14l37L08K42k60o1j10k54n5K73L10k55n3j11N4K46j01J50m01
7647a92K90K08l53q9k6J43j8r0q7J79j10L90k36N3L3l04L75j39K16n6l53qR9K26
$$ y = [361, -2, -259, 255, 347, -406, -121, -80, -178, -44, -38, -321, 162, 40, 282, 148, 11, -81, -92, 371, -132, -205, 72, 169, 232, 339, -158, -28, -44, 80, 237, -134, 10, 103, 60, 178, 173, 92, -102, 132, 288, 85, -247, 253, 152, 53, -5, 95, 45, 154, 54, -111, -86, -21, 63, -8, -35, 222, -89, -195, -209, -165, 161, -66, 204, -213, 305, 388, 240, 209, 89, -255, 246, -226, -405, 260, -131, -14, -150, -80, 83, 7, -27, 6, -207, -9, 190, -149, 98, 240, -285, 6, -134, 24, -181, 173, 133, -37, -185, 57, 76, -155, 16, 22, 195, -77, -113, -85, -3, -322, 320, -271, 4, 117, 234, 304, -6, -129, -397, 48, 28, 226, 118, 127, 208, 25, -128, -114, -130, 79, 134, 382, -225, 16, -49, -43, -70, 87, -1, -71, 266, 174, 109, 223, -114, 194, 436, 176, 115, 5, -249, -304, -31, 279, 24, -29, -140, -86, 160, 59, 209, -192, 98, 306, -47, -136, -162, -19, -37, -127, -214, -35, -145, 245, 9, 62, 95, -209, 166, 27, 243, 187, -166, -174, -75, 151]
7671A51pr2l8k4J09L24n18K17l28J64J45k69R6Q6q0K9J56j76j65K45K18k38J21
7694A26l09K98j97R3R6k24K66o8m91J23K53On0j3J81n9M7j62rJ00M6m4k1l2J1
7719c3M35j15l40J34J05r4J2J4l27J09L30n55L12j57m4K52M11l90k41o6K34J18
7741A04kk88k50O52j79m5j47P6J84l79M27j70K6l88M62K18k41L3l83M0N28n8r5
7764A25L2k81L4rJ98j00k68J65J05R6o6l34K12k6L06k69K72k80K70k22qN34n34
7787d8l09M82K19j77m0n51L10J07M10l01k40m4MN10l2m20n3L19k07N6l2J8qK14
7811A87M6K6j34k23J30Q7RK05l49j18K5L44k40K54l12j6K13N2j86k14K44r5M64
7834C99k75j28M8M4j52m4J42K31r3rp2K21m00K76k19M03j46k01J23k14J24K77
$$ y = [151, 144, 52, 14, -10, 99, 423, -95, 122, -206, -42, 103, -166, -70, 16, -64, -35, 121, -55, -220, 25, 243, 5, 126, -183, 115, -82, 11, 107, -117, 149, 81, -410, -287, -34, -28, -78, -91, 90, 31, 78, -84, -93, 7, 53, 9, -12, -44, -33, 402, 287, -53, 81, 186, 92, 104, 118, -209, -100, 230, -325, -13, -170, -214, 38, 449, 59, -182, -248, -14, 104, 102, -186, -436, 216, 37, -8, -155, -79, 105, -274, 153, -17, 9, -379, 83, 301, 60, 93, -290, -250, 278, 220, 125, 157, -124, -90, -99, 99, -1, -269, -104, 1, 97, 31, -303, -91, -117, 189, -80, 192, -88, 182, -40, -48, 486, -48, -357, 125, 344, 167, 127, -424, -114, -7, 403, 102, -138, -182, -178, 332, 300, -120, -173, 146, -61, -5, -37, -19, -27, 187, 233, 259, 125, -98, 32, 119, 128, 333, -16, -134, -109, 235, -5, 249, -63, -79, 134, 186, 0, -214, 30, -65, 399, 124, -4, 44, 88, -64, -108, 34, 265, 172, 163, 91, 312, -88, 188, -31, 372, 226, 25, 148, -66, 58, 335]
7856C35m78K01j21Q1J3k02J30N7J09M2r0l57K25K18r7k3L78l32l75K46k4M46m01
7879a9m78L62J84N6l54j05L82J72j19J0k01J39O5Kk4l65J53K67j29K44p6j31j01
7902f6K42j62l4n5R8p8J80j39j25%K90m73N94j43k09j82K05K8j62M6J52k62J58
7925i7L22k06K26Q6m31lK54K5k37o9q7N7J71p9nL4N0j43K61P2k40n5l55L10J20
7950a9j7k98M58j77K49j04M0l98K72J14j32N3p0Q1k9P6j98L21l87K42O8l5K32
7973C42m25k53J16J59J61j26J70j74j99O08m71J8M3pj80L70O1j59j62K54k89J76
7995C3P1j45j39L11j28R7k44L6k13L66Mk36K31j03j22K85l58K00m9L6L42l01k59
8018b85J44J23m9Q6j13N0m70O66j35k72o6J78K02N7j12o1P5k66L00pk61J64p8
$$ y = [335, -143, 58, -63, 18, 31, -171, -41, 16, 125, 167, 77, -280, -55, 163, 66, 43, 421, 89, -286, -40, -64, 382, -19, -497, -135, 49, 105, -249, -354, 28, 200, 81, 91, -110, 29, 94, 96, 72, -293, -140, 127, -2, 242, 166, 35, -66, 176, 14, -20, -75, 23, -55, 125, -14, -139, -139, 151, -322, 272, 129, -80, -262, -57, -29, -191, -145, 7, -255, -97, 225, 19, 245, 331, -100, -103, 151, 176, -61, -130, -217, -160, 11, -68, -73, -39, 11, -132, 129, 201, -39, -94, -449, -139, -19, -36, -334, 124, -53, 196, 92, 132, -266, 6, 120, -12, 41, -29, 52, 23, 99, -99, 222, -165, 77, 145, 110, 342, -83, -336, -220, -61, 100, -26, 144, -30, -229, 379, -92, -74, -31, -38, -218, 152, 213, 54, -108, 146, -143, 33, 104, -41, -180, 131, 3, 100, -144, -108, -321, 45, 49, -187, 44, -59, -181, 104, -254, -54, -103, -67, 275, -26, -285, -141, -18, -67, 19, -94, -44, -514, 152, 17, -255, -321, -143, 59, 116, 4, -57, 18, -248, 52, 45, -216, -52, -130]
8041a30L6J94l25M2k39M23P0k28K59n00L27j46L03k33q1L8M5J16K05l66k8N1k0
8064a87L86q4j76NJ4j00K78j74P8L8j38L46P4m81R4L45j32p7j46J83l25L66k13
8087b6k0k67L62N7J16j81m11M17K46k01k6J76r7k04J70J76Jo31J27M94m4j62k44
8110a72P4j10N52k18j83K10l14J61J76l40L6n2L21l3j64k6q3Q3J54P3k18R5rK59
8134B72o4J7k16n5K7L27k06r5m02n0Q63J4m54k70K73L38k35j17r9r4J31K97j76
8157B6k71K55r3K65J47m50L6J65J30j33l95N70l60J51k03L94l54L8J70j89J01
8178@J7K23o45N8K82K58L9k98N5j98L54j98j9
$$ y = [-130, -94, 100, -225, -183, -422, 1, 71, -157, 102, -398, -71, -217, 86, -147, -228, -190, -145, -29, 176, -190, -218, -167, -187, 199, 115, -61, -56, -42, -142, 136, -38, 40, 78, -60, 286, 360, -121, -27, 318, 186, 109, -37, 146, -179, 187, -26, -46, -313, 49, 106, 222, 41, -370, 47, 293, 92, 66, 242, 145, -59, 111, 287, 288, -343, -216, 278, 234, 72, -172, -98, -208, 344, 126, -57, 153, -161, 0, 176, -164, -128, -180, 141, 108, -56, -82, -165, -82, 72, 145, -73, 22, 13, 272, 208, 225, 9, -46, -19, 308, 102, 7, -395, -445, 418, 432, -22, -292, -19, 319, 84, -33, -132, -226, -95, 202, 26, -245, 10, -83, 182, 329, -121, -85, 80, 210, 77, -318, 252, -108, 43, -160, 234, -120, -82, 88, -101, 0, 17, 240, -405, -347, -65, 193, 232, -66, -11, -209, 145, -53, -72]
8191g2
$$ Imaginary data points
##PAGE= N=2
##DATA TABLE= (X++(I..I)), XYDATA
0@%%%qJ6j6J6k4L2m0N6o5P8j01J21j45J76k09K48k91L43m00M61n33O16p09Q10
27D32r21J042j178J330j497J678j878K098k340K606k896L213l562L947m371M840
43B543n356N932o582P309q132R079j0176J1462j2996J4867j7207K0231k4319L0180
57A6835l9341N5818r4673L48305L14840n84176j64550J87616K10456p2214m1504
68A37412r044J934l1637K4316k7137m1912L5776J50240K5095j68458j71313L0426
80d4302Q9478L0026L6703P4684n8862j63028m7041J29600J17706l890j13501j27569
92g9996m318J35427O0528j18556q8983J13921J54962k6159j75602j11270P0989
103f9057J53042L6247j30001j32518L1157J53334P9564r9848j25699M2496J23222
$$ y = [0, 0, 0, 0, -8, 8, -8, 8, -16, 16, -24, 32, -33, 45, -56, 65, -80, 96, -113, 135, -156, 187, -213, 248, -285, 331, -378, 432, -489, 553, -625, 705, -792, 886, -992, 1106, -1234, 1372, -1524, 1689, -1873, 2074, -2297, 2543, -2813, 3119, -3463, 3846, -4286, 4793, -5383, 6079, -6917, 7950, -9257, 10974, -13345, 16835, -22506, 33312, -61361, 286944, 601784, 17608, -146942, 40674, 251130, 178916, 137412, 128368, 130302, 98665, 122981, 95844, 53932, 89708, 239948, 265043, 96585, -74728, -44302, 45176, 75202, 111905, 186589, 127727, -35301, -82342, 47258, 164964, 161074, 47573, -79996, -84314, 51113, 111641, -6915, -95898, 18023, 172985, 146826, -28776, -140046, -69057, 83985, 120232, -9769, -142287, -111130, 42204, 121768, 21920, -103779, -61283, 61939]
114F1939j3197j08125j9428L3365l3635k2223P0755N9439k3963l5394k0264k7723
126g8454J2001N7566m653q2044j8474R0080M1222j08181r8266J10057K15325K4364
138A60543k07299j66802M6004J47656Q5183k9587r4264l5189P7766N4615o5180
149b6554m4582R8285J02161m8241j32861p5041L1303R7969Q4487J0421l9688l8092
161A9567l3267k4092K8049Q2458O2073m5364j36367p7052Q4728J25492J482o3495
173B4212J5532N4485k6802r2186n8213L7709J17822P4634r2432j64110j4620J48460
185B4491J06450m2994q7557j2573M0423q297o9708k3154P1192O6449j9753n7965
197a2996k2034K7788M8405Q381n0334k6505M0330R184p2808l6760P2497P8162
$$ y = [61939, 48742, -59383, -78811, -45446, -79081, -101304, -30549, 28890, 4927, -30467, -50731, -78454, -66453, -8887, -13540, -95584, -114058, -23978, 17244, -90937, -189203, -79146, 136179, 160543, -46756, -213558, -167554, -19898, 65285, 35698, -58566, -93755, -15989, 38626, -26554, -71136, 27149, 129310, 81069, -51792, -126833, -95530, 2439, 86926, 97347, 57659, 19567, -13700, -37792, -9743, 72715, 134788, 89424, -46943, -123995, -39267, 86225, 87707, 24212, 39744, 94229, 67427, -24759, -82972, -45263, 72559, 147193, 54761, -109349, -123969, 24491, 130941, 87947, 390, -12183, 28240, 19943, -49765, -72919, -1727, 64722, 44969, -12996, -35030, -7242, 41163, 49544, -790, -27295, 13035, 22219, -50589, -87349, -14852, 63310]
209F3310j5553p0157k8867N1941O6355k9284j10483m1445Q1953Q0209k7995q2728
221f2744k1730O8003O1957l4477p3191Q802O6666P3q0351o0673K4317Q8558O3427
234D8637l8628q1665K999O2828p433n9957R488O9567J0794p5484p1538K1471J01058
247g863P4583k5870p0803k5450J9597J1624j8901j5696L7383O7476j4939j07655
259g6514m1290J04348J02016k2339p2101k5825M532n661j4799LM2653O1544J221
272E7788p8022o2130L4034R2146M0343o5331q9583M779O8704J000o1786O039Q8915
285C6896M8225n0844q4630k7029N8510P0496j5070p5085k3168M4482K9750j1038
297A495p782K0511L2781p8n2236m2129L2587N0986j7861n0698P973N9503L1319
$$ y = [63310, 47757, -22400, -51267, 674, 67029, 37745, -72738, -114183, -32230, 47979, 19984, -62744, -84474, -16471, 45486, 11009, -62182, -53380, 13286, 13359, -66992, -127665, -103348, -14790, 48637, 10009, -71656, -68657, -5829, -13262, -73219, -63731, 5836, 16630, -58854, -130392, -108921, -7863, 66720, 40850, -29953, -55403, -35806, -24182, -43083, -58779, -21396, 46080, 31141, -76514, -117804, -13456, 88560, 66221, -5880, -31705, -27173, -32834, -47633, -47630, -4977, 56567, 57788, -20234, -82364, -48330, 43816, 84159, 18828, -70755, -65976, 2728, 3728, -58058, -52019, 36896, 85121, 34277, -50353, -77382, -18872, 51624, 36554, -38531, -61699, -17217, 12533, 1495, -6287, 14224, 47005, 46927, -5309, -47438, -14851, 36135, 18274, -32424, -24451, 35052, 66371]
310F6371l7679n3336J7161P6468J3804q7463o2459M6420P4660J906n9020m0831
322d3998L6942Q6631K2700q3288p7027K5021O5708Q902m5662l2015K2505M3659
334C0078j226l9934n40M5847J2521m0134l1580K100O561l831k683K1237M6008
347D4424J2334o1477n8332L5949Q3585J9424o6058p7861n541P7739O1389m2383
359B3192p0640L0562R4196J2748r3738p8882L3259R9380L3148p5141p5250K0377
371d6789O7531K9019j1772k0043j2985J197j289k4313j3095K9222K2160k3467
383d624j7533K8967K6873k0218m0228K315N4773K9508o8228r2778J9636J11564
395C0027N2749o0627p7308L355P7682N5176m7780r4963j1864Q1588N2362m2904
$$ y = [66371, 28692, -24644, -7483, 68985, 82789, -4674, -67133, -20713, 53947, 55853, -3167, -43998, -7056, 79575, 102275, 18987, -58040, -33019, 32689, 41591, -4071, -36086, -13581, 30078, 28852, -11082, -11622, 34225, 46746, 6612, -24968, -22868, -16307, -20138, -22821, -1584, 44424, 56758, -4719, -63051, -27102, 56483, 75907, 9849, -68012, -73553, 4186, 65575, 23192, -47448, -16886, 77310, 90058, -3680, -82562, -49303, 50077, 83225, 8084, -67166, -46789, 20742, 49761, 37989, 17946, 4961, 6158, 4869, -19444, -32539, -3317, 18843, -4624, -22157, 6810, 33683, 13465, -26763, -24448, 30325, 59833, -8395, -101173, -81537, 30027, 82776, 22149, -55159, -51804, 25878, 81054, 33274, -61689, -73553, 8035, 60397, 17493]
407A7493p1612l732P6055O3451l0629p3528p990M5839J0001k9300j0641Q834Q68
420d891q12J0848J9680J4187j7649m1148p784M4099K8207m0016o4182r759O7173
433b047P1602k1900r5192k4892R0280O6291n8800j01358j5999P5669O8779k3226
445B9207q4400k6808P1189P0917j4390o6297l5535K3844M1316l904m2837q804
457d6502L8528J7981j7583K158K3087p093k9711o230K3786J9201k0127m9649j1950
470f4104O2724O4364j9447p2331k9300M9209O6822r524r1903n3494O5940Q6447
482E5403j8003q0733k0910N9456O0963p452o7070m4848K8684M7909k802l4847
494b4250j2907J6366K3391R592p566k691Q266j0775k8047M846L5333p85m1739
$$ y = [17493, -54119, -57851, 18204, 81655, 51026, -22502, -30492, 15347, 25348, -3952, -14593, -5759, -4891, -5703, 5145, 24825, 39012, 21363, -19785, -27569, 16530, 44737, 4721, -59461, -69220, -2047, 69555, 47655, -47537, -72429, 17851, 84142, 25342, -76016, -92015, -16346, 52433, 29207, -55193, -82001, -10812, 60105, 45715, -20582, -56117, -32273, 9043, 5139, -37698, -46502, -7974, 10007, -7576, -5418, 17669, 10576, -19135, -25365, -1579, 17622, -2505, -52154, -64104, -1380, 62984, 43537, -28794, -58094, -8885, 57937, 48413, -43490, -96984, -31044, 55403, 37400, -43333, -64243, -4787, 56176, 48724, -18346, -63194, -34510, 13399, 10597, -24250, -37157, -20791, 2600, 12192, 4626, 1935, 10201, -574, -28621, -23775, 11558, 10773, -30966]
507c0966j4454M3604N3377O05n8193m3291M1827P2590q695q3853m4393M7629P5048
520E0835J5119n8407m9551L7632P6066J097p3230m3208L1394M9680M090m3151
532a634k8842K9852M6008k382k9642j086J4363j1335k3231k481J8259J4467j2934
545I382k8321Q555M8640J8574m2120l8867J5966M1284Q529m5589n2781J7327P8825
558C9404L2445n8390n6094K6672O4310J1624n4859n0592J7603N2809L769m4222
570a5521j5899L4850L2064k677k4524k0385O695J9688j0073l3111L691L4790L564
583A3152l2260r547L5577L4473j7721n3980j8156M5117L1789l9070m8998J4756
595d4868N3471K4301k6561l9941r19M6171K6281m1535n3620R762N0458J8813l0651
$$ y = [-30966, -45420, -1816, 51561, 52166, -6027, -49318, -7491, 65099, 56404, -27449, -71842, -24213, 50835, 65954, 7547, -42004, -4372, 71694, 72791, -439, -43647, -12253, 37427, 41517, -1634, -30476, -624, 45384, 43002, 13360, 12274, 26637, 15302, -7929, -10410, 7849, 22316, 9382, -18939, -10384, 38256, 56830, 14710, -24157, -8191, 33093, 41622, -3967, -56748, -39421, 39404, 71849, 13459, -42635, -15963, 48347, 59971, 5112, -45480, -27877, 24932, 28701, -15521, -31420, 3430, 35494, 32817, 8293, -12092, -5397, 14291, 4218, -28893, -25202, 9588, 13152, -19108, -28655, 6922, 41395, 23674, -30306, -48462, -3345, 28444, -10626, -59624, -44868, 8603, 32904, 6343, -33598, -34517, 11654, 37935, -3600, -57220, -47458, 3000, 21813, -8838]
608h838l0809K0082N2295Q517m8370k4740L3120K4741k6419l0208R345L2564J8040
621B9320j3412k3373Q029L5161R834l1608k9382O769K9323R982k8536k5384L1807
634H530N4160q178n5079j0308M2044K0443k9662l3747K112L1035J5789k2299j9899
647e059K4105L7643l241l8279k5244J4592L4091K250m3128k2702M2030M3634k0875
660C9817m2363M979M1137J8258l0761m7069o115M1870K5937k4430k7774J3361
672F847K9551O863j9719k1810N931K2446p137l6794r886L0460J8889j6002j5755
685f116R891K3472J710l4935l1315J9416M0251r610n0075j7713L6725M3526l46
698B4881m4152l0343L0182M3062j7330n7735j8086L8518L7612p124l7497j4466
$$ y = [-8838, -39647, -19565, 32730, 41247, -7123, -31863, 1257, 25998, -421, -30629, -21284, 11280, 29320, 15908, -7465, 564, 35725, 45559, 13951, -15431, -8662, 20661, 30643, 2107, -23277, 8530, 62690, 54512, -567, -10875, 31169, 51612, 21950, -11797, -9685, 21350, 37139, 14840, -5059, 19046, 56689, 53448, 15169, -10075, 4517, 38608, 40858, -2270, -24972, 17058, 60692, 39817, -2546, 2433, 43570, 61828, 31067, -16002, -22117, 19753, 45690, 21260, -6514, 6847, 36398, 43261, 23542, 1732, 7663, 30109, 22972, -13822, -23708, 6752, 25641, 9639, -6116, 3775, 27247, 28957, -5978, -37293, -17877, 22374, 12764, -37311, -55024, -18299, 25227, 24881, -19271, -49614, -19432, 23630, 6300, -51435, -69521, -31003, 6609, -515, -38012, -52478]
710e2478L3150L3978j5100l4531m621J4360J367j0514m267R697J5941j57j7666
723c0841K779L1430O318l9240k7590K2961L5793k479l9645k5181L3938N9058L642
736C0943n6583l5312L0627M7724J105n0931m2006K5580O2403J0966m8788k7006
748e1278L1661L8150j606l4654k6349R021K7312J456k0689K71K0704M592j1288
761a2697K785J5580M215k1305k7722N654L9498J3477l8610l0287L0432N2104R915
774D3039m1058m4277R001N5823K1606n2669n3587K3432O5222K1589l9150m2033
786c3062J0920M8832J8057l8041l8933M758K5333J1897l041j0025k640J2044Q387
799A4486n993k026M987j1167k0289M292K5356Q093k1097k2870J3152M8667K4038
$$ y = [-52478, -19328, 14650, -450, -34981, -39602, -25242, -23875, -34389, -38656, -28959, -13018, -13175, -30841, -28062, 3368, 9686, -29554, -57144, -34183, 1610, -869, -40514, -65695, -31757, 27301, 30943, -25640, -60952, -30325, 17399, 18504, -32427, -74433, -48853, 13550, 24516, -24272, -51278, -19617, 18533, 16927, -17727, -44076, -35055, -7743, -6287, -26976, -26705, -6001, -1409, -12697, -9912, 5668, 9883, -11422, -39144, -33490, 6008, 19485, -19125, -49412, -18980, 33124, 43039, 1981, -42296, -33295, 22528, 44134, -8535, -62122, -38690, 26532, 48121, 8971, -33062, -22142, 26690, 44747, 6706, -32227, -27469, -2136, 9761, 6720, -3305, -5945, 6099, 14486, 8493, 6467, 11454, 287, -20002, -15710, 9646, 17739, -3358, -26228, -13076, 35591, 59629]
812E9629m5268n8066J0173N9013K3056l8095m8500J311N3206M0085k6614m9877
824a9947K557M7853K2402l3407m8547n827M2950L4508j5686l0821J353J8463L458
837A9309j836O215k238j6124j6262k233J7202K1060n386k5236J621L3266J3965
850D3323l0326l8627J095M2561L1031l2724o0961l108O2112M5775k0985n1053
862a1887j8654L2003L5064j6581m6854p976L8308K4641j5393k3105l133J9016
874E449K0271l488k1789j0505L528l456l918J3802J6355n280j9098o577K1402
887F696K8076j0605m7572j9577L8831L6759j8886m5160j0735M0196M5530p969
899C5584n3834k3390L9211L6181k2462m6132j1018L3765L8358j226l6238j8323
$$ y = [59629, 14361, -43705, -33532, 25481, 48537, 10442, -38058, -36747, 16459, 56544, 29930, -19947, -17390, 30463, 52865, 19458, -29089, -34916, 8034, 42542, 26856, -3965, -2612, 15851, 19309, 17473, 23688, 21450, 5326, -10936, -13169, 4033, 25093, 19707, -5529, -3908, 29358, 43323, 12997, -25630, -24535, 18026, 49057, 16333, -44628, -47736, 14376, 60151, 39166, -11887, -30541, 1462, 36526, 19945, -26909, -34885, 3423, 28064, 12671, -10434, -13567, 5449, 25720, 22232, 443, -10062, -6534, -9990, -13908, -106, 16249, 10969, -8129, -14706, 6696, 34772, 24167, -23405, -42982, -4151, 32608, 13722, -31438, -42173, -1977, 43553, 35584, -18250, -41640, -2429, 33752, 11290, -34842, -45860, -12095, 26263, 25037, -11201, -29524]
911b9524K3401K5138o739j8005n261L877k513r382P88K2093K0064j2639k2694
924a1396P194J9290o647k2319m053J8352J9878m620l4596k1925L3974N5741N045
937E3918m8954l9432J2607L7416Q450l0698j7827K7038K7631j5481l1135n70K8624
950A1587K4916o283l5185k5799J2088K2286m36m159J3643R427j4246k1541j008
963a4710K3758K1379j4760l6700p166K7971J5213j5648j1698J6087K6680K294
975C2700l3256l3420J3562M3289Q444l4866k6235J4232L1958J1837j9879k0009
987a1643J5088K4390j1626l3634n425K2886J3820q513j3644J271K0452J3184j7633
1000H973k3615O201K0995r45k1656j2180J4733K2099l833k5569j137L4425J7362
$$ y = [-29524, -6123, 19015, 12276, -5729, -10990, -7113, -9626, -19008, -18220, 3873, 23937, 11298, -11396, -4202, 15088, 8441, -13878, -17931, 421, 20299, 15679, -18917, -40842, -6868, 48873, 53918, 4964, -34468, -21861, 15555, 24005, -6693, -24520, 2518, 30149, 14668, -16467, -17037, 11587, 36503, 30220, -4965, -30764, -18676, 3610, 3174, -985, 12658, 22085, 7839, -13702, -14710, 9048, 30427, 15667, -21033, -28199, -228, 14985, -663, -12361, 3726, 30406, 32700, -556, -33976, -20414, 22875, 31319, -3547, -29782, -15550, 16408, 28245, 8366, -11643, 3445, 27835, 16209, -17425, -22850, 36, 13856, 5343, -8301, -7030, 13422, 26606, 8973, -14642, -8441, 12554, 11609, -10047, -22227, -7494, 14605, 10772, -14797, -15934, 18491, 35853]
1013C5853k8287l3368k53J9437J4597k547j3747j621J6850N193j9423r616K2220
1026E288K4399j0975l7671k2399J9805L5205K530k0731J984J9665k953k5911j2508
1039b4272J6745K8203P510l0014l7447L929L8334K2547q773j4648j866M591o519
1052a680j9226n468K7615K4524j6630l3777m082K4521J8199j957j0085l41M853
1065F466j2937k7586j052L6307K7249j3228l1014j2569K0398L0098r79l2381j5048
1078b6276K5543J8082k3519k9255J0017M0215K2343k1462l5406j403K8331J1170
1090A8380j7825j5879K896J0390O465l245n893O634J2870n361j5639L299J4703
1103A1795m576k1945j0410J5871K7171M941k4929j6632K2107K5274j5602l4618
$$ y = [35853, 7566, -25802, -26055, -6618, 7979, 5432, -8315, -9936, 6914, 12107, -7316, -16932, 5288, 29687, 18712, -18959, -41358, -21553, 13652, 16182, -4549, -2565, 17100, 14147, -11764, -24272, -7527, 20676, 28186, -1828, -39275, -35346, 2988, 25535, 16762, 2114, 248, 4839, -1680, -20906, -26374, 1241, 25765, 9135, -24642, -28724, -4203, 13996, 12039, 1954, 1613, 6466, -6471, -34057, -35109, 1198, 28447, 15219, -15795, -28364, -7966, 22132, 21153, -11228, -26276, -733, 17349, -6170, -35425, -25408, 14807, 37150, 15688, -19718, -21121, 7210, 18380, 555, -15324, -12428, -2038, 4427, 1182, -4711, 1923, 14793, 9432, -6207, -2908, 11795, 7219, -14726, -25136, -9265, 17906, 22847, -2082, -18714, 3393, 28667, 13065, -21553]
1115b1553m309L1122K5096j5644m2545j3188L9773M3564m290l5630k2254P471
1127a2387J8842L788j6211o773K0915J4724j8199k1812Q885K4081J0618p380j3865
1140E226q544n550q219J534K7646K8562j0937l8962j7995K0642L3261R279k6862
1153I081l0182P094K7441r00k7679n268L3345L3645r832m7768l2304K5391M6425
1166B8489N050l3133k2257O112J5111R645L79k595L014J988j1535j2262K876P103
1180b015o91o39N988P172n51j3795j2487J5287L1167k898m1802k5485K3352L6593
1194A9196N389k8581k4845J5896M0602Q134l7281l1461J1347L1508R716k2084
1206b464k4843Q638L0517Q365k1424j3380J0352J3098J41j1611j3475l224Q553
$$ y = [-21553, -25862, 5260, 30356, 14712, -27833, -41021, -1248, 42316, 38026, 2396, -19858, -12387, 6455, 10243, -5968, -12741, 8174, 22898, 4699, -17113, -8228, 15853, 26471, 19091, 5226, -3318, -8868, -17087, -15553, 12093, 40655, 29718, -9244, -27239, -6597, 26664, 35943, 9081, -21101, -14007, 13434, 12534, -15145, -20413, 12932, 46577, 36745, -11023, -43327, -17936, 28489, 33539, 406, -21851, -15739, -628, 9017, 9396, 6801, 9815, 11803, 268, -11994, -9118, -2015, -2706, -3345, 2643, 9815, 9264, -4531, -17018, -1731, 29436, 26538, -15264, -40749, -17397, 19196, 24585, -3996, -28841, -12945, 27657, 35791, -1490, -32951, -21604, 9904, 19620, -2464, -27307, -18669, 11848, 20213, -1211, -14591, -4239, 8859, 9000, -2611, -16086, -19310, -10757]
1219a0757O814M414J1839L564k1428k1234J1144K9833R913k2878l0327j27L0356
1232A126J6282j9467j8049J7414K9068N89l3154l3683P431M5545K6057k9044m1428
1245c1313J35L1251K0087m593j3701l850N943l985j5737l722J5821J1636j865
1258F107m256j951k535k159Q8M077J3505M384k4553l0734P395L7493K2618j4361
1272A5118l0176p708K5087K1321j7938l2015K136L0955J3039k1457k6891K867
1284b5662L3217K4248j5747l0973m909J7570Q399o678j0428j516R629Q328n479
1297am729R671N870j3006j0612R597J1570o637j7571n743J8082K3053m794k4762
1311a0012n045K1969J3575j6037k5920n769K3242K6925p987l3539q776K7937K3211
$$ y = [-10757, -3943, 471, 12310, 15874, -5554, -26788, -15644, 14189, 24102, 1224, -29103, -29230, 1126, 17408, -2059, -20108, -2694, 26374, 26963, -6191, -39874, -32443, 13102, 39159, 10115, -31313, -31178, 73, 20160, 15567, 1866, -1984, 3959, -26, -15763, -19485, -3664, 7972, 6107, 1851, -100, -2635, -4794, -4706, -629, 12876, 17260, -7293, -38027, -30632, 6861, 29479, 15118, -15058, -22766, 2321, 23642, 5704, -26311, -24175, 6780, 19819, -1638, -28529, -25662, 7555, 31803, 16056, -14917, -19826, -2256, 6143, -535, -10963, -12479, -2850, 5478, -1, -4730, 4941, 10811, -2195, -12807, -3210, 8360, 1723, -15848, -21591, -3509, 19544, 14750, -10012, -15057, 6912, 20487, 4450, -21470, -27239, -3997, 22928, 14941, -18598, -27374, 563, 23774]
1324B3774o790k1038r439Q502R858q206j4288P280K1548M437j5280q873N722Q263
1338E470J327o027m053N556n22j4819o976J9168K3486Q1j9887j7854L440K1411
1352I801P817k0459j6668J4324J9827o871k0716k112K2031K1273p865l0236j3114
1365b2968J6523J5363n174j0469Q04P622N330l551r878L527J5664J180j9937j2565
1379a8529R230J3619l3r691k343J4108J2054j2258j9658N093J9303J858j7133
$$ y = [23774, 16984, -4054, -13493, -4991, 4867, -3339, -17627, -10347, 11201, 15638, 358, -8515, -2793, 5470, 6797, 770, -3283, 2273, 1751, -13068, -20044, -876, 22610, 22691, 2804, -15050, -11610, 9801, 17618, -2841, -19509, -5185, 14642, 7771, -12945, -15057, 6974, 28247, 20382, -9854, -22968, -6445, 8918, 3744, -6725, -5921, 1701, 7031, 3480, -6398, -2871, 12793, 13973, -5964, -18529, -9299, 4320, 4287, -5404, -7747, 6361, 18415, 6157, -13501, -8408, 10895, 12753, -4380]
$$ [...]
8191a9
##END NTUPLES=NMR FID
##END=
