##TITLE=1H_CA-8730-2
 CDCl3, 8 sc, 
 29.7.2020
##JCAMPDX= 6.0         $$ Bruker NMR JCAMP-DX V2.0
##DATA TYPE= NMR FID
##DATA CLASS= NTUPLES
##ORIGIN= UXNMR, Bruker Analytische Messtechnik GmbH
##OWNER= root
$$ XWIN-NMR		Version 3.5
$$ Wed Jul 29 11:09:32 2020 Russian Standard Time (UT+4h)  she@DPX200
##.OBSERVE FREQUENCY= 200.1315
##.OBSERVE NUCLEUS= ^1H
##.DELAY= (6, 6)
##.ACQUISITION MODE= SIMULTANEOUS
##.ACQUISITION SCHEME= undefined
##.AVERAGES= 8
##.DIGITISER RES= 18
##SPECTROMETER/DATA SYSTEM= spect
##.PULSE SEQUENCE= zg30
##.SOLVENT NAME= CDCl3
##.SHIFT REFERENCE= (INTERNAL, CDCl3, 0, 15.7039)
##AUDIT TRAIL= $$ (NUMBER, WHEN, WHO, WHERE, WHAT)
$$ ##TITLE= Audit trail, XWIN-NMR		Version 3.5
$$ ##JCAMPDX= 5.01
$$ ##ORIGIN= Bruker BioSpin GmbH
$$ ##OWNER= she
$$ F:/spectra/data/she/nmr/H-F/1/audita.txt
$$ ##AUDIT TRAIL=  $$ (NUMBER, WHEN, WHO, WHERE, WHAT)
(   1,<2020-07-29 11:08:29.56 +0400>,<she>,<DPX200>,
      <created by zg, POWCHK disabled, PULCHK disabled
       configuration hash MD5:
       00 E9 B6 7A A2 85 ED C7 34 08 36 98 17 FE 4E 26
       data hash MD5: 16K
       BD DC 2E A1 88 65 7E F3 78 AB 20 24 74 83 23 1A>)
$$ ##END=
$$ 
$$ hash MD5
$$ 0A 71 07 EE D6 6C 49 C4 01 35 C3 25 69 E5 90 A1
##$RELAX= 
##$RELAX= 
##$RELAX= 
##$RELAX= 
##$RELAX= 
##$RELAX= 
$$ Bruker specific parameters
$$ --------------------------
##$DU= <F:/spectra>
##$EXPNO= 1
##$NAME= <H-F>
##$PROCNO= 1
##$TYPE= <nmr>
##$USER= <she>
##$AMP= (0..31)
100 100 100 100 100 100 100 100 100 100 100 100 100 100 100 100 100 100 
100 100 100 100 100 100 100 100 100 100 100 100 100 100 
##$AQSEQ= 0
##$AQ_mod= 1
##$AUNM= <au_zg>
##$AUTOPOS= <>
##$BF1= 200.13
##$BF2= 200.13
##$BF3= 200.13
##$BF4= 200.13
##$BF5= 200.13
##$BF6= 200.13
##$BF7= 200.13
##$BF8= 200.13
##$BYTORDA= 1
##$CFDGTYP= 0
##$CFRGTYP= 5
##$CHEMSTR= <none>
##$CNST= (0..31)
1 1 145 1 1 1 1 1 1 1 1 1 1 1 1 1 1 1 1 1 1 1 1 1 1 1 1 1 1 1 1 1 
##$CPDPRG= <>
##$CPDPRG1= <>
##$CPDPRG2= <>
##$CPDPRG3= <>
##$CPDPRG4= <mlev>
##$CPDPRG5= <mlev>
##$CPDPRG6= <mlev>
##$CPDPRG7= <mlev>
##$CPDPRG8= <mlev>
##$CPDPRGB= <>
##$CPDPRGT= <>
##$D= (0..31)
0 1.2 0 0 0 0 0 0 0 0.06 0 0.03 0 0 0 0 0.0002 0 0 0 0 0 0 0 0 0 0 0 0 
0 0 0 
##$DATE= 1596006509
##$DBL= (0..7)
120 120 120 120 120 120 120 120 
##$DBP= (0..7)
150 150 150 150 150 150 150 150 
##$DBP07= 0
##$DBPNAM0= <>
##$DBPNAM1= <>
##$DBPNAM2= <>
##$DBPNAM3= <>
##$DBPNAM4= <>
##$DBPNAM5= <>
##$DBPNAM6= <>
##$DBPNAM7= <>
##$DBPOAL= (0..7)
0.5 0.5 0.5 0.5 0.5 0.5 0.5 0.5 
##$DBPOFFS= (0..7)
0 0 0 0 0 0 0 0 
##$DE= 6
##$DECBNUC= <off>
##$DECIM= 24
##$DECNUC= <off>
##$DECSTAT= 4
##$DIGMOD= 1
##$DIGTYP= 9
##$DL= (0..7)
0 120 120 120 120 120 120 120 
##$DP= (0..7)
150 150 150 150 150 150 150 150 
##$DP07= 0
##$DPNAME0= <>
##$DPNAME1= <>
##$DPNAME2= <>
##$DPNAME3= <>
##$DPNAME4= <>
##$DPNAME5= <>
##$DPNAME6= <>
##$DPNAME7= <>
##$DPOAL= (0..7)
0.5 0.5 0.5 0.5 0.5 0.5 0.5 0.5 
##$DPOFFS= (0..7)
0 0 0 0 0 0 0 0 
##$DQDMODE= 0
##$DR= 18
##$DS= 0
##$DSLIST= <SSSSSSSSSSSSSSS>
$$ [...]
##$SUBNAM2= <"">
##$SUBNAM3= <"">
##$SUBNAM4= <"">
##$SUBNAM5= <"">
##$SUBNAM6= <"">
##$SUBNAM7= <"">
##$SUBNAM8= <"">
##$SUBNAM9= <"">
##$SW= 24.9337058887773
##$SWIBOX= (0..15)
0 0 2 0 0 0 0 0 0 0 0 0 0 0 0 0 
##$SW_h= 4990.01996007984
##$TD= 16384
##$TD0= 1
##$TE= 0
##$TE2= 300
##$TE3= 300
##$TEG= 300
##$TL= (0..7)
0 120 120 120 120 120 120 120 
##$TP= (0..7)
150 150 150 150 150 150 150 150 
##$TP07= 0
##$TPNAME0= <>
##$TPNAME1= <>
##$TPNAME2= <>
##$TPNAME3= <>
##$TPNAME4= <>
##$TPNAME5= <>
##$TPNAME6= <>
##$TPNAME7= <>
##$TPOAL= (0..7)
0.5 0.5 0.5 0.5 0.5 0.5 0.5 0.5 
##$TPOFFS= (0..7)
0 0 0 0 0 0 0 0 
##$TUNHIN= 0
##$TUNHOUT= 0
##$TUNXOUT= 0
##$USERA1= <user>
##$USERA2= <user>
##$USERA3= <user>
##$USERA4= <user>
##$USERA5= <user>
##$V9= 5
##$VALIST= <valist>
##$VCLIST= <CCCCCCCCCCCCCCC>
##$VD= 0
##$VDLIST= <DDDDDDDDDDDDDDD>
##$VPLIST= <PPPPPPPPPPPPPPP>
##$VTLIST= <TTTTTTTTTTTTTTT>
##$WBST= 1024
##$WBSW= 4
##$XGAIN= (0..3)
0 0 0 0 
##$XL= 0
##$YL= 0
##$YMAX_a= 1041983
##$YMIN_a= -492611
##$ZGOPTNS= <>
##$ZL1= 120
##$ZL2= 120
##$ZL3= 120
##$ZL4= 120
##$ABSF1= 10
##$ABSF2= 0
##$ABSG= 5
##$ABSL= 3
##$ALPHA= 0
##$AQORDER= 0
##$ASSFAC= 0
##$ASSFACI= 0
##$ASSFACX= 0
##$ASSWID= 0
##$AUNMP= <proc_1d>
##$AZFE= 0.1
##$AZFW= 0.1
##$BCFW= 1
##$BC_mod= 2
##$BYTORDP= 1
##$COROFFS= 0
##$CY= 11.3945322036743
##$DATMOD= 1
##$DC= 2
##$DFILT= <>
##$DTYPP= 0
##$F1P= 16.9975609425685
##$F2P= -3.02152046262296
##$FCOR= 0.5
##$FTSIZE= 0
##$FT_mod= 4
##$GAMMA= 1
##$GB= 0.15
##$INTBC= 1
##$INTSCL= 1
##$ISEN= 128
##$LB= 0.24
##$LEV0= 0
##$LPBIN= 0
##$MAXI= 10000
##$MC2= 0
##$MEAN= 0
##$ME_mod= 0
##$MI= 1.114404
##$NCOEF= 0
##$NC_proc= 0
##$NLEV= 6
##$NOISF1= 3.799351
##$NOISF2= 2.8
##$NSP= 1
##$NTH_PI= 0
##$NZP= 0
##$OFFSET= 15.70392
##$PC= 1
##$PHC0= -9798.896
##$PHC1= 19.00092
##$PH_mod= 1
##$PKNL= yes
##$PPARMOD= 0
##$PSCAL= 0
##$PSIGN= 0
##$REVERSE= no
##$SF= 200.130013532006
##$SI= 16384
##$SIGF1= 3
##$SIGF2= 2
##$SINO= 400
##$SIOLD= 16384
##$SREGLST= <1H.CDCl3>
##$SSB= 0
##$STSI= 0
##$STSR= 0
##$SW_p= 3612.71676300578
##$SYMM= 0
##$S_DEV= 0
##$TDeff= 0
##$TDoff= 0
##$TI= <>
##$TILT= no
##$TM1= 0
##$TM2= 0
##$TOPLEV= 0
##$USERP1= <user>
##$USERP2= <user>
##$USERP3= <user>
##$USERP4= <user>
##$USERP5= <user>
##$WDW= 1
##$XDIM= 8192
##$YMAX_p= 0
##$YMIN_p= 0
$$ End of Bruker specific parameters
$$ ---------------------------------
##NTUPLES= NMR FID
##VAR_NAME=  TIME,          FID/REAL,        FID/IMAG
##SYMBOL=    X,             R,               I
##VAR_TYPE=  INDEPENDENT,   DEPENDENT,       DEPENDENT
##VAR_FORM=  AFFN,          ASDF,            ASDF
##VAR_DIM=   8192,          8192,            8192
##UNITS=     SECONDS,       ARBITRARY UNITS, ARBITRARY UNITS
##FACTOR=    0.0002004,     1,               1
##FIRST=     0,             0,               0
##LAST=      1.6414764,     0,               0
##MIN=       0,             -492611,         0
##MAX=       1.6414764,     1041983,         0
$$ Real data points
##PAGE= N=1
##DATA TABLE= (X++(R..R)), XYDATA
$$ [...]
2582f710K149P421J548o558m278N323O097j594n118r78N034K850m176p351M20
2597e921P669K759m729l723L798N258Q41n721n081J927O650n00o218k097M898
2612a90M712j277m331j370M970L806m580p541J8O005K525k818j784J766L160q6
2628B985m895k664M653M964k884p855k332M995O326J387m534k338L693J911n674
2643b262m157L917O585N3o126n053L163P847L857m900m589J566K608k539l739
2658c769N66O130N017l131p955o46Q187M746m214n724K72L438N33m097j988O528
2674C893O995k292r190k712N872N196j369o593k908M744M626l151n258K834P782
2689H469L44p662n610K628O724L32p272l554O414O314l008o675o4N455L042m454
$$ y = [-6710, -4561, 2860, 4408, -2150, -6428, -1105, 4992, 3398, -1720, -2698, 2336, 5186, 1010, -6341, -5921, 1748, 4507, -222, -3945, -147, 5111, 5952, 231, -4850, -2923, 3727, 3227, -2991, -5088, -190, 4522, 3245, -1086, -2456, 2514, 6320, 1740, -5801, -5783, 222, 2747, -71, -1855, -89, 3071, 2985, -1910, -4574, 79, 5043, 2159, -5696, -8028, -3033, 3293, 4680, 146, -2192, 1501, 3412, -2262, -6419, -2502, 4083, 4136, -1990, -7043, -3880, 3967, 7824, 2924, -1665, -99, 2509, -30, -3769, -3203, 2927, 7944, 4813, -3142, -3788, 4399, 9145, 4931, -793, -521, 2917, 3450, -647, -2635, 3893, 10888, 8596, -594, -3306, 2566, 7762, 6393, -200, -3108, 1636, 6262, 3111, -2147, 687, 8469, 8813, 1151, -4459, -1831, 4893, 5225, -2047, -5601, 813, 7127, 4119, -2556, -2620, 2835, 5877, 1423]
2705A423p164J93P286K502o572m275N302P613o77p855m918L767O925j917p896
2720f263j79P591L564n580n597K728Q323K387p498q562J589Q014J996n017j972
2735d476M783L723l281p004l51Q591N458o744j0277K03Q150M406l182l543K202
2750a342M584k018p781l121Q110O869l567q780k511N703O529j72n697n93N454
2765A667J51p589m330N797P873Q61p192m700L559Q003j78o228j228M230J230m373
2781b447l877K935P497L707n156o859K274P317N47n702l360L254M726n79n419
2796a142j113O841N454l805o740L60M689J737l961m249J662O092K164m895l907
2811h13L815M223j389m990k600L444L493k070o041L59P245L626m517m914q8K942
$$ y = [1423, -5741, -5548, 1738, 4240, -2332, -6607, -1305, 6308, 5631, -2224, -7142, -3375, 3550, 1633, -6263, -6442, 1149, 4713, -867, -6464, -3736, 4587, 6974, -524, -9086, -7497, 517, 2513, -2504, -4476, 307, 4030, 749, -6255, -6606, 1985, 7443, 699, -9578, -9375, -1225, 3181, -1, -3544, -1342, 3242, 1224, -6557, -9678, -1568, 5301, 1734, -7046, -9557, -3854, 2675, 2503, -3194, -3787, 1667, 1818, -5771, -10101, -4304, 3569, 4430, -2762, -7462, -3903, 4100, 3922, -2306, -3534, 696, 1926, -2447, -6324, -3389, 4108, 7815, 2659, -4200, -1926, 5391, 5938, 236, -3124, 130, 4856, 4277, -1142, -2255, 4586, 10040, 6235, -505, -145, 4544, 6281, 2320, -1929, -267, 5825, 7989, 3094, -813, 3002, 7225, 5836, 846, -1754, 1690, 5183, 3113, -2928, -2569, 4676, 8302, 3785, -1129, -1217, 1725]
2827A725R51k923l579K904M927j275n988j485N330N381j043o113m693K077M711
2842I07o62l640J538M587O81m880l274K072N751K059n522n616J138M756Q84j381
2858f02M15K686J407k783n426p75O432M196m340o021M21M276K971j398k706J581
2874C34L212j483p411k023N924N383j203n086k936K996M798k66m760p38L679K13
2890F33m288l466K253N832K460m210m841J835N847q94n409j010L426K218j839
2905a453m175O40O028M044m259n622J400M975M13m386l481K417O185J150n021
2920a145l392N119N134k848n726n79M574K986k757n294R57P233K835m456m425
2935a784J970L084k53l720k484L847M931j916o891j1O659M333m002n686q64L817
$$ y = [1725, 2676, -247, -3826, -922, 4005, 2730, -3258, -4743, 587, 5968, 4925, -1188, -5881, -3804, 907, 245, -3395, -1857, 2730, 3411, -1469, -4743, -2671, 3080, 5139, -383, -5999, -4861, -105, 779, -602, -187, 2499, 3906, 1123, -4303, -5078, 1354, 5550, 1210, -4811, -4390, -114, 2857, 1459, -1247, 334, 3546, 2063, -5348, -7371, -1447, 3936, 2733, -2353, -5289, -2293, 2505, 2239, -2521, -3259, 420, 633, -3655, -7121, -4868, 964, 3424, -786, -5627, -3792, 2055, 1161, -4248, -5258, -1832, 386, -1453, -5628, -4988, 1040, 5084, 825, -4797, -3397, 1578, 1991, -2395, -5876, -3459, 2726, 3876, -1145, -4537, 582, 5716, 2868, -2858, -3437, 1137, 4123, 1366, -3928, -2971, 4262, 7097, 2641, -1784, 186, 3270, 3017, -703, -3187, 660, 5591, 3675, -3216, -3227, 3432, 7765, 3763, -1923, -2787, 1030]
2951A030K125m051l543L924O397j349o771k580M419N718o68o483l907L118M761
2966B140j756l934J802N293J072n192n333J809O648J923o028m322L020M542n69
2981A115l000O62L714J872l791o526J77O844L288l838m852J216M318K120l632
2996c13l215L056M753k442p476j344N600M788j209m984j324L580L029k606m739
3011d846J135M336l02m469k377K894M691J232m553l403L420L555k459m799M16
3026e529M052K223k393l746J329N475J535m925l435K985L457l49l912j781L191
3041a823N011J87m683j280L759K797k922l654P21M133K012k679l698J915N305
3056E101J181l724k074J284K124q28k756q18L962L935k138m907P4M247K121j923
$$ y = [1030, 3155, -896, -4439, -515, 5882, 4533, -2238, -4818, -399, 5319, 4651, -1832, -5739, -2621, 2140, 384, -3550, -1748, 3545, 4617, -575, -5908, -4099, 2549, 4472, -1556, -5878, -2858, 1684, 1115, -1885, -1223, 2491, 4363, 572, -5954, -5777, 1067, 4355, 517, -4335, -3119, 1199, 3319, -313, -3528, -472, 4281, 1839, -5637, -6981, -1381, 3407, 2198, -2786, -4110, -530, 2499, -107, -4846, -3711, 625, 323, -4146, -6523, -3629, 1062, 2294, -2259, -5662, -2242, 1313, -1146, -5945, -5529, -1477, 746, -1647, -5393, -4064, 1411, 2946, -1979, -5414, -2429, 1028, 679, -3233, -5014, -1823, 3188, 3375, -1308, -2588, 1171, 3968, 1046, -2608, -1887, 2246, 4258, 1579, -2119, -204, 5101, 6282, 2558, 484, 1768, 3892, 3064, 308, -510, 3452, 7387, 5249, 342, 416, 4663, 6784, 4861]
3072D861l496j065K747J185k667j808L651M533k057n049k142K436L839K89m091
3087A166k889K347K919j572k049J621L147L84l641m929L78N335K128l683l058
3102b396K077K595o66k096l0K545K150l385n617L62N162L031k259l437N65K492
3118A093J645k956k786J650M054j615m913j331L943L878q5m131k203K946K053
3133A242k403m063J090L911N56l075k416J704M299J215m899k997K563L243j678
3148a708m095n41L557L478j426m703M93M731J094m169l338K351L706N53l351k613
3164e981K330N291L09m495j650L132J873k060l586O96M797L067l671m299J954
3179b293M877J502l874k156J370K330o58l137n39N409L638k832n475l93M379K627
$$ y = [4861, 1365, 300, 3047, 4232, 1565, -243, 3408, 7941, 5884, 835, -1307, 1129, 4968, 5257, 1166, -1723, 624, 3543, 1971, -78, 1543, 4690, 5074, 1433, -3496, -3118, 2217, 4345, 662, -2396, -319, 2276, 1610, -486, -516, 2029, 4179, 794, -4823, -4461, 701, 3732, 1473, -1964, -1399, 1093, 2738, -218, -3004, -1354, 2700, 1085, -3828, -5159, -1216, 2662, 2577, -1554, -3757, -811, 1242, -1161, -5224, -4134, -223, 333, -2742, -5158, -3454, 845, 2060, -2839, -5836, -3273, -30, -1708, -5803, -6344, -2787, 691, -735, -5438, -4945, -214, 880, -3289, -6627, -4276, -570, -17, -3368, -5981, -3651, 1640, 1949, -2546, -4196, -1064, 809, -1251, -4837, -4141, 656, 3723, 52, -4247, -2293, 2584, 4086, 212, -1944, -574, 1756, 1098, -2039, -2578, 2831, 6469, 3637, -1838, -2231, 2148, 4775]
3195D775k053l340n77L720J108l858j475M338M291j832n311k563K663M283n29
3210C640l792r07L633R56k719j572K197L423Q2m211m488J644M944J340l763j455
3226a048K562K319j596k840o24L855K278l740m474R46M771J810k289k392P91K376
3242B705O21l664k336K798L194j327l828k71K818L240j340l872o19L188J616l560
3258f37k914K010L032K86k481j333J571K921r96m095j427L331K278j517l390o04
3274c965L063K599j028l360O39L199l92l750j777K694L204N89k976k466K282L518
3290B073p98k807L6J424O75j961j719R14M201K430l064m230J315L379P62j968
3306F62j653P35J876o32k738j59M325K899k510m239o88K177K257r55k346k74K748
$$ y = [4775, 2722, -618, -1195, 2525, 3633, -225, -1700, 2638, 6929, 5097, -214, -2777, -114, 4169, 3640, -152, -1059, 2574, 3530, 811, -761, 1436, 4859, 4941, 730, -3758, -2114, 2830, 4170, 407, -1048, 1514, 3833, 2237, -603, -1227, 2628, 4906, 1166, -3308, -2362, 2409, 4219, 1930, -462, 329, 2705, 3326, -338, -2674, 124, 3318, 1991, -1837, -2108, 710, 3950, 2610, -1262, -1881, 1307, 2923, -637, -3551, -1541, 1491, 1777, -704, -2037, -466, 2455, 1459, -2636, -4063, -732, 1546, 29, -3361, -3965, -902, 1697, 669, -2691, -2052, 1147, 755, -2995, -4772, -2078, 1126, 1715, -1261, -3727, -1445, 2073, 1275, -1532, -1496, -72, 603, -1358, -3077, -2163, 2038, 4468, 1404, -2826, -1511, 1868, 2630, 662, -991, -256, 1620, 988, -1750, -1909, 2416, 5315, 2805, -1434, -2122, 55, 2312, 1357, -989, -1263, 1485]
3323A485J029l137j194K135K746m77l414k883J871L235k31l004l93K990P61j996
3339d77k282Q94K790N41l253k873J496L805M67k604j403J985K225m15l753j492
3355d349L135K844k312l116J225L524R61k029k350M67L087P56l420k321K384K287
3371G73J9j925n92K093K297j640l509m86L786J885l329k222R76K975R99k129j894
3388a923J830L035j657m176j055L588K562j298k771j015K436K782j548l086P37
3403a559K975m72l546j342J957L788P91l463k254K424K358j407k577M70K352O04
3419A099j720k440J487L885J457l071l230J665K856k41k784q53K102L145r16l388
3435i47l64M095J681k768k499J04K189J501j658k554J548L117lk658r95J979J330
$$ y = [1485, 2514, -623, -1817, 318, 3064, 2587, -827, -3710, -1839, 1396, 1165, -1839, -2232, 758, 1519, -477, -2759, -1865, 925, 1466, -1787, -4660, -3164, 641, 1108, -1496, -2899, -914, 1311, 896, -2857, -4349, -1214, 1630, -682, -3798, -2573, 951, 1912, -117, -2467, -2000, 1087, 1843, -1577, -3898, -1514, 773, 792, -1133, -1725, 368, 2665, 1025, -2484, -2970, 816, 2701, -628, -2850, -1874, 1101, 2100, -29, -1923, -93, 2942, 1285, -2891, -3946, -358, 2204, 906, -1865, -2880, -444, 2338, 790, -2296, -1559, 1416, 944, -2602, -3944, -1987, 1801, 2592, -871, -3125, -701, 1657, 250, -2327, -1857, 495, 1099, -621, -3061, -1574, 2311, 3768, 697, -2533, -868, 1988, 1747, -1037, -1890, 212, 3357, 2441, -947, -1311, 2784, 4465, 1697, -802, -698, 1491, 2992, 1334, -1220, 328, 3445, 3442, 784, -211, 1768, 3098]
3452C098o48k645j210K502K212j205l228J180K762J039k257k072N74K418J44k835
3468a71j394K767K733j309k840l48J686K333r93l167r24K788J677j870j739J159
3484C88L059k82k285j775R44K820L2l000j053K268J411q94j288j15J779J473k203
3501A279l142N17L004P21k313j598J090K137J64k165j667J942J533j406k817L4
3517b687J878J523r52k013l49K217J304k201k820N97K349rj492j450Q41K280N64
3534d20k773r70J931J777j741k280K4J971J662q55j842K50K951M99k665j128J391
3551b218J792N55k341j383J510L261J92k732m89K442J218j517j840p1K412J799
3567B590j648k669J425K836N30j903j132P75J313k15j887r59K344K391j494k337
$$ y = [3098, 2450, -195, -1405, 1097, 3309, 2104, -1124, 56, 2818, 3857, 1600, -472, 102, 2520, 2664, -171, -1565, 1202, 3935, 2626, -214, -562, 1124, 3457, 2464, -703, -1627, 1161, 2838, 968, -771, 388, 3447, 3165, 880, -895, 49, 2869, 2901, -99, -1152, 1116, 2527, 1633, 345, 230, 2009, 3482, 1279, -1863, -1346, 1658, 2379, 66, -1532, -442, 1695, 1859, -306, -1973, -31, 1502, 96, -2721, -2687, -809, 714, -238, -2251, -2600, -383, 921, -1280, -4100, -3503, -1154, -1163, -2655, -4105, -3264, -984, -420, -3193, -4163, -2232, -455, -2196, -4476, -4452, -2481, -819, -1674, -3516, -3266, -315, 184, -2481, -3609, -2218, -426, 129, -2212, -3595, -2085, 1176, 1368, -1364, -1853, 589, 1807, 290, -1550, -1621, 791, 2590, 942, -1727, -302, 2534, 3064, 1161, 29, 804, 2117, 1902, 15, -944, 1400, 3791, 2297, -40]
3583d0K73K128J151j649k310j66K502R21k483j431J966K505o94k015j429J383
3599F12J976j014k896l01K997J140j573j871N64K269J023k214k260O23K957o35
3615A397k692k10K617J391n94k247q52J696J476j026k557O51K171L93k027r03
3631a316Q94K775L66l065k226J531K513o47j956l14J728J166j635j965L41K939
3647A129Q33l154j888P49J969M64j296j292J149J912m55l176j05K867R91j912
3663a215k156o2K150J784j360j903Q94K016k55k437p75J597K181l52k215r31J974
3680a065K546j112k210K04J602O19j265j651O05K481Q68k093j079J608J832o25
3696A265j938m22J359J281k05j990m05K182J539j243j376J39J752K40j727j873
$$ y = [-40, 233, 2361, 3512, 1863, -447, -613, 1889, 2810, 327, -1104, 862, 3367, 2673, 658, -771, 612, 2588, 1574, -1322, -1623, 1374, 2514, 941, -930, -366, 1903, 2926, 712, -1548, -925, 2032, 1397, -1295, -1505, 1112, 2503, 1909, -338, -1190, 506, 1982, 956, -1601, -950, 1221, 1614, -413, -1316, -422, 2353, 2719, -346, -2572, -1041, 1472, 825, -1131, -1445, 283, 1449, -186, -2151, -1810, 1129, 1962, -1192, -3080, -2331, -362, 102, -1194, -2486, -1337, 575, 120, -3056, -3161, -294, 697, -1215, -3371, -3433, -1283, 501, -859, -2762, -1868, 148, -107, -2544, -3319, -1722, 459, 107, -2108, -3039, -1065, 1481, 369, -1841, -1637, -35, 584, -681, -2332, -1727, 754, 1622, -471, -1550, 58, 1890, 1265, -673, -1095, 264, 1545, 1340, -650, -1055, 1127, 2666, 1423, 47, 186, 1938, 2178, 451, -1422]
3712a422R85K684J5k217o57J700J259q44j205l76J134J276j499k362P76K791Q67
3729B905j532j184l84J256O97j212q53J072J213j196k353O14K433J366r25k109
3745a92o38J198J125j108j242J062J396j32j688q48Q82K135K36k224j855J135
3761g58J692j61j275K92J040N07r25k110P43K231K15j938j317K43J175Q41p27
3778b32j104J079J584r97k249j03J679J080j054j576k34J867J460j480j779O40
3794a419J923j59j519r66P91J616M72j543j260J686J592j044j753n0J639R34j065
3811a25j233k06K008J030j896r00J359J432p71j774j271J566K307k33k059n70
3827a336J764Q12j084r08O81J263K71k295j568J145K810P82k144r58N96J057m5
$$ y = [-1422, -437, 2247, 2262, 45, -612, 1088, 2347, 1503, 298, -78, 1056, 2332, 833, -1529, -753, 2038, 2905, 1373, 189, -195, 1061, 1758, 546, -307, 765, 1978, 782, -1571, -957, 1476, 2842, 1917, -192, -830, 368, 1493, 385, -857, 205, 1601, 1469, -219, -1067, -185, 1950, 2186, -38, -1893, -758, 934, 773, -502, -210, 830, 1337, 412, -1698, -955, 1276, 1491, -447, -1764, -1521, -346, 495, -232, -1336, -257, 1327, 330, -1919, -2022, -343, 737, -317, -1893, -2127, -260, 1200, -280, -2059, -1419, 504, 345, -1174, -2140, -1349, 267, 739, -804, -2064, -378, 1214, 170, -1583, -1633, 6, 940, -125, -1358, -1564, 444, 1474, -422, -1322, 37, 1469, 698, -1076, -2347, -781, 1526, 1293, -766, -1336, 428, 1240, 156, -752, -71, 1192, 1463, -832, -2400, -1255, 1555, 2337, 193, -765, -169, 888, 843]
3844H43j453n9J236J421j908j864Q11K696L38p15j968j96J541K51j214j086K067
3861G41J312q70k258k14K053J834n07k405o97J560N30j198n45R17J776m89j650
3878a10j299J299K018k31k562o65J602R79l50j405KJ623Q52j640j712N35J848
3895G84qj796p94J235J452n96j441o38J780Q31j051j580j51J396P42n99j493P31
3913a196J556P07j924j179O40J758j54j313k39Q45P49j31j267J87J773R95j758
3930D9j504K58J358P78n48j095M13J290k79j294K69J499N03j031j893j53J247
3947a33J888q6j759RP98j41r10l58M92J453p9j520j538J170J903J14j248l37J65
3966a17J03l09q85J40J500N57j350j466P15J443P95q12j019r9R56l5r93k79J411
$$ y = [843, -610, -669, 567, 1988, 80, -1784, -973, 1723, 2061, 1346, -622, -818, 723, 974, -240, -1326, 741, 2053, 1183, -1075, -1289, 764, 2598, 2091, -314, -1011, 549, 1079, -119, -664, 253, 2029, 1540, -110, -1409, -110, 1908, 1677, -885, -1550, 52, 1031, 681, -724, -722, 901, 1753, 113, -1599, -1064, 784, 776, -1020, -1814, -579, 873, 277, -1164, -1802, -22, 809, -242, -1822, -1973, -577, 165, -434, -1927, -1196, 360, 1067, -857, -2036, -1396, 362, 208, -1105, -1344, -499, 250, 119, -1148, -961, 812, 1807, 49, -1455, -1197, 161, 939, 391, -704, -291, 999, 720, -574, -305, 1194, 1697, 666, -1227, -1380, -133, 1755, 1669, -90, -81, 717, 576, -334, -692, -200, 1253, 1174, -346, -1884, -714, 1189, 1303, 55, -282, -117, -14, -323, -1208, -1068, 432, 989, -361, -1827, -1112, 331, 1126, 314, -705, -804, 152, 117, -876, -1155, 256]
3985B56Q95n03j241k54R31J645m46k193j90J469P43j102q38J089J139L14j258
4002D56j258Q76J497r7j544m54J231M49N7r58l53P83J332j417j524K68J702K11
4020A257j493o52N44J736K8j535j171J042J220q81j237o6P92J243r74r92l27K024
4038E58O12j789j439M03J569N26q67r58M18J181R4j815j5J982O44j391j282mJ404
4057a69J143n40j348O24J354l80j238p02J532J357k27k228p33J316J894j26j552
4074b3K98R46Rj152p07P93J788M1j749j504J333J651O4j321q49R32N43m44j409
4093g60J18K410L59j431j745R56J305N3p57j343J040J331n48j702N8J669R99n17
4111A495j457p66J323J335p60j589K87J715M1j320l82R26J027L7j751l52J211
$$ y = [256, 1151, 648, -593, -847, 84, 1729, 1283, -910, -1100, 369, 1112, 10, -828, 261, 1400, 1714, 456, -802, 74, 1571, 1474, -70, -524, 707, 1156, 1213, 255, -98, 685, 2017, 600, -924, -656, 1046, 1257, -236, -888, -344, 1392, 1420, -115, -1286, -244, 976, 95, -1142, -1208, -416, 827, -147, -1139, -1466, 558, 1170, -619, -2058, -1655, -86, 440, -427, -1385, -967, 214, 308, -1507, -1522, 460, 1104, -287, -1569, -1573, -169, 974, 434, -914, -290, 1064, 684, -554, -1256, 276, 1633, 1406, -822, -1555, -239, 1655, 1529, -23, 275, 1221, 1230, 78, -629, 164, 1952, 1993, 244, -1260, 73, 1724, 1788, 467, -382, 550, 1093, 649, -760, -642, 1768, 2127, 696, -1049, -93, 1212, 1265, 508, -835, 205, 1536, 988, -714, -656, 1013, 2012, 1495, 38, -728, 595, 1930, 1170, -419, -132, 1583, 1624, 304, -78, 848, 1875, 1912, 161, -191, 1020]
4128A020Q58o70j538N80J187M58n83j576L61J076M50j096p08N66O14l03r97k22
4146e23N35R31J9j501r62J124L90n74n87L91K59P6q26q03M90J103R4j583m28L34
4166b041J60M13m78Q4L06P37q79j758P42J406L03o99j209l0R51Q60p90m22R32
4185a412N54q90p56M78M11J007K4j255m32J043R16J02r55O81o4L86o19p13Q83
4204f11J235K53j184k97M51O33M2p9l88K56O16o52q73M05J603K44r80p33K27M27
4224E95P48k10r79l11J200j07n09j71N49M67r9r58l70O68Q61o60q95o1J357L01
4244A416m11r87l09J126Q25j134q32P97O61k25j198N3R92P67k94j366m02J113
4262E92P89j029o06P08O34K24j121j104Q22J687K14j795j145J249O55qm45j74
$$ y = [1020, 1878, 1208, -330, 250, 1437, 1895, 1312, -264, 97, 1173, 1623, 527, -181, 385, 999, 696, -301, -523, 12, 943, 962, -539, -1501, -377, 13, -561, -1148, -757, -498, -422, -1248, -2051, -1561, -458, -364, -1947, -2375, -2041, -1881, -1468, -1946, -1862, -1556, -819, -1698, -3456, -2714, -1308, -1005, -1704, -2913, -2943, -1992, -1132, -1922, -2344, -1412, -858, -1748, -2504, -2026, -1615, -608, -584, -1839, -2271, -1228, -312, -210, -1165, -484, -548, -162, -781, -1494, -611, 624, 877, -307, -604, -153, 480, 522, 443, 55, 311, 927, 275, -598, -193, 1410, 1654, 674, -59, 168, 595, 1343, 1133, 154, -157, 1043, 936, 427, 256, 805, 1272, 1173, 215, -155, 513, 1374, 714, -181, -242, 1115, 1416, 1005, 18, -291, 835, 1660, 526, -306, 491, 1152, 927, -271, -218, 774, 1541, 1247, -119, -521, 592, 1381, 352, -254, 454, 1088, 1312, 191, -913, -91, 1596, 1810, 15, -1130, 119, 774, 766, 321, 147]
4280A47M77O02j212j374P11J994k2j412q18L17Q67Q69j267p29R79J284j378j184
4298a149J66J532O70p63j444lJ134N99j008r85J129J049q76j231l47J104J514
4315A091l40j550n85J524N92r63n44O7R55J76j033p45O22J495O1j467n48J045
4333a47R29m20r48o37R14J216j097j009P03Q82P2m29o84l0J134J32j164o28J332
4352A21P98k19j325K63P76K53l30p33r6J206J99j264n60Q03Q47j03k83l83k99
4371c29Q82l14q28J69J277R9q56q63K31Q94O31r13m03l37O47L45q01j0O42N71
4391G34m51m75p46Q84R26o18r68K21M37J77j81l02j30O26L37q69p58N12P38L63
4411D57n58k80M0L85K75m42J62J06N27p73n04M57O92R4k34o08m1O39O02r03k49
$$ y = [147, 624, 1226, 14, -1360, -649, 1345, 1323, -89, -907, -590, 277, 1146, -121, -850, 129, 1413, 35, -1149, -983, 549, 1219, 456, -988, -991, 143, 742, -266, -1251, -122, 927, 51, -1180, -1527, -423, 1091, 751, -799, -1384, 140, 732, -231, -775, -708, 247, 423, -610, -1355, -733, 762, 823, -644, -1192, -147, 782, 362, -586, -1223, -309, 907, -190, -1199, -496, 386, 458, 29, -655, -685, 449, 581, -583, -1211, 121, 919, 700, -625, -362, 414, 667, 337, -396, -492, 714, 913, -351, -911, -108, 739, 636, 353, -30, -329, 553, 239, -589, -420, 857, 956, 100, -763, -532, 362, 993, 80, -323, -660, -13, 332, -469, -479, 163, 734, 283, -192, -938, -54, 872, 254, -714, -493, -56, 121, -60, -362, -492, 134, 471, -398, -1156, -644, 94, 457, -101, -381, -341, 44, 319, -123, 39, 145, 672, -101, -605, -148, 544, 638, 404, -204, -245, 394, 996, 93, -156]
4432a56M65K03q4j87n35M89O70l1o98m5L92L56l33p31q2N05O85o95n21p5R57R
4454E58o29n34P63N1j64l10j170R95P14l59p72J95N79J45n24o41j15Q97P32r34
4474e23j197N30J393j45m53p79M76O73k16p13r6J380Q1q58m69M62O53P22q65o75
4494f19q6J214J77q18j15N46P97k45p72m78R09Q20m37j204O05R23Mj209j39N91
4514D64Q28O14j503j030J018R36l68r68K7L55L26k18p84K43R35j97j011p83Q93
4533b23O57l61r81k31P69O69j6j289k38R59L77o79o69J98P28K11o49o38J19J807
4553E20m86j402j37P87P02l64q56M1R79M94n00j096N63R65q9n09n30M20P40J57
4573C99p31p72J617K43p94p79N00N00Q27o62o41j84O91O59n09m35L32L44r1l66
$$ y = [-156, 309, 512, 428, 241, -294, 195, 865, 834, 136, 91, 483, 839, 506, -225, -307, 198, 883, 188, -333, -408, 549, 558, -71, -605, 158, 209, 45, -265, -1435, -440, 274, -85, -857, -662, -83, 62, -462, -1103, -1218, -321, 411, -523, -1720, -1190, 203, 58, -395, -1174, -698, -25, -241, -954, -1050, 330, 411, -447, -916, -454, 199, 921, 56, -619, -705, 509, 686, -132, -247, 299, 1096, 851, 79, -399, 510, 1330, 893, -311, 294, 1217, 1221, 12, -127, 464, 1292, 1906, 403, -627, 391, 1327, 959, -9, 18, 373, 699, 481, -303, -60, 875, 678, -333, -1116, -223, 434, 73, -908, -1139, -370, 299, 283, -1006, -1244, -285, 92, -587, -1256, -1058, -330, -119, -768, -1406, -1287, 520, 34, -1368, -1505, -718, -16, -380, -1236, -1195, -216, 278, -222, -1318, -755, 210, 121, -388, -918, -498, 242, 399, -332, -1104, 513, 756, -38, -817, -317, 183, 1010, 348, -293, -477, 214, 873, 364, -71, 261, 605, 514, 148]
4593A48m36K88O27p1j011L2J023J11o65m45K13N58P1m67m62m2J217j38o49k43
4613c41P58K1j10m61o3O76r5k95k98J34Q44k05k90L14n83M76J53k29m60P1P37
4634G54n5j72J36m85P02O8m71LL57J76q97L26K74J08K69k12o15l22Q90j6j82n14
4656A22O5J48L27k72n92K79j9M71m23n67N42j02j89j38o42N50M98k50n71n43P70
4677e36N76l53p44l4L88M22l28l88K66M36k7o29j61M86N23m15k99j20N35M87o20
4698e35n88K04Q94J29o17l22K59N41J94p66m9J012R2l70n86J09P73N96p34q47
4718f11K12J267K33q19l83J62N50k25l43o94N56Q00l81p07L30N15L31o58p98O69
4738FN76M8n76q75Q56Q12k43r19j6K41N55M8o82L90M47K40j126o70O91Q32J61
$$ y = [148, -288, 0, 627, 556, -455, -423, 600, 711, 46, -399, -186, 372, 443, -24, -486, -528, 689, 551, -98, -341, 417, 438, 328, -133, -196, 480, 385, 90, -208, -74, 770, 565, 275, 589, 6, 482, 635, 406, -54, 17, 754, 699, 527, 663, 178, 880, 948, 477, 480, 837, 1013, 116, 442, 716, 824, 1093, 881, 266, -56, 834, 818, 636, 122, 187, 335, 662, 390, -202, 77, 58, 529, 106, -461, 81, -21, -210, -348, -990, -440, 58, -192, -763, -1306, -536, 40, -313, -1057, -1091, -703, -281, -609, -997, -731, -295, -322, -951, -1112, -626, -103, -518, -817, -937, -402, 85, -535, -1123, -919, -25, 104, -513, -835, -576, -35, 159, -607, -656, 356, 448, 78, -508, -399, 374, 970, 236, -611, -399, 868, 1101, 282, -101, 61, 611, 386, 43, -651, -95, 705, 324, -383, -53, 462, 793, 135, -663, 6, 582, 630, 54, -821, 35, 847, 604, -315, -331, -90, 465, 513, -169, 221, 668, 908, -218, -888, -197, 635, 796]
4759G96p21p22N59J102k25j383j13J320N49o54p31L15P24j14l99p20O73Q72k42
4778H86q57k50M39N84j79r89K1O33P11n19q82J80R48j02n75l80M5O48j78k35l42
4799c93N04L53p55o48L78Q06O1m45p18j4P80M85r14j79L11R8j70k95L07J12M83
4820A47q8q98K33K77K59p21l39O20L72k16l07j06L41N12l18n60Q2K96j66L34n1
4841b97r0J28J08k41L3L20J62k99K0k63l75M73L17Lk71P3rK42k76M26l68J42R
4864c3k77k32P86j73M3k32K60Q9Q8j04k31k69M92L59n07j06P1j11O59o2m87l3
4886a0L60K33m55p7J00R4Q1k6l90J21O02J8q29J91M03K87j61m96l90L14O81l33
4908C18m39PO55k24l83k7K80K40J02n95k21N57N48m48o48J66L60L41l56n32k68
$$ y = [796, 75, -647, -88, 1014, 789, -594, -707, 613, 1162, 508, -223, 92, 816, 702, 303, -417, 256, 1128, 886, 29, -221, 218, 802, 623, -366, -345, 288, 999, 480, -402, -222, 726, 624, 49, -331, -286, 362, 184, -51, -393, 111, 464, -291, -939, -561, 245, 306, -139, -857, -871, -91, 394, -520, -699, -388, -290, -460, -755, -448, -336, 147, 59, -839, -606, -329, -70, -791, -1130, -510, -138, -354, -661, -767, -426, 86, -232, -792, -710, -414, -580, -246, -297, -387, -259, -151, -392, -359, -39, 123, -176, -156, -419, -794, -321, -4, -1, -272, -199, -208, 34, -242, 184, -184, -42, -33, -310, -542, 244, 71, 114, -118, 142, 231, 319, 215, -16, -285, 207, 566, 59, -47, 24, -87, 572, 510, 23, -10, 350, 583, 128, 51, 151, 245, 326, 300, -90, 31, 633, 651, -178, 13, 416, 703, 542, 46, -344, -30, 651, 318, -121, -114, 541, 317, -66, -93, 187, 427, 529, -66, -287, 270, 818, 370, -278, -112, 248, 589, 233, -299, -567]
4929e67J154q4q48J36J70O01l19M5m26K86M55o41n93L08P11K26p61l80J92L13
4949b2M35l24m71J17J042q45m87J99L78N55q79n72J47J032M28j215n59R00N01
4968C60j47j108o7N16L40J4m76k38N79K20m37j38J75M57M9n77j34K18P16j85q90
4989g53j05O19P09n07m34l3L70O46n60p05N27N76k54o00K76M42L88n29n18J69
5009b76M66M84k71j085M23N61L13k23k33J34K04nm84l61J163j55n22j21j54O00
5029D58J24l50n71J25Q26k07n99R4K43L0Q8m3l45N8M72n80j84M04M90j21n07o1
5051a56L39L02K85n49n97L88K3L25l07J52J91j84J54j7k07J02O8j84j45K22R0
5072B95K28j50j07RN32q2n93L63l66J66J89q0l39J99J14l18K38l09N25k26l2l3
$$ y = [-567, 587, 503, -345, -209, -39, 562, 243, 288, -138, 148, 603, -38, -631, -323, 388, 614, -147, -527, -335, -22, 413, 89, -382, -265, 777, -68, -555, -356, 22, 577, -302, -874, -727, 305, 733, -482, -1041, -141, 360, 213, -895, -962, -446, -106, -92, -568, -806, -227, -7, -444, -582, -407, 50, 99, -478, -612, -394, 322, 137, -753, -858, -239, 470, -37, -471, -504, -134, 512, -48, -753, -226, 350, 96, -504, -228, 214, 602, 73, -445, -276, 190, 674, 403, -682, -259, 302, 615, 392, 159, 293, 497, 492, 8, -353, 810, 655, 133, 12, -142, 458, 582, 232, -339, -214, 612, 405, -194, -100, 143, 173, 261, 218, -127, -69, 403, -177, -361, 43, 533, 412, -95, -156, 183, 485, 770, 221, -376, 12, 35, 360, 53, 205, 396, 212, 366, 349, 142, 244, 312, 128, -17, 205, 295, 523, 373, 266, 275, 807, 725, 132, 495, 129, 295, 484, 404, 65, 264, 378, 60, 298, -11, 514, 288, 256, 223]
5094B23j5k31L8N2l52L51O6L00m73j33M1p8L46Q4m68j37K72L55m08J00j92K5K59
5117B5l13j03k98P23j11l13k15N35J81j14m36j71L77L75J82o67J05L80j17N5k79
5138a99J80K17m1k58k37K30P57k05p65L6O08M14k30n67o2L99K81m09k87k1J65
5159FK08po18K40P03o41n28K45P98J57m48o11J78L02K63l14o00O04L99l83k86
5180c33qm1M86j65o04M3J015j70p37m89K42Q46O0n94p48Q92N20m1n44k52M35J94
5202Gn77L3K24L79n0l90j85O16L78j01r03j37N93N53k03n54p1N49J35K04j096
5223e96J92N59m4n11M2M00L65k75r26J40P66O94q73l68kM71K22l47q5j21N58J29
5245C90o90j21R47j78o61poM77L82m63l94J76O13k32k35m23N88J75j10j49n4K57
$$ y = [223, 208, -23, 15, 67, -285, 66, 132, 432, -41, -174, -133, -211, 135, 219, -249, -386, -114, 241, -167, -67, -259, -234, 25, -288, -391, -689, 34, -77, -390, -605, -70, 111, -3, -439, -610, -233, 142, 324, -343, -238, 142, 25, 80, -199, -19, 198, 157, -101, -338, -108, 649, 444, -321, -285, 323, 737, 507, -60, -122, 277, 558, 149, -138, -159, 6, 214, 207, -411, -171, 532, -109, -637, -392, 406, 563, 115, -496, -318, -16, 247, -67, -667, -63, 336, -47, -333, -341, -382, 104, -61, -665, -622, 393, 223, -514, -1003, -761, 85, 145, -449, -1197, -305, 215, 174, -370, -622, -187, 7, -570, -537, -313, 66, 16, -374, -559, 57, 435, 334, -569, -706, -113, 440, 237, -317, -388, 161, 296, 500, -596, -404, 155, 111, -400, -358, 42, 407, 132, -794, -654, 112, 806, -67, -435, -437, 34, 256, -91, -176, -297, 261, 390, -300, -421, 526, 348, -313, -320, -326, 151, 533, 70, -324, -148, 465, 233, -2, -425, 163, 338, 228, 79, 25, 282]
5267B82Q0J86p69M79L61m35k22P1M56N3r6l82j24K98L64j05n07K98j6j88K65q4
5289B65L99k48l56l47M93M61q5n62j25Q9K46N16n70l82J62j15J42j84J45J12o3
5310gj59K18Q7l9j94k40K31p0M77n41R3K66j25k54L43j89Q5K04k06k40N69j76
5332A33j54l29M4J49L22J10m98j04L57ol63K43K4L19l27j95o9M40p1M2l15ON43
5355C01j28l26j15M75j62j27J10k07J53N66o45l59N96M36n43o51K72M50L96k27
5375B65p46R2P48J27p49k5l4L60K14r2l55K84J65j01l17j02L60N58n87n64J24
5396c75M87N23o71n91R8R67j13n07O7L57N2j30l71j20P97J31p48k85L35N85k45
5417B43n55j74L69O10q6m56n94O49K90R6l70j25K11o0l34m2O46M75l92n87k94
$$ y = [282, 362, 548, -221, 258, 619, 184, -38, 33, 489, 542, 446, 64, -60, 238, 602, 497, -10, 288, 272, 84, 349, 265, 664, 416, 60, -287, 206, 667, 582, 20, -105, -16, 230, 746, 176, -206, -44, -159, -17, -201, -56, 56, -7, -166, 52, 139, 100, -94, -334, -103, -173, 304, -237, -144, 122, -3, -257, 86, -103, -18, 186, -20, -260, 309, 133, -21, -350, -306, -157, 165, 275, -223, -327, 30, 24, -339, -96, -72, 247, -80, -275, -344, 96, 25, 67, -248, -242, 301, 173, -153, -268, 207, 45, -82, 28, -179, -26, 540, -105, -464, 132, 568, 25, -626, -354, 96, 492, 265, -481, -389, 359, 486, -263, -288, -322, 38, 252, 160, -195, 89, 254, 153, -164, -266, 94, 652, 65, -499, -375, 112, 635, -36, -627, -529, 438, 325, -182, -115, 242, 294, 164, -207, -327, 470, 601, -147, -432, -97, 488, 243, -312, -486, -117, 493, 407, -49, -643, 6, 296, 392, 22, -103, 108, 48, -286, -328, 318, 793, 401, -186, -480]
5438d80M96O54l77m87j74M34M58l05l42n7M24J70p92n4M91n3J44m67oL74N54o81
5460g6l86Q4M17J02m93J46j60M82q7l01J86n1J92k11j20L84Q2j86k67n14O65J45
5482C3Q7m63j86L70Q5J44l96L52k30K24l86K56k53N18l20k1j78K69L29j5m15k13
5504d09K16N60o18K71pK20k80n5J65r0J83l52L2L28K07j79j96J9K19r1J60l94
5526i1k05K24L39j19J60l3k89O8k34K44K84j13j25n72K48O76k09q7j29J86m17
5547a94K98l4p9K67Jj68j24M33j97j41k14J95K01P5j56l31J30L23L41l55n09M05
5569A67J66l48k48L74L62j47j77l56K90L76J29p36k1J34J59K05k31l49O5N83m1
5590C56n10J23L72k27j51l23L69N71k29p68K34L96K05l34j73n9J32j59J57k93
$$ y = [-480, 16, 670, 293, -194, -368, 66, 524, 219, -123, -180, 244, 414, -378, -432, 59, 6, 150, -317, -323, 51, 605, -76, -462, -378, 39, 141, -352, -206, -366, 116, 29, -272, -86, -137, 55, -156, -276, 108, 190, 4, -263, -777, -112, 33, 120, -343, -529, -159, -74, 70, -326, 26, -204, 20, -366, -110, -363, 155, -165, -186, -364, -95, 234, 219, -196, -409, -193, 367, -251, 20, 13, 233, -47, -102, 63, -27, 156, -196, -164, 164, 371, 192, -4, 15, 234, 143, 303, -91, -296, -72, 267, 148, 308, 275, -14, 54, -180, 64, 348, 235, 110, -462, -214, 462, 253, 166, 37, 223, -194, 104, 70, -9, 258, 259, 91, -33, 400, 203, 62, -152, 43, 244, 319, 163, -168, -38, 285, 626, 271, -238, 167, 333, -15, -263, 111, 473, 326, 149, -207, 83, 459, 588, -148, -169, -35, 124, 329, 98, -251, -186, 397, 356, -154, -31, 341, 114, -37, -360, 9, 580, 351, -417, -183, 213, 418, 84, -89, -148, -16, -175, -18, -311]
5610c11K3N38k04j66j61L78J12r6l00m36O08N61p37j87L06L69j37m50j6J38K71
5631A03R0n33J87O8K62m12m53N94L48K07n55n35N21J44R4J77n10K08J53m6l84
5652b72L26j9j19J36k09K99M65k70o28k9N15L09k27l79j73J79O75l99n25K1L09
5673a5j33J89n83N04Q4j26l73kN39L55o00k76M34M63l9l31j36k09K83K22o28K10
5695a68K64k70K98j89k81N09J52k16k27Q1M23Kl24k41P9L81k48k5j22l4J37O9
5717E0n32N64P7l66o0J49rK08k84l41J35L05J57j20l52k2L41O1ok86J08Q2J02
5740c9k54L0L64n5k58k89O0N31j81J13k35j51N15l88P4J48J40r2q4J2K48j01k54
5763a46K0k45N31p6j36o32P16k1L07k96l08K72nk87K82N7K71j60j42k90N54Q9
$$ y = [-311, -288, 250, 46, -120, -281, 97, 209, 113, -187, -623, -15, 546, -191, -378, -72, 297, 160, -290, -306, -168, 103, 193, -340, -153, -85, 177, -235, -688, -94, 254, 461, -94, -629, -108, 36, 130, 307, -203, 5, 158, 112, -272, 54, 35, -84, 52, -157, 142, 607, 337, -291, -320, 195, 504, 277, -102, -275, -96, 579, 180, -345, -324, -15, -148, 41, -542, -38, 46, -80, -453, -455, 84, 439, -161, -437, -3, 460, 421, 90, -46, -255, 28, 250, -378, -168, 96, -174, 124, -65, -346, 163, 315, 99, -128, -47, 376, 378, 54, -187, -108, 273, 25, 0, -122, -156, -19, 50, -482, 82, 159, -207, -267, -118, -127, 81, -203, -544, -409, -104, 53, -67, -419, -441, -100, -39, -45, -331, -223, -141, -39, -293, -263, 101, 46, -212, -501, -441, 90, -91, 22, -213, -364, 151, -237, -163, -15, 125, 33, -51, -39, 209, 108, -146, -126, -371, 160, 84, -52, -684, 32, 11, 318, 22, -286, -14, -19, -306, -24, 33, 304, 144, 2, -288, 266, 355]
5785C55J8n07R3K50J70l00J08q8k09J13j34M03l81M16j20k95n6K11J64k11m64
5806d64K95J96L48m24NP1K13k15j19Q0Q6P1j79l88j1N36j6l88O2L53L24j66n93
5829c23j47M72K40m24j42K8L66J38l63k9J78J27k87j44O7L76K21l16k78L68NJ07
5851B40m97M4P6N5O9k10j52L76L03k18n45L76K20k34j44k43L97L38l87l05J35
5872c06J56J71Q1m70M8L25M0J0k20M0M01Nn48q0J80L06J39l80l81K50N58j08l42
5895a25j7K48R7L8m25M45p8k85q9n9L08N13m04n66J84L98K47n72l5L9L68j74m7
5918Ij98O12J1l2k96k03K93Ol07J17L4M90k46l37j5J2M01O0l09Lj87O04m47nJ80
5943B50j14k49j07M00m7K96l37l63M4L53L33m18n0K55k87n5J19L6l9j85J21o5
$$ y = [355, 373, -134, -41, 209, 379, 79, 187, 99, -110, 3, -131, 272, -109, 307, 187, -108, -164, 47, 211, 0, -464, -169, 27, 375, -49, -44, 27, 240, 25, -94, -14, 72, 143, -36, -424, -435, 101, 85, -303, -241, 112, 436, 270, -323, -470, 2, 242, -182, -324, -296, 70, 208, -155, -184, -6, 121, -166, -310, -243, 133, 354, 38, -240, 128, 133, 240, -257, -213, -137, -82, -13, -223, -375, 1, 304, 86, -459, -83, 137, -97, -241, -484, -87, 251, -136, -441, -306, -150, 21, 102, -368, -320, 5, 45, 55, -165, -125, 276, 281, -267, -347, -167, 139, 278, -102, -483, -233, 325, 217, -125, -142, 106, 203, 241, -184, 261, 183, -102, -191, -250, 58, 571, 167, -399, -215, 183, 430, -142, -177, -138, 230, 56, 9, -189, 423, 434, 402, 106, -97, 196, 202, -105, 12, 46, 536, 290, -47, -62, -50, 351, 411, 102, 105, -82, 522, 75, 70, 250, 136, -113, -220, 180, 133, 429, 92, -271, -227, 126, 459, 41, -9, 246, -41, -96, 23, 59, 20, -165, -44, -109]
5965a09J54J64k47m37L81O6P8O3j87Lj31L24Q9l61L01k16K7k16L49L76o24r5n9
5988c07P2O44m69J13m49L59J0j27j01K66k74K33m1k92Q4L96l56q9j37J87L02k24
6010b00l45J52L15K26q3l65K46L30j12l11j5N6K76m07l31L09K42K65l38j97N1
6031b36L24J43k50j02L9K92j75l53J37J7M67r4j55k21M21M1n01j29L91M52j30
6052C78p27K50K40M91n38j63K3J19M46o10L13j23M4k0k56J76K43P4n33m8l3O00
6074C46j08q4j91j21L41j49k70m9K88J14m22l0K20J17r7k11pJ16L83j28m01J48
6096a95J58J67j05n24L07L23J41o08K35J49m1J40m55J26M42mL9n07k04L40K65
6117A89l18m2K69J1k51K58k82K40j43L6j55J17K92j45k03m98P92om7J53p09J67
$$ y = [-109, 45, 209, -38, -475, -94, -28, 50, 113, -74, -71, -202, 122, 211, -150, 151, -65, -38, -254, 95, 471, -153, -248, -307, -235, 409, -60, 53, -396, -37, -27, -154, -255, 11, -263, -30, -71, -363, -279, 117, -239, -328, -465, -278, 24, -200, -545, -393, -78, 148, 65, -300, -54, 276, 164, -147, -162, -106, 170, -237, -568, -259, -17, 248, -90, -287, -236, 88, 231, -19, -121, -82, 210, 35, -318, -181, -164, 303, 209, 54, -167, 254, 295, -206, -335, 56, 508, 378, -349, -99, 141, 632, 94, -69, -46, 73, 519, -91, 222, 99, 143, 123, -133, 43, 286, 360, -173, -221, -254, 346, 238, 154, -37, -158, 183, 34, -236, -285, 3, 117, -305, -335, -115, 2, -95, -306, -313, -197, 186, 58, -343, -195, -37, 130, 25, -499, -192, 131, 272, -336, -101, 48, 7, 147, -308, -182, 260, 256, 295, -212, -416, -76, 189, -129, -171, 98, 109, -142, 116, -166, 74, -69, -33, -188, -71, 221, 76, -127, -625, 167, 161, 114, 267, -442, -275]
6139b75N04m8k83K7O3m2J50k61M33M2l64k09M5J01M80k47m42J73L35L2j69J85
6161B30j85K54r9k44n6J40J26l96K49N2J01J53m11K6J49L22l1q19L11N5K85N0
6183B62J76k96q3J71J4k06M8J44L8l23J85k37M89j9m97R9L33M4l54j4J93k63J09
6206A3r2n7K25q9j34j34J75K63n5n1l67k0M39Ql48j05J69K38q5jL84Qk44l19O2
6231a17M3J68m4n94M60K07J90j76j58o9M5J5J23k62Q4R2l7k25l4L74K6k75k34
6254c98K7M81L27l34l04J1N45l29l49P4P6K40k03k97M2L37J85j96j37m8K23q3
6276a10Ok31O4J78j05j51J57q1M29j52k35J61J70k31j63q8O29k03k12j89J29N95
6298C67k70k24j88J97L03L76o68K70k05K02n1l50J18N7N8J73l94K20J08j79J63
$$ y = [-275, 229, 181, -102, -75, -12, -54, 96, -165, 268, 310, -54, -263, -218, -117, 363, 116, -326, -153, 182, 214, 45, 230, 45, 299, 200, -44, -100, 40, 166, -230, 19, 71, 172, 325, -86, -60, 89, 411, 380, -439, -128, -73, 212, 262, 438, 142, 59, 230, 244, 38, 86, 230, 268, -55, 130, -107, 382, 363, -134, -35, 298, 342, -12, -26, 167, -96, 13, -79, -136, 89, 0, -134, -268, -93, 170, 115, 64, -303, -323, 116, 124, -224, -329, -160, 78, -7, -8, 376, 384, 140, -179, -117, -74, 94, 50, -544, -84, 123, 313, 137, -21, -90, -45, -30, 93, -169, -85, 7, -30, -255, -289, 85, 111, -164, -398, -371, 110, 437, 103, -201, -190, 355, 26, -323, -249, -173, 67, -136, -433, -391, -54, 131, -65, -202, -250, -27, -110, -104, -335, -271, -93, -198, -349, -192, -273, 156, 4, -231, -70, 100, -131, -294, -382, 247, 44, -168, -357, -228, 367, 97, -127, -315, -118, 185, 561, -107, 163, -42, 160, 109, -241, -123, -66, -8, 165, -229, -9, 99, -80, 83]
6319H3l23Q0M08k24J42j74P7R9J31l83L16j52j03j07j55PM67J0l09O8K9K89k78
6342bj99rM09j78K20k91L86k78j97j25L40L27k71k59j64L94j19J42l66K0J84O5
6364B9lj76k14J50J74K57j08q8L1J75k40n3J13O37o87l70L81j33M69k08m46N2
6386b58K00k8L6J0j6K22k5j56j67K33r7M9o8j06O38m08J92l85J21L74k38l4l78
6409b89M88j39j43rK4j92L18l24J67J21K22p9m32L94M0n9o1k43M7J93L53l14m14
6432c31J65L20pl39L08K55m35k10K5M75J59l46r7j77J7l9M09j88L4R4j6n2l51
6455c27M54R4K71p38O4K21L49m63K70o08K44L57k46qP4J38j76k54K45L75j61p0
6477A05l17N6L2N77q70K40K36K85l76Q5n0j3J28pl67K69J06R7k66j78J23J55P7
$$ y = [83, -240, -160, 248, 24, 166, -8, 69, 168, 299, -84, 232, 80, -23, -130, -285, -278, 189, 199, -110, -42, -13, 276, -2, -201, -210, 199, 21, 241, -50, 336, 58, -139, -264, 76, 403, 132, -127, -291, 103, -16, 126, -240, -220, -36, 29, 26, -150, -364, -214, -40, 217, 109, 21, 52, 227, -13, -66, 47, 684, -3, -373, 8, -125, 344, 136, -310, -258, -58, -86, -50, -40, -56, 166, 141, -15, -182, 51, -46, 3, -65, -171, 467, 59, 251, -134, -13, 361, 123, 89, -289, 199, 60, -83, -92, -68, -260, 58, -266, -99, 22, 244, 165, -267, 127, 167, 108, 47, -196, -149, 44, 397, 83, -331, -166, 154, 147, -192, 116, 371, -64, -274, -249, 226, 385, 39, -58, -235, -218, -257, 152, -36, -2, 92, 76, 24, -327, 127, 221, 492, -246, -182, 39, 388, -75, 195, -413, -169, 188, -58, -66, 8, 146, -30, -284, -39, 336, 175, 105, -212, -156, -124, 453, -417, -177, 59, 344, -32, 53, 3, -10, 118, 111, -256, 13, 119, 216, -50, -228, -105, 50, 127]
6500A27m78R6J05L30k37k38R6J23K36j15k99J19N10k9m91j24M19j92k80J39K41
6521E8R3m5j85k3j51J54K71m44p6M82P9q8o1Nk32N18o31K29j55M52r8j74q3J59
6545E4M45n62j82J35n1M13k40j38K71r5l7R2J54q2P6o7k59J44K79K03o78J05P0
6568E0K69k31p9n9n0l1L31q3k51L07j96k31J77R3K85k79j37k07O78j26o5j40l05
6591b80L48M4R7l37N3P4K08n99K58J51K78l64k7k54P22l14j69j90M28K5J32l55
6613g1J5K25P3o1j95l09M59L31m76k35k01O46m12J99j13rM8J08p5j61L5K63m40
6636c56P7J22Q0Q8k70L17Om4L5j03l64L58J92k50J03k18L6J07l8p2J16j73J71
6659h0l09M90J13j63k48k00p5P12j04k23k03M09K72q1n29N25l22K52j21n7K3L3
$$ y = [127, -351, -255, -150, 180, -57, -295, -199, -76, 160, 45, -254, -135, 375, 346, -145, -269, 150, -42, -322, -183, 58, 151, 106, -79, -102, -253, -99, 172, -272, -348, 134, 213, 125, 64, 69, -163, 355, -276, -47, -202, 250, 152, -22, -105, 54, 499, -63, -245, -110, -161, 252, 12, -126, 145, 50, 13, 105, 259, 177, 253, 186, -73, 71, 350, 553, -125, -20, 50, 319, 88, 9, -50, -100, -131, 200, 117, -134, 173, -23, -254, -77, 16, 301, 22, -115, -322, 356, 230, 165, 25, -280, 68, 112, 209, -128, -75, -1, 207, -392, -134, 17, 295, -69, -96, -350, 372, 58, -111, -301, 127, 152, 284, -71, -56, 169, 242, 181, -14, -323, 136, 467, -9, -244, -445, 201, -211, -12, -125, -134, -86, 22, -53, -214, -179, 84, -356, -279, -157, -77, 11, -259, 58, 64, 20, 55, -48, -412, -54, 138, -112, -9, -227, -191, -84, -122, -194, -78, -251, -80, -389, 101, 214, 51, -197, -397, -472, 240, 136, -87, -290, 119, 391, 310, -219, 306, -16, 236, 115, 58, 81, 114]
6681A14k0j63k00N73J65k83k30j56M0M70ll15j93K17N0P2J42J26l46j08m2J1M16
6704C37k30j28j31L05j3O6j99l6j03O68m48K17m51K25J3o5j10J87J1j58k70J44
6726a69M68k69P4n55K71L05L45j73p05J14L60Q3k19N7J6j71J92k41l5M21L1l66
6748a66r9Q5M47r4J28n52Q1K68J04rk19K7r3J03k00R2J62r9m8k75J73K44j11q0
6772a31m43N07K15m1m50M35m9r6K27l76L16k15q9k24K13J19L54n33L8J86k8K28
6794A63k81j65K88L8K57l28m6J48kk69KK16J7J90m55K64M7Q4n7l39l2J44K90L6
6818B10p3l6j3m4k62j01M34K9j97O3j42K48J24l8l97j4K38L41l49k66J54K12k7
6841I4j03%K29j94k6j65K21M15n82L1j2L9K43j44j70k09L51R9l19L00l94K08J02
$$ y = [114, 94, -69, -269, 304, 469, 186, -44, -200, -160, 310, 307, -8, -201, 16, 66, 138, 280, 406, 60, -48, -90, -79, 337, 107, -21, -152, 153, 140, 206, 7, -29, -132, 536, 88, 305, -146, 79, 92, 27, -83, 104, 115, -43, -313, -169, 299, 30, 104, -451, -180, 125, 470, 297, -408, -294, 66, 149, -70, -13, 3, -168, 24, -217, -252, 169, 200, -166, -265, -180, 267, 173, 301, -251, -170, 98, 202, 193, -26, 1, -92, 11, -189, -97, 65, -34, -82, -357, -184, 60, -51, -131, -574, -67, 148, 107, -343, 92, 43, -53, 174, -202, 114, -101, -190, -414, -201, -82, 272, -261, -223, -37, -65, 163, -118, -283, 5, 43, 300, -28, -74, 74, 72, -197, -195, 21, 38, 228, -227, 37, 84, 168, 111, -228, -260, -116, 174, 210, 137, 101, 88, 44, -218, -319, 115, 144, -53, 10, -132, 116, 240, 202, -195, -209, 29, 370, 21, -245, -91, 121, 94, -9, -9, 220, 26, 0, -165, 56, 471, -111, -80, -92, -53, 190, 46, -124, -333, 18, 117, -202, 98, -296, -88, 14]
6864A4m0k30J01R7O9k15R5K99K30l14j02MJ3J22j40j08Q0J95l63K45K6j45R6j96
6888a67j18M80ML3j22j48O2J56j3l20J12l5J86J29l49K6L6K39l72j04M19k20J88
6911A02k08j02P1N51m94j3L43q1j12k46K14k48K66k06J00k24J85J70k20j07J15
6932a44J31K10m40N1K10l41N85k00j47J8J72j87KJ53l9j7o1J33jN7J79p03K00
6955a79K07J24J8k58K6J80J61l07P3J45J27k80m87K85L08K31j57m00J38L08p2
6976A91j54O7m02O88j91l89L13j10K1N2n9K80k12j92p1J85J16rj64J60p9P5R3
6999B09n25M01j81l5M9m2J82k01J08j98J85j35LK01m07J44N21l77P0J75m26L45
7021F6k0j98J7J76K40l07J14l83K37J85j83j47L40l17M57m39N6l81P63k4k15m27
$$ y = [14, -26, -256, -155, -58, 11, -204, -109, 190, 420, 106, 4, 8, 21, 143, 3, -105, -25, 170, -193, 52, 78, -67, 29, -167, -285, 195, 199, 232, 110, -38, 24, 180, 167, -153, -41, -76, 110, 239, -110, -84, -48, 191, -181, -285, 134, -86, 102, -106, -208, -137, 414, -80, -93, 250, 169, 57, -189, 25, -223, 43, -163, -63, -287, -102, 68, -152, -259, -144, -13, 197, -243, -192, 18, -323, 262, 62, -85, -67, 105, -82, -80, 73, 34, 17, -44, 89, 88, 145, 324, -379, -179, 28, 152, 170, -88, -62, 118, 279, -28, 45, 190, 317, 37, -450, -165, 143, 374, 217, -183, -45, 263, 191, 37, 104, -298, 390, 199, -190, 123, 13, 34, 86, 27, 307, 95, -97, -168, 17, 133, 124, -40, 120, 41, 116, 209, -316, 85, -96, -131, -82, -124, 58, -143, -35, -233, -48, -183, -180, 21, -386, -242, 279, -98, -28, 147, -279, 66, 46, -152, -135, 41, 281, -26, 88, -295, -58, 127, -56, -203, 137, -180, 277, -162, -106, -487, 276, 252, 37, -390]
7043c90r4K81M80j13k74J40lj1p8q9K77j13P2l99J09L94o0k72J82k54M7L63m87
7066b92R1L00J31j95m62K95J20R7m67L82n4J59r5j46K3K7L94j95j52j61J95J94
7088A89j30l31L97j3M9l75r7N47p4l36J23j05K55l85K78k77K97Q8j9k9ol79L17
7111a6l9k2r6O4M02m44J26k6L35k07l12K95K9n0j33j32M3L58r4l96O68k51J48
7134B50l81j51N20P5l7O7l76Q6K38m02J0j3J7K21o6j3o3K17m3k30j44K07lJ53
7158A39k97K3j9M83k87j42mON5j48L96j3k79J47j10j2J41R4K1l38r5N99m51Oj3
7183i8O6K38o1J97k56j90L43j56J5J60l77M40k31k52N3J42K54m18J09M3p4L01
7205B48j94J08k13L59l30J26j50M15k43j33J96M7j1k03j16J83J43O2k61N4p9K98
$$ y = [-390, -484, -203, 277, 164, -110, 30, 27, 16, -62, -151, 126, 13, 85, -314, -205, 189, 129, -143, 39, -215, -168, 195, -292, -201, 99, 230, 35, -427, -132, -12, 85, -382, 0, -54, 105, 10, -136, -113, -86, 308, 113, -39, -200, -5, 189, 59, -272, 125, 112, 161, -214, -311, 236, 162, -174, -51, -156, 99, -286, -8, -285, 12, 100, 81, 52, 46, -333, -16, -55, -77, -173, -109, 293, -151, -25, -51, 284, 77, -235, 60, 89, 39, -94, -226, -183, 175, 81, -315, 353, 102, 250, -131, -282, 238, 313, 276, 343, -33, 53, 291, -111, -101, -114, -97, 124, 58, 45, -18, 199, 156, -74, -218, -11, -14, 139, -158, -135, -154, 329, 42, -100, -104, -98, -43, -191, 205, 192, -87, 60, -50, -62, 79, 173, 194, -144, -239, 360, -91, -85, -98, -32, 206, 145, 342, 86, -104, 239, 83, 98, 258, -119, 321, 90, -162, -109, 33, 287, -131, -22, 21, -53, 248, 54, 162, -51, 308, -22, 104, -46, 369, 126, -7, 189, 236, 225, 22, -94, 89, 232, 294, 33, 87, 8, 306]
7227C06l67M10k61Q2P6l24J17l64O15j32k67p2M01k46J93l58J7L16K8k49k53L73
7249D1k67N37m59j29N36j95J73m42j12J19K54K5n29K08o1L35nk86r0L39l5j31
7271a74j14L15j19k1j08p0K85M6P9o08K86K88j51J67n03L70J76m63O1J84K43k10
7293d1k57rK76j17J35n8j07J51j6j49J48j15J70K34n07j17K86K44J55m29j1K20
7315H6j02K6q3j51J75K58j76l74J41K90L10l56k64q1M54l9J08o7j80j65M69l22
7337d3J48r4M61o05J10J83O0j02p2m7K39P6k02k37L24j37K22k33l20M90k39O4
7359D6k22j7J40K17k0l66L8M57l8k55k57K43J13J72k33r7K62l04J3j86R3k10N72
7382A61n10J30l20P39J33n43J69Q2m9j50L57j83j1J27k99K35pQ9j68jK80K07o6
$$ y = [306, -61, 349, 88, 170, 246, -78, 39, -325, 290, 158, -109, -181, 220, -26, 167, -191, -174, 142, 170, -79, -332, 41, -226, 311, -148, -277, 259, 64, 237, -205, -317, -198, 56, 81, -448, -240, -301, 34, 29, -257, -347, -8, -43, -174, -288, 27, -92, -113, -221, -291, -6, 40, 119, -489, -203, 85, -66, 101, -402, -32, 144, -319, -258, -74, 169, -41, -298, -307, -31, -148, -13, -71, -178, -27, -43, -192, -44, -159, 11, 245, -262, -379, -93, 151, 306, -123, -134, 86, -16, 10, -73, -224, -49, 209, 33, -341, -200, 90, 400, 44, -220, -301, 153, 114, 222, 155, -25, -190, 279, -43, 105, 11, 472, -133, -23, 160, 220, 118, 46, -1, 238, 314, 112, -125, 199, 62, 284, 51, -269, 221, -18, 46, -176, -193, -53, 164, 144, -222, -184, 273, 235, -20, -277, -34, 79, 251, 18, -79, 183, -121, -108, -294, -201, -411, 161, -349, -219, -539, 200, 333, -210, -41, 41, -8, -158, 199, 16, 5, 132, -167, 68, 61, 150, -18, -19, 261, 468, 402]
7405D02l59m7M1J1J43o7k85M28l44j71L03m6j08O78o37L9J05J87j63J18l12j36
7427b20K65l8k22P4J44M0K3j84R4K95j45k67N0p2J92k16k88J75K08p6k4K21j91
7450a62K79j7j08k77K72k86K41j0R8M16m17o9j83K87j4K17k81j80K49J04m69k7
7472c37K21K92r0m4l2O7K58l43m5l37O24k84K07m05ML36L63l26j17j35J17l8k75
7495c19L49j55J64p6j24L12N5R0l99l24N13L09k36l66l4K35J34m09J90J49J84
7516B42l0k13O4j01J55J09l16J3K13J23ok24%o9P4L27m47J03j27R5J59m2J95l60
7540f3M9j19K75j86M11l57j55k38P44j25j75Qk07J83j1q1j49J64l8k6J16j0k40
7563b30n1L5r0J54N27n85k48L17l4K87j85q2j1J87p4o0O6J58k0K83l99J65k3J06
$$ y = [402, 43, -4, 37, 48, 191, 124, -161, 267, -77, -248, 55, 9, -99, 579, -58, -19, 86, 273, 110, 228, -84, -220, 45, 7, -215, -141, 3, 43, 66, -118, -24, 271, 126, -141, -91, -163, 29, -187, -475, -300, -92, -168, -192, 29, -162, 117, 100, -8, -285, -13, -299, -58, -68, 30, 446, 29, -40, -223, 64, 50, 267, -14, -194, 55, 159, -310, -337, -116, 176, 86, 42, 10, 77, 335, -8, -53, -390, 234, -50, 157, -248, -244, 92, 455, 129, 12, -123, -6, -44, -319, 30, -125, 39, -37, -161, 151, 206, 296, -103, -427, 86, 395, 159, -207, -241, -6, 128, -281, -91, 58, 242, 212, -1, 63, -38, 117, 226, -90, -77, 136, 259, 253, 29, 29, -40, 34, 361, -86, 17, -110, -15, 144, 102, 297, -63, -14, -133, 142, -44, 367, 10, -145, -383, 361, 236, 61, 69, -138, 45, 34, -47, -196, -32, -70, -96, 20, 10, -230, -281, -246, -336, -182, 345, -240, -488, -171, -205, 82, -103, -185, -196, -9, -83, -143, -77, 81, 61, 344, -55, 110, 87, 193]
7587A93m44L32k26K30L5L3l86K47L20n76P2K74j61J35j76J55m4j10K28o1Q5n6
7609I9J0J0n9j37K17l99O89m19L6J00j05K36k33k45K92l20J51J40r7K33k90K0
7631g1k48P5M39L5l63Q8K32l42J64K9k27j9K23o0J2J44j85l00K66J52j81P5l03
7654c65p3K99J59j01K28l47J08q3J70L17l79L90l05k18K4K95j13R5j28k24L14
7675F3k7j74J77J38l40L9k4J56K12k92o0J36p3k58M79j79J69j75K32Q8o88K02
7697a99N33k22J00j25J86l65P5l3q7k4K9J21P0k75L66J33m80J83J10J4o4k3k53
7720b30L77j48J01l5k13M44j61k68J98L6J50J11l67J91p5q9K00m99L31R2J71k54
7742F3q4J21j07J59j75R7p4K3P5j95J70J02j60k22P6m0J67n4K22k09j91N28k35
$$ y = [193, -251, 81, -145, 85, 120, 153, -233, 14, 334, -242, -170, 104, -57, 78, -98, 57, 13, -97, 131, 70, 155, 99, 109, 119, 60, -77, 140, -259, 430, 11, 47, 147, 42, 278, 45, -200, 92, -228, -77, 63, -34, 199, -91, -71, -319, -244, 195, 230, -133, -45, 187, -155, 9, 38, -189, -208, 15, -45, -33, 111, -74, -374, -108, 44, -137, -62, -365, -438, -139, 20, -81, 147, -200, -92, -175, -5, 312, -67, 323, 18, -200, -176, 119, 6, 101, -27, -251, 63, 36, -138, 39, 177, -163, -124, -148, 8, 220, -72, -132, 4, -69, -327, 152, -27, 142, -33, 199, 287, -401, -199, 334, 112, 212, 87, 273, -92, -17, -50, -137, -161, -132, -11, 59, -216, 150, 283, -197, -14, 96, 110, 46, 23, -230, 147, -1, 100, 65, -148, 296, 135, -133, 65, 101, 251, 362, -5, 186, 111, 22, 222, -277, 54, 146, 317, 63, -21, 100, -7, 152, -23, 74, 0, 23, 98, -97, 73, 175, 15, -207, -131, -171, -4, -58, 164, -45, -236, 292, 57]
7765E7m48M91m4k09J20j1O0L04l41M6j16k78M20k36L42k17j51J35ml6p0J28L5
7788b3J3k50O04k44j00p2LO3N7om64q0M94R4P0o90O94l00Jj28K14P9l73j1J73
7813a82J41j6L47j96k03PK46l2m04j56M96J62k66J7J79j21j93K98m85M74K41q
7835C46j54m79K06L13k34J48nk41J78ON9j50L5o7j06J76J37n2k3r7K5J60j12j21
7859e2J25O6q6j3l58J39J19J89l31K03P0j26L39p03P9K35j00J0K76l03K84O7k04
7882g5n2K43R3l79K22J32k60o2k7J44r1j10K10J10m52K65L9O3l43L69m6J38l0
7905A01l68K95l0J73j74j09N4k47N37n50K15Q7J32l13J06Q3K50j53o0J04rk9j17
7928b2k21M11N2k1m05j56J74N34mm34p1J86l0K08k19j19M76k99m1k43M51l86J29
$$ y = [57, -391, 100, 56, -153, -33, -44, 16, 320, -21, 25, -91, -369, 51, -185, 157, -60, -211, -76, -80, -116, -186, -58, -23, -10, -260, 344, 100, 0, -72, -69, -6, 51, 45, -419, -499, -5, 89, 159, -531, 163, -137, -136, -264, -50, 29, -344, -355, -182, -41, -57, 290, 94, -109, -102, 144, 112, -292, -448, 48, 210, -56, -39, 140, 19, -174, 124, -361, 113, 354, 346, 192, -287, -81, 232, -2, 146, 141, -100, 78, 84, 143, -7, 28, -39, -145, 31, 168, 116, 93, -4, 21, 181, 69, -52, 73, 139, 53, 40, -318, -179, -60, 129, -202, 1, 71, -55, 284, -419, -340, -105, -205, -195, 81, -222, 62, 129, -75, -127, 116, 209, -170, 52, 184, -76, -138, -165, -21, -112, -222, -12, 98, -354, -89, -50, 13, -330, 39, -7, 131, 101, -267, 28, -2, 171, -3, -112, -58, -305, 232, -318, -103, -16, 116, -197, -91, -8, 242, 89, 29, 133, 124, 95, -22, -243, 168, 220, 199, -206, -362, -188, 346, 342, -92, -163, 23, -7, 201, -18, -137, 339, 40, -1, -244, 207, -179, -50]
7951e0j46Q2j48N39n38j18J4J15K32Pk11K79n0j16ok1k22M69R2o5J7l3K49k49
7975A22k05j37L73O9k93K39k82L83k38J61k45P9K88k73p8l0L50k39j54L19k04
7996El8P7j07m3p0J63r5k55L97j26L92j63m6j6J0J39l15J45K59l83J28j00k38
8019b80M03J59k52l83j80M27J83l00L4k0K68P0l21J63K79j82q5j60J05J79l10
8040b03L22n5j61L09l32J16l1P3J15j95KL05k56J11l05J79l2K57o8k40k0K37K8
8063A56j06j24P8J14J30j34j70lK0J54j48O1k21K95N2o6k57M09j87J13l83M19
8085B02m23K88J07m35L38j76o4K43j62N6K71j15k19K96l2q7l29K36K19j35q5J71
8107A65j20K5J64j39j34L14j67Nk63J83Q9k59P7J00j18J81qn7j47K34j59j5j09
$$ y = [-50, -196, -114, -262, 277, -261, -379, -365, -250, -18, -11, -222, 57, 7, -109, -115, -136, -358, 111, 203, 138, 155, 122, 371, 122, -83, -220, 153, 222, -71, 168, -114, 269, 31, 192, -53, 26, 314, 41, -37, -67, 283, 44, -110, 209, 5, -33, 44, -63, -106, -176, -13, -108, -363, 34, -92, 300, 137, 91, 75, 85, 224, -91, 54, 313, -70, 58, -42, -280, 123, 282, 30, -353, -533, -106, 77, -223, -189, -209, 59, 129, -192, -29, 250, 68, -17, -177, -72, 107, -203, 119, 64, -97, 212, -120, -4, -35, 38, 153, -42, -40, 265, 9, 120, -185, -6, -38, 219, 151, -89, -109, 128, 156, 50, -74, 4, 118, 248, 114, -56, -59, -39, 115, -33, 28, -193, 102, 154, 88, -169, 240, 53, 166, -217, 202, -221, 67, 174, -261, 77, -99, -163, 80, -82, -26, 245, 130, -89, 207, 175, 88, -241, -5, 214, 79, -6, 165, 45, 70, 234, 95, -39, 275, 108, 113, -150, 33, 122, -137, -60, 40, -78, 103, 95, 38, -109, 125, -34, -49, -158]
8130a58L78k02n3m0L9J04k92J81j39J04j08J05p0L6q8K91J66l04l42L11R9k25
8152b07K77k73p0N55o20L63K75k39J99l86J0r2K81k91J88j71O1J83k19n8L2L46
8174A44n8m05L63j00J99j44j43O0O2M03m37j4q5N09l25l5p
$$ y = [-158, 220, 18, -35, -75, -36, 68, -224, -43, -182, -78, -186, -81, -151, -115, -203, 88, 254, -50, -392, -81, 18, -207, 70, -203, -273, 282, -338, 25, 300, 61, 260, -126, -116, -208, 73, -218, -30, -201, -140, 43, -176, -234, -202, 144, 86, -319, 44, -56, 143, -1, -144, -84, -22, 381, -56, -70, -155, 354, 29, -6, -13]
8191a3
$$ Imaginary data points
##PAGE= N=2
##DATA TABLE= (X++(I..I)), XYDATA
0@%%%qJ6j6K4l9M7n6P5r5J16j44J81k21K63l11L71m36N10n98O93p99R22j059J207
27F43j373J559j762J984k234K509k805L132l495L889m321M797n319N891o522P224
43C797p999Q857r823J0913j2145J3558j5196J7114j9406K2206k5709L0238l6357
56a9952M5141n8909Q3761j42771N33604O01109p64103l22259J53484L83748L967
67D96820j12150m4662J04248q6166k19494r0620K87584L13161m3780m14228k87497
78i6784J12108L05506J8629k45541q6770K47117J42528k36635k95629Q1503L13410
89B59442Q9828k69452k60267N8117K16987P811j61363K213K09035P8935k12158
100A9128k43340L4763K60049J30852j97456k65996L4996K81197J33619j58069
$$ y = [0, 0, 0, 0, -8, 8, -8, 16, -23, 24, -32, 43, -52, 64, -80, 101, -120, 143, -168, 203, -233, 277, -321, 372, -427, 495, -564, 643, -730, 829, -933, 1051, -1183, 1326, -1479, 1653, -1842, 2047, -2274, 2523, -2796, 3095, -3427, 3797, -4202, 4655, -5168, 5745, -6400, 7158, -8038, 9076, -10330, 11876, -13833, 16405, -19952, 25189, -33720, 50041, -92730, 440874, 1041983, 277880, -44379, 109105, 492853, 496820, 384670, 340008, 444256, 358090, 138596, 47976, 335560, 648721, 604941, 190713, -96784, 15324, 320830, 339459, 93918, 7148, 254265, 396793, 160158, -135471, -53968, 259442, 349270, 79818, -180449, -122332, 94655, 102466, -58897, -56684, 152351, 231286, 19128, -224212, -189449, 70600, 201452, 3996, -262000, -227004, 54193, 187812, 29743]
110B9743j82569M7045J72036K0056j57907p9380J07134N9967j33608q3368J76569
121b4282K24407l7465k48674j56530R2789K06673O9442j35215j53610j253R5292
132f8426M1617k0855K0839R1035L1870j38608j78485R835J66377P1017q5905n6712
144a16401N3437M2573n0659o6388K9069J20147P6601q4872j79864j02554N1516
155b27395J50883J46314L7562r8737j31919n5112L2513R2235J10825K9573j15459
166b8717j64476n0035J10183J76929J01438m1471j17430q2593r088M4215O2402
177A357K0430l6087j8506K8854p90m5325J4522R7180O1752n1051j01739n0751
189h0154J9774K8900M0K3306P4688L5957p5924j09359j2133J02014J12639j4844
$$ y = [29743, -152826, -105781, 66255, 86311, -71596, -150976, -43842, 16125, -117483, -200851, -24282, 200125, 162660, -86014, -242544, -149755, 56918, 126360, -8855, -162465, -163718, -68426, -26809, -47664, -26825, 64210, 96080, -42528, -221013, -211178, -44801, 26216, -59689, -116401, -62964, -20391, -71050, -137438, -108369, 11778, 88379, 3507, -176357, -278911, -227395, -76512, 69802, 107364, 8627, -123292, -178404, -145891, -53656, 57169, 86742, -28717, -193193, -243228, -133045, 43884, 145322, 103851, -13579, -96172, -105260, -61045, 1357, 21787, -14300, -32806, -3952, -4742, -50067, -35545, 61635, 123387, 72336, -29403, -80154, -60380, -31480, -31440, -8134, 66554, 102511, 26587, -82772, -94905, 7109, 119748, 104904]
201A04904j61944j30945O3068J58568L8895q2993l9923N3582L3401n5627o0342
212g9356L7322P0383m6977j32852n711J69194J19852r0641j71515k7139J50984
223f456J38782n3800j80627p5086R5722R2180k8576m1041O7567R8842l4712j62360
235h9565o8984J49783J62145p6052k05637k7957J68408R8481r0813j03071P1811
246a1451J65662J6467j92541j63606O9212J84136N4279j00596p5415M8230O4731
257E9108m8711q8727O8012J87630R939k63828k18485J16543K91158J01889j67132
268D7396j71594L8856J34773j02j13604j0919J16067L2204j42684j36097O5965
279a39739K01101Q5032j36048j52648N9158J62417j5034j91781q1485J56923J71455
$$ y = [104904, -57040, -187985, -124917, 33651, 72546, -10447, -50370, 3212, 36613, -19014, -79356, -42034, 28349, -18628, -151480, -157191, 12003, 131855, 41214, -130301, -157440, -6456, 132326, 78526, -102101, -177187, -81465, 10715, -17861, -58902, 8665, 107507, 72795, -89565, -158549, -8766, 153379, 77327, -128310, -156267, 12141, 110622, 19809, -83262, -11451, 154211, 170678, -21863, -185469, -116257, 67879, 122158, 21562, -53853, -5623, 59108, 10397, -78330, -10318, 177312, 187251, -76577, -295062, -178519, 112639, 214528, 47396, -124198, -85342, 49431, 49329, -64275, -75194, 40873, 73077, -69607, -205704, -139739, 61362, 146394, 10346, -142302, -83144, 79273, 64239, -127542, -209027, -52104, 119351]
290A19351n6151k00515m9933J75955J44857p9130j41791J7929J00669k0692j25670
301a15121l0545J41507J41600n2634j83818m8581J71408J53980p8116j95142n0223
312a45685J38594J15823o4826j26160K6685J41951L0184j12629m5350J00400O4911
323A23898j01714j42040J8365J69896J03849r9628j57688Q233J53752Q3124p8697
334H1350j16088j0358P3215K1433p5164m0075R1871J00156m2500j11019m733R3083
346F1171L0581q8731q5226M3258J11139P433j14599o3984Q8420J25787J5229r2162
358C8316r2649j1988M9717K9273j5049K823L6823o377o6316k7530P4946R7536
370A09525m983j19483j02606L0899J03160L5132m6028l0664J9122K5273P036q461
$$ y = [119351, 63200, -137315, -187248, -11293, 133564, 54434, -87357, -69428, 31241, 10549, -115121, -145666, -4159, 137441, 84807, -99011, -147592, 23816, 177796, 99680, -95462, -145685, -7091, 108732, 43906, -82254, -55569, 86382, 116566, 3937, -41413, 58987, 123898, 22184, -119856, -101491, 68405, 172254, 72626, -85062, -76829, 76923, 160047, 81350, -34738, -45096, 28119, 49552, -25612, -65687, 26184, 126340, 83840, -27179, -31912, 61171, 91752, 3021, -82205, -38947, 72192, 79625, -34974, -98958, -10538, 115249, 130478, 38316, -54333, -66321, -16604, 12669, -2380, 443, 37266, 30889, -35427, -62957, 11989, 109525, 104542, -14941, -117547, -86648, 16512, 51644, 5616, -25048, -5926, 19347, 26383, 17922]
382A7922j8496r025M106n862j5560L09J3881O522J215R350K2883K4196j3205o3597
396b5361m7528L0551O2157J5678l4087l8914q471L9829O1541J8034m4617n1784
408b2972j1174K0168J5457o192p908J6965J5601j9520r890M6873M6445l8836q5874
421d0857k8224N5620O7522m592p4581m4448N6867R0135J2563o4449n2583R638
433a7389L2376r335m0896L425N7680J3377o4998k7534Q0391P6299m8535j17817
445f2956l5873Q5760Q0300m7164j09639o233J10612P3887m9258q2251m749N8690
457A1126J7809o5812n2491N5000Q3184l3596j07250O01J36436Q8701q7745j52413
469a06450j6866J31009Q0600q4308j08769L1378J09552K4043o7514l2304N6509
$$ y = [17922, -574, -9599, -5493, -11355, -26915, -26606, -12725, -6203, -4988, 4362, 27245, 51441, 38236, -25361, -72889, -42338, 19819, 35497, 1410, -37504, -45975, -6146, 55395, 73429, 28812, -22972, -34146, -13978, 1479, -4713, -12621, 4344, 19945, 425, -9465, 37408, 83853, 45017, -40857, -69081, -13461, 54061, 49469, -25112, -69560, -12693, 77442, 90005, 25556, -27027, -17389, 14987, 5652, -35244, -31819, 25861, 39238, -25760, -53294, 27097, 103396, 54861, -62956, -98829, -13069, 67231, 20067, -89572, -95805, 14807, 88694, 39436, -42815, -47564, 11126, 28935, -36877, -89368, -34368, 48816, 15220, -92030, -91429, 45007, 133708, 45963, -106450, -123316, 7693, 88293, 3985, -104784, -73406, 36146, 60189, -7325, -39629, 16880]
480A6880N5123m9065j02854m342J14007N9827r5117j07707N3128J55505M6283
491A41668j29360j26279N3219J44327Q446j38732p0891R0357R6704l2802q3348
502d6691J2018R5728K6908j07516r9005N7995J30440J388j37171p9660R2822J44069
514I1325O065j29891p4185Q2235R1173n5731j12213J0411J04909K6428q6874n1216
526i7564Q5208J10943l2588j42814m5900J16086R8983o5439j32731j4585J25154
537D753J04434m2001j10617j2132R4650M0312p6087o2254M7356P1326k3812q1859
549d5931J234J14167P6760p6285j21607P319J08370M2006p6318p9445J9083Q1118
561E0471L4836m6935m0262L7147M8249l0698p0512p912N8756K7045n6833o5953
$$ y = [16880, 72003, 22938, -79916, -84258, 29749, 89576, -5541, -113248, -60120, 95385, 141668, 12308, -113971, -60752, 83575, 92021, -46711, -117602, -27245, 69459, 36657, -46691, -34673, 61055, 87963, -19553, -118558, -60563, 69877, 71265, -65906, -145566, -52744, 91325, 97390, -32501, -106686, -24451, 66722, 10991, -101222, -90811, 14098, 40526, -46348, -97564, -12356, 98587, 65999, -76815, -122715, -6629, 92354, 26915, -105816, -120401, 4753, 109187, 67186, -43431, -55563, 39087, 79399, 3312, -58942, -11586, 59740, 35928, -45931, -44697, 69470, 146230, 69945, -51662, -44343, 64027, 106033, 29715, -49730, -30647, 50471, 85307, 38372, -1890, 35257, 83506, 52808, -17704, -25616, 33140, 60185, 3352, -62601]
573f2601L3026J04346K9551r1256p8721L6287P8169M288o8255n3611J3626M7506
585g645J6991j7241k351J8459l618l1807j6841J8419K5763q845m8500l2136M0112
598d9240P0563J0295n1760l1809K1492L1591P95k6860k4320K72J3947R019J3245
611a2770K0332N294j5413j2341P26M997R195J846k5337k9956J1117M7755L4690
624D0135r260l6765k1751K1861L3922p393m4335k9743J1646L4595K5919p143k4953
637a3265p9K2306n42k3703k183J4715j5059m1992j0697N0851O1365m766o9252
650c2301l8144M7998N9401j4815o2403k9980K5875L8111K688k3774O011M5884
662B4551J4251m9206l7941L9333N7232j7621p7036k7300P6000Q7458k0686r0508
$$ y = [-62601, -29575, 74771, 104322, 13066, -65655, -29368, 48801, 53089, -15166, -68777, -55151, -7645, 9346, -7895, -10246, 8213, 4595, -27212, -44053, -25634, 129, -8716, -57216, -89352, -49240, 21323, 31618, -20142, -51951, -30459, 1132, 1927, -24933, -49253, -48981, -35034, -26015, -12770, 7562, 12856, -2557, -14898, -14172, -9175, 20, 1866, -23471, -53427, -42310, 5445, 40135, 30875, -5890, -27641, -5780, 28142, 20749, -23586, -53329, -41683, -7088, 18831, 11688, -13265, -13344, 8962, 8420, -15283, -17466, -2751, -17810, -59802, -70499, -19648, 41717, 36951, -32301, -70445, -22447, 36954, 22139, -40264, -70244, -44369, -6258, -3570, -27344, -21333, 24551, 38802, -10404, -48345, -9012, 48220, 30599, -46437, -73737, 2263, 89721, 69035, -21473]
674b1473j3957Q6596N8121m6629p5805n208N6994L1239l1982k7451M2975N7574
686A10994k1249o9345l587P7780M6848o2500j01175k260J08485P1897o2908q9884
698C096K4037R3509J7841p6926n4459L8165N6439k6493p5629q83Q8335M6254o6296
711F6990p7090K5273Q8615J9139r2012r1686L1935J07919K2894q8175n6852N7740
723A4690P4853k0700p6995j6468N8333K0862p2730o2990N5189J00346k135r7836
735b5581m9451O5982Q8456j4420j04698n7896O1063P7800k2629p3840k090P2783
747A5479L4983n3238n7823K8321O8326j4110r5089l4503Q2792P8370l7228q8907
759g2627j0433Q1586N9726m5296q8508j3113O2482L0051m3687l7725K9336N1069
$$ y = [-21473, -35430, 51166, 109287, 62658, -13147, -18355, 38639, 69878, 37896, 10445, 53420, 110994, 89745, 20400, 16813, 94593, 141441, 78941, -22234, -24494, 83991, 155888, 92980, 3096, 27133, 120642, 138483, 61557, 7098, 45263, 101702, 75209, -420, -1303, 87032, 133286, 66990, -10100, 15173, 103788, 122927, 30915, -60771, -28836, 79083, 101977, 13802, -43050, 14690, 89543, 68843, -8152, -24620, 33713, 54575, -18155, -81145, -25956, 74390, 72255, -25581, -75032, -9050, 79406, 64986, -39712, -97608, -36545, 41255, 18626, -55214, -57304, 15479, 50462, -2776, -60599, -32278, 36048, 21938, -73151, -107654, -24862, 53508, 16280, -72627, -83060, -1474, 58252, 12956, -75552, -88665, -26183, 3868, -39819, -77544, -48208, 2861]
771B861l497n3123j8827N4168M5603n1280q7790N76Q5421M5280n1789o5177J4004
784h3570P3641L1241m8330n1850J1370L3585p732k9671J933L5392K2451k2370
796c3910l5785J3202N9638K1220n9089o1687J5576O1219K3004l4288l2656K1437
808d2119M7880Q666l1974j6291J6082Q315j5291j1546P955J8255P533j2088p720
821b2343K4886L5537n731m7315l4577J3953M1980K2246k1400l3516J073K9372
833D165J9136J204r26q720k0980j7425l01J4159K0263J0562j1545j8016K348K1423
847A5347J7591p603l0135k0422J6893K5815j0077k9106K011L4539K7543l505k7173
860A1718k2949L608J8455K676j0296r07P340l119j0592L979L1494L3796j3464
$$ y = [2861, -636, -53759, -72586, -18418, 27185, -24095, -111885, -111309, -25888, 19392, -32397, -97574, -83570, -9929, 21312, -27018, -78868, -67498, -33913, -41645, -71316, -69383, -33991, -11540, -33910, -69695, -56493, 3145, 24365, -34724, -96411, -80835, -19616, 3388, -30900, -63556, -42119, 5761, 14427, -17547, -33838, -17756, -9441, -24732, -36278, -28323, -10068, -2535, -14623, -22343, 2543, 38080, 32349, -14966, -49543, -35590, 6390, 28636, 7236, -26280, -25207, 4165, 23301, 24505, 23579, 14859, -6121, -23546, -23847, -9688, 10575, 21137, 9592, -8424, -6076, 15347, 32938, 25335, -4800, -25222, -8329, 17486, 7409, -21697, -19686, 14853, 42396, 38891, 11718, -11231, -7623, 10832, 13508, 3212, 2305, 9645, 6526, -4066, -87, 31407, 65203, 51739]
873E1739n9812l3191L8051N0728o624m4285j4755L0728L4011l860k7156k745K4177
886C7006J133l7165k2068K7101L5555p172m1289j4187M7520N4886k0598p6944
898a6222k8112N2536M5516k7631n4802k284N0163K7952l2447l4794K5952M2705
910D8532j8223n9881j8074M1044L3954k2806m6918P329O6585L3379n8222p3033
922f6334J5604P6943K5076o0411o2341J7351O1251J3408l8986m573N1933J6703
934D5624o5743o5078K7486Q5651L2327o4103p5645J5831Q2781L5598m6215m1322
946c2808K4126L7074k1071n8777j0318O3269N1719l3930o1660J1591O3707J2621
958D5543n5458l2620M2675N3164k5040q2903k5824P7772Q2025j6060p5264k7751
$$ y = [51739, -8073, -41264, -3213, 47515, 40891, -3394, -18149, 12579, 46590, 42730, 15574, 12829, 37006, 38139, 974, -21094, 6007, 41562, 34390, -6899, -21086, 26434, 81320, 60722, -16222, -44334, 8202, 53718, 26087, -28715, -30999, 19164, 47116, 14669, -20125, 5827, 48532, 30309, -29572, -47646, -6602, 27352, 4546, -42372, -35043, 31542, 64921, 6699, -66334, -50730, 26213, 51289, -9122, -71463, -54112, 7139, 20547, -18439, -23012, 28921, 45624, -20119, -85197, -57711, 27940, 60267, -3836, -79481, -63650, 19131, 54729, 8514, -32808, -8682, 28392, 7321, -51456, -61774, 1495, 53214, 19284, -42376, -30785, 32922, 45543, -9915, -42535, 140, 53304, 28264, -54639, -80463, -2691, 79334, 63274, -11990, -39741]
970c9741M0121L6281j9909m0010Q207M4760K33o0053k4199O4095P0529j9305p9577
983a8568l2631N0476N2114k5550o3473m400N7684K9320l1453l1271J7587L5212
995C5047k738m2026k2068L2992L5807k7321n5721M298O6461M1131l4600n9101
1007b7839l867M9070K1619m3707m2990K3168M9058K664l6971j6092K4486K9600
1019B8199n005k9161r414J7360P25l1672j7482L3917N0777R906m2783m7397N447
1032c6583M7403K4078k2633k7295m215j295p196Q310L2143L0749n302m3056l5534
1045d0426J0525L7324J5035j5713k0188n085J0625J3263j241m636J3342J8445
1057C1270r224l2251k2386N044K3238K1995M871j0958j2513n513k61J1403J7303
$$ y = [-39741, 380, 36661, 16752, -23258, -15051, 29709, 29942, -30111, -54310, 9785, 80314, 61009, -18568, -51199, -723, 51391, 25841, -37632, -42032, 15652, 44972, 13519, -17752, -165, 35047, 32309, -9717, -31785, 1207, 37014, 9693, -46028, -41730, 24731, 65862, 31262, -27839, -31706, 17364, 38983, -4724, -47714, -24546, 24512, 27176, -9795, -25887, -1401, 28199, 23194, -5967, -15381, 1979, 2704, -28968, -46450, -12533, 38244, 48150, 5367, -42030, -36583, 10820, 34898, 12265, -15030, -19245, -20540, -27736, -19426, 12717, 43466, 38164, -4892, -40426, -29901, 7423, 22458, 6745, -13443, -18528, -7903, 5360, 4119, -517, 12825, 31270, 22046, -10205, -32591, -27547, -4309, 17686, 22557, 11599, -914, -6427, -6688, 4715, 22018]
1070B2018M776j4979k3688k0851p38L1834L8615K170l1968k3594N977K0195P714
1083A7481j3016j5154K028O219o607m047J7084J9087k574j9488j3055Q803J8864
1096A5625m284l4470j9736L0658M3795rl6609j9807K2337L1201p224l6752j0355
1109b5630K8105J3532k5227k0476K1146L5529O657k6167k0494J2883K1822j6623
1121E057l9152J089M9759L2179l1086n3275l792N4610M2398k4428m9927o246K3388
1134E74n260k6601R705N2453K8340m0719o5749n980O6243M9580l3020o4978j2564
1147d7976L7695K2522j9790j9055K6998M3178r965o3104l0068M3803M7269j6968
1159A4539m6658n658L8492J7757l3927k9027L6661O1368p924p5770m6560L5477
$$ y = [22018, 26794, 11815, -11873, -32724, -33462, -1628, 36987, 39157, 7189, -16405, -10428, 9767, 17481, 4465, -10689, -8661, -2442, -9049, -13096, 3988, 23075, 20501, 1013, -12042, -3239, 15625, 11341, -23129, -42865, -12207, 31588, 31579, -5030, -24837, -2500, 28701, 21477, -15275, -25630, 2475, 16007, -9220, -29696, -8550, 26979, 33636, 7469, -13025, -142, 21680, 5057, -34095, -33006, 16753, 48932, 17846, -35429, -39221, 15389, 57787, 33359, -16568, -22814, 574, -4686, -31287, -21582, 30871, 59211, 18492, -47257, -53237, 13006, 62586, 29566, -35412, -47976, -10281, 12241, -7549, -26604, 394, 43572, 33607, -29497, -59565, -15762, 31507, 14539, -32119, -37777, 715, 18472, -15455, -44482, -7821, 53547, 45623, -30147, -76707, -41230]
1171d1230O2002J2438m0403k7087K4213L2263j5457l2913J4983M6069J778n8004
1183b1348m3067L2628O7640J3741n3450l4443L7808M9081j4277n0284j3898L4131
1195D262K5525j9326l2880Q537M2368J2427l5774k3362K9749L7830j5855n3323
1207a9822k2377L8746M7097j1123m6756l696M5767K2405l4401l7884R374L7421
1219B4751Q203l4082k7345J8159L3603j491k3056K804K7992P228l5176m1388N097
1232c4701N1175L2555k9595m7616j302L6136K1163q681j1865K779J013k1121k6347
1245c6407J0733M3597K1786k4527l2786q98K4078J7355q821k0652l520J4151L13
1258D402k2354r244K2672K8891M394k0763k0680m27J0267l30o350N947R727q947
$$ y = [-41230, 20772, 33210, -7193, -34280, -10067, 22196, 6739, -26174, -11191, 34878, 36656, -21348, -64415, -31787, 35853, 49594, -3856, -38299, -491, 48590, 34313, -15971, -29869, 4262, 29787, 10461, -22419, -13882, 28486, 40913, 5139, -18223, 11526, 49356, 33501, -19822, -42199, -3453, 43644, 32521, -14235, -17931, 27836, 50241, 15840, -22044, -12670, 24751, 32954, -1128, -28473, -10314, 23289, 21798, -1258, 1546, 29538, 36766, 1590, -39798, -34701, 16474, 49029, 19434, -28182, -29484, 6652, 27815, 19134, 7269, 10048, 11061, -10060, -36407, -25674, 17923, 39709, 15182, -17604, -18502, 5576, 22931, 14110, -6542, -10062, 4089, 4402, -17952, -27196, -4524, 24367, 28761, 7998, -12682, -13109, -2842, -3172, -9522, -3575, 6152, -2795]
1272b795j8276l003J9394K4874P167k1164l1905q053J6749J6615K05r744o735
1285a6671M801R945J031m788K741L429r774j4018l74J0233P782o67p677j222J4742
1300d87J5595p642k2398j2154R678J6349K647j4169r293J4807J7984m835j2934
1313f852M993J3074k457j7925j2336Q551J8350L711j5708l502K2356J7894j3741
1326A6408k9684q506K4085K6428q998l6518j3281K7839K6490n029j3598M561R788
1339A9985j0440k6551q077K9312K9678j4274m0184r257L3799L0596p966k8975
1351b354j0541J7516J1426k1982k5325J6288L7374M776l1720j7966K1947K8180
1363B7619q804l5805q256L2778J8029l1487l5081J7436M9540J9311l1715l8778
$$ y = [-2795, -21071, -24074, -4680, 20194, 27361, 6197, -25708, -33761, -17012, -397, -192, -9936, -16671, -11870, -1925, -894, -5682, -2941, 488, -9286, -23304, -23678, -13445, -5663, -6330, -14007, -15229, -487, 15108, 7466, -14932, -27086, -17408, -1059, 1588, -12581, -21874, -7067, 10917, 6082, -6852, -1859, 11215, 8758, -9167, -21503, -12952, 5398, 9109, -6599, -10101, 12255, 30149, 16408, -13276, -21782, 2303, 28731, 19733, -16785, -30066, -2227, 24263, 19234, 5636, 10197, 19985, 9545, -17006, -25083, 4229, 33907, 19633, -20551, -29808, 3991, 34587, 26621, -2354, -12895, 4621, 16047, -5935, -31260, -14972, 22402, 27178, -4542, -22508, -561, 27619, 18815, -16990, -25246, 7532, 25561, -5926, -41007, -23571, 25969, 45280, 13565, -25213]
1375b5213L697L5159J1093k9376k0581J9722K3677j1253k5132N274L7634J9449
1387D4150l2663m3384Q600M5464R766m0278k7070K4752M0688K295l3441j7952
1399a9073K4235K6726j7409l6948o56L2500J3232k5482k5066J6871M2414Q084
1411C9428m2941l3121K3202L8712p404m1178j4908K9798L0638q880l1321k872
1423b0847K9806J1462k7293k3998J2633K2947m397k6548r231K9804L2656j1888
1435A5106m2851j1353L4300K5605j9848l5500l485K9169J7730j6365j8121J6836
1447h777K6382p955l1810r615K2919J9642j1037k7217m508K9286K4591j3763k5851
1460a7713J975K3329P539j8518k0143M230K1466O041j4407m631J9602J2050j4642
$$ y = [-25213, -21516, 13643, 24736, -4640, -25221, -5499, 18178, 6925, -18207, -12933, 24701, 44150, 11487, -31897, -23297, 22167, 31933, -8345, -35415, -10663, 30025, 32320, -1121, -19073, 5162, 31888, 14479, -22469, -23125, 9375, 22607, -2875, -27941, -11070, 31344, 39428, -3513, -36634, -13432, 25280, 17876, -23302, -38210, -8412, 22226, 13346, -17975, -20847, 8959, 20421, -6872, -30870, -18237, 4710, 313, -26235, -35466, -5662, 26994, 15106, -27745, -39098, -4798, 20807, 959, -34541, -38026, -8857, 8873, -7492, -25613, -8777, 17605, 9650, -22160, -31775, -8856, 10786, -251, -27468, -31976, -2690, 21901, 8138, -17713, -15738, 7591, 15130, -3388, -23531, -19301, 2165, 8206, -6201, -10832, 8770, 20820, 6178]
1473F178j8491N353J8935N011j9925k0852P770K9205J2698j4800j5881M075J3499
1486A2775M243j1479j3600J982J2556K34j0367K002J5495O751r082j1482p55R152
1500H425M686j1269j3637L331J4668P552k731o218k881M511O850m252j1288l155
1514e408M615l7k708L795Q706M631m869j0792l021J1526Q058j1159j7247l150
1528a7060J2879J5275K610j2217r328R781J3189o191j6655l669R311N776o462
1541b761q227O101J6703L703j6072r274J2619J1693r916k0163n782J5863K0082
1554A4569j884j9686n504J7799J3043j0703j6252O91J0903J117j5167q888J9641
1567c21K5654p676k9319n658K5528J7845j6688k8980n039K4950J9682j3532k2188
$$ y = [6178, -12313, -6960, 11975, 16986, -2939, -23791, -16021, 13184, 25882, 11082, -4799, -724, 12775, 17018, 5539, -8061, -6079, 6477, 6711, -3656, -1654, 13841, 20592, 11510, 28, -727, 8425, 13111, 1842, -11795, -8464, 6204, 13756, 11025, 4807, 1926, 6437, 13287, 9035, -2253, -5408, -793, -830, -3538, 257, 8963, 13594, 8725, -2067, -5088, 6438, 14496, 3337, -13910, -17060, -4181, 11094, 13704, 1487, -7841, 1940, 15129, 8938, -7717, -11386, -2075, 3701, -2761, -10988, -4887, 11816, 15519, -553, -9827, 2792, 14485, 4569, -15594, -21376, -5513, 14569, 12685, -7001, -12505, 5294, 18337, 7634, -8618, -7927, 2976, 4093, -11074, -19962, -321, 25333, 17657, -11662, -17320, 8208, 26053, 9365, -19615, -24654, 296, 19978, 6446, -15742]
1580a5742O599K6536O502k0013j7328P695J8431l337k4781o646K7894K2443j7070
1593A1183k8044N795L0512J0467k6143k7984O736K9982O292k4415j2981K1212
1605B612K2891p422k4633n478K0905J4291k0153k9343Q203L7144J1387k9554k3742
1618b2892J7128L4283L783l2482k3868J6120K5541o797k4242J687K5811J1231
1630B5303j8599k0261Q239K6894M554l0203k3477J7277K9205j184k5572q267K3181
1643G090K3029j2113l2776o298K7180J4599k0866k1376R957K3071L088j8746r728
1656a3889J7196K0937j1634l3836j0120K5606K2782q460k3598n301K0074J6452
1668A6209j1041j8585M640J6028m648k2399o422J8735J8654m902j9841l909K0374
$$ y = [-15742, -9143, 17393, 23895, 3882, -13446, -5751, 12680, 9343, -15438, -22084, 5810, 28253, 11183, -16861, -11066, 19446, 29913, 3770, -24214, -17478, 12504, 18796, -5619, -18600, 2612, 25503, 18081, -6552, -12030, 8875, 23166, 3013, -26330, -18127, 19017, 30404, 850, -22892, -5764, 28519, 32302, -180, -24048, -7928, 17613, 10816, -13426, -11739, 14072, 25303, 6704, -13557, -5318, 21576, 26130, -4073, -27550, -10273, 18932, 17748, -7824, -16091, 7090, 30119, 18006, -14770, -21068, 6112, 20711, -155, -21531, -11574, 11497, 14585, -4161, -13889, 3307, 24244, 12610, -21226, -31346, -5740, 17042, 8582, -15016, -20317, -243, 16209, 5168, -13417, -8777, 7251, 2603, -19796, -26218, -7483, 11171, 6269, -13572, -17481, 2893]
1681B893J3716j5290k1743P06J7700P638j1304j3931M582J9653Q808j3370j1882
1694a1824P757R442o868j4055j354J3958J1084p294j4319L225J9129P016j3816
1707B081j4359M40R925N363n331r177K265J2662M973o579l410L759K178n996q575
1722i781j065J0494Q338o918j2018L295J4994P343o526j0951n657L487O896k262
1736c31o629J988Q494L693l164m664J134O661J420j0372p973N857R745k715p972
1751d828K420J1769Q991m790j5406p012J0513J1375m414j2113k267Q804Q685n61
1765A1166n573K066R592k009j7551r178J3517J5222l715j5056m947J3642J5416
1778B2592m296j7342l638J2666N467j2748j2484L810J5181P331r742j0960P573
$$ y = [2893, 16609, 1319, -20424, -19718, -2018, 5620, -5684, -19615, -15033, 4620, 13428, 58, -11824, -4067, 5375, -1493, -15548, -16902, -2944, 8140, 846, -13473, -10248, 8881, 15897, 2081, -12278, -11838, -1913, 3450, -1881, -11058, -8793, 3869, 8842, 2263, -1147, 2612, 4790, -1206, -9781, -10846, -352, 7986, 1068, -10950, -7655, 7339, 14682, 8156, -2795, -8452, -4965, 1931, -331, -6960, -4972, 3522, 7215, 4051, -613, 521, 7182, 8602, -1770, -9743, -3886, 5859, 3144, -4828, -2408, 9361, 18352, 13562, -1844, -8856, 1657, 13032, 8618, -3495, -5762, 3042, 11727, 11166, 5593, 7659, 17251, 15242, -2309, -11487, 2030, 17252, 13537, -1519, -6466, 7176, 22592, 18296, 954, -2684, 9982, 15449, 2701, -9783, -5973, 9208, 16539, 6797, -4163, 3410]
1791C410J4541n594k0241n413J6105J1433j1540j9667N53K2958J5612j4295k1183
1804a3321J945J6616K162j5035j0948P835J5032o78j6700m664J9190J5192j3452
1817C174k3066j258J9277J0134j5044j8922O221K5449P195j9426j2864J3172J5350
1830I392o755j8971n176J5736J3475j0168j8266O234K4996Q413k0663j8519P106
1843a3166K1617L652k1752j6399J5212K4903j945k0495m116J7022J0655j1745
1855C443j8165J329J8339N037j7326j2355J5205K2684j439k1202j1525J1897J7990
1868A3912m239k2414p493J8826J4103j0333j4187P114J7753L152j8676j5565R540
1881h507J9119j831k0340o301J7317J6057n620j6140m144J4073J2123j1098j9440
$$ y = [3410, 17951, 12357, -7884, -13297, 2808, 14241, 2701, -16966, -16413, 6545, 22157, 7862, -13321, -11376, 5240, 7402, -7633, -18581, -10746, 4286, 3608, -13092, -17756, 1434, 16626, 3174, -19892, -21150, -1873, 8261, -6783, -25705, -19484, 5965, 13160, -6266, -19130, -5958, 9392, 2637, -16334, -21510, -5774, 7701, -2467, -20733, -14499, 10497, 18910, -1753, -20272, -13166, 8451, 12103, -9649, -26048, -10836, 14067, 12122, -8373, -12489, 4533, 15188, 3443, -14722, -13393, 4946, 9983, -7343, -19698, -4493, 18191, 16752, -4450, -15975, -4078, 13912, 9673, -12741, -20234, -1408, 12695, 2362, -11825, -4711, 13042, 16194, -2482, -18047, -8507, 10612, 8781, -11559, -17860, -543, 15514, 9894, -6246, -10390, 3683, 15806, 4708, -14732]
1894a4732o46J6904P736q326p084O180J1804k397j4630n321J4319J1489j2277
1907C019j8695J390J7571J2013n284j2561j195J0664L825j1494r438O786J0779
1920G380j164j1034n152J0146J4409j444j4851n685R698N705r510j0188K812J2400
1934C522P057o600j0369J277J0608L746p750o493o79K591m99k504J99Q540P849
1949A0495n963j2009k24J0529M572p452j0320j880R387Q219l541o559K964Q098
1963F316O54o939o259J6N543L116o353n203P321J1123j209r317m054N849O969
1978G573k857j1472m842Q880Q914l349o151J617P720L276n399r318j529P848L071
1993C982p886m431P917Q736l190r877j793J1769R781q682k0520l749J5993J1845
$$ y = [-14732, -15378, 1526, 9262, 936, -6148, 32, 11836, 9439, -5191, -10512, 3807, 15296, 3019, -15676, -14286, 3285, 15298, 10014, -2547, -3742, 6922, 10747, -747, -10185, -3399, 7380, 6216, -4818, -9970, 176, 14585, 13141, -1710, -7395, 2303, 8008, -1502, -11690, -8878, 3522, 10579, 3979, -6390, -5113, 5495, 9241, 1491, -5002, -5681, -3090, -3589, -6093, -5894, 2646, 10495, 4532, -7477, -7701, 2828, 7400, -52, -10372, -12252, -2865, 5354, 1813, -4746, -1782, 6316, 6970, 31, -6228, -6212, -669, 2447, -3906, -9109, -1788, 9335, 8126, -1191, -5245, 604, 7573, 4716, -6756, -11598, -2718, 6196, 2847, -3304, -1687, 6033, 9309, 3910, -5408, -6937, 911, 3982, -3904, -8335, -418, 8318, 5128, -4749, -6542, 5227, 15008, 6326, -14194, -17943, -1950, 9895]
2007I895m753r977M33Q712L854p739p570O644J1444m619j6519o367J2618J7146
2021A3202M15j3028o744R779Q964r499j3449M357J6056J899j4013r607Q304J6887
2035A3523M357j3186q167P655O709q844j2911M606J7342Q846j2262j8621K693
2048h260K2087R804j5789j6960L781J2272j76j1488l580J3588J3411q335j8299
2061g944p12J6204P095j3030j4212K226J4208N339j2017j0306J0380J6780l460
2074A0551j8020p388J1027R842o515j5276P81J7636Q581j3504j3790Q095J5775
2087G795o99j6590r755Q973J4516j131j5941m565J5749J4542o781j5808m079R854
2101c920P874p517r696N712J4055q33j5276l975J5807J3633n168j7667r125R969
$$ y = [9895, 5142, -4835, -4402, 4310, 8164, 425, -7145, -501, 10943, 6324, -10195, -16562, -3944, 13202, 13617, 589, -6155, 3624, 12588, 3089, -10360, -6003, 10053, 11952, -2061, -11668, -3364, 13523, 17880, 4694, -3473, 4182, 10891, 2047, -10864, -6258, 11084, 19930, 7668, -10953, -8260, 13827, 23631, 7842, -9118, -5337, 6935, 6759, -4729, -8309, 5279, 18690, 10355, -7944, -8656, 7548, 14643, 1613, -12599, -10373, 3835, 9174, -2843, -13149, -2769, 14011, 10551, -7469, -14857, -3830, 6012, -503, -15779, -14998, 2638, 11219, -2285, -16075, -7980, 7795, 7096, -9494, -19249, -10276, 4240, 3109, -12832, -17397, -1648, 12894, 6113, -9695, -13774, -3920, 3954, -3563, -13259, -7547, 6508, 5675, -9601, -13576, 2231, 15864, 10696, -6971, -16096, -6127]
2115f127J2159k742q801K512J1159J415j0086o969O562J3303J597j5510j2331
2128a3859P111J4154R19p510k19Q442M094q781j2220O23J4137P079r778j1831
2142g639J093R299N894j307k979P89K553n480j0564o84J2207Q839n988j0733k070
2157f770R010R073l339r563j133N667n50p043k656N936P171J732n394n901L502
2172b58O795j123q624l597N101N715k068n999j314Q318P967m840r109n59O091
2187B496J139n133m320J208P389N056m225n421K561N475j172o384k218M010N211
2202E672k915r330p28J2232J0757m872j1767l972M949M786j652n188J190O472
2216E634O3q343k416R468R915j770j2224r390L877R742J044p828m73R278M111
$$ y = [-6127, 6032, 3290, -5511, -2999, 8160, 9575, -511, -7480, -918, 12385, 13982, -1528, -13859, -6748, 7406, 8325, 815, 596, 9038, 13132, 4351, -7869, -7246, 6891, 13970, 4192, -7639, -6546, 2753, 8647, 7340, 4361, 5150, 7703, 2223, -8341, -9025, 3182, 12021, 6033, -4700, -6770, 2240, 11313, 7974, -1589, -2722, 2945, 2395, -4648, -7304, -1368, 5803, 7535, 2141, -3760, -258, 6537, 5414, -3210, -6807, -1706, 4009, 1941, -4058, -5372, 2946, 10913, 6073, -3036, -3595, 2496, 3635, -1498, -5818, -4610, 2779, 7835, 3610, -1811, 750, 6225, 5053, -1331, -3549, 461, 5672, 2757, -6573, -7301, 4931, 15688, 10816, -951, -4923, 26, 4812, 3160, -2028, -838, 5634, 5697, -2646, -5062, 4406, 14321, 12551, 327, -9063, -5186, 4556, 5600, -2228, -2701, 6577, 10688]
2231A0688q895q427L749J2258L256j1616j2946L167J1432K444n596j565O877M455
2245I281o487j1467j764J2370R416r556j4696K97J3644P376n891p260K348Q083
2259E694k111j3126m601J1780J0356n959j1621j86J1595Q245o248j2256J38J1648
2273C348L042j1253r068O912J2808K184j0330n849Q220J0585n113j4619j672J2292
2287A487O524p503r772L144J2546M374r724r259O602J0874l080j3575n337R305
2301c394J1232p63j0057l549R303O225r168r527M854J1111j027j3176p802Q989
2315f749J5443J298j3332p278P148O769n025q851k28Q624N594p339r880L086J3967
2330C247L602j0237q784L197O931q73q758k382R722R557n513j2041R07J0656M856
$$ y = [10688, 1793, -6634, -2885, 9373, 12629, 1013, -11933, -8766, 2666, 5110, -486, -2051, 4826, 9281, 2794, -8673, -10437, 1933, 11349, 1793, -12903, -12606, 1038, 8414, 2523, -4737, -2389, 5694, 3583, -9543, -14144, -2364, 7992, 2033, -9588, -9774, 1821, 10066, 3818, -8438, -8300, 3348, 6390, -4863, -13931, -7019, 5789, 7973, -2357, -8206, 14, 10599, 5486, -9133, -10805, 1487, 8011, 508, -9264, -6120, 6426, 10800, 1076, -8183, -1581, 9293, 6213, -7362, -12699, -3394, 7838, 7075, -2982, -6531, 2772, 8997, -171, -9698, -4844, 6267, 5240, -7936, -15738, -6749, 8694, 9992, -3340, -10618, -3470, 3299, -1726, -10577, -10805, -2181, 3413, -3926, -13806, -10720, 3247, 6849, -3388, -12172, -8975, -2044, -2917, -11675, -14057, -4335, 5222, -291, -12332, -11425, -769, 4087]
2345D087o404q616o91P223L166n212m161P431R405k520j0173l813O693Q157k558
2360B014j0789k989R584P885l842o760K223P312J365n860o085J674O413J513n886
2375b228k365O311O345j678n883k874M775N215l361q383m10Q363L560m815l794
2390a222L368O728J363o704o925K639O684o3o296j304M861N158m96n658k308N739
2406E564N847m742r934r25P304M959j702m352j50N641K054n870l930L543M213
2421G520k403o116j676N120O741j09o281k841N455M363n453p622N04O273L519
2436F994m653n940K688R066J684q677n373L869N412j839p076l797O132P948j793
2451D645p536k113P163M079n620p994q32P005M594n479o964M129R073l46p166
$$ y = [4087, -2317, -10933, -11624, -4401, -1235, -6447, -10608, -3177, 6228, 3708, -6465, -10278, -3585, 4572, 2014, -8775, -11764, -2180, 5705, 1863, -4897, -2674, 4638, 6003, 143, -5942, -4268, 2145, 3658, -2228, -4593, 1718, 8063, 6385, 502, -2372, 2403, 7618, 4257, -4126, -4536, 3827, 7387, 2572, -1222, 2146, 8874, 10237, 3533, -3392, -753, 5931, 5868, -428, -1732, 3129, 8287, 7791, 2133, -175, 5564, 11411, 6669, -3265, -4190, 3114, 8073, 6371, 2019, 1869, 7510, 9564, 3694, -236, 3307, 7520, 5117, -999, -2675, 2445, 9186, 9077, 2796, -45, 5410, 9773, 4320, -3302, -2798, 3475, 6994, 2341, -3599, -911, 8155, 9839, 1162, -4211, -342, 5070, 3231, -3845, -7642, -1510, 6438, 4645, -2891, -5004, 2159, 6238, 618, -7376, -8208, -1203, 3391, -2088, -9052, -4923, 4150, 3804, -3362]
2466c362l251M935M124m664q434p39R940P044n789r254K291R120L190o455q085
2481i389J734Q359R83r159l978Q622R608l016r689k363P002O242n081j0103J50
2496a0078J0262L542o856n556M817Q387J121q286o837M442Q005k319r863l96R144
2511d71O308n117p969J262R106L128r585q888N529J0490p92q980l375P355Q758
2526F759p61r433m620O580O325m949p506K266Q985L350o788o603M479J0690J135
2541I909j0497o397N660O639j650n852Q76P668M964n971q514K225R506K674q167
2556C073o650K768P429K059n329l032O317P505m873j1201j514Q600N649l885p531
2571f15j304P007M673m396m520L391M766k497p887l292M884O491M92p516k711
$$ y = [-3362, -6613, -1678, 2446, -2218, -10652, -11391, -1451, 5593, -196, -9450, -7159, 1961, 5151, -1304, -9389, -7655, 704, 1687, -7472, -11450, -2828, 6780, 3764, -5925, -8288, -1286, 4956, -125, -10228, -10078, 184, 3726, -3130, -8686, -3869, 4518, 5639, -2647, -9484, -5042, 2963, 644, -9219, -9615, -471, 5837, 720, -7249, -5987, 3119, 6247, -3338, -12226, -6697, 3793, 3001, -5979, -9354, -1999, 6759, 5998, -3435, -8055, -1475, 4850, -99, -7605, -5339, 3646, 6996, 208, -6395, -1916, 8774, 9909, -588, -6985, -1325, 5314, 3664, -2188, -1312, 6356, 11320, 5349, -3165, -940, 8566, 11240, 3073, -3577, -809, 6620, 8679, 3350, 318, 6635, 14140, 9267, -1934, -3448, 5152, 10801, 6916, -615, -1919, 5088, 9761, 5365, 845, 4236, 9002, 6505, -1382, -4674, 210, 6701, 7193, -323, -3034]
2586c034N855N475m002o440J90M377J822n024n827K823Q145J330o098l060M312
2601H44L781k055o004l243L754O098j215n984p51O182L766l307m601l78M504K170
2617C561n201o115K925P522J325l263k097J592K406j094m460j410M858L782m262
2632F9o776P34P197N166j644n785k543L061J737m334k926M871N666k146o792k318
2648f763N261O836O28p747m732K768L139k107k343K453N335K166m732p220J271
2663e787Q794K679o338n857J884M290O73k555l04N562M280m998q734j64P853M064
2679E342l474o056q92O024M736l606m993L633O172j858q431l222N397O377o35
2694D514o938j987P021N604n024o740J061N577J442n237n297K449P289J820p122
$$ y = [-3034, 2821, 8296, 4294, -2146, -1956, 2421, 4243, -781, -6608, -3785, 4360, 5690, -408, -3468, 844, 4625, 2570, -3434, -6677, -2923, 3175, 1960, -4024, -4775, 1407, 5173, 1866, -2735, -3113, 1391, 3561, -1640, -7755, -4830, 2692, 4017, 754, -1343, 249, 2655, 1561, -2899, -4309, 549, 4331, 69, -6707, -5973, 1224, 6390, 4746, -1039, -3582, -521, 1216, -3118, -6044, -1173, 4493, 2347, -4445, -6763, -1502, 5334, 5962, -1785, -6517, -3749, -610, -2717, -5060, -2607, 2728, 4894, 162, -7058, -5787, 3007, 5686, -652, -6509, -4625, -335, 338, -2217, -2521, 3041, 7321, 2323, -6411, -6575, 1278, 5342, 1868, -4188, -5080, 944, 5680, 2074, -2919, 714, 6886, 5028, -3403, -6625, -1228, 5149, 4514, -2424, -4411, 2610, 8214, 3190, -3550, -2489, 3088, 4530, -707, -6004, -3555, 3734, 5554, -1568]
2709a568l308N980N997l396q862k595N752O237k754p197J036P940J732o568m723
2724f297M596O428n47q785o038M933R108J014o489j492M581K635m706n336J854
2739d541Q144K890q129q622M232J0183K765n326l710K050L342k530o499L26Q432
2754C007M872n948p970N26P902N114k777o923o12M719%o378j928P452O772k599
2770E229p967l472N502O735j765p278j322M939J118m542j888M517O082M46p349
2785a015n898M023O896o23o733k063M872M039j612m798j19O683L073o025o370
2800e670J976N907P08l816k705K714N722Q93n658l308M117M226k708m892n27M084
2816A063L188j981m647J109P120J721o238n158J685L987N00k560j927L269L879
$$ y = [-1568, -4876, 1104, 7101, 3705, -5157, -7752, -2000, 4237, 1483, -5714, -4678, 3262, 4994, -1574, -6297, -1701, 4727, 4180, -4605, -10643, -5710, 3398, 4412, -2077, -3569, 1012, 3647, -1059, -6395, -4541, 3603, 6493, -1636, -10258, -6026, 4157, 6922, 1596, -2114, -64, 3278, 748, -5751, -5425, 3007, 7879, 1931, -6039, -5513, 2389, 7503, 4726, -2197, -2809, 1910, 1910, -4468, -6396, 1056, 7828, 5229, -2738, -6210, -708, 6027, 4262, -3016, -4338, 601, 1719, -2823, -4711, -194, 5888, 6334, -1015, -6913, -2890, 4006, 3383, -3350, -5413, -541, 3498, 1886, -2912, -3031, 3652, 6725, 700, -5670, -3694, 2213, 2921, -895, -3600, -886, 4836, 5729, 71, -3237, 880, 5106, 2398, -2494, -3021, 1063, 4251, 2270, -2377, -1268, 5852, 7573, 1335, -3823, -2138, 1849, 2349, -211, -2138, 1131, 5010]
2831E010k570n443kN818L189l357o466k729M142N450r53l759O92M383j063n353
2847c011j934L731M637j63o566l963L513O132j90k476j3J519k76l101l395J501
2863d055O366K697n589n539K171O379J672k756l028R27K561k149n209J28P044
2878A620M693l822n928p38M027M256j782n456m85L855N62l989j810M168M528J66
2894C865n674m190L110N140j956n471o46M594K178k909l216J598N194J602n299
2909b080n312K164N450l18m591j891L454N394k20n804k611N488M322l925n947
2924f427J494M911K226l294l643K078O940J593n926m497K879M182j025k715j140
2939b364M272L936k444n952J237P165K199n470n825J198N211J928l786k588M261
$$ y = [5010, 2440, -3003, -3005, 2813, 6002, 2645, -3821, -6550, -2408, 3042, 2089, -1670, -978, 3405, 2342, -3011, -4945, -1214, 3423, 3260, -3306, -7269, -3756, 2376, 2186, -290, -303, 1216, 940, -2161, -5556, -4055, 2311, 5008, -581, -6120, -3949, 2430, 4102, 1346, -1682, -755, 1806, -343, -5552, -5424, 1620, 6313, 2491, -3437, -4175, -148, 4108, 2326, -3130, -3615, 240, 802, -3187, -4997, -829, 3699, 3865, -1809, -5999, -2889, 2251, 295, -5176, -5822, -1228, 950, -1959, -5175, -3577, 1617, 3219, -2080, -7392, -5228, 222, -96, -4687, -6578, -3124, 2270, 2050, -3754, -6365, -877, 3445, -480, -6427, -4933, -22, 2204, -1090, -4733, -2655, 4285, 5878, -48, -4545, -1666, 2516, 1491, -1224, -2364, 1908, 5844, 3400, -2552, -1315, 5850, 8049, 2579, -3246, -2048, 3163, 5091, 1305, -1283, 2978]
2954B978N020k869p327n26N766M289l125o280k325M985M855k060m282J718M776
2969E593j352n982l294L463N957M55o827l318M243N004j842l467L19L192K98m256
2985a814m576K421P106K036n703m118K845N008J0l783k813K952L732k894n730
3000e321Q60P329L785l983m735n54M222K130l088m008K034M729q17m068q46M248
3016A917L918j232n153k547L421L783l168m383J698M998P82l578k680J389M825
3031C990k38n410l201M056L476j682l846o11L992L804j585n251j137M272J762
3046B391l513l193J838M310J025l138l326K547N046o28n087j983K739K120q69
3061B79j926K84L572K252l188m453J411M844J172l299l315L00L296J925k865j155
$$ y = [2978, 7998, 5129, -2198, -2724, 3042, 7331, 4206, -2074, -4399, 586, 5441, 3381, -901, 817, 5593, 4241, -1741, -5035, -1572, 4385, 4840, -1987, -5305, -1062, 3942, 2100, -1367, -1048, 2144, 2442, -1814, -6390, -3969, 3137, 5173, -530, -4648, -1803, 3205, 3215, -568, -3381, -429, 3303, 409, -5321, -4461, 2868, 6653, 2670, -2065, -2619, 1603, 3733, 645, -3363, -1329, 3400, 2583, -1485, -2331, 1917, 5835, 4603, -550, -3097, 324, 4107, 939, -3444, -1746, 3252, 4034, 456, -2224, -835, 3990, 3752, -1658, -4859, -803, 2673, 991, -2855, -3466, 526, 4330, 2745, -2506, -3643, 629, 2391, -1122, -4315, -2477, 1833, 2858, -280, -3606, -1059, 3987, 3359, -1728, -3711, -972, 1148, 279, -1647, -1363, 2209, 4461, 1273, -3180, -1769, 3075, 4247, 948, -2367, -2067, 1229, 3154, 289, -866]
3077h66L339L409k935n639n26M045L262j221m099j787L352L159j987k364J603
3092G45K304r95m316k938K161N509R32m519k934K888K595j220k490K34J981R41
3108H78l408m316K284N926K144m364k953R40K597N66k484k792K722L705k012m216
3124d783m2N491L070k010m715r67L251K433k685l311K478L755j44l296j359K605
3140b29L654m55m779k282L740L149j933l701J019L657K405k499l975O29M346M37
3156C183m898k645L794M153p94l974j765L523L855j131n306q66L590J621l072
3171g32k279J897M188J516m081m383K800N017k97m920j580K480K408r52k311L10
3187i19M526K261m730m746J197M830J673k692l300N71L764J167l430j339M192
$$ y = [-866, 2473, 5882, 2947, -2692, -3218, 827, 4089, 2868, -1231, -3018, 334, 3493, 1506, -858, 745, 3049, 2054, -2262, -5200, -3039, 2470, 3402, -1117, -4051, -1163, 1432, 212, -2278, -2044, -63, 878, -2530, -6846, -4562, 1364, 3508, -856, -3809, -2869, -272, 294, -2190, -4982, -2260, 1445, -567, -4783, -4825, 666, 3736, 1726, -2989, -3956, -705, 1728, -957, -4268, -1790, 1965, 1821, -1475, -2834, -229, 3425, 2970, -1809, -4091, -351, 2798, 865, -2836, -1817, 1840, 4245, 1746, -2229, -1600, 2746, 3183, -1715, -4360, -566, 3587, 2793, -1181, -2946, 577, 4432, 3301, -2005, -2871, 719, 2340, -732, -3011, -1114, 3074, 4590, 509, -3874, -1074, 3943, 3646, -1274, -2854, -374, 2034, 1082, -1229, -919, 3607, 5868, 1138, -3608, -2411, 2419, 4092, 1400, -1900, -1329, 2435, 3602, 172, -1167, 3025]
3202C025K857l347n529o55M201L962j000m411m84L796J118l187j533K632K093
3217C538j396m201k276K996N396l82m108j465K683J752k335k726L42L496J059
3232B373l552l848K551N382O59l771k299J181K395k93l418r92L253L187k491l469
3248c152P48L821J647k588l015m49L729J242l545k495L084L482m39l339o43J962
3264E0K038j514l736j74L944K021k761k643Q17L120J767k195l158J36L255j87
3280G80l847n07L026L156j148l468j674K779K807j292k941k12K287p5j824q07
3296b960J706L404N21l827l304J716M084m91k625j001J435J674o18j944L91M242
3312B403J153l856l797Q55L461K127j910k324N72K611Q29k538j343K656K189k233
$$ y = [3025, 5882, 2535, -2994, -3649, 552, 4514, 3514, -897, -1381, 2415, 3533, 346, -1187, 1445, 3538, 2142, -2059, -4335, -1339, 4057, 3675, -433, -1898, 785, 2537, 202, -2524, -2182, 1314, 2373, -1179, -5027, -2476, 2906, 3565, -206, -2505, -1324, 1071, 778, -2640, -3632, -379, 2808, 317, -3152, -2404, 1417, 3064, 476, -2539, -2988, 741, 1983, -1562, -4057, -973, 2509, 2070, -1269, -1912, 50, 2088, 574, -3162, -3336, 608, 2629, -132, -2775, -1958, 1162, 2929, 734, -2424, -2288, 967, 780, -3067, -3574, -548, 2608, 1460, -2008, -3682, -903, 1904, 612, -2329, -2541, -254, -329, -2153, -2960, -1254, 2150, 2671, -1156, -4460, -2744, 1340, 849, -1776, -2777, -1342, 332, -286, -2230, -1839, 2403, 3556, -300, -4097, -3242, 219, 2346, 436, -1888, -1316, 1295, 2124, -414, -1757, 899, 3088, 855]
3328H55l140j013K679L429n35l341j65K947M38k611j669J750K289m11k586k198
3344c282K637L812m08l401j183K365J598j225l384k82L499K256k714k807J769
3359g50L548J50k563k354J233K828J97l609j103K708K709o75k295j63K006J026
3375B893j622l237P14M085J142l537j917K222K545M79k656j847J952K048j655
3390A609l650J61M532J754k234l048l36K689J799k117k923Q75K475m19k994o10
3406b437K814K513n36m038j898K719K300j771k572P95K149J54k301j281J637L078
3422A325N94m018k423K566L010j116k657l80K701K220j348l391O16M036J010l202
3438d57k772J566L028O07j663j648J847K924o39k984q03K612J232j128k157j61
$$ y = [855, -2285, -3298, -619, 2810, 2275, -1066, -1231, 1716, 2154, -457, -2126, -376, 1913, 1502, -1084, -3282, -645, 3167, 2759, -642, -1825, 540, 2138, 913, -2471, -2753, 746, 3002, 288, -2519, -750, 2798, 2948, 385, -1969, -736, 2092, 2289, -1320, -2423, 285, 2994, 2319, 24, -139, 1867, 2893, 1271, -1966, -1252, 2833, 3975, 438, -1479, 743, 3288, 3767, 1111, -736, 1216, 3264, 1609, -2041, -1880, 2652, 4406, 2172, -876, -1212, 1477, 3276, 1159, -1764, -889, 1586, 1167, -1827, -2437, 377, 2890, 2354, -1684, -3582, -863, 1437, -334, -2906, -2111, 38, 192, -2109, -3390, -1753, 1325, 1919, -2099, -4522, -1956, 1054, -62, -2719, -3099, -398, 1822, 474, -2917, -2301, 1735, 2745, -457, -3229, -1663, 1365, 1972, 309, -1339, 508, 3432, 2793, -191, -994, 1618, 2850, 1722, -435, -596]
3454e96K902J672j509k900J377L240m78k651j837J509K574l16k687r04K934J906
3470D236k021l001J15K370J315j866k711m90K973J554k278k025J907J999j076
3485A001k808j382J902K175l99k664k98K162J465j662j274L63J526K20j951k280
3501c904J185L354M23k738q10J386J936l91k109j006J988J696j659k555Q59K849
3517E04J214j462j933j26K536O86k125k311J388K540k64k052o53J147K147k04
3533A032k905o03K026J315k072j980R84K376Q23j417j816N61K228k29k574j134
3549c385J733J985o53j997q56K201K353p37k838l77K298N52k130o02P33K456Q08
3566A544k480j291J538K775p36k400o90J342J366k11j799j47K714J872j934l030
$$ y = [-596, 2306, 3978, 2469, -431, 946, 4186, 3708, 1057, -780, 729, 3303, 2987, 300, -604, 2330, 4236, 2215, -786, -671, 1699, 3014, 1148, -1563, -2053, 920, 2474, 196, -1829, 78, 2077, 1001, -1807, -3189, -1287, 888, 489, -2175, -2473, -311, 1154, -508, -1782, -1419, 107, 327, -1624, -3904, -2719, 635, 1058, -1680, -2490, -1104, 832, 441, -1668, -2674, -686, 1010, -649, -3204, -2345, 504, 1718, 256, -1677, -1803, 733, 1419, -706, -3017, -1629, 911, 647, -1405, -2058, -911, 1236, 1032, -1873, -2476, -450, 865, -1207, -3187, -2203, 173, 996, -421, -2237, -1676, 552, 323, -2251, -3385, -1652, 333, -320, -2317, -3173, -972, 1381, 644, -2194, -2571, -273, 279, -1851, -2453, -1720, 736, 1544, -936, -2227, -689, 2086, 1350, -1050, -1740, -398, 968, 757, -1042, -1189, 1525, 3397, 1463, -1567]
3582a567J033K534N81k049j726R82K374N67k878n79K357J802j397k599j97J463
3598G01J803j502k000M9K868O79k351j163P01K026l90j702k008J314K811o06k686
3615a456j80K925J189j969k029n64J871J685j949j798J210K353j76j718p83J578
3631A89K067o54k732j768K561K666j188k154O6K211P00j711j213R96K191J29l185
3648h29j462K248K485l54j488o17J275J189j063k414J90K749R30k453j972R48
3664f38K426P16j702j788P13K304j316k259j04K512P85q64j929o39K423J720j754
3681F06k758P60K130k6j627j365J330K070R2k003j309K030J571j453j906J5J686
3698a57Q64j016j355K80K191J104j972j561R68J173J3j778j023J483K644j72k738
$$ y = [-1567, -534, 2000, 2581, 532, -1194, -212, 2162, 2729, -149, -728, 1629, 3431, 2034, -565, -762, 701, 2504, 1002, -998, -949, 1919, 2598, 247, -916, -215, 1811, 1421, -281, -2289, -975, 1836, 1230, -1456, -1636, 1289, 2478, 509, -1520, -2084, -213, 1472, -477, -2275, -1065, 1288, 1112, -606, -1389, 189, 2256, 1602, -1130, -2898, -337, 2329, 1141, -1013, -947, 1264, 1964, 253, -960, 36, 2227, 2356, -829, -2291, -43, 2442, 2088, 600, -17, 1258, 2447, 1384, -1030, -840, 1909, 2839, 386, -1586, -638, 1788, 2504, 802, -986, -273, 2031, 715, -1544, -1648, 864, 1649, 785, -1144, -1783, 640, 2360, 606, -2152, -1392, 738, 712, -915, -2280, -950, 1120, 1212, -791, -2100, -70, 1501, 48, -1858, -1843, -157, 707, -309, -1664, -1384, 807, 1911, -61, -1622, -654, 519, 532, -1246, -2269, -786, 1858, 1686, -1052]
3715a052o32J899J277j163j320P8R89P76j479j230J231K314J25k239j239M05J329
3732F9O50j104j077J365R52r01j846P56K524M46j710k100l81K233J102j287q91
3749a200J069Q35m15j476j31J094J784l42k698j125J692J784l03j358L50J229
3765G89l1j004j536Q01K627n02k139r17J240J972pq42j124P60J147r66k008O02
3783a138J951Q31j381j639M48J879J103j773j555M48K431o57k072j87J411J339
3799A439J41j630p54J328J396j631j870Q16J955M64q87j657O26J869N06j960j185
3816a034J955J041j349j411m07K011J637n38k257l44K168O20j765n83P30J104
3832A578m23j855r66J856K528j27k923j104J518J201l52j449l00J522P88k004
$$ y = [-1052, -1684, 215, 1492, 329, -991, -913, 76, 852, -627, -1857, -626, 1688, 1813, -426, -1665, -1260, 69, 719, -385, -1462, -97, 855, -46, -1892, -1136, 1388, 1834, 124, -1976, -2357, -124, 978, -309, -1200, -131, 704, 289, -1187, -1318, -224, 1560, 1218, -1480, -2605, -913, 871, 568, -790, -440, 789, 758, -246, -1782, -981, 1646, 1144, -995, -1912, -672, 1300, 1293, 451, -673, 87, 1234, 268, -1740, -1138, 813, 1644, 263, -1376, -928, 951, 2054, 281, -1274, -826, 1605, 948, -1124, -1311, 100, 1439, 1580, -50, -804, 524, 1920, 289, -1581, -765, 1190, 1654, 767, -890, -264, 1605, 2111, 151, -1034, 921, 1962, 613, -798, -1205, 806, 2443, 1905, -352, -696, 1472, 2092, 327, -256, 474, 1578, 1155, -700, -1666, 190, 2718, 2591, -332, -1436, 82, 1283, 931, -518, -818, 704, 1492, -512]
3848e12j239J373K310k25j768j728K49J736k89q40n78J818J020j697j642N55K083
3865F26R63j657k075RJ772J104j501n67J405J226r52j578p08J649J508o50k220
3882a646jJ562J320q42j266Q21Q58K02j289j648J025J775j71j654p00K036Q57
3899A239q63j251o23J728J103j977j849J297J181O35j120r95O42J427J34k161
3915a453j134J270J925r35j457m4R66P13m58j079P8J949K47k273j094J164J268
3932c47P39p70j075M52J523l7j283O7J292J84r68j303P5J932J407n60j613k09
3950d94J344K28r79j11J021P60l18j191p64J390J858l49j667n47Q36K69k81p41
3968B64O08J305M65k188j154J312J567K3j297r05k30J252M36j288q5J254M55j064
$$ y = [-512, -1751, -378, 1932, 1707, -61, -1789, -1540, 196, -93, -933, -1511, 307, 1327, -370, -2012, -1457, 626, 1589, -68, -2143, -2134, -362, 742, -759, -1326, 79, 1305, 353, -1225, -1933, -284, 1224, 574, -1646, -1647, -85, 1235, 393, -873, -52, 806, 1008, -281, -1929, -904, 871, 700, -954, -1654, 382, 1239, 376, -875, -1498, 230, 1333, -644, -2493, -1196, -15, 620, -500, -1495, -853, 574, 708, -1453, -2587, -1317, 608, -327, -1784, -1828, -862, -149, -607, -1686, -1608, 341, 588, -1685, -2779, -1615, -347, 392, -378, -1453, -1001, 522, 485, -798, -731, 561, 745, -223, -1526, -1451, 481, 1888, 1328, -285, -494, 850, 1078, 99, -12, 1009, 1769, 1451, 260, -504, 886, 2744, 2395, 728, 181, 1017, 1286, 1005, 264, 872, 2177, 2642, 454, -700, 612, 2179, 2202, 905, 0, -230, 1022, 1458, 170, 85, 1339, 1794, 730]
3986G30j207J56J170R17p41j834J55J605M59q71r17J113P42k85j084r56P96J462
4004A410N0j485j16R81O06p98k87k35R56Q69j349j258R07J265J40j224k18O94
4022I08J139k36j775p68J283J386j281p78l11J215K30o42j008K29J470L42k009
4039f06j677R27J996k71j077r81Q16R91o21j702M61J334L84j408j406N26J359
4056i55P03j065j079N12J568q69j455o8J712J049j162j573m6J473K127j131j773
4073b032M37J319l40q09l44J201J530l96j893o77K126J478n06j197q08R24P60
4090G73l40r66M02J950M08k080j123J261J620q4j446p65O60J524p55j496O11J159
4108A313O46j180j343k78J578N77r25j466M73J580j42j255k19P58Q27o45j606
$$ y = [730, -477, -321, 849, 1766, 1025, -809, -654, 951, 1410, 539, -378, 735, 1477, 1192, 108, -848, -52, 1410, 1460, -25, -141, 840, 1446, 648, 361, 126, 1082, 1951, 602, -656, 251, 1516, 1656, 432, 214, 908, 2047, 1811, 36, -732, 551, 1937, 656, -122, -433, 782, 1012, 370, -638, -409, 1061, 1403, -606, -2283, -1356, 640, 369, -708, -1689, -873, 118, -503, -2205, -1744, -410, -26, -1434, -2840, -2314, -955, -252, -1317, -2396, -1884, -316, -1185, -2640, -2708, -996, 53, -1109, -2682, -2728, -1255, 872, -259, -2032, -1595, -276, -616, -1425, -1769, -568, 962, 566, -1327, -2004, 122, 1600, 1094, -103, -911, 13, 773, 433, -533, -131, 1819, 2227, 147, -976, 285, 1905, 1821, 375, -390, 270, 1794, 1039, -457, 154, 1313, 1959, 779, -564, -842, 736, 1313, 388, -1078, -605, 975, 833, -422, -641, 117, 944, 299, -1307]
$$ [...]
8191b92
##END NTUPLES=NMR FID
##END=
