##TITLE=1H_CA-8726-2
 CDCl3, 8 sc, 
 29.7.2020
##JCAMPDX= 6.0         $$ Bruker NMR JCAMP-DX V2.0
##DATA TYPE= NMR FID
##DATA CLASS= NTUPLES
##ORIGIN= UXNMR, Bruker Analytische Messtechnik GmbH
##OWNER= root
$$ XWIN-NMR		Version 3.5
$$ Wed Jul 29 09:48:48 2020 Russian Standard Time (UT+4h)  she@DPX200
##.OBSERVE FREQUENCY= 200.1315
##.OBSERVE NUCLEUS= ^1H
##.DELAY= (6, 6)
##.ACQUISITION MODE= SIMULTANEOUS
##.ACQUISITION SCHEME= undefined
##.AVERAGES= 8
##.DIGITISER RES= 18
##SPECTROMETER/DATA SYSTEM= spect
##.PULSE SEQUENCE= zg30
##.SOLVENT NAME= CDCl3
##.SHIFT REFERENCE= (INTERNAL, CDCl3, 0, 15.7039)
##AUDIT TRAIL= $$ (NUMBER, WHEN, WHO, WHERE, WHAT)
$$ ##TITLE= Audit trail, XWIN-NMR		Version 3.5
$$ ##JCAMPDX= 5.01
$$ ##ORIGIN= Bruker BioSpin GmbH
$$ ##OWNER= she
$$ F:/spectra/data/she/nmr/H-F/1/audita.txt
$$ ##AUDIT TRAIL=  $$ (NUMBER, WHEN, WHO, WHERE, WHAT)
(   1,<2020-07-29 09:47:35.95 +0400>,<she>,<DPX200>,
      <created by zg, POWCHK disabled, PULCHK disabled
       configuration hash MD5:
       00 E9 B6 7A A2 85 ED C7 34 08 36 98 17 FE 4E 26
       data hash MD5: 16K
       5C 25 75 2A D9 32 2E 29 8A C7 5E EB 15 1F 87 74>)
$$ ##END=
$$ 
$$ hash MD5
$$ 5C 08 88 B3 A3 21 A9 B9 CB 26 64 6C B8 32 7A 95
##$RELAX= 
##$RELAX= 
##$RELAX= 
##$RELAX= 
##$RELAX= 
##$RELAX= 
$$ Bruker specific parameters
$$ --------------------------
##$DU= <F:/spectra>
##$EXPNO= 1
##$NAME= <H-F>
##$PROCNO= 1
##$TYPE= <nmr>
##$USER= <she>
##$AMP= (0..31)
100 100 100 100 100 100 100 100 100 100 100 100 100 100 100 100 100 100 
100 100 100 100 100 100 100 100 100 100 100 100 100 100 
##$AQSEQ= 0
##$AQ_mod= 1
##$AUNM= <au_zg>
##$AUTOPOS= <>
##$BF1= 200.13
##$BF2= 200.13
##$BF3= 200.13
##$BF4= 200.13
##$BF5= 200.13
##$BF6= 200.13
##$BF7= 200.13
##$BF8= 200.13
##$BYTORDA= 1
##$CFDGTYP= 0
##$CFRGTYP= 5
##$CHEMSTR= <none>
##$CNST= (0..31)
1 1 145 1 1 1 1 1 1 1 1 1 1 1 1 1 1 1 1 1 1 1 1 1 1 1 1 1 1 1 1 1 
##$CPDPRG= <>
##$CPDPRG1= <>
##$CPDPRG2= <>
##$CPDPRG3= <>
##$CPDPRG4= <mlev>
##$CPDPRG5= <mlev>
##$CPDPRG6= <mlev>
##$CPDPRG7= <mlev>
##$CPDPRG8= <mlev>
##$CPDPRGB= <>
##$CPDPRGT= <>
##$D= (0..31)
0 1.2 0 0 0 0 0 0 0 0.06 0 0.03 0 0 0 0 0.0002 0 0 0 0 0 0 0 0 0 0 0 0 
0 0 0 
##$DATE= 1596001655
##$DBL= (0..7)
120 120 120 120 120 120 120 120 
##$DBP= (0..7)
150 150 150 150 150 150 150 150 
##$DBP07= 0
##$DBPNAM0= <>
##$DBPNAM1= <>
##$DBPNAM2= <>
##$DBPNAM3= <>
##$DBPNAM4= <>
##$DBPNAM5= <>
##$DBPNAM6= <>
##$DBPNAM7= <>
##$DBPOAL= (0..7)
0.5 0.5 0.5 0.5 0.5 0.5 0.5 0.5 
##$DBPOFFS= (0..7)
0 0 0 0 0 0 0 0 
##$DE= 6
##$DECBNUC= <off>
##$DECIM= 24
##$DECNUC= <off>
##$DECSTAT= 4
##$DIGMOD= 1
##$DIGTYP= 9
##$DL= (0..7)
0 120 120 120 120 120 120 120 
##$DP= (0..7)
150 150 150 150 150 150 150 150 
##$DP07= 0
##$DPNAME0= <>
##$DPNAME1= <>
##$DPNAME2= <>
##$DPNAME3= <>
##$DPNAME4= <>
##$DPNAME5= <>
##$DPNAME6= <>
##$DPNAME7= <>
##$DPOAL= (0..7)
0.5 0.5 0.5 0.5 0.5 0.5 0.5 0.5 
##$DPOFFS= (0..7)
0 0 0 0 0 0 0 0 
##$DQDMODE= 0
##$DR= 18
##$DS= 0
##$DSLIST= <SSSSSSSSSSSSSSS>
$$ [...]
##$SUBNAM2= <"">
##$SUBNAM3= <"">
##$SUBNAM4= <"">
##$SUBNAM5= <"">
##$SUBNAM6= <"">
##$SUBNAM7= <"">
##$SUBNAM8= <"">
##$SUBNAM9= <"">
##$SW= 24.9337058887773
##$SWIBOX= (0..15)
0 0 2 0 0 0 0 0 0 0 0 0 0 0 0 0 
##$SW_h= 4990.01996007984
##$TD= 16384
##$TD0= 1
##$TE= 0
##$TE2= 300
##$TE3= 300
##$TEG= 300
##$TL= (0..7)
0 120 120 120 120 120 120 120 
##$TP= (0..7)
150 150 150 150 150 150 150 150 
##$TP07= 0
##$TPNAME0= <>
##$TPNAME1= <>
##$TPNAME2= <>
##$TPNAME3= <>
##$TPNAME4= <>
##$TPNAME5= <>
##$TPNAME6= <>
##$TPNAME7= <>
##$TPOAL= (0..7)
0.5 0.5 0.5 0.5 0.5 0.5 0.5 0.5 
##$TPOFFS= (0..7)
0 0 0 0 0 0 0 0 
##$TUNHIN= 0
##$TUNHOUT= 0
##$TUNXOUT= 0
##$USERA1= <user>
##$USERA2= <user>
##$USERA3= <user>
##$USERA4= <user>
##$USERA5= <user>
##$V9= 5
##$VALIST= <valist>
##$VCLIST= <CCCCCCCCCCCCCCC>
##$VD= 0
##$VDLIST= <DDDDDDDDDDDDDDD>
##$VPLIST= <PPPPPPPPPPPPPPP>
##$VTLIST= <TTTTTTTTTTTTTTT>
##$WBST= 1024
##$WBSW= 4
##$XGAIN= (0..3)
0 0 0 0 
##$XL= 0
##$YL= 0
##$YMAX_a= 540262
##$YMIN_a= -257280
##$ZGOPTNS= <>
##$ZL1= 120
##$ZL2= 120
##$ZL3= 120
##$ZL4= 120
##$ABSF1= 10
##$ABSF2= 0
##$ABSG= 5
##$ABSL= 3
##$ALPHA= 0
##$AQORDER= 0
##$ASSFAC= 0
##$ASSFACI= 0
##$ASSFACX= 0
##$ASSWID= 0
##$AUNMP= <proc_1d>
##$AZFE= 0.1
##$AZFW= 0.1
##$BCFW= 1
##$BC_mod= 2
##$BYTORDP= 1
##$COROFFS= 0
##$CY= 11.3945322036743
##$DATMOD= 1
##$DC= 2
##$DFILT= <>
##$DTYPP= 0
##$F1P= 16.9975609425685
##$F2P= -3.02152046262296
##$FCOR= 0.5
##$FTSIZE= 0
##$FT_mod= 4
##$GAMMA= 1
##$GB= 0.15
##$INTBC= 1
##$INTSCL= 1
##$ISEN= 128
##$LB= 0.24
##$LEV0= 0
##$LPBIN= 0
##$MAXI= 10000
##$MC2= 0
##$MEAN= 0
##$ME_mod= 0
##$MI= 1.114404
##$NCOEF= 0
##$NC_proc= 0
##$NLEV= 6
##$NOISF1= 3.799351
##$NOISF2= 2.8
##$NSP= 1
##$NTH_PI= 0
##$NZP= 0
##$OFFSET= 15.70392
##$PC= 1
##$PHC0= -9794.676
##$PHC1= 13.40092
##$PH_mod= 1
##$PKNL= yes
##$PPARMOD= 0
##$PSCAL= 0
##$PSIGN= 0
##$REVERSE= no
##$SF= 200.130013532006
##$SI= 16384
##$SIGF1= 3
##$SIGF2= 2
##$SINO= 400
##$SIOLD= 16384
##$SREGLST= <1H.CDCl3>
##$SSB= 0
##$STSI= 0
##$STSR= 0
##$SW_p= 3612.71676300578
##$SYMM= 0
##$S_DEV= 0
##$TDeff= 0
##$TDoff= 0
##$TI= <>
##$TILT= no
##$TM1= 0
##$TM2= 0
##$TOPLEV= 0
##$USERP1= <user>
##$USERP2= <user>
##$USERP3= <user>
##$USERP4= <user>
##$USERP5= <user>
##$WDW= 1
##$XDIM= 8192
##$YMAX_p= 0
##$YMIN_p= 0
$$ End of Bruker specific parameters
$$ ---------------------------------
##NTUPLES= NMR FID
##VAR_NAME=  TIME,          FID/REAL,        FID/IMAG
##SYMBOL=    X,             R,               I
##VAR_TYPE=  INDEPENDENT,   DEPENDENT,       DEPENDENT
##VAR_FORM=  AFFN,          ASDF,            ASDF
##VAR_DIM=   8192,          8192,            8192
##UNITS=     SECONDS,       ARBITRARY UNITS, ARBITRARY UNITS
##FACTOR=    0.0002004,     1,               1
##FIRST=     0,             0,               0
##LAST=      1.6414764,     0,               0
##MIN=       0,             -257280,         0
##MAX=       1.6414764,     540262,          0
$$ Real data points
##PAGE= N=1
##DATA TABLE= (X++(R..R)), XYDATA
0@%%%%%%%Qj6J6j7K5l2M0m9N7p2Q6j02J21j43J68j94K23k59K99l42L90m43N03
30B67n67O37p17Q04q97J002j117J240j376J528j692J872k075K298k545K821l130
47a647L480l879M341m876N508o275P224q429J0022j2248J5592k1263L3400j05407
61h4457J43280J71250k20895j87492k9177J07997L9123k2361o983R1972K4626
72B6883j35863j48300P1212K09725J30165o5134j47838o8925O2080M0254n6594
83h2335j3887J23904Q9845q6167j49097j3526J43502J49387k0796j58606q3895
94a01671P5109O6473m4944m3837N6298R3875K1378q2165q6245L8376J17637N688
106A15972j24179o4529P3955Q6293j3850p8306k5606Q7065R4778m2657j14791
$$ plain form
0 0 0 0 0 0 0 0 0 8 -8 8 -9 16 -16 24 -25 32 -40 46 -56 65 -78 90 -104 119 -140 159 -183 207 -236 267
30 267 -300 337 -380 424 -473 529 -588 652 -724 804 -888 984 -1091 1207 -1338 1483 -1647
47 -1647 1833 -2046 2295 -2581 2927 -3348 3876 -4553 5469 -6779 8813 -12450 20950 -84457
61 -84457 58823 230073 9178 -178314 -207491 -99494 -60371 -82732 -89715 2257 26883
72 26883 -108980 -257280 -186068 23657 153822 88688 -59150 -128075 -65995 -25741 -82335
83 -82335 -96222 27682 117527 31360 -117737 -131263 12239 161626 140830 -17776 -101671
94 -101671 -26562 39911 -5033 -48870 7428 101303 122681 40516 -45729 -7353 110284 115972
106 115972 -8207 -72736 1219 87512 73662 -4644 -30250 56815 151593 108936 -5855
117e855r094P9923N006q7416n0354O1022J18489M5169r6007j12036L0020J14406
129I3273K3959p3375m4582K4644K4507m1099o8028L0871J55021R4994r9382j57018
141c6215k9984Q1942O8204j665l9957j1289K9531j4332p4667j044J32045J16408
153B18977m2210j50191j09494K4408J12256N9539l4546j9219L9303j0494q5761
164B568l0786R0882J20235J3687j28253j46544j499J22760P3648k2056j4052K7981
176A08571l121o3905o4820J7289J08760P4154q3075j47128k3728J05450Q1428
187A09875q146l7240j824K5338j9731q6345m3685Q1642R5486l0342j01556l4229
199e0757O1306P8397N009p0006l8962M9347L2484o7756p2152L0088Q0702K4258
$$ plain form
117 -5855 -14949 64974 69980 -17436 -67790 -6768 111721 156890 60883 -51153 -21133 93273
129 93273 117232 43857 -725 23919 48426 7327 -60701 -29830 125191 220185 120803 -36215
141 -36215 -66199 15743 83947 82282 42325 31036 60567 46235 -28432 -29476 102569 218977
153 218977 176767 26576 -82918 -58510 53746 113285 78739 59520 98823 88329 2568
164 2568 -28218 62664 182899 196586 68333 -78211 -79710 43050 116698 94642 80590 108571
176 108571 105450 41545 -23275 -5986 102774 176928 93853 -53275 -77003 28447 109875
187 109875 101729 64489 62665 88003 68272 -18073 -61758 19884 115370 85028 -16528 -50757
199 -50757 10549 88946 93955 23949 -15013 34334 66818 -938 -73090 -43002 37700 61958
211F1958m9375m9694L0259Q0632j306j01927n9561N7942O7267j7736o2209k4895
223f8645M2049N4847j1180n5286J1021P1074j7r8217p6819K9235R3439N3892m2907
236B486p1756R146O1567l235n4550N012O1884J5434p0384r0114q798J01320J01523
249E9535j6611q2501k3336L1156L409k9729r753L7701M9978j7499r6723n3676
261a48049Q3822J19598J5042p1258n5964j065K0171p487k9694K0792P7644K1897
273D5449q1780p1318L9094R5720M5649m4108q0319k2638M3203J3653m1155J231
285e7319P5610M9013m2191p5456j9061O2270O7428k4200q5509k1074N6049K6267
297A1827l1609j5523L8812N3611N252o4735o0116L1113P0730n360o9912k2374
$$ plain form
211 61958 12583 -37111 -6852 73780 72474 -29453 -89014 -31072 36195 18459 -43750 -68645
223 -68645 -26596 28251 17071 -38215 -27194 43880 43863 -54354 -131173 -101938 -8499 45393 2486
236 2486 -69270 -60124 1443 -1792 -56342 -51330 10554 25988 -44396 -134510 -143308 -41988 59535
249 59535 42924 -39577 -62913 -31757 -28348 -58077 -67830 -30129 19849 2350 -94373 -148049
261 -148049 -64227 55371 70413 -845 -56809 -57874 -37703 -45190 -74884 -54092 23552 45449
273 45449 -36331 -107649 -68555 27165 72814 28706 -51613 -74251 -31048 -17395 -58550 -57319
285 -57319 18291 67304 25113 -50343 -69404 -7134 60294 36094 -49415 -70489 -14440 11827
297 11827 -19782 -35305 3507 57118 62370 -2365 -62481 -31368 39362 34002 -35910 -58284
309e8284N2036N0924o182m8320j5030N4646M2130m9355p1966J1764N8789J0428
321C1580m3555k9777L4118P2517K0200o9443n9427L3039N5834j1470n1300j5361
333c3045L5163L7419j6581n0491R298Q2506L7492o9434p8925K998N2047K6674
345C5121k4758l1893K3022N2853q083o4149j0562O6672M5884l8059p7975l4895
357f6822M3686O3879l970m5807J0378N5139J548o2429l8331L3703O0370P094o9897
370a1459o0062L5846P6240Q853m1890p914L3522J4199l6948n7135m556O6310M4077
383E9083m8931o4649J9889O6795K2389l6092l5363J1900L8650j1843p0130k5577
395g3879O5547N9892k2926n4304o915M4592L7757k4222o0722q219N2651J6077
$$ plain form
309 -58284 -6248 44676 38494 -9826 -24856 29790 71920 22565 -49401 -37637 21152 31580
321 31580 -11975 -41752 -7634 64883 85083 15640 -43787 -10748 45086 33616 -17684 -33045
333 -33045 2118 39537 22956 -27535 -18237 64269 101761 32327 -46598 -43600 8447 35121
345 35121 10363 -21530 1492 54345 46262 -17887 -28449 38223 84107 46048 -31927 -66822
357 -66822 -23136 40743 36773 -9034 1344 56483 58031 -4398 -42729 -9026 51344 58438 -11459
370 -11459 -71521 -35675 40565 49418 7528 -386 33136 47335 10387 -46748 -51304 15006 59083
383 59083 10152 -54497 -34608 32187 54576 18484 -16879 -4979 33671 21828 -48302 -73879
395 -73879 -8332 51560 28634 -25670 -32585 12007 49764 25542 -35180 -43399 9252 25329
407B5329n3271l5668L6641O0337J2936m3993m0984K4770N2655j4918o9873j8302
419f4341N0793L6109k0640l7386J607M8842L4616l7557n7506J1918N1966l92n4297
432c6268l0609L0998N8015J5818m6886l3898L9012M7738k8765o1814n824M4916
444g567K8103k6575m6730N902O6774L7589m5188n0450J6163M0207m131m3932k7607
457e7442K8351N5409L143n5738j8425N6097M4005k9596n5007j1454L4065K6570
469A9978k7954m4483J9471O8800J6234n2993l4138K8439M2807j903n0239l8760
481e4741K8769N4319p659n0670K41N6487L1674l1382n1684r128M3983K9023m1892
494b660n0370K4003O0749P932m0416j9945K8684M0651q084o0122l2786M2907M6190
$$ plain form
407 25329 -27942 -63610 -26969 33368 46304 2311 -38673 -13903 38752 23834 -46039 -64341
419 -64341 -13548 22561 1921 -35465 -33858 14984 49600 12043 -45463 -33545 18421 18029 -36268
432 -36268 -66877 -35879 22136 37954 -8932 -42830 -3818 43920 15155 -46659 -52483 -7567
444 -7567 20536 -6039 -52769 -46867 19907 57496 12308 -38142 -21979 18228 14097 -29835 -57442
457 -57442 -29091 26318 29461 -26277 -44702 11395 55400 25804 -29203 -40657 -6592 19978
469 19978 -7976 -52459 -32988 35812 52046 -947 -35085 -6646 36161 34258 -15981 -54741
481 -54741 -25972 28347 20688 -29982 -29741 26746 58420 27038 -24646 -33774 10209 39232 -2660
494 -2660 -53030 -29027 31722 39654 -762 -20707 7977 48628 40544 -19578 -52364 -9457 36733
507C6733k4049m5811P368M9825K7946k7359m5741K566N1028J0566o0579m1738
519e9245L6079N3818J834l8153j9655L1447M4284j4399o0425j5850M6221K5382
531C1338l5215m0063R375M9576L2021k7083m6287J1144M8191k825n4985k5331
543e0144L2204L8402m586l9598j6231M3635M7276k2267n3897m972L5863J0693
555A6378l0516l1345J0203M8347K4182l7753l6592K7984M6578p876m7240k4621
567d2271J9300L2540l304l8463p520N0539L5725l0585m2138L781L2926J2174k9090
580f386l9139O519M7829J5812l7454j9626L5112L5985j2289m3105k4259K3378
592a7623L5880j2983m6925j192N0197K6206k6015l0249N542L1950J2118l7760
$$ plain form
507 36733 12684 -33127 -25759 24066 52012 24653 -21088 -18522 32506 43072 -17507 -59245
519 -59245 -23166 30652 32486 -5667 -25322 6125 50409 36010 -24415 -40265 5956 31338
531 31338 -3877 -43940 -34565 15011 47032 19949 -26338 -15194 32997 30172 -24813 -50144
543 -50144 -17940 20462 15876 -23722 -39953 3682 50958 28691 -25206 -30178 5685 16378
555 16378 -14138 -45483 -35280 13067 37249 -504 -37096 -9112 37466 29590 -17650 -42271
567 -42271 -22971 9569 6265 -32198 -39718 10821 46546 15961 -26177 -22396 10530 22704 -6386
580 -6386 -45525 -39006 8823 24635 -12819 -32445 2667 38652 26363 -16742 -41001 -17623
592 -17623 18257 5274 -41651 -42843 7354 33560 7545 -22704 -17162 14788 26906 -10854
604a0854m2404J6297M7821K347l8570j2385L3351L5677m813m2795k5313K8682
616a2959L2450k5536m4326Q555M5472J7343k3932k6814J0802M1976R889m7100
628a4180l8702K2654L7352n327k9581n886K9592L3667p910m3129j1088M1139K2880
641C1481l5896m0861P379L8256K0339j7914k4781J7110M3015k188m9483k1973
653c5516L1736L0450j1444l5082j3351L4074M1840q827l8740J566L8448P256l7214
666E196l1630J1439M0409J8247l0497l0280K6849M7038k906l9665j3835K2077
678B2442J9986j3699l6700q081M3299L6576k1179l5808R169L5730P533k8854l1166
691g52O213L5888P022l9105j8913L8202M0348r731l5877j3242K0129K2214j5966
$$ plain form
604 -10854 -53258 -36961 10860 13207 -25363 -37748 -4397 31280 26467 -16328 -41641 -12959
616 -12959 19491 -6045 -50371 -41816 3656 20999 -2933 -29747 -18945 23031 32920 -14180
628 -14180 -52882 -30228 7124 1797 -27784 -33670 -4078 29589 21679 -21450 -32538 8601 31481
641 31481 -4415 -45276 -37897 359 20698 2784 -21997 -4887 38128 35940 -13543 -35516
653 -35516 -3780 26670 15226 -19856 -33207 867 42707 33880 -4860 -3294 35154 42410 5196
666 5196 -26434 -14995 25414 43661 13164 -17116 9733 56771 53865 14200 365 22442
678 22442 42428 28729 -7971 -16052 27247 63823 42644 6836 16005 51735 59268 30414 -752
691 -752 5461 41349 48371 9266 -9647 28555 68903 59172 23295 10053 30182 52396 36430
704C6430m0441l748M0144J9811k6056k3693J5138L2865R147l0391l7356P298L6351
717C5499j141l9530j1815L3173K8518q889k9351j0399K5863K3061k6080m4911
729b6002J337L6789J1928k3274j9102J2368L2660J0937l3737l2852J7609L1597
741B0258j2581l8865r210K8114K9388l429l1379r820L2791K1696k9591l7760M709
754c5679K8008Q078k0188k1098J3383L9316R021l6635k2410K3803K3683j5485
766f203l3208r822K4742K9278q572l2110M016L9975J2582l4098k8763Q766K5675
779g742O455k6338k4165K0673M2128J056l4715j0566K6060J9905j5479l6275j2733
792e1736K9691L0368j6720l2147J1861L8060P777k6772k2962P861K6142L455l5486
$$ plain form
704 36430 -4011 -7759 32385 52196 26140 2447 17585 50450 59597 29206 -8150 -852 35499
717 35499 34358 -5172 -16987 16186 44704 35815 6464 -3935 21928 44989 18909 -26002
729 -26002 -24665 12124 24052 778 -18324 -5956 26704 37641 3904 -28948 -11339 20258
741 20258 7677 -31188 -40398 -12284 17104 13675 -17704 -27524 5267 26963 -2628 -40388 -35679
754 -35679 -7671 407 -19781 -40879 -27496 11820 20841 -15794 -38204 -14401 9282 -6203
766 -6203 -39411 -49233 -24491 4787 -3785 -35895 -31879 8096 20678 -13420 -42183 -33417 -7742
779 -7742 -1287 -27625 -51790 -31117 11011 12067 -22648 -33214 -7154 12751 -2728 -39003 -51736
792 -51736 -22045 8323 -8397 -40544 -28683 9377 17154 -9618 -32580 -24719 1423 4878 -30608
805c0608k3981K7824L8444l587k7342m945K1267J7769j4364l5013n940L5130J9049
818A3703l0219k9081J6882L8307J3342k0510k5004N674K6323m556l7383j1161
830d3683L4908K7749j3626k9179m290K9655K9306j3231l8308m117K7047M307k7769
843b1231j2054K4894L3478M484l2119k4811K2655L6570q105l8828j0723K2377
855c413J6274j0027j9016O121L6719K0813l0762l9268R053L4663N662k6664k0768
868b0613J1062L0999P565k6792j1872L0568K5595k0738l6963p209K3014K0816
880B5432r342k7035R22L5416J6496k5847k2701J2828K2301k808k7387k0928J5805
893f848L3750n65l2809n333L2644K1929j7319l1941r709J9920J7830j6573k7356
$$ plain form
805 -30608 -54589 -26765 11679 8092 -19250 -24195 -2928 14841 477 -34536 -40476 -5346 13703
818 13703 -16516 -45597 -28715 9592 22934 2424 -22580 -16906 9417 4861 -32522 -43683
830 -43683 -8775 18974 5348 -23831 -28121 1534 30840 17609 -20699 -24816 2231 6538 -21231
843 -21231 -33285 -8391 25087 29571 -2548 -27359 -4704 31866 23761 -15067 -25790 -3413
855 -3413 12861 2834 -16182 -10061 26658 47471 16709 -22559 -13506 21157 26819 155 -20613
868 -20613 -9551 21448 29013 2221 -9651 20917 46512 25774 -11189 -18398 4616 25432
880 25432 16090 -10945 -10023 25393 41889 16042 -6659 6169 28470 25662 -1725 -22653 -6848
893 -6848 26902 26337 -6472 -11805 20839 42768 25449 -6492 -16201 3719 21549 4976 -22380
906b2380J1148L6143M643k9230j6392J7044K8102N66l5375k9076J5896L1499m398
919H190k3170M200K7445J1234k1461l0773k89L4738J8819l0876l6713Q547L0875
932G66R575j3096p463J4399J9626j2546m2514j4002L5703L2793j4577l3556q296
945c3188K2609K3358l963k0224L543K4563n458m0403k0405K6270L7585P429k4786
958c070k3628J1483K9677j456k5722l040K1960M421k5628k3598Q866L8462K5921
971C4648k0521l3604M886K7881M29k4861j0187J5350J8332n511k7067o958L4138
984F955L0763j5701l3630l554K0627R800j5632k2257L890L1286J3731k4057j7870
997a5649K0053K4700p699k7726j3173J6378K3669o776l1683o188L2697K3849j2199
$$ plain form
906 -22380 -11232 24911 29554 324 -16068 976 29078 29644 -5731 -34807 -18911 12588 8190
919 8190 -14980 -10780 16665 27899 6438 -24335 -24624 10114 28933 -1943 -38656 -30109 766
932 766 10341 -2755 -10218 4181 23807 11261 -31253 -45255 -9552 23241 8664 -24892 -33188
945 -33188 -10579 12779 8816 -11408 -7865 16698 11240 -29163 -49568 -23298 14287 21716 -3070
958 -3070 -26698 -15215 14462 13006 -12716 -15756 6204 10625 -15003 -38601 -29735 8727 34648
971 34648 14127 -19477 -14591 13290 13719 -11142 -21329 -5979 12353 6842 -20225 -27183 6955
984 6955 37718 22017 -11613 -15167 5460 15260 -372 -22629 -18739 12547 26278 2221 -15649
997 -15649 4404 29104 21405 -6321 -19494 -3116 20553 13777 -17906 -24094 8603 32452 20253
1010B0253j9718j191J2495L120j9403j9986J4190L5400J973l2695j6991J9560
1022b993K7883N391j9238j8673N306J0696j4807j9946J4593L6742J0795k4769
1034A0980k8387j535K7131K0704j5258k5622K061J3205q170j6116P501K9615K2927
1047C9036j2582m0114j9913K4835K8201q295k1907q04J1504K099j0468o788J7438
1060B242L0832j175m0901k8018J5452K7396M616j3679q882J0204J5726p604k2423
1073a6214M413L1064P704k9497k8059K539K5320J7899r302j8084Q982K3566m162
1086A6169k6923q260J7648J5243p439k3489r073K2941K5382r140k4000L324K2708
1099A5091M961j8774k0487P00K0663R637j6538j1449K0454K2228j0320k5743o844
$$ plain form
1010 20253 535 -656 11839 14959 -4444 -24430 -10240 25160 27133 -5562 -22553 -2993
1022 -2993 24890 30281 11043 -7630 -2324 8372 -6435 -26381 -11788 24954 35749 10980
1034 10980 -17407 -18942 8189 28893 13635 -11987 -9926 3279 -4891 -21007 -13506 16109 39036
1047 39036 26454 -13660 -33573 -8738 19463 11168 -10739 -11543 -39 2060 -8408 -15196 2242
1060 2242 33074 31899 -9002 -37020 -21568 5828 10444 -3235 -12117 -1913 13813 6209 -16214
1073 -16214 -11801 19263 26967 -2530 -30589 -28050 -2730 15169 5867 -12217 -3235 20331 16169
1086 16169 -10754 -19014 -1366 13877 6438 -17051 -26124 -3183 22199 13059 -10941 -7617 15091
1099 15091 20052 1278 -19209 -18509 2154 11791 -4747 -16196 4258 26486 16166 -9577 -16421
1112a6421J6749J9789m859k8649j2998K0349J9023q014r798J2039J6677l753k6335
1125f201k3324J1082L4510R460k6871k0137J0970J7762K721n763j93J0789N099
1138A9904k3152l2454M784L7843K1230j3953k2830n306J3049J1836o462j0426
1150e937J0641J3066j8232l2057j590L0881K9174R86k5426j9586J0046J6625p599
1163I92j4962P489J5578l616k0787j3198J4184L3148J2817k5152k5636O353J5541
1176B751l852j3644k40J4014J2690p382k1385M12K7368J4326j9639k2540J026
1189a6095J3906N931j0365j2716J0669K5268K646k3378r861J5804J2344r559j9151
1202a4557o219J7749J9478q664k3543K875K5892J0433j3668j5467r54J0050L026
$$ plain form
1112 -16421 328 20117 15258 -13391 -26389 -6040 12983 4969 -4829 7210 23887 20134 -6201
1125 -6201 -29525 -18443 16067 25527 -1344 -21481 -10511 7251 9972 4209 4016 14805 19904
1138 19904 -3248 -35702 -30918 6925 28155 14202 -8628 -13934 -885 10951 4489 -5937
1150 -5937 4704 17770 -462 -32519 -34109 -3228 25946 26932 1506 -18080 -8034 8591 992
1163 992 -13970 -6481 9097 5481 -15306 -28504 -14320 18828 31645 6493 -19143 -12790 2751
1176 2751 -1101 -14745 -14985 -971 11719 4337 -17048 -16636 10732 25058 5419 -17121 -16095
1189 -16095 -2189 3742 -6623 -19339 -8670 16598 19244 -4134 -13995 1809 14153 4594 -14557
1202 -14557 -20776 -3027 16451 7787 -15756 -12881 13011 23444 9776 -5691 -6645 3405 6431
1215F431j6367j0752K0353K7627n402k6160r255J4771J7308M99j8165j1410J1456
1228I34Q858j4898j1593J9645K7881K833k3782k3975R59K3798J2014j7001j3906
1241h233J1169J0934r948j1565P389K3788J5560j7014l6028j0188K5492J8928
1253B0284q816j1756M190J0087N05j2461q148J6569K3106r174l4659j4289J8152
1266f410K1058K727j0955o196J1271J0296j4933j9846Q540K3933P53k3838j7247
1279b0847Q452K4039J1157j5230j5104J1954J5871j1724k3309j957J6650J2579
1291A2531p489j9427j670K4103J4863j8268k0127O882J6519k94j7530j4248P985
1304a6170K1992L041j9402n768K0760J1990j5748k2070k960J6679J5212r623k2834
$$ plain form
1215 6431 -9936 -20688 -335 27292 21890 -4270 -13525 1246 18554 19053 888 -10522 934
1228 934 9792 -5106 -16699 2946 30827 33660 9878 -14097 -13138 10660 22674 5673 -8233
1241 -8233 2936 13870 3922 -7643 -254 23534 39094 22080 -13948 -24136 1356 20284
1253 20284 11468 -288 3902 13989 14494 2033 -6115 10454 33560 24386 -10273 -24562 -6410
1266 -6410 14648 17375 6420 224 11495 21791 6858 -12988 -4448 19485 20238 -3600 -20847
1279 -20847 -12395 11644 22801 7571 -7533 4421 20292 8568 -14741 -16698 -48 12531
1291 12531 5042 -14385 -16055 8048 22911 4643 -15484 -8602 7917 7623 -9907 -24155 -16170
1304 -16170 5822 8863 -10539 -16307 4453 16443 695 -21375 -24335 -7656 7556 -2067 -24901
1317b4901O66K3685Q697j5194r080J0583J2026n630k3173j5611J6916K8016r69
1330F031k2857n996J5086J0705n833j2510j080J4162N700k1056k0658J2881K9228
1343C803Q536j4524j4215K034J3158K367j5687q602J6996J3210j4326j9765M265
1356b2750K3385J7466o661k1761p994J5588P324j5307r670J3702J6567k143j5140
1369g394r086J3449K3520p34k5347j2262J4323J1654q384j0692L906J7253J2076
1382B2282j3200j9838N830K3053J726k1263j2686Q559J5524L500j2735q318J5941
1395H375J8919r084k3163k080J6088P309j1243j5221J010K0482J2803j5058j6028
1408f891R903J7665l123j7808r342P092J3786p67j7358m359K1150J6104j2395
$$ plain form
1317 -24901 -24235 -550 8147 -7047 -16127 -5544 6482 852 -22321 -37932 -21016 7000 6031
1330 6031 -16826 -22822 -7736 2969 -2864 -15374 -16454 -2292 3408 -17648 -38306 -25425 3803
1343 3803 12339 -2185 -16400 -14366 -1208 1159 -14528 -23130 -6134 7076 -7250 -27015 -22750
1356 -22750 635 18101 11440 -10321 -18315 -2727 4597 -10710 -20380 -6678 9889 7746 -7394
1369 -7394 -16480 -3031 20489 19755 -5592 -17854 -3531 8123 -261 -10953 -7047 10206 22282
1382 22282 9082 -10756 -4926 18127 19853 -1410 -14096 -5537 9987 13487 752 -7566 8375
1395 8375 27294 18210 -4953 -7033 9055 16364 5121 -10100 -9090 11392 24195 9137 -6891
1408 -6891 3012 20677 17554 -254 -9596 -2504 11282 10515 -6843 -11202 9948 26052 13657
1421A3657j8810j158J2366O953r458j6465J897J9499M682j6818p024J5293J4026
1434A8640m618j7911j2530Q316J5795k943j7484j63J7980P672j0785j1096L081
1447f046J3992N707j6436j9721O273K0868J772j3673l587J2055J0648l489j6583
1460h220p836J4546J3143j2422j8872K966J7615R046n876j0818N44J4979M086
1473A2881j8612j3328J1174J5537l288j2792m264J1192J5743r65j6911o292J4671
1486D746P094j3832j2558M341J4159P780p258j2572N101J8382J983j9198r657
1499a1489R619R997l068j1563m723J3048J6569m922j7983k89J5221M453j2563
1512B307j2433J041J3061Q412j0785j1461J0097J8616k707j6632p256P292R688
$$ plain form
1421 13657 -5153 -6311 6055 13008 3550 -12915 -11018 8481 13163 -3655 -10679 4614 18640
1434 18640 14022 -3889 -16419 -8103 7692 4749 -12735 -12898 5082 12754 1969 -9127 -6046
1447 -6046 7946 13653 -2783 -22504 -16231 4637 6409 -7264 -10851 1204 11852 8363 -8220
1460 -8220 -16056 -1510 11633 -789 -19661 -16695 920 9966 4090 -6728 -6184 8795 12881
1473 12881 -5731 -19059 -7885 7652 4364 -8428 -12692 -1500 14243 13278 -3633 -9925 4746
1486 4746 11840 -1992 -14550 -10209 3950 11730 4472 -8100 -2999 15383 17366 -1832 -11489
1499 -11489 -1870 8127 5059 -6504 -11227 1821 18390 13468 -4515 -4804 10417 14870 2307
1512 2307 -10126 -9085 3976 12388 1603 -9858 239 18855 16148 -484 -7740 -448 9240
1525I240k830j4580n695J6726J4165r948j4529M866J4500L121j2182j4882K63
1538a1765J5928O305j4507q805J3219J4501l960j3404n970Q212J1734n451j9808
1551a3771l773J7826J1084q773r536L970J0916M348j1213j4654M231J6162o06
1564F211j6370n119J2673J2475r68j0680o128R177J0789r929j8301K023J6452
1577B305N062q729q461M042J4359O145j3977j3654P659J3112m862j3674l502J0791
1591c384J2446K16j2848m977J3860R472j2922j5116L085J2198M531p275r925M648
1605e991J6388M473j5147q682J0640Q930p074j3244l820J0636J4300k508j5018
1618f117k90J5585N536j2505j0194K644J0335L217j1580j1749R314J9899J385
$$ plain form
1525 9240 6410 -8170 -13865 2861 17026 7078 -7451 -2585 11915 15036 2854 -12028 -11765
1538 -11765 4163 10468 -4039 -12844 375 14876 10916 -2488 -8458 -246 11488 6037 -13771
1551 -13771 -17544 282 11366 2593 -6943 -2973 7943 12291 1078 -13576 -9345 6817 6211
1564 6211 -10159 -15278 -2605 9870 8902 -1778 -7906 1271 12060 2131 -16170 -14147 2305
1577 2305 7367 -1362 -9823 -5781 8578 14723 746 -12908 -5249 7863 3001 -10673 -14175 -3384
1591 -3384 9062 9278 -3570 -8547 5313 14785 1863 -13253 -10168 2030 6561 -714 -10639 -5991
1605 -5991 10397 14870 -277 -8959 1681 10611 3537 -9707 -13527 -2891 11409 8901 -6117
1618 -6117 -6407 9178 14714 2209 -7985 -5341 4994 8211 -3369 -15118 -5804 14095 15480
1631A5480j4550o161Q182O292m409j1794m010J1954J1587r684j4230N703J6789
1644A1149N127r510j1383p04R228K554j2015p801J3646J4565n901j4057j821J0751
1658C828J0491m001j6654o500J2664P457j0201p691Q573J3235K481j0981j2322
1671i621L527J4813J298j7124p780J1244R976k862q029j745J0770R701q495j8350
1685a2677k07J5224L874j1314p993N656J2181M825j0066j0258P618J3399o119
1698D143j6715l313J1082Q530l224j0448j692J4679J0305j1789j5538L203J2679
1711A902K67j0071p373N074J3613K972j3461o233J3516J0860p968j5406l766Q884
1725g190R796k891j2159R76J6378N535j3777r414P283J1613q0j2698j1455O172
$$ plain form
1631 15480 930 -5231 2951 9243 4834 -6960 -10970 984 12571 2887 -11343 -5640 11149
1644 11149 16276 6766 -4617 -5321 3907 6461 -5554 -13355 291 14856 8955 -5102 -6923 3828
1658 3828 14319 10318 -6336 -12836 -172 7285 -2916 -10607 -2034 11201 13682 2701 -9621
1671 -9621 -6094 8719 10017 -7107 -14887 -3643 6333 3471 -4558 -6303 4467 14168 5673 -12677
1685 -12677 -12884 2340 6214 -5100 -13093 -7437 4744 9569 -497 -10755 -3137 10262 4143
1698 4143 -12572 -15885 -4803 3727 503 -9945 -11637 3042 13347 1558 -13980 -10777 1902
1711 1902 2169 -7902 -15275 -10201 3412 6384 -7077 -13310 206 11066 3098 -12308 -16074 -7190
1725 -7190 2606 -285 -12444 -11468 4910 10445 -3332 -12746 -5463 6150 6070 -6628 -18083 -11911
1739a1911J6707J938j2439j875J1992O189q046j1848j884J1153J0083q980j5213
1752a4134L715J7137M990q871n874M559P988j134j3915q180J2128J4662m698j3598
1766e225l6J1675P894l860j0828k785J0921M813j3286j0738R803J4979J665r760
1780E232p092M904J1951n41j4689o145J1314P529p693r561K214J2731Q565o468
1794A2251j3776k69J2949K035j3264p328O920J0211J233q708o128Q060J3205m405
1808A2986j6225l479J0026N434o491q655K73J1250Q981q187j2365M380J1543j496
1822G975j1697o969N079R364J743j0474n915J1663J1419o761j2823r56Q260K822
1836B730o134r769R47J4197N862j1130q926P880J0522k002j0326p621M276R699
$$ plain form
1739 -11911 4796 6734 -5705 -7580 4412 10601 2555 -9293 -11177 -24 10059 1079 -14134
1752 -14134 -10419 6718 11708 2837 -3037 1522 9510 8376 -5539 -13719 -1591 13071 8373 -5225
1766 -5225 -5261 6414 14308 10448 -380 -3165 7756 12569 -717 -11455 -1652 13327 14992 5232
1780 5232 -1860 3044 14995 14454 -235 -6380 4934 12463 4770 -4791 -2577 10154 18719 12251
1794 12251 -1525 -1794 11155 13190 -74 -7402 -482 9729 10962 2254 -3874 4186 17391 12986
1808 12986 -3239 -6718 3308 8742 2251 -6404 -6131 5119 14100 5913 -6452 -2072 9471 7975
1822 7975 -3722 -10691 -5612 3752 5495 -4979 -10894 769 12188 5427 -7396 -8352 -92 2730
1836 2730 -3404 -13173 -12226 1971 7833 -3297 -12223 -4343 6179 4177 -6149 -13770 -9494 205
1850B05o56j1802j377J4164P751q064j0469P5Q300N846p509j2111K353J3978J914
1865B598j0206k926R164Q573k481j1802p582Q033J1041n058j1795J002J2228M831
1879E620n251p029J581R944L385j2512j1473O810J2483K30p994l128O192Q363
1893G221l66j1084m174R936O661r197j0587K669J0563O151l391q235J139J0504
1907G810J481j2822o235Q213P978k831q708l346Q199J1822j566j2270k556R735
1921D904K584q857p432K793R488N454p157r638N172J3439K66j1633n675M779N256
1936C743j596p517l459J0343J0438n877j1485J717R782K186p065q542l93R306
1950A581N027q305o640Q889J0200k879r487m259M897P083k181j1068l662J2664
$$ plain form
1850 205 -451 -12253 -13630 534 8285 221 -10248 -10173 -1873 3973 -3536 -15647 -13294 684 2598
1865 2598 -7608 -10534 -1370 7203 4722 -7080 -14662 -6629 4412 -646 -12441 -11439 789 5620
1879 5620 369 -6660 -5079 4865 8250 -4262 -15735 -8925 3558 3788 -4206 -7334 -1142 7221
1893 7221 6855 -4229 -8403 1533 8194 -1003 -11590 -8921 1642 7793 4402 -3833 -2694 7810
1907 7810 9291 -3531 -9766 -1553 6425 3594 -5114 -8460 -261 11561 9995 -2275 -4831 4904
1921 4904 7488 -1369 -8801 -6008 3480 8934 1777 -7861 -2689 10750 11016 -617 -6292 -1513 3743
1936 3743 2147 -5370 -8829 1514 11952 6075 -5410 -3693 6089 8275 1210 -7332 -7725 1581
1950 1581 6608 -1697 -8337 552 10752 7873 -1614 -5873 -976 6107 3926 -7142 -10804 1860
1964A860Q078o647p475K340P825L164o777r752J306J0888J740j0617m353R680
1978A260R004r52p946n817M713P803l820j1494R28J0792L344o781n364L799R331
1993H800M676r012j1828L196J0020q65q261j282P406O310j786q800l320J0095
2007E349R079q598j2515k94Q358L952k822m074J995Q908J622j1719o827Q683Q693
2022I790l708r768m145M882Q825J244p405r85R397K203j0748q136L551Q829L643
2037G469o340r399K952J1989K220q645l104N959L138m897q856k331Q885R906l741
2052E205j0835J51J0057L362o216o146P23N481K405q761o229P671J1470j626q718
2067b006k589N239N221k357r516l720Q861O744o421p111M333Q858J842o396o917
$$ plain form
1964 1860 9938 3291 -4184 -1844 5981 9145 2368 -7384 -6078 4810 6550 -4067 -8420 1260
1978 1260 10264 9312 1366 -4451 262 8065 4245 -7249 -6321 4471 7815 1034 -4330 -531 8800
1993 8800 13476 4464 -7364 -4168 5852 4987 -3274 -4556 2850 9160 7374 -1426 -4746 5349
2007 5349 14428 5830 -6685 -6979 1379 5331 2509 -1565 430 9338 10960 -759 -7586 1097 9790
2022 9790 6082 -3686 -7831 -2949 5876 7120 -285 -1270 8127 10330 -418 -8554 -5003 3826 7469
2037 7469 1129 -8270 -5318 6671 8891 246 -2858 3101 6239 1342 -7514 -9845 -960 8946 5205
2052 5205 -5630 -5479 4578 7940 1724 -4422 -3699 1782 4187 -4574 -10803 -3132 8338 6712 -2006
2067 -2006 -4595 644 5865 3508 -6008 -9728 -867 5877 -544 -7655 -3322 5536 7378 982 -5935
2082e935J787Q665O15j1518n645Q584R416j586o116j756M340N469l948j0612N62
2097g678J0734K778q977o656M169R270N307n338q179J798O992k715j0441J86R497
2112G47N925l993q710k527R332R798m840j0536o63O348l93o010k366N720R502
2127G334J587j0660q392P495J0531k213q848l580L840L770j258n776J967J1511
2141G308M828j0518j0295L087Q411K368n453o528J478Q741J302q072j410R540
2155D787N664o191j0010k898O823P806k991r379J889J0192K378p390m468L682
2169a06N934N08r036p125O250J0614j779r375q2Q190N116m271q594k751P095N790
2185F378o948q249N402R615O14p645m501M167Q469K28j0737p219O367P609k606
$$ plain form
2082 -5935 -4148 4517 5132 -6386 -12031 -3447 5969 4383 -1733 -3489 851 6320 2372 -8240 -7678
2097 -7678 3056 5834 -3143 -9799 -5630 3640 8947 3609 -4570 -2772 4220 1505 -8936 -8750 747
2112 747 6672 2679 -6031 -8558 774 10572 5732 -4804 -5467 881 488 -5522 -7888 -2168 7334
2127 7334 8921 -1739 -10131 -2636 7895 5682 -3166 -6746 -2906 864 -394 -6170 -4203 7308
2141 7308 12136 1618 -8677 -5590 2821 5189 -264 -6792 -5314 3427 4729 -3343 -4753 4787
2155 4787 10451 4260 -5750 -8648 -1825 5981 2990 -6389 -4500 5692 8070 680 -3788 -106
2169 -106 5828 6336 -2700 -9825 -3575 7039 5260 -4115 -4197 3993 9109 4838 -3756 -6507 588 6378
2185 6378 -570 -8819 -3417 6198 6812 -833 -5334 -1167 7302 7530 -3207 -10426 -4059 3550 944
2200I44n873J609O764L444n312r592J91J0771M397r951p985L243P238J538k636
2215a210k823L843O739m722j2016j898J0397O701m117q342k024O056P097k544
2229A137o780K731O859k987j0266l772O310R381K109p829o156N188Q118k807o608
2244e372L67N636J80n670n831K049J1014O096p573q214L423P439j235n944l146
2259f781L337O440p65q330j462J0267P195n844p799KM749L948m295p281J193J0328
2275D902K955p567l460N317N498j342o788m368M530P527k801q957K31R463M572
2290I712l586n610k32M666K337o320p114N519R136o35q383k647N471O598N44p073
2306B383n317M828M554n567o363L898Q532K664n030p346J86Q571L332p751o239
$$ plain form
2200 944 -4929 -3320 3444 6888 1576 -8016 -7825 2946 7343 -2608 -10593 -7350 -112 1426 -1210
2215 -1210 -4033 -190 6549 1827 -10189 -12087 -1690 5011 894 -7448 -9472 -3416 3681 1137
2229 1137 -5643 -2912 3947 960 -9306 -13078 -6768 2613 4722 -3107 -9263 -4075 4043 1236 -5372
2244 -5372 -5005 631 811 -4859 -10690 -8641 2373 8469 896 -7318 -3895 3544 2309 -3635 -6781
2259 -6781 -3444 2996 2231 -6099 -7561 2706 9901 4057 -3742 -3740 1009 4957 662 -6619 -5426 4902
2275 4902 7857 290 -3170 2147 7645 6303 -485 -4853 -323 7204 4403 -4554 -4323 5140 9712
2290 9712 6126 516 284 4950 7287 967 -6147 -628 8508 7873 -510 -3157 2314 8912 9456 2383
2306 2383 -2934 1894 6448 881 -5482 -1584 6948 9612 4582 -2764 -2578 5993 9325 1574 -4665
2321d665L986M682k458m581kO299O608k746j0342k987P672M837n138n746J103
2336c478M977K104l696m624M439Q881j186j1212m364N155N364n6m867l146N096
2351f13O962l479p467J095P345J386o438n557M43P138M083m988n410M731P378
2366F609j928o837k576L699L996r74p063j567Q176N788m735o494K524N624J359
2381E601m507o464Q3P827K389p278k447O352N686j989o220l173M120O065j904
2396D141r251j063P804L780l821l382K155N092J189o086o861K541Q549j63p396
2411b772k152M943N130l89m841l064N039M525n629q294J916P583K614l475m582
2426c448R34N972L063o604n838L826N673k719n954j063M401N927k59o646k396
$$ plain form
2321 -4665 -679 4003 1545 -3036 -3038 3261 9869 7123 -3219 -6206 1466 6303 1165 -4581 -3478
2336 -3478 1499 3603 -93 -4717 -278 8603 7417 -3795 -8159 -3004 2360 2304 -2563 -5709 -613
2351 -613 6349 2870 -4597 -3502 3843 5229 -1209 -6766 -6323 815 4898 -90 -5500 -769 6609
2366 6609 4681 -2156 -4732 -1033 2963 1989 -5074 -6641 1535 7323 2588 -3906 -1382 4242 5601
2381 5601 1094 -5370 -5287 2540 4929 -2349 -4796 1556 7242 5253 -967 -4140 -20 6045 4141
2396 4141 -5110 -6173 1631 5411 1590 -1792 363 5455 6644 558 -6303 -3762 4787 4624 -2772
2411 -2772 -4924 19 5149 4760 -81 -3145 1894 6419 790 -7504 -5588 1995 4609 1134 -3448
2426 -3448 -2514 3458 6521 -83 -5921 -2095 3578 859 -5095 -6158 -1757 4170 3911 -2735 -5131
2441e131O503L936o244o144J591M946J736k788m551K409P167J423p953l510N037
2456a573L892k665n239k418M780O209j318o689K31P490J553o244m729J777M996
2471E3K007n079n630M697Q230k56o271k107M251K565j928n719k266O555N886m595
2487C93o074K609O559J638m258m960N82N382J520o942l877O775O449j733n285
2502a222j045L603M127k063p353j426P070L648n348l851L570M934J761l927n195
2517b717J771O357n50p947k249O540M578j158m622j514M429M977l486p309M51
2532b449O801O18n522l523L136O689L225n771n967L530N739k363o931P4M633L422
2548E341j981n570n02P569N091n763p380J448M914l7l782k704L149O147K26p328
$$ plain form
2441 -5131 1372 5308 -936 -7080 -5489 -543 1193 -1595 -6146 -3737 3430 4853 -3100 -6610 -1573
2456 -1573 2319 -346 -5585 -8003 -3223 2986 1668 -5021 -4790 2700 4253 -1991 -6720 -4943 53
2471 53 2060 -3019 -8649 -3952 4278 4022 -2249 -4356 -105 2460 532 -5187 -7453 -898 4988 393
2487 393 -5681 -3072 3487 5125 867 -4093 -3511 1871 3391 -3551 -7428 -653 5796 4063 -1222
2502 -1222 -2267 1336 5463 3400 -3953 -5379 1691 5339 -9 -3860 -290 4644 6405 2478 -2717
2517 -2717 -946 5411 4861 -3086 -5335 1205 5783 4625 3 -1511 2918 7895 4409 -2900 -2449
2532 -2449 4352 4970 -552 -4075 -939 5750 8975 3204 -2763 767 6506 4143 -2788 -2714 1919 5341
2548 5341 3360 -2210 -2712 4857 9948 4185 -3195 -1747 3167 3130 -652 -3356 -207 5940 6166 -1162
2564a162l157O388N491l820o169j845L203M371j878n159J223P865J545p145m582
2579d831L020M585Q62n010n157K814P106l79o501k10N662K872l815n647j746N163
2595a212M460m156o574L313O947R70n404l273J711M995O47o115n044M917O148
2610B330l059n175J015N876K968k750o902k060O389M068n358m892L203M947m1
2625E59l560k583M049N963j321r090l705O111N263j917l459J01M118K643l336
2640a64n695K440P660j16p934m330L096O054K454k736l870L277M724l040o929
2655e109P34O470K747m006n614l08O467N101l061n292K360M431k189n276j580
2670d125L582N629L61o236l106N834N650l245n232M02K895J446l041m596J381
$$ plain form
2564 -1162 -4319 2069 7560 3740 -2429 -4274 -1071 3300 1422 -3737 -2514 5351 6896 -249 -4831
2579 -4831 -1811 2774 3636 -1374 -6531 -3717 3389 3010 -3491 -3701 1961 4833 1018 -4629 -6375 -1212
2595 -1212 3248 -908 -7482 -4169 2778 3748 -1656 -4929 -3218 1777 2424 -3691 -8735 -3818 2330
2610 2330 -729 -5904 -4889 987 3955 1205 -5697 -7757 -1368 2700 -2658 -7550 -4347 600 559
2625 559 -3001 -5584 -1535 4428 3107 -5983 -9688 -3577 1686 -231 -3690 -3589 529 3172 -164
2640 -164 -5859 -3419 4241 4125 -3809 -8139 -5043 1011 3465 729 -3141 136 4860 1820 -5109
2655 -5109 -4375 2095 4842 836 -4778 -5086 1381 6482 3421 -1871 489 4920 2731 -2545 -4125
2670 -4125 -543 5086 5447 -789 -3895 1939 7589 4344 -888 -486 2409 3855 814 -3782 -2401
2685b401P324K768o231m020M090L934j040m123l647K872N081q02o378m34O309
2700C302K330l031l477Q4K899K199m833n365K748P219N77n461k083K559L361m34
2716B594m427k441L976L810m520o164J684O905L339k784m550j789L630K386m593
2731b944l342M389M249k494n244j154M257N832P62o799m098L721K733l420k039
2746e591K723M112Q67l942m428J481P487J760o240m135K223K841m19j676k69M068
2762H62M292k839p596j2O591L091l659m059n66L545L199k706l012L605N581k025
2778D292o333j654L743L659jm481k102M499M579k801m320J623M336M84l782m060
2794b319P15N547K101m612l248M576M870k173m116j844J958L552p15m996p93N171
$$ plain form
2685 -2401 4923 7691 1460 -2560 1530 5464 4424 301 -3346 -474 4607 3805 -2573 -3007 3302
2700 3302 5632 2601 -876 -792 2107 4306 -527 -5892 -3144 4075 4652 -809 -2892 -333 3028 2594
2716 2594 -1833 -4274 -298 3512 -1008 -7172 -5488 1417 4756 1972 -2578 -4367 -737 1649 -2944
2731 -2944 -6286 -1897 2352 -142 -5386 -6540 -2283 3549 4311 -2488 -6586 -2865 -132 -3552 -5591
2746 -5591 -2868 1244 2111 -1831 -6259 -4778 2709 4469 -1771 -5906 -3683 -842 -1261 -2937 -3206 862
2762 862 5154 2315 -5281 -5293 1298 4389 730 -3329 -3895 -350 2849 143 -2869 736 6317 4292
2778 4292 -2041 -3695 48 3707 3706 -775 -2877 1622 6201 3400 -920 703 5039 5523 1741 -2319
2794 -2319 -1604 3943 6044 1432 -1816 2760 7630 5457 1341 -503 1455 5007 4292 -704 -1497 3674
2810C674K647l900k931K142L972J041l985n647L74O152J352m614r13L404J759
2825D527j493l548r68L655M086l583p371j33N611K381j191j768l23K420P35m663
2841a626l629L797N920j942n802j917K725M139J437l536k185L023J716m708m216
2856f804K848N361R14k956m446J71N852K780m865k816K572K079l197k742k20M001
2872a468M949j170o467j099N379K380l551k686R91K186J091l004l051K944O716
2887D140n25n725j665K643K600r96l080j412L329M069k558m454K131M740K87k812
2903G12l134K01L294J932m275l011M199N054j574l597p11K029K321q09m268j341
2919b978N209K495l885l588K439M509J075k584l928J00L822P97m728r57M810K642
$$ plain form
2810 3674 6321 2421 -510 1632 5604 6645 2660 -2987 -2613 3539 4891 277 -636 2768 4527
2825 4527 3034 -514 -1482 2173 6259 2676 -4695 -4828 783 3164 1973 205 -118 2302 3037 -1626
2841 -1626 -5255 -1458 4462 2520 -3282 -5199 -2474 1665 3102 -434 -2619 404 2120 -2588 -6804
2856 -6804 -3956 1405 2319 -637 -5083 -4912 940 3720 -1145 -3961 -1389 690 -2507 -5249 -5469 -1468
2872 -1468 3481 2311 -4156 -5255 124 2504 -1047 -3733 -2742 -556 535 -2469 -5520 -2576 4140
2887 4140 3615 -2110 -3775 -1132 1468 472 -2608 -4020 -691 3378 820 -3634 -1503 3237 3524 712
2903 712 -2422 -2221 1073 3005 -1270 -4281 -82 4972 3398 -199 -910 1119 3440 2631 -1637 -2978
2919 -2978 2231 4726 841 -2747 -308 4201 5276 2692 -1236 -1136 2686 3483 -1245 -2202 2608 5250
2935E250k662l564l57L250M105j758o125o66L680J569l355p86K490L172N96m579
2951B60m052K728N907j343n030j372K659J485k21j894o93M466K308m778n846J643
2967c773N523M61k860k487L80L396J644l841k188M175L185l975n072Q2L171L449
2983A270k96m492r52M730K067m601k672K464K969l51l942k878K083N902N06n116
2999c309j649M327J556k351k940q96L393L054k372m997J647N634J012l949j795
3014c635J012K712K76l552l351L738N299k197l884K28L524J978j685l752j112
3029d401M521K826m095l789K895M457M17k720j682Q07L649p0n550j590M900L507
3045D082k379k917j52K991K799j163m154P3M190O9m816j586L526L809M89k733
$$ plain form
2935 5250 2588 -976 -1333 1917 6022 4264 -1861 -2527 1153 2722 -633 -1419 1071 4243 4839 260
2951 260 -3792 -1064 4843 3500 -1530 -2902 -243 1242 1021 -873 -1566 2900 5208 430 -5416 -3773
2967 -3773 1750 2211 -649 -3136 -2756 640 2284 -1557 -3745 430 3615 -360 -5432 -5350 -2179 1270
2983 1270 974 -3518 -4470 260 2327 -2274 -4946 -2482 487 136 -3806 -6684 -4601 1301 1807 -3309
2999 -3309 -4958 -631 925 -1426 -4366 -5262 -1869 1185 -1187 -6184 -4537 1097 2109 -1840 -3635
3014 -3635 -2623 89 365 -3187 -6538 -2800 2499 302 -3582 -3354 170 2148 463 -3289 -4401
3029 -4401 120 2946 -1149 -4938 -2043 2414 2831 111 -1571 -764 2885 2815 -2735 -4325 575 4082
3045 4082 1703 -1214 -1366 1625 4424 3261 -893 -820 3370 3439 -1377 -2963 563 4372 4861 2128
3061B128l621K005M579m73m986o93L673J002k541k298Q54M108L550l464n244P37
3077f84M450j76k883r95J106K108M08l580j498M704L904k828n242m15K614J621
3093B614j098k356O1L930J364m647k895L863L317r47l912k244Q73M173L22l951
3109a533o76M573J550l692l091Q42L087J700k511m121M33M820J022l733j168K830
3125C32J487r63l263k011K794L915j749m727O48L808J665j817k175m72K963J200
3141A635l536l660K840M189m38l117o45K072K793m77m252k139L855L125k882l312
3157c949J561K925R57j258k684P13L915O91n145k674L442L187l91j955j313J540
3173d38L098j111l722J20L979J122l787k840R61L306K834j712l498J045L590j030
$$ plain form
3061 2128 -1493 512 5091 4618 -368 -1061 2612 3614 1073 -1225 -371 3737 7287 3823 -1421 -684
3077 -684 3766 3590 707 -288 818 2926 3334 -246 -1744 2960 6864 4036 -1206 -1621 993 2614
3093 2614 1516 -840 -779 3151 4515 -132 -3027 836 4153 3206 -706 -2950 -2077 2096 2418 -1533
3109 -1533 -2209 2364 3914 222 -2869 -2027 1060 2760 249 -3872 -3439 1381 2403 -1330 -2498 332
3125 332 1819 856 -2407 -4418 -1624 2291 542 -4185 -3537 271 1936 119 -2056 -2528 435 1635
3141 1635 -1901 -5561 -2721 1468 1030 -2087 -2732 -660 2133 1656 -2596 -4735 -880 2245 -637 -3949
3157 -3949 -2388 537 1494 236 -2448 -1735 2180 2871 -2274 -4948 -1506 1681 1290 -665 -1978 -438
3173 -438 2660 1549 -2173 -2053 1926 3048 -739 -3579 -2618 688 3522 1810 -1688 -643 2947 1917
3189A917l485n27K945J802q12l800j223L493M540j636l947L8K398j21k057j369
3205a844P69L792J268l962l821L662M151q44l049j412Q41J534J70k938m84M580
3221B413J758l186l480J433K510J240j538l547k37L773J007l898p36L799K045
3236C356j859k600j556J832L145j553l817R3L931Q27k394j445R03K274J186k946
3252f23l545J760M005p59l675k32K793K071L3l119j955K865K538k482l364J290
3268b399L114M7j615j709P95L580J222l708k826J965K525q85j829o1J756K269
3284B241q47l641k77M304J755l451k884O78J716J752q37j556Q17L309m78m306
3300a705n26L065K235j035k843j656J895L426l85k821R98K652l78l206j561J484
$$ plain form
3189 1917 -1568 -2095 850 2652 1840 -1960 -3183 310 4850 3214 -733 -695 1703 1582 -475 -1844
3205 -1844 -1075 2717 3985 23 -3798 -136 4015 3171 122 -1290 -449 1085 1255 -1683 -2167 2413
3221 2413 4171 985 -2495 -1062 1448 2688 1150 -2397 -2634 1139 2146 -1752 -2488 1311 3356
3236 3356 1497 -1103 -2659 -827 2318 765 -3052 -2959 972 1799 -595 -2040 -1137 1137 2323 -623
3252 -623 -4168 -2408 1597 838 -2837 -3069 -276 1795 1828 -1291 -3246 -381 2157 -325 -3689 -2399
3268 -2399 715 762 -853 -2562 -1767 1813 3035 -673 -3499 -1534 991 106 -1723 -1784 -28 2241
3284 2241 1394 -2247 -2524 1780 3535 84 -2800 -2122 -406 1346 509 -1047 -230 3079 2601 -1705
3300 -1705 -2231 834 3069 2034 -809 -2465 -570 2856 2471 -350 648 3300 2922 -284 -1845 -361
3316c61K599J603k841l237K018L957r50k345L28J142O60r82k825r50L894K715
3332D425k805l039J327K513M36j233k130K32K448L89l560j382L143L040j638k199
3348c3q37J661J752n74l922l45L781R25k773j399J357K236K67j952k337J259L029
3365B095o15m329k81L014J724p07j859j021J415K543k120l482J266L080j55k355
3381a787j337Q58L057J125k310k592J663K419k030k686O92K293J815p46l448q35
3397c849L594K593k598l111J146J749m23j410j156J532L347L20m055j670L292
3412f99K145j312k409n60J385J841j007k374Q19L808M72l503j539R87K413O44
3428A111j917k660J764L242l63l139O22K594J104k031k024j065K476K688k224
$$ plain form
3316 -361 2238 3841 1000 -2237 -219 3738 2788 443 771 1913 2573 1591 -1234 -2184 1710 4425
3332 4425 1620 -1419 -92 2421 2857 1624 -506 -274 2174 2563 -997 -2379 764 3804 2166 -33
3348 -33 -870 791 2543 1969 -1953 -2298 1483 2408 -365 -1764 -407 1829 2096 144 -2193 -934 2095
3365 2095 1480 -2849 -3130 -116 1608 901 -958 -1979 -564 1979 -141 -3623 -2357 723 568 -1787
3381 -1787 -3124 -2266 791 1916 -394 -2986 -1323 1096 -934 -3620 -2928 -635 1180 434 -3014 -3849
3397 -3849 -255 2338 -260 -3371 -2225 -476 -899 -2309 -3465 -1933 1414 1734 -2321 -3991 -699
3412 -699 1446 134 -2275 -2835 -1450 391 -616 -2990 -2171 1637 2109 -1394 -2933 -1946 467 1111
3428 1111 -806 -3466 -1702 1540 1177 -1962 -1340 1254 2358 327 -1697 -2762 -286 2402 178
3443A78k685J571L215j13k154j162J005J789P03l488j730L164K922j892k230M80
3459d27K093J289j008k876p51L415J174k655j934K076K156n2j713j552J246K786
3475C267r0l928j316L144J421j288j694N02J882J649k184k880N83L562J86l049
3491b33j311J087J694R47j699j877K340K338j932l311J06K309J204j069j943m91
3507a841K318K080k438k429K047K050j240k004j017P97K612O05k951j706L281
3522A64J772k164j959L73J232J101j469k192N90L207J245l167j307J984J434m86
3538C58j956j499Q17L079l03k948q0K948R82j263k097O5J478J809k365k368J344
3555a999L077Q0k281l41J367J035J47j986j473K237K375j572k671P90K446J117
$$ plain form
3443 178 -2507 -936 2279 2166 12 -1150 -145 1644 2347 -1141 -2871 293 3215 1323 -907 -427
3459 -427 1666 2955 1947 -929 -1680 1735 2909 254 -1680 396 2552 2500 787 -765 481 3267
3475 3267 3177 -751 -2067 1077 2498 1210 -484 18 1900 3549 1365 -1515 -932 2630 2816 -233
3491 -233 -1544 -457 1237 2184 485 -1392 948 3286 1354 -1957 -1851 458 1662 593 -1350 -1841
3507 -1841 477 2557 119 -2310 -263 1787 547 -1457 -2474 -1677 935 1540 -1411 -3117 164
3522 164 1936 -228 -2187 -1814 -582 519 -950 -3142 -2552 655 1900 -1267 -2574 -590 844 358
3538 358 -1598 -3097 -2280 799 496 -2452 -2532 416 1398 135 -1962 -1897 -419 1390 -975 -3343 -1999
3555 -1999 1078 1158 -1123 -1464 -97 938 1085 -901 -2374 -137 2238 666 -2005 -1215 1231 2348
3571B348j129j574l48K203P86k739j596K133K603j032j443n75J123K130k54k867
3587b31o01K647R94k078j513J011J438J324r82j970K36K777P4l216o62J693J743
3604B684r78j013j226J472K422q01k847n3K495j60j658j141L42J857J457j874
3620I78k364J625K536j201j925l97J153O18L49k405j138L094K320k215k264M64
3636g72J132O55j055j316k85K643N71k651j548K812J870j118j437j231L95J909
3652E74l51k398k04K982O62j816j358P04J264J155j392k584M10K918j2k588R0
3669a944J993O85k34j780j228J609K207j711k473P18K405K33j090o80K74J417
3685D01R80k012k081J389K338j023j500mJ106J565Q9k348p65J887J551j603j733
$$ plain form
3571 2348 1219 -355 -703 1500 2286 -453 -2049 84 2687 1655 212 -363 760 2890 2636 -231
3587 -231 -832 1815 2809 731 -782 229 1667 2991 2009 39 275 3052 3126 -90 -752 941 2684
3604 2684 1706 693 -533 939 3361 2560 -287 -340 2155 1995 337 -804 -462 1395 2852 978
3620 978 -1386 239 2775 1574 -351 -748 405 1023 1372 -1033 -2171 923 3243 1028 -1236 -772
3636 -772 360 1015 -40 -1356 -1641 1002 1573 -1078 -2626 186 2056 938 -499 -1730 -1335 574
3652 574 223 -2175 -2379 603 1265 -551 -1909 -1205 59 1214 -178 -2762 -2352 566 554 -2034 -1944
3669 -1944 49 734 500 -1280 -2508 -899 1308 -403 -2876 -2158 247 480 -610 -1290 -1016 401
3685 401 1381 -631 -2712 -1323 1015 -8 -1508 -1512 -406 1159 1248 -1100 -1865 22 1573 -30 -1763
3702a763O31J416J40m28j372O57K706R9k537j646K052J379p91q63q43J056J851
3719A744n12k330N45K568J87k388j438P76P94J766q91j785P19J878p18j955J63
3736h77J609O49o56j962j003J939K260r51j683N81J167l74j621j86L12J824K20
3753A248j804j895J735K086j95j461n62R59N98m83k232o0K202J311k255j002P86
3770a024J294N96p03j696J27J781J1k400m94J988J390q02j124n37Q99J892j331
3787a33k171LK649K50j689n04L93J260J118j209j909J276J929j071k463K85J657
3804c29J741o03j652o67J869J435j667j842J358J689o55j525p81J358K094N87
3820B410k067j784J871J278r92j132J42J054J225j128j766K05K954R52k081j553
$$ plain form
3702 -1763 -1132 284 424 -4 -1376 -719 1987 2086 -451 -2097 -45 1334 543 -320 -1163 -107 1744
3719 1744 1232 -1098 -553 2015 2202 -186 -1624 -848 -54 1712 821 -964 -245 1633 915 -1040 -877
3736 -877 732 1381 725 -1237 -2240 -301 1959 1008 -675 -94 1073 699 -922 -1108 -796 1028 1248
3753 1248 -556 -2451 -716 1370 1175 -286 -848 111 709 226 -2006 -2066 136 1447 -808 -1810 -1024
3770 -1024 270 866 163 -1533 -1406 375 386 -2014 -2508 -520 870 68 -1056 -1593 -694 1198 -133
3787 -133 -2304 -2301 348 598 -1091 -1595 -1202 58 1176 -33 -1942 -666 1263 192 -2271 -1986 -329
3804 -329 1412 809 -843 -1510 359 1794 127 -1715 -357 1332 677 -848 -1629 -271 1823 2410
3820 2410 343 -1441 430 1708 716 -416 -274 780 2005 877 -889 -684 2270 3222 1141 -412
3836d12L92J060L89o65j038R38K031o33k994L21K334R20p51j611q58O24K072p53
3854A366j905R47K163q06j560j152J152J622M88k084j851J126K312q56j572M77
3870a33J077M74o92j844p48K497J170k195j593J469J430m80n40j001J18J995k83
3887G21k134q85J901J004r61j158J00J232R94o45k509o2K324R09k508o31J115
3904a193J046J62j119j047J144K153j027k637j75J652J067m96r92m75J589Q20
3920D72j460j309J050K114o81j801q81N41J920R48j537j216J497J501j764j398
3936b004Q42J606L27o88j830l70K684J214j812p88R85O21n72q19n74P46K231l23
3954A476k575n04K143J136r28q73J11L92N23o54j399J155K607o19j866p02J232
$$ plain form
3836 -412 -20 1040 1429 764 -274 664 2695 2062 -932 -611 1723 2643 1892 281 -577 47 2119 1366
3854 1366 -539 408 2571 1765 205 -947 205 1827 2315 231 -1620 -494 1818 962 -610 -133
3870 -133 944 1418 726 -1118 -1866 631 1801 -394 -1987 -518 912 432 -108 -1109 -991 1004 721
3887 721 -1413 -2298 -397 607 -354 -1512 -1412 -180 814 169 -2340 -2402 -78 831 -1677 -2308 -1193
3904 -1193 -147 15 -1104 -2151 -1007 1146 119 -2518 -2693 -1041 26 -470 -1462 -1937 -348 472
3920 472 -988 -2297 -1247 867 186 -1615 -2496 -1955 -35 913 -624 -1840 -343 1158 -606 -2004
3936 -2004 -1162 444 771 83 -1747 -2117 567 1781 -31 -819 166 787 215 -604 -1178 -432 1799 1476
3954 1476 -1099 -1603 540 1676 748 -125 -14 378 901 247 -1152 3 2610 1991 125 -577 655
3971F55N73P62j292j373R16J922j098k081J166J834J40j149r49k21J405J090j826
3988D74j672J255J766m77j238k62R11J115j42k175p20J688J302j854o73P38Q06
4005H42P09n17j283m86K063J44k058p68J359R72k93j227n68Q88J809k55k430l02
4023a401J587K15j279k92L31J114Q78j394j872J050K389n71j746n44P12N07nm03
4041g24o60J231J367j532j740P09J733M0p32q94m88J111J010q86r29J372R72q44
4059A16j492j03R17J232K71j901m44J807P55j141p46P05R68M7q10j615O11J828
4077A005J040k254n31J117Q48o64m26n05O57J382p65j906M39J726O06r67o05n1
4095A46O72P29j033j232P23J688o11j488o7R16R44L39j677n58R81J498j407j443
$$ plain form
3971 655 1228 1990 698 -675 241 2163 1065 -1016 150 1984 2124 975 26 -195 1210 2300 474
3988 474 -1198 57 1823 1346 108 -154 757 1872 1730 -445 -1165 523 1825 -29 -702 36 842
4005 842 1551 1034 -249 -735 1328 1472 -586 -1354 5 977 684 -543 -1111 -223 1586 1331 -1099 -1401
4023 -1401 186 401 -878 -1170 -839 275 1153 -241 -2113 -1063 1326 755 -991 -1535 -823 -316 -321 -724
4041 -724 -1384 -153 1214 -318 -2058 -1349 384 424 -308 -1202 -1690 -579 431 -455 -1384 -12 960 116
4059 116 -1376 -1479 -562 670 941 -960 -1404 403 1158 17 -729 -24 944 991 181 -1434 -823 1005
4077 1005 2045 -209 -740 377 1225 561 135 -370 287 1669 904 -1002 -563 1163 1769 802 197 146
4095 146 818 1547 514 -718 5 1693 1082 -406 -473 443 1387 1726 49 -509 472 1970 563 -880
4113h80R78Q98J52o68q88j29J612O87j950j032J581N22l88j137k37M74J576lj694
4132e26m45J571L58j387o53M84J041K01o28j452M17K077k18j523l27J213J34o28
4150b91n47l05Q30J473q80j556P3J677K1q59n42J58N76N28j133j080J764J335
4168A242l17j582o26N75R93N50j035q48J039R38j419o17P71J173J06p58r00l48
4186a063J615M82j338n76J658K45o10p04j13P48J362r56j673j75J359J000r25
4203C36q45N57O82L72q93j083O73J911m46k329J93J133K89J60p17p19J117J148
4221A539j221j612Q12J220O2r83q09O39J016M49j288j411J410J654j453j104o3
4238a143R77M70R0j204m25K034J45j600q49Q61N20K91n63o93j60J468M17j488
$$ plain form
4113 -880 98 996 1148 480 -408 -537 1075 1762 -188 -1220 361 883 495 -642 -879 -405 1171 1168 -526
4132 -526 -971 600 958 -429 -1082 -598 443 644 16 -1436 -1019 1058 840 -683 -1010 203 337 -291
4150 -291 -838 -1143 -313 1160 280 -1276 -1203 474 495 -364 -906 -748 -172 356 -777 -1857 -93 1242
4168 1242 925 -657 -1283 -708 285 835 -200 -1048 -9 929 -490 -1107 -336 837 943 185 -715 -1063
4186 -1063 552 1034 -304 -880 778 1023 413 -291 -404 344 1706 750 -923 -1098 261 1261 336
4203 336 -509 48 730 1102 209 -874 -201 1710 1264 -1065 -872 261 550 710 -7 -726 391 1539
4221 1539 318 -1294 -482 738 800 -183 -992 -353 663 1112 -176 -1587 -177 1477 24 -1080 -1143
4238 -1143 -166 304 394 -810 -1235 799 944 -656 -1505 -644 -124 167 -396 -1089 -1249 219 636 -852
4256h52o92K078kr31r27j11Q01J260l31j596M31J349qj248k05L40J064Q9j418
4275i09j429J138J860N1j828L23L61K52j21p72j44J103J468k033j291J112J475
4292F16K41r48o85j25O03N15j207o08J563J018j148r35K74J051N57j57j362m11
4310a148J677J85j189n74J495M66l97m60r83M70J654j92j499n28J362M89o85k26
4328h3p7M72J486p18j935N82J598j98j482K24O02O92K29p95j146Q65J794j465
4346F45r91L79R85R6l47o97m01J481O35j325j071R06J157l64n56o07L82N66M55
4365A328j538n83J978N09r68r92l5N81J60J14j054K11J493N1k015JJ443L45k05
4384H24p54j185M14J473k77j243K08J169Q1q50o49j27R04J263j257j862P11J513
$$ plain form
4256 -852 -1544 534 532 -399 -1326 -1437 -636 624 293 -1303 -872 477 469 -779 -984 -644 420 509 -909
4275 -909 -2338 -1200 660 711 -1117 -794 -433 -181 -302 -1074 -1218 -115 1353 -680 -1971 -859 616
4292 616 857 -91 -776 -901 -298 217 -990 -1598 -35 983 -165 -1100 -826 225 782 625 -737 -1148
4310 -1148 529 714 -475 -1049 446 912 515 55 -928 -458 1196 1004 -495 -1023 339 828 143 -83
4328 -83 -160 312 1798 1080 -855 -273 1325 1127 -355 -131 471 1163 1392 597 -549 316 2110 645
4346 645 -346 33 1018 1114 767 70 -331 1150 1785 460 -611 295 1452 1088 532 -75 307 873 1328
4365 1328 -210 -793 1185 1694 726 -266 -301 280 440 554 -500 -289 1204 1255 -760 -759 684 1029 824
4384 824 70 -1115 -701 772 495 -748 -540 629 710 -140 -789 -916 -12 1251 -6 -1868 -1157 356
4402C56l17q61K25M64O9R8j000m21R81J201j200j107N48N84L29K36j147k51J421
4421B08K84j756m92J315N10k78m92j32p3Q89M90j594j22J404P3r04m46L90L67
4440c59J093m79j361J71J488K70j485n0N69L53ll27o69L47J772p41j510O11J275
4459I65l30q29k41j53J150N85r64j162J180J117p36q53L11M83J34L83j307n99
4477h66J599Q57p38j114Q24l02K01m2o94L17R61O63j568r71J531N06j39m69n16
4496D0j11Q96O7j321K87J098L87q97p22K01P63J54j67j196M59J082l58j148P5
4515d11J096J05L8q85r03R32J139n70j156M14M07J14K14o90J84N46M16j071j032
4534a113J170O59p08n83K42K35N54j39p04l74R85N79j056m98N18M50J31l13p74
$$ plain form
4402 356 39 -822 -597 -133 -64 34 -966 -1387 -406 795 -405 -1512 -964 -380 -51 185 -962 -1213 208
4421 208 492 -1264 -1756 -441 69 -209 -701 -833 -906 -17 473 -1121 -1243 161 234 -670 -1116 -726 -359
4440 -359 734 255 -1106 -935 553 823 -662 -712 -143 210 207 -120 -789 -442 1330 589 -921 -310 965
4459 965 635 -194 -435 -588 562 1147 183 -979 201 1318 582 -271 40 523 657 1040 -267 -866
4477 -866 733 1590 852 -262 562 260 461 419 -275 42 1003 1666 98 -873 658 1164 1025 556 40
4496 40 -71 825 892 -429 -142 956 1343 446 -276 -75 688 842 675 -521 -62 1020 662 -486 -411
4515 -411 685 790 828 -57 -960 -28 1111 541 -615 -201 206 320 534 -156 28 574 990 -81 -1113
4534 -1113 57 716 8 -575 -333 -98 456 317 -387 -761 224 803 -253 -751 -233 217 348 35 -739
4553g39M01Q35O23j963O7O63K18m2p39k17L68J196R3j535L80Q01K70p39n09J80
4573c88M63M30l47r21M74J265r43o63K29L92o9K69m16k53K53J587j258r39Q20
4592a5J029p29k73m12n2Q95N67j093j051J174O25l40l93j09K22N87j97r85p2J219
4612E97K10r58k70N02M20M2k88p90M1J260jj453r4J121M10m57j27p21N07J037
4632I88l09j274J00R29L00j013m7P6M26N59p54q85M50Q39m94p13O08LJ94L41p42
4653d18k79K84J191j014p09N03N25j15l41J85o27J121L38j235m14P40L85l26l25
4672e31r2R2P95r2j110L5J279J11j143J14J61J34N68m27q71O35J088k65j314K43
4692e90P43L09l85k64o31Q30P26q05j046M93J659j022j80j43K20M66K39o59r03
$$ plain form
4553 -739 -338 497 1120 -843 -776 -113 105 63 -676 -893 -525 671 764 -771 -391 410 680 -59 -568 -388
4573 -388 75 505 158 -763 -289 976 33 -630 -401 -9 -78 191 -225 -478 -225 1362 104 -835 -15
4592 -15 1014 285 12 -400 -452 443 1010 -83 -1134 40 665 325 -68 -177 45 632 435 -550 -622 597
4612 597 807 -151 -421 81 501 543 255 -535 -494 766 765 -688 -782 339 749 292 165 -556 -49 988
4632 988 679 -595 -495 434 734 -279 -326 -250 176 735 -19 -904 -454 385 -109 -822 -214 -211 -17 324 -418
4653 -418 -697 -413 778 -236 -945 -442 83 -32 -373 -188 -815 306 644 -591 -1005 -265 120 -206 -531
4672 -531 -623 -531 264 172 -938 -903 376 487 -656 -542 -381 -247 321 -106 -977 -342 746 481 -833 -590
4692 -590 153 462 77 -187 -818 12 738 -67 -1113 -620 1039 17 -163 -306 -86 380 619 -40 -943
4711i43O97R15n6r09P8M48L28l53l50m94J009M10o45p74O26P89k86m30j40l24
4731d04J008K31j238m52J434J11m09j95m11O70O05l91r26k27J173K4r35j00N24
4750I2K54M3l67n37M41R76l50j238J09Q00L18l58o24j78Q83N63p26j122N80R20
4770D79m03p88K01K85L76M82j259l15R34P13r52n76K94N25p0N5q56l30J359M32
4790E86j112l49M66N42j68k51l37J95M52K04j235MJ060p9m03n35L23p1J012n10
4810b06p45J62R03N0j107M48P3M60J51o18p08N35Q96J04j017M82N05k42k78k78
4830d30MM62Q78j034n36N01P29m18l64LM8P86j58q28j29O86O00j252JM37L74L38
4852F98k01q20J77R99M7q99J68J7O38j79j47l87M4J135m63j016M41Q64j92l58
$$ plain form
4711 -943 -246 669 613 -296 -218 230 558 205 -145 -639 370 780 135 -639 -13 776 490 60 -80 -404
4731 -404 604 835 -403 -855 579 690 281 86 -325 345 950 559 -367 -594 579 603 -332 -432 92
4750 92 346 389 22 -515 -74 902 552 -686 -577 223 541 183 -441 -619 264 827 101 -1021 -441 479
4770 479 76 -712 -511 -226 150 632 -627 -942 -8 705 -247 -823 -529 -4 -74 -19 -875 -1205 154 586
4790 586 -526 -875 -409 133 -35 -286 -623 -428 24 228 -1007 -1003 57 -22 -425 -960 -637 -708 304 -206
4810 -206 -951 -789 114 164 -943 -495 -422 38 189 -429 -1137 -602 294 398 -619 -137 368 126 -152 -430
4830 -430 -426 36 914 -120 -656 -155 574 156 -208 -205 -157 629 471 -357 -486 200 800 -452 -451 -14 360 698
4852 698 497 -323 -146 853 900 1 169 186 824 645 498 111 155 1290 827 -189 252 1116 924 566
4872E66l35n8K92N04j67q87M91R19l97j024L27L57K09J89n49p01O23J127r60n69
4892d3K52P17j65m86l89k59P98O26o93n86N00K62k38k16k75J54K73J47r93l7J222
4913E71K78r36k75mr0M42q1p64J46J092l71o54J58O32j93j4m77l81R0P74j84o94
4935i35L59O98l86n36L34l98N72L25o03o80N78N48Qn08K48p1M4J54l00l10L15
4956e44P67p69j92L95L92k23J79o85Q6Q71K8o81k73M90J90l48L76k61O7N97L62
4977H24j305R6O52L57p10M85j57j04N29j02o25j5J142l93p87QM36K67m00K96o85
4998a91L45P06m19n49M78L72k7l37l45K1N16K38m95p54N11P60m77k66L5J15K5
5019B62L00l89m55N02O35l41n42L06L7O4k01p4l08O27L1p44k0O56J15l20r9j37
$$ plain form
4872 566 231 173 465 969 802 -85 406 1325 928 -96 231 588 797 986 437 -264 359 1486 526 -43
4892 -43 209 926 761 275 -114 -373 425 1051 358 -228 272 534 296 80 -195 -41 232 379 -614 -651 571
4913 571 849 -87 -362 -366 -456 -14 -95 -859 -713 379 8 -646 -488 144 -49 -63 -540 -921 -831 -57 -241 -935
4935 -935 -576 122 -264 -800 -466 -864 -292 33 -570 -1250 -672 -124 -116 -624 -376 -447 -403 -249 -549 -859 -544
4956 -544 223 -546 -738 -343 49 -174 5 -680 -594 277 305 -376 -649 -159 31 -317 59 -202 -135 462 824
4977 824 -481 -385 267 624 -86 399 242 138 667 565 -60 -75 1067 674 -113 -105 331 598 198 494 -191
4998 -191 154 860 441 -108 370 742 715 378 33 54 570 808 313 -441 70 830 353 87 122 237 262
5019 262 562 173 -282 220 855 514 -28 278 315 379 178 104 -204 423 454 -290 -310 346 461 141 42 -95
5041i5J20K20p9o40m8Q70J28n98l29N08k75M94l96m55K91O85j23j047P54J02j24
5062c7K02l00l29k7J049o20q65M24K55J86m82K08k45N13J35m24l76M87K12l07
5082c41j43L48j46L28M06j009o6O98L67p76j02M45K59l80L12q66L19O07K35q10
5102c15m3P54n2n51n2m7L38O61l35m80j28N03j58k60j03J55K88K36m25k90N00
5123A96O29k65n53k72Q74l74K67o00p0M43O65q23p09M47N18r5k51l62M3O80P2
5144D60o37k40N52J91l28m32K70j37N50o0k24m06O35n1m27j3M30q6j60L06p20
5165e27J26N86Q2n99j76M30K98k55k55j41j72Q13k10r60M61P64m89l22L31j05
5185c20j35O92p56l26K30P89m50n37L58J92j94M09o48J5P50J65m17q39P71J04
$$ plain form
5041 -95 25 245 166 -474 -522 348 476 -122 -451 57 -218 276 -120 -575 -284 401 278 -769 -15 87 -37
5062 -37 165 -135 -464 -491 558 -62 -927 -503 -248 -62 -544 -336 -581 -68 67 -357 -733 -246 -34 -341
5082 -341 -484 -136 -282 46 452 -557 -623 75 442 -334 -436 9 268 -112 200 -666 -347 260 495 -315
5102 -315 -358 396 344 -207 -259 -306 32 693 358 -122 -250 253 95 -165 -268 -113 175 411 -14 -304 196
5123 196 825 560 7 -265 609 235 502 -98 -168 275 940 117 -592 -145 373 278 27 -335 -292 388 460
5144 460 -177 -417 135 326 -2 -434 -164 -301 249 189 -35 -441 194 143 -284 -297 133 47 -113 193 -527
5165 -527 -401 185 267 -332 -508 -78 220 -35 -290 -431 -603 210 0 -960 -499 265 -224 -546 -215 -320
5185 -320 -455 237 -519 -845 -615 174 -276 -813 -455 -263 -457 -48 -696 -681 69 234 -183 -1022 -251 -147
5205a47l70K31j60j05N45L49p99j98N62L97o17k39M39l85P02q4l71j08N91N3p95
5226e09M72K2L71m0q4o09O9J149p19j87M8N89k82J30m01l93P96L09m80n53M16
5247A14L25j53k62J03P4N5Q8k7n57O30J90k65m00NM83J1j76l31J60L19L76j127
5269c65j01Q40j80K20n29k1L72J3J41o37M2P07k64l24J0O0J15Mm8j91j84Q60k20
5292C20o78K23J20r9k8k8l26O42K81m46o68N46O19l90l98k28j48P56J78n00l85
5313f37O53Ol60p3Q4p3L09P6m02k13M72K70k75q6k34Q0K30k42k35L83N23r2m96
5336c32j78O01j88J56j53Q8j90K58k98k63O1Q94l21m07O6j4J46N71p2q93M68O49
5358F49l10j89j31K63J16N0k26m11L65J61j85k20M01L9kj80KK1r8P67n26l47K93
$$ plain form
5205 -147 -517 -286 -446 -551 -6 343 -456 -654 -92 305 -312 -551 -112 -497 205 121 -250 -358 233 286 -509
5226 -509 -37 -15 356 316 232 -377 -308 841 122 -65 -17 572 290 420 19 -374 422 731 251 -302 114
5247 114 439 286 24 127 201 256 344 317 -240 390 580 315 -85 -80 403 414 238 -93 67 386 762 -365
5269 -365 -466 374 194 414 -115 -136 236 249 390 -247 -205 502 238 -86 -76 -16 99 103 55 -136 -320 540 320
5292 320 -358 -135 -15 -114 -142 -170 -496 146 427 -19 -687 -141 478 88 -310 -538 -686 70 248 -252 -637
5313 -637 16 22 -338 -411 -327 -400 -91 -15 -417 -630 -158 112 -163 -249 -483 -403 -173 -415 -650 -267 256 164 -332
5336 -332 -510 91 -97 59 -94 -6 -196 62 -236 -499 -438 456 135 -272 -206 -220 -74 497 425 -468 0 649
5358 649 339 150 19 282 398 448 222 -189 176 337 152 -68 333 372 370 190 192 213 115 882 356 9 302
5381C02j02j14K37k07k13P74k13k79j41L19J05k10j16L53l00j47K76l33N5O49
5401F95J00q42K16R0Rk1J11o32N63K81l07l52P2K98K44j86k22l30K49K47j56j65
5423c8K77L38p04l54K87K58l1K72k58p17N36M58n54P9J05L35j28k14l00L0L01
5444b2J54l50k44J6M63j83P7J0j04N5K0k09l57O55J55m18PJ29L8o1K03k74j94
5467d34N34j81m98L24K57l18L90k22j8O4M61n58k7L54K65l31k29L29l02J88O7
5488A15j92j92N75L04q78K4K70K76LM7k23k74L73L48o20n6K59O9J5J91m42K13
5510B05L92j27m33j31J34M31p50M69q6j09O33l63j93m51Q35j52j3q4K7k22K25
5531B37j73l56M86L80q8p86M10pk04L40l39j16J17L01l10J34J22J19j06j62k33
$$ plain form
5381 302 200 86 323 116 -97 677 464 185 44 363 468 258 142 495 195 48 324 -9 46 695
5401 695 795 -47 169 259 268 247 358 -274 289 570 263 -89 -17 281 525 339 117 -213 36 283 127 -38
5423 -38 239 577 -127 -481 -194 64 33 305 47 -670 -134 324 -230 -151 -46 289 161 -53 -353 -323 -22
5444 -22 132 -218 -462 -446 17 -166 -89 -79 -183 -128 -108 -317 -674 -19 136 -282 -275 -146 -108 -169 34 -240 -434
5467 -434 100 -81 -579 -255 2 -316 74 -148 -166 -102 359 -199 -226 128 393 62 -167 162 -140 48 115
5488 115 -77 -269 306 610 -268 -244 26 302 305 352 129 -145 228 576 -44 -100 159 228 243 434 -8 205
5510 205 597 470 37 -94 40 471 -279 190 104 -5 628 265 72 -379 456 304 291 207 234 12 237
5531 237 64 -292 194 574 486 -300 110 103 -101 239 -100 -216 -99 202 -108 26 148 267 161 -1 -234
5552b34J28p8K80k75l82M23J01l90K3L25k0J61m5m74k2N92K49p48J35J42j0k10
5574c29L32l35j60M73j99j77j09L26K3k99J25J10l00P02p3m47J30L07k90n97N70
5595b17M9k32L91q8k17J42K00M7l83L62J52m66L79j31M6j24L03j86j87Q6L05K04
5617D35l86o8n2O2K53l80l85Q04K55n71j48K90m0K09k07m7k07M51k3n63M99K06
5639C87l07N8n1l30J97N93Q1q34L61R6J6j85m2k7J19N15j61q19K56O19m98j9J67
5662A92j17J70j72J66m25N78k05l26k4K20j44J13R3l68J52J57K18m40j77M50J50
5683B61l44J63J69m23M25k24m37N3L35J50l01J61m51J29J32K91n68J91K87r6l91
5704d88K80L43Lj92k4l60J67L42l03k14O5N39l08k24J25j30J67L98j57k63K21
$$ plain form
5552 -234 -106 -184 96 -179 -561 -138 -37 -427 -404 -79 -99 62 17 -457 -479 113 362 -386 -251 -109 -119 -329
5574 -329 3 -332 -492 -19 -218 -395 -504 -178 -155 -454 -329 -219 -519 183 110 -337 -207 100 -190 -787 -217
5595 -217 -168 -400 -9 -97 -314 -172 28 75 -308 54 206 -260 119 -12 34 -90 213 27 -160 -74 231 435
5617 435 49 -19 -71 -9 244 -136 -521 283 538 -33 -181 109 69 278 71 24 -183 268 245 -318 181 387
5639 387 80 138 87 -243 -46 547 628 -206 155 251 267 82 40 13 132 647 486 -333 -77 542 44 25 192
5662 192 75 245 73 239 -186 392 187 -139 -163 57 -87 26 119 -249 -97 60 278 -162 -339 111 261
5683 261 -83 80 249 -174 251 27 -410 -357 -22 128 -173 -12 -463 -334 -202 89 -479 -288 -1 -97 -488
5704 -488 -208 135 138 -54 -78 -438 -271 71 -232 -446 -381 158 -150 -374 -249 -379 -212 186 29 -234 -13
5725a3L38l56k9n9K47k68L16l4r1K56J22k98j86J78j42o3M7j8k30P50P2p65J96
5748c0P8M80m65J48j88j59K52N82q01J05L66k50n1j63N62q1k54J89k03mJ98j72
5770A39k64M62L78p11P4L31n20M72r8k07R5O9M67n88j20K53j07R6J38k47m40L07
5792b1J57L0k17k4J42J04L5l85j08M47K26o64J83L67l05Jk06l32K07M43j37k68
5814c25r2N88k62j52J85m85L78M54k78l18k72N55k73o6nN5QK40R0n20M7N81n20
5837c87l6K84J72M5k07K0k44K60K57l79j22K84J36m37K88J22%m78P14l40l94M25
5859a7N9k86j71L70n8J53R0m41M5N83l44K75k38L0k2K54j9n5n47O97k24m58K43
5882h1K49k4j41R1om41J073p07k05M40qj00k7o7M22l88L59j24m83K37L3J81m10
$$ plain form
5725 -13 325 -31 -60 -119 128 -140 176 142 51 307 429 131 -55 123 -19 -82 -35 -53 -283 467 539 -226 -30
5748 -30 48 528 63 211 23 -136 116 698 -103 2 368 118 67 -96 466 385 131 320 117 113 311 139
5770 139 -125 337 715 4 78 409 -111 361 263 56 151 220 687 99 -21 232 125 221 359 112 -328 -21
5792 -21 136 166 -51 -75 67 171 206 -179 -287 160 386 -278 -95 272 -33 -32 -238 -570 -363 80 -57 -325
5814 -325 -417 171 -91 -243 -58 -543 -165 289 11 -307 -579 -24 -297 -363 -368 -313 -305 -65 25 -495 -448 133 -387
5837 -387 -423 -139 33 78 -129 -109 -353 -93 164 -215 -337 -53 83 -354 -66 56 56 -422 292 -48 -442 -17
5859 -17 42 -244 -415 -45 -103 50 140 -301 -256 327 -17 258 20 50 28 282 263 208 -339 358 134 -324 -81
5882 -81 168 144 3 94 88 -353 720 13 -192 248 240 140 113 46 468 80 439 315 -168 69 102 283 -127
5905a27M06j48J70j7J03n65J71K80O1m82L30m6jQ3j18l18M90Mm11k09M53M38n32
5928A5J13j55K23j62j18J2J1J95L04o19J99o3Q6p8K7k49j01N08k11k90L53Qj63
5951a55k0J68l27J87K77r2l42K12K59m6n28J04M18k19J70L3r01N79N04p29L50
5972i8K97j70m26K65nj96K39ql69L13j49L04j80K39j70M9o8or9J63J09m8j47K45
5996H4J65k01j13N58p15K6N95k91k12MM6l6J18J55p4l52N99K46n53K5L59j64m34
6019a65L65Qj18K98m46k52L84J12j71K76L7k21j31L15K0m52L37J65j95j52J56
6040A70o4J7lN3k04M74L7n14Nr4j6m0L45Lk25J64j7l87Q8N43l50k44K00j7J96
6065A20ok50l2M8L49j40k73j16J07q5K20J57k55j36M21n00K54o1J35Q5k46R5j41
$$ plain form
5905 -127 279 131 301 284 387 -178 -7 273 334 -148 182 136 135 218 100 -218 272 276 -135 -344 109 547 15
5928 15 128 -27 196 34 -84 -72 -61 134 438 -181 18 -45 41 -37 -10 -259 -360 148 -63 -353 0 8 -155
5951 -155 -175 -7 -334 -147 130 38 -304 -92 167 121 -407 -303 115 -104 66 99 -802 -223 281 -448 -98
5972 -98 199 29 -397 -132 -137 -333 -94 -102 -471 -158 -307 -3 -183 56 -114 -65 -133 -139 -238 -75 34 -14 -161 84
5996 84 249 48 -65 493 -222 -196 399 108 -104 -100 -54 -90 28 183 109 -243 356 602 49 74 433 269 -165
6019 -165 200 208 90 388 -58 -310 74 186 15 291 328 107 -24 291 311 -141 196 361 166 14 170
6040 170 106 123 120 173 -31 443 480 -34 -29 -123 -139 -179 166 169 -56 108 91 -296 -208 335 -15 -259 -59 -76 120
6065 120 114 -136 -168 -120 229 89 -184 -300 -193 -278 -58 99 -156 -292 129 -371 -117 -178 -43 42 -204 -109 -250
6088b50J82M4j54k80M40K5k32m1L3J06Q4k44L18j8q8K09o52L70J95m85J21M27
6110A10K5l75J44M6l29K17P6J72l71K42j87K93j25P7l35P9P5M4k9K06j61j74N07
6133B27j76m28K95L19k24j4R4n2m3K14p6k17J83Q6K01m29Q5N11m24QL01k92j88
6156c9L59j92k9M00m2o44M18j55j86L43j28j18K66K06q7l61k21M11j15o9J46l18
6178a55k1L27n1j80j75L64j31K2k02K39k42K04n0J7O0K47j11l14O01m42K4Q6M1
6201A58l26K90J09n43J98p8J32k82M30l16p8L78J48m25j71L59J27j08k97NJ64
6222a26J73k39j45K14L86k35l50L93j6r2j72K35l78J87l5K04M4M2P1j3j33R5k18
6245a08J62p8o7j46L71J86k26J26K48m32R7r2R2o6l9N70n85J77j66J02j37K06
$$ plain form
6088 -250 -68 -24 -178 -458 -18 7 -225 -266 -233 -127 -43 -287 31 13 -75 134 -518 -148 47 -438 -317 110
6110 110 135 -240 -96 -50 -379 -162 -86 86 -285 -43 -230 63 -62 15 -320 -241 -166 -122 -151 55 -106 -280 227
6133 227 51 -377 -82 237 13 -1 93 41 -2 212 136 -81 102 188 389 -40 45 556 132 140 441 149 -39
6156 -39 320 128 99 499 457 -187 231 76 -110 233 105 -13 253 459 372 11 -210 201 86 17 163 -155
6178 -155 -176 151 100 -80 -255 109 -22 0 -202 37 -205 -1 -51 -34 26 273 162 -152 449 7 31 117 158
6201 158 -168 122 231 -312 -114 -192 -60 -342 88 -228 -306 72 220 -205 -376 -17 110 2 -295 -290 -126
6222 -126 47 -192 -337 -123 263 28 -322 71 55 -37 -209 26 -352 -165 -200 4 48 90 161 148 15 110 -108
6245 -108 54 -24 -91 -237 134 320 94 220 468 36 133 41 133 67 28 598 13 190 24 126 -11 195
6267A95k16K21pNJ00l27K32j60J49K96k01k05L75j47n45K25M06l01N4n0m2J54
6289B11j67K45k99J8J69m6J6k23M1J20J70n3k85J1M32l38j55N4K64j58j44R1l8
6312f4J74Mk15K47P2k80k88L85j77L4j8R8J2j87Q8J26k62L08k36m8j41J70J21
6335g7k86M64k27k81K45L07l09j91K00J2k02L86j22j02L1k31J84J50N6k74K75
6356Hj44o8Q8k12K42j11M5o1K1j55k5j8r1M25N4M9n97K75J90p4K63k68L54m83
6380b93L73k06j10L03o5m6J01M3J49l78J36K96l32L38k7j73J0K79l57j50K36J93
6402C20k31K89j84j43k6J61k37M3K90N1k5j73J16j52L4J67k0k03j55l1J1N84m37
6425D9n5ML74j57k61K02k07j2L87k11j33J18q4Q2k99K64j14j78M18j98J3K14Q9
$$ plain form
6267 195 -21 200 193 198 298 -29 203 43 192 488 287 82 457 310 -235 -10 396 95 149 99 57 211
6289 211 44 289 -10 8 177 131 147 -76 -35 85 255 202 -83 -72 360 22 -133 -79 185 27 -117 -26 -64
6312 -64 110 114 -101 146 218 -62 -350 35 -142 -108 -126 -28 -16 -203 -115 11 -251 57 -179 -227 -368 -198 -77
6335 -77 -363 101 -126 -407 -162 145 -164 -355 -155 -143 -345 41 -81 -183 -152 -383 -199 -49 7 -267 8
6356 8 -136 -204 -116 -328 -86 -197 -152 -213 -192 -347 -372 -390 -481 -56 -2 47 -550 -275 -85 -159 104 -164 190 -293
6380 -293 80 -126 -236 67 2 -44 57 100 249 -129 7 303 -29 309 282 109 119 398 41 -109 127 320
6402 320 89 378 194 51 25 186 -51 -8 282 333 308 135 251 99 133 300 280 77 -78 -109 -98 486 49
6425 49 -6 -2 372 215 -46 156 -51 -63 324 113 -20 98 14 96 -203 61 -53 -231 187 -11 2 216 305
6448C05m07J51r6O6m88M86j46K59k35K47j12l26Q1L19m63L04L53m19p4K40k57
6469b12l3L07l9l71M18j49k72L33K4j10%K32k05j80j33M13k91P2K81j46k67M16
6491H8n37m5L19J41J6j81M30l91m8N15k38m34M04r9k8j32L29j54N6J92l08qL6
6514g7K07k67J71j50L33l80L07J60O4m0k59K47Mk13K22k24p9K75k85j68M93k82
6536E9J08M9j00KJ30J28m94n0O96n11N8K11j46m29K17K53j16K65j29j21j20K82
6558B42k80j58M76l2k09L5K22m22M71j95k17O2K16J78n74M31l77L9%J39j64r9
6580b16N93l86k01J60M10n33j56J78R4l05L89J44o42K65L02J78m62J91K68n79
6600c08L51n7L5j11OM6o3L35k91k17M8P6k0j17J70k17M5K99j94o7J76Q7j73J23
$$ plain form
6448 305 -102 49 -47 19 -469 17 -129 130 -105 142 30 -296 -215 104 -359 -55 298 -121 -195 45 -212
6469 -212 -245 62 23 -348 70 -79 -351 -18 6 -104 -104 128 -77 -257 -390 23 -268 -196 85 -61 -328 88
6491 88 -449 -494 -175 -34 -18 -199 231 -160 -208 307 69 -365 39 -60 -88 -220 109 -45 11 203 -105 -113 -77
6514 -77 130 -137 34 -116 217 -163 144 304 368 328 69 316 320 107 329 105 26 301 16 -152 341 59
6536 59 167 216 116 118 248 376 -118 -168 528 17 75 286 140 -289 -72 181 65 330 201 80 -40 242
6558 242 -38 -196 280 248 39 74 296 -126 345 150 -67 -5 211 389 -185 246 -131 -92 -92 47 -117 -216
6580 -216 377 -9 -210 -50 360 -173 -329 -151 -57 -362 27 171 -471 -206 96 274 -188 3 271 -308
6600 -308 43 -14 21 -90 -84 -38 -101 234 -57 -274 -226 -150 -170 -287 -117 -334 -289 10 -184 -251 -75 12 -161 -38
6624c8J36m26Q1K99k18Q8K54l90m6J72K41j99m1J92k00L11l44J55l45K96j58J45
6646c5J33m9N9O1k67L86k98P8J35l1j36K27J29n32L82k24J43m99N45J24j79P5
6668B27j06q2K30J38r9k31p1K10l68L22Kk38n9M22j96M1j53pO3J54K1r6j83K04
6692A45j54J5K61l36P8J6o1j82M99j62j30j93n0K63R1k15K53j45J52Kon02K47
6715a14k2j32M38l96m2J48Q7m7j65K47Q8m70K27L48k62j96J48lPM95n21q0L25
6738A08l16p4R2J32K27m72N56j94k61J96J0r7K9R2j23J31o7m2p3J46j92J85k12
6761b19L22O7k72J11l7P8rn7O4Q8j87O0m2J01K39l66J52R5l94J47N23m73R6K1
6785A08j12J70j01n4J98J6N4j05P5k51N37k79k13K90j92l0J62J08k12J92k27n7
$$ plain form
6624 -38 98 -328 -247 52 -166 -78 176 -214 -260 -88 153 -46 -87 105 -95 216 -128 27 -318 -22 -180 -35
6646 -35 98 49 108 169 -98 288 -10 68 203 172 36 263 392 -140 242 18 161 -338 207 331 152 227
6668 227 121 39 269 407 308 77 6 216 -152 170 172 -66 -125 297 101 142 -11 -18 45 199 220 124 -59 145
6692 145 -9 6 267 -69 9 25 -36 -218 281 119 -11 -204 -254 9 100 -115 138 -7 145 147 141 -361 -114
6715 -114 -136 -268 170 -226 -268 -120 -33 -80 -245 2 90 -380 -153 195 -67 -263 -115 -118 -111 384 -137 -217 108
6738 108 -208 -282 -190 -58 169 -303 253 59 -202 -6 4 -93 -64 28 -95 36 -31 -73 -146 0 -192 -7 -219
6761 -219 103 170 -102 9 -28 50 41 -16 48 136 -51 9 -33 68 307 -59 93 188 -206 -59 464 -9 87 108
6785 108 -4 166 65 11 209 225 279 174 249 -2 535 256 43 333 141 111 273 381 169 361 134 77
6807G7J38O0j13k40N9J62k83K26J62k11K27j83J43j93R8J78m45K22Km0r7K23j31
6830D1l27M61l2m09L00K32n11J46J95j14n06N49m8l11j9M26J5j04K65l07j00L95
6852B37m65K63q4N4j20J52j30J00m25K13r8p6M78P0k88q8j96M13M3kj53Q6l92
6875d08M46m49N85j93P0j19J8J61j87J35o5j43j2J41j33J43J44r3j71p6K60l5
6897A9k18K77o2j64J63K2j89M40k50j21r5N79l50j59L15k98j7M8M22m08J02J87
6919B43j14K1oR5k91K6K25k68J17J10P5j90J38L34l36k21K03m4q8K39K9p7R2j04
6943B08l5j38M04l67N2J77l52K95j38k5l07N18k87o1o6P7K03j18j04L4J39j80
6965g1K87j07k33K4P2k79K11K65k04P4j30J56k96M22p0l80M96l16k15L66L1j31
$$ plain form
6807 77 215 275 162 -78 -19 143 -140 86 248 37 264 81 224 31 129 307 -138 84 86 46 -51 172 41
6830 41 -286 175 143 -266 34 266 -245 -99 96 -18 -524 25 -23 -334 -353 73 88 -16 249 -58 -158 237
6852 237 -228 35 -49 5 -115 37 -93 7 -418 -205 -303 -379 99 169 -119 -207 -403 10 53 51 -102 -16 -408
6875 -408 38 -411 174 -19 51 -68 -50 111 -76 59 -6 -149 -161 -20 -153 -10 134 41 -130 -206 54 19
6897 19 -199 78 16 -148 15 37 -152 288 38 -83 -178 401 51 -108 207 -91 -108 -60 362 -46 56 243
6919 243 129 150 144 239 -52 -26 199 -69 48 158 233 43 181 515 179 -42 161 117 29 268 297 220 312 208
6943 208 173 35 439 72 124 301 -51 244 106 81 -226 292 5 -56 -122 -45 158 40 -64 -30 109 -71
6965 -71 216 109 -124 -100 -28 -307 -96 169 -35 39 -91 65 -231 191 121 -259 237 -79 -294 72 103 -28
6987b8L5o1lO0k31J20k18R3K02P3j47K34m4j46J90j18p2k3K66j90R6j89J15j36
7011a22J87N3n19J21K98l00oL29j45k00J66L21m71L32j09j50N0L17k87J10K19
7032A94m03J01R5k3P7j17M09n02J52j48J12J13j85K28k09OL87m21O5K74m6j98
7054c9J63P9l74K30K7mJ85r9k11P2J24L38l50j14L0K53j86k76J75J38k36K95j4
7077B06o7j81K90k33K61l08Q4ok48O67o02M41l80p7O3k2L0l45Q14k62k83m8P0
7100a36J01p6P6J8K66l76Oq6l1R9R7K4q2N6J3j26M1l1J23O0j83J84j1M2q3m6k24
7127b85M3J59J5l76K50L57k45K7J11j17J27k29J00J53m31L19J4J3J05L7m49K30
7149g2J50J13k13J77k10j08K02j74L09o7l8q6P0K91l05j26K22m5m2L30k60k56
$$ plain form
6987 -28 7 -54 -57 3 -228 -108 -326 -233 -31 42 -105 129 85 -61 129 11 -61 -84 182 -8 88 -101 14 -122
7011 -122 65 118 -401 -280 18 -282 -288 41 -104 -304 -138 183 -288 44 -65 -215 -165 152 -135 -25 194
7032 194 -209 -108 -13 -36 41 -76 333 -169 -17 -165 -53 60 -125 103 -106 -100 287 -134 -69 205 159 -39
7054 -39 124 203 -171 59 86 82 267 168 -43 29 153 491 141 27 57 310 124 -152 23 161 -75 220 206
7077 206 139 -42 248 15 276 -32 52 46 -202 465 -137 304 -76 -153 -90 -112 -82 -427 387 125 -158 -206 -136
7100 -136 -35 -111 -35 -17 249 -127 -121 -207 -238 -139 -42 -18 -100 -44 -31 -157 -116 -147 -24 36 -147 37 26 68 -15 -61 -285
7127 -285 -242 -83 -68 -444 -194 163 -82 -55 56 -61 66 -163 -63 90 -341 -22 -8 5 110 147 -302 -72
7149 -72 78 191 -22 155 -55 -163 39 -135 174 107 69 -17 53 344 39 -87 135 90 48 378 118 -138
7171a38L1L34p2m11K72J47p5j42O0o6Q8J08k01p8k3M91p8n0k44Q9m76O50J66o76
7195b94N50l62M3N31l88J33k15K74J08m21P3J47k17k6K72p9q4j79M8%o4N7J57
7218F4L1J76k59P0j48L66n67O07l10j87o8J42j10J82k8r9N7n3J66J07k47J98j50
7241f0L3J01R1q3r0N1k32O4N9K72k23K52k30j04n7M50j87j61K1K13l03L8J59j5
7265E9m4k24L6J37Q5k75K76j18j90M35l45j15Q5j08J77j46J31L12K5j03k29K85
7287A46k87J65Q9L1l49R0L26j29l61N20j13r6j37J8k5K7K07J02l63N1K31j15n1
7310b3K76j63k83L23j32P2K32n36N18k45j22K8J34K41l11K24j32k38n1K48j86
7331a26p1K99R9j41p1M19m72k2J79l60M78j66J20p6k86M22j38r5Q3j52J60j82
$$ plain form
7171 -138 -107 227 155 -256 16 163 88 -54 6 -60 28 136 -65 -143 -166 325 247 197 -47 42 -434 216 382 -294
7195 -294 256 -106 -63 468 80 213 -2 272 380 -41 32 179 -38 -64 208 129 45 -134 -86 -86 -150 -93 64
7218 64 95 271 12 82 -66 300 -267 340 30 -157 -225 -83 -193 -11 -39 -138 -81 -134 32 139 -108 90 -60
7241 -60 -27 74 165 82 -8 43 -189 -125 -66 206 -17 235 5 -99 -156 294 107 -54 -33 180 -123 -85 74 59
7265 59 15 -209 -173 -36 49 -226 50 -68 -258 177 -168 -283 -198 -306 -129 -275 -144 168 193 90 -139 146
7287 146 -141 24 113 144 -205 -115 211 82 -279 241 128 32 -105 -87 -112 -85 122 224 -139 -88 143 28 -23
7310 -23 253 90 -193 130 -2 70 302 -234 284 39 -83 -55 79 320 9 233 101 -137 -188 60 -126
7331 -126 -197 102 201 60 -11 408 -64 -86 93 -267 211 45 165 89 -197 225 87 -8 75 -77 83 -99
7353i9R0j74L5L14j29N0mj10j02p8K19j48L8qK17q8j14Rj94K65k22O0K10J5Q2
7378A34k18n4MM0k18K31k17M73l31j03J64k51LM72l11J67p4J65o3p3j09K5r4r9
7402c37j1M8L7O00j1l54l4j35K94j54k99K31J53o6L80j26m32K08L8O8r7k69O6
7425b02J33K81j39j18K61O7l08K10L9l66L00N3j13L8j03P1k8K66j11k36o1J20
7447E4j75K63j36L33l44o7J08M20k00J88l32k08J82J94l81P2J41R1J1k13L3J39
7469A73O1K72n48K2J29P7n73N60J06o06Q2L42L0j5q9n7P2N9n0k76nL32k8l37L74
7494A07k03j41Q6J04k13N5K10r7l74L60N6J42Kj15j73J02l1o0M3O8m0l7o4J61
7518e2J74Q4J17n63J39L4J51k71R6J19j30J23Q3j98j80M80j37m91K86J03l80K79
$$ plain form
7353 -99 -9 -183 -148 166 37 87 83 -27 -129 -207 12 -136 -98 -106 111 23 -91 -82 -276 -11 -233 -173 37 52 134
7378 134 -84 -138 -134 -94 -312 -81 -298 175 -156 -259 -95 -346 -343 129 -182 -15 -89 76 13 -60 -169 -144 -238 -337
7402 -337 -348 -300 -263 337 326 -28 -62 -197 97 -57 -356 -125 28 -38 342 216 -216 -8 30 98 1 -268 -202
7425 -202 -69 212 73 -45 216 283 -25 185 224 -142 158 211 98 136 33 104 76 342 231 -5 -66 54
7447 54 -121 142 6 339 -5 -72 36 456 256 444 112 -96 86 280 -101 -29 112 203 214 1 34 173
7469 173 234 506 -42 -20 109 186 -387 173 279 -327 -245 97 127 112 23 -34 38 97 47 -229 -234 98 70 -267 107
7494 107 -96 -237 -151 -47 -260 -205 5 -92 -466 -106 -50 92 94 -21 -194 -92 -123 -183 -140 -72 -112 -149 -213 -52
7518 -52 122 206 323 -240 -101 -67 84 -187 -91 28 -102 21 104 -94 -274 206 69 -422 -136 -33 -413 -134
7540a34O2p0j86M87p2J75k69P2jj41P3M9l81K65L56k98J38j35K53m06K35J23k64
7563f9J0l6J90L0j6K2k27mN4l6n3J49j64o0L22K01j87k81M12k01J76k40j17J77
7587E2R4Q7k70K39j55j40JM13k1L7k4j07n03O02k42rJ50Pk39K35L2k88J92K50
7611C93k85j85K42O9l06J96l55J81j01K45j6m06L61K50l42j3l2K92o06M59R1k71
7633a39M51j30j64K12k72M5j63J72P4l21L28m8l51M1K48m84K48K05q9K03J12q7
7655I1r7j28J28J87q7k19L9Q3l6J30l79K97j10j2l07P17k24k81Q6K48k35J10L0
7678C1j28j78K13K86k38J36k86J68K9l3L31j29J02n46L64l7l1J07m11K63M9Q7
7700A49k35J27J09k40L02n7k12p2K07k88M09L4j4J0j24k96J54L65m49J91P5n8
$$ plain form
7540 -134 -72 -142 -328 159 87 262 -7 65 64 -77 -4 45 -336 -71 285 -13 125 -10 243 -163 72 195 -69
7563 -69 -59 -95 95 125 109 131 -96 -100 -46 -82 -135 14 -150 -210 112 313 126 -155 257 56 232 -8 -125 52
7587 52 146 233 -37 202 47 -93 -92 321 300 337 313 206 -297 305 63 54 204 211 -28 207 239 -49 143 393
7611 393 108 -77 165 234 -72 124 -231 -50 -151 94 78 -328 33 283 -59 -72 -104 188 -418 41 132 -139
7633 -139 312 182 18 230 -42 3 -160 12 86 -235 93 45 -306 -265 -17 -501 -253 -48 -137 66 178 91
7655 91 -6 -134 -6 181 94 -125 -86 -3 -39 91 -288 9 -101 -113 -420 297 73 -208 -122 126 -109 1 31
7678 31 -97 -275 -62 224 -14 122 -164 4 33 0 331 202 304 -242 122 85 54 161 -250 13 62 149
7700 149 -86 41 150 -90 212 155 -57 -129 78 -210 199 233 219 229 105 -191 -37 328 -121 70 145 87
7722H7K24m68K47j1k79N50l28o6q2J91m5n5J47k2m19K73k21K3L08N5r2j29J57
7745D5n00L81j9J87k70K44j24k3L8k91L70j74K19J09l98L59k60j19N2M40k73j70
7767a77K34p2N1j13K5j18J44K12m40Q5J36J14j63j70K9J00Q5R1l62L7K73Oj70
7790a63K10r5J80l10J99R2rk30J28K93l63q8Q9L0J59M1J58l73J29j23M80j10k79
7813D5J37n6k8j95K21J21l65k6p3N2J83K41k45M7P2j77J41K48Mj22j36p6J11l96
7837b72M71k01n9J67k60K36P4j44J3J22Qk72J41j7l2OK5n8J88j50K0m7J64k98
7861a75L83l6j97K01J7j79N4J19k78J74m6rr8M6J25j58j92N35l88j72K38j52L09
7884A21q7j12k16K76Kj10j69K24o4J79N3m40J13K88Kj89n0J74j24J42rj91P4J67
$$ plain form
7722 87 311 -157 90 79 -200 350 22 -44 -126 65 20 -35 112 90 -329 -56 -277 -254 54 109 17 -112 45
7745 45 -455 -74 -93 94 -176 68 -56 -79 -41 -332 38 -136 83 192 -206 153 -107 -226 -174 266 -7 -177
7767 -177 57 -15 36 -77 -52 -170 -26 186 -254 -169 -33 81 -82 -252 -223 -123 -38 53 -309 -272 1 7 -163
7790 -163 47 -48 132 -178 21 113 104 -126 2 295 -68 -156 -67 -37 122 163 321 -52 77 -46 434 324 45
7813 45 182 126 98 -97 124 245 -120 -146 -219 -167 16 257 12 59 131 -46 95 343 347 225 89 13 124 -272
7837 -272 199 -2 -61 106 -154 82 156 12 25 147 155 -117 24 7 -25 -19 6 -52 136 -14 6 -41 123 -175
7861 -175 208 172 -25 176 193 14 68 187 -91 83 37 28 -70 -24 101 -57 -249 286 -102 -274 -36 -188 121
7884 121 34 -78 -294 -18 -16 -126 -295 -71 -135 44 97 -343 -230 58 60 -129 -179 -5 -129 13 4 -187 -113 54
7908E4M2kl51L04k33K28m54J27k9M21m29K23k6K37k69J21q3K02qk17L73k02J1
7931D0Q9l14Q9J97L4k15J21K36j15p1K47m87N7M48n29K17J70k8l04K98j06K31
7953C05l75R4L92m36r7J50j38N5R8j94J25J94k7j64j92M55k48j49L55o2j31J20
7975A30O2m45J08L41lj72J78k3o10M07J20k10K92m99L27J04j83J19mJ79j85M41
7997D74o45K88M2k09P7m8j7j85J91r4M19k35k75K18k29L28pj62k30K61Q5j25K96
8020B18n24J14K81j62J95k46L45l64k4pJ37K73k22n8M7L9k%J76k22L7n5j48o5
8044b37L44j80k7K00k0j52j03Q1N6kk5J80k17K76r8J5R7k11k4N9P3q6J80J44j4
8069C09m0n12O32m63K80o93N75m7j44j20L91m3rJ63m39M86p2j41l88N65k5l76
$$ plain form
7908 54 96 94 -257 47 -186 42 -412 -285 -314 107 -322 -99 -125 112 -157 -36 -119 83 75 -142 231 29 40
7931 40 129 -185 -96 101 135 -80 41 277 162 91 338 -149 -92 356 -173 44 214 186 -118 180 74 305
7953 305 -70 24 416 -20 -117 33 -105 -50 48 -146 -21 173 146 -18 -210 245 -3 -152 203 141 10 130
7975 130 192 -253 -145 196 193 21 199 176 -434 -27 93 -117 175 -324 3 107 -76 43 39 218 33 474
7997 474 -171 117 159 -50 27 -21 -38 -223 -32 -126 293 58 -217 1 -228 100 93 -69 -299 -38 47 -78 218
8020 218 -306 -192 89 -73 122 -124 221 -143 -167 -174 -37 236 14 -44 3 42 40 40 216 -6 31 -24 -172 -237
8044 -237 107 -73 -100 100 80 -72 -175 -94 -38 -40 -65 115 -102 174 76 91 188 -23 -47 12 85 -1 179 323 309
8069 309 269 -243 389 -74 206 -487 88 41 -103 -223 168 125 116 279 -160 326 254 113 -275 290 265 -111
8091a11qK63j01k21L59j96J44q3p7L0j77K01J93N4m37o2L35k21J75j56K60l86
8113b22J79n6L0K08l24N9J81p1j47L1lj46K12J51q3j16K87k22R6k41m9K01k5k22
8137b92J27K30p0MJ17J4k70L5J41o8l04K65O8p0J45j68j41K02J84l2k58M88M1
8160C88o28L4L07j23J10j0J90n39M32m4j04j37q9J66Q4j41Kj58N79j29O9l21M62
8183D00m55rK51n46K82P8L71l86
$$ plain form
8091 -111 -119 144 43 -178 181 -15 129 46 -31 -1 -178 23 216 270 -167 -229 106 -115 60 -96 164 -222
8113 -222 -43 -99 -69 139 -185 -126 55 -16 -163 -132 -135 -281 -69 82 -1 -117 170 -52 44 -197 -246 -45 -70 -292
8137 -292 -165 65 -5 -1 116 130 -140 -105 36 -32 -336 -71 -3 -73 72 -96 -237 -35 149 117 -141 347 388
8160 388 -240 -206 101 -22 88 78 268 -271 161 117 13 -124 -213 -47 37 -104 -102 -260 319 190 259 -62 400
8183 400 -55 -64 187 -359 -77 1 372 -14
8191a4
$$ Imaginary data points
##PAGE= N=2
##DATA TABLE= (X++(I..I)), XYDATA
0@%%%qJ6qQj6K4l2M0n6P2q6J02j20J44j76K08k42K84l34L88m48N17n94O78p70
28d09Q74r90J116j255J407j573J757j962K185k427K694k986L309l665M058m492
44b359M975n521O131o821P614q532R608j0891J2455j4410J6934k0341K5223l2848
58a8783M6556p8931K93042K98378l88594j61173L8902J81033K9799l2985l9971
69A67273N8219j2788j15432r1683J31519J91175L3607j67143j68021l2733J03063
80I7056N8962m4166k2245R3234L8050j21530j32730L9308J52451Q1410r9966j78996
92c9162n2501J14628Q0714n1070m9779N3238O2948l0601j02674o5804N4108R9496
104G3541k3136j29916m0271J02377P9346m3027q3303p915Q1283N5099p6578j19095
$$ plain form
0 0 0 0 0 -8 8 0 8 -8 16 -16 24 -32 40 -46 56 -64 80 -96 112 -130 154 -180 208 -240 277 -317 361 -409
28 -409 465 -525 591 -664 743 -830 927 -1035 1150 -1277 1417 -1569 1740 -1925 2133 -2359
44 -2359 2616 -2905 3226 -3595 4019 -4513 5095 -5796 6659 -7751 9183 -11158 14065 -18783
58 -18783 27773 -51158 241884 540262 151668 -9505 29397 210430 240229 207244 167273
69 167273 225492 212704 97272 5589 137108 328283 361890 194747 26726 -6007 97056
80 97056 156018 111852 89607 182841 220891 99361 -33369 5939 158390 239800 139834 -39162
92 -39162 -91663 22965 103679 52609 2830 56068 119016 88415 -14259 -80063 -25955 73541
104 73541 50405 -79511 -119782 -17405 61941 18914 -64389 -72304 8979 64078 -12500 -131595
116a31595O043R3902O596q0565j9579Q5399Q9533j2831j19712r0581O1905J18477
128F992k509r9159m1913M4291L4722k5315l1934N1345J20563K5186j47499j45659
140b10889L1613J31339O4020l1672n5196j0229L1482K502m1137K1211J15272N5203
152A03519j06442j54319m0420J00480J35177L8872o7677m4296K8237j436o0148
163f8453O06J01437P7881n1133j41741q8235P4564J58848O0145o4078m9763J2733
175B2811p984n2105k5675N1795R4508K6762j05688j19094L5132J43430O7588n1746
187G9734o6090r800J7670j6527n6181n467R5328P5959n8184j03880k240Q7020
199C7342O0872k8928q1962l1542N3587L2592n9768m9796N7486Q4305j29o6541
$$ plain form
116 -131595 -125552 -31650 -25054 -105619 -125198 -39799 49734 36903 -82809 -173390 -111485 6992
128 6992 4483 -94676 -136589 -92298 -57576 -82891 -114825 -63480 57083 82269 -65230 -210889
140 -210889 -179276 -47937 16083 -15589 -70785 -81014 -49532 -47030 -88167 -66956 48316 103519
152 103519 -2923 -157242 -197662 -97182 37995 76867 9190 -35106 -6869 -8305 -68453
163 -68453 -67847 33590 111471 60338 -81403 -169638 -95074 63774 123919 59841 10078 22811
175 22811 14827 -37278 -62953 -11158 83350 110112 4424 -114670 -79538 63892 131480 79734
187 79734 13644 3844 21514 4987 -51194 -56661 38667 114626 56442 -47438 -49678 37342
199 37342 98214 69286 -12676 -44218 9369 41961 -17807 -67603 -10117 74188 74059 7518
211G518m0507L6981O0555k2106r9827l2780Q4160O8439l6180o5092k658N4636
223A3139M2809k5894n8469N845N5550j5620r2169l7656P5038R7107J8342p1448
235F574p1039K0696O5779n382n8768K703N4111l030p2986n1627M2352J11158O4381
248A04922o3475j05718j5758N0433J4688k6222j211L5715K6582l1867p6466j1412
260i9789J03840R5993l7471j09952n0238K7325M0104N221j5074K1774N5376k738
272C4371q6248m7474O7404R0201K559p9383p4471M887O5201K7916l1458K702O2120
285C8327K0449o7123o8513J1503P2194M6054m6065q1604Q56P5484L1865l7152
297c725j5958L7473L1407k3511o7030l6520M9585P0853j5819o9646m550O6085
$$ plain form
211 7518 -32989 3992 64547 42441 -57386 -90166 -6006 62433 26253 -38839 -41497 13139
223 13139 55948 30054 -28415 -22570 32980 17360 -74809 -112465 -37427 59680 78022 6574
235 6574 -64465 -43769 22010 16628 -42140 -39437 14674 11644 -61342 -112969 -70617 40541 104922
248 104922 41447 -64271 -80029 -29596 -14908 -41130 -42341 -6626 19956 -11911 -88377 -99789
260 -99789 4051 100044 62573 -47379 -97617 -70292 -30188 -24967 -40041 -18267 37109 34371
272 34371 -51877 -99351 -31947 58254 60813 -18570 -93041 -88154 -22953 4963 -26495 -23793 38327
285 38327 58776 -8347 -76860 -65357 6837 52891 6826 -74778 -73922 1562 33427 -3725
297 -3725 -19683 17790 49197 25686 -41344 -77864 -28279 42574 26755 -42891 -47441 18644
309A8644M0900k8034n1244o475M9013K6657n7059o0129L2372P0254M005m7634
321h730j5481M2698N2631j0791p9198m5809N0272O0414k0560n3805O61M5758K9649
334D7709k3534m2110J4650O6489Q397q6630o5919L6839P2175J8688l4193k7337
346a4776K3184M1325j7344o1044q09O5619K5027o0372o7602J846O8422N8949j8005
359D4420n5081L748M6292j0214o4231k0240N0525N0080j4764o8321l3543N8391
371a2938P6308r562o1017j3369L1709M372l9482l5594K0094O7390K7819n8992
383c262n5069L6662O9991J330n4435l4066J9000L4302j3878n3161j711P5292M8583
396F9578m4671n9646O395M8840K1004l7531n3444O640N8670J4480n0821k1780
$$ plain form
309 18644 59544 31510 -19734 -26209 22804 49461 -7598 -67727 -35355 34899 38904 -8730
321 -8730 -24211 18487 71118 60327 -18871 -64680 -14408 46006 25446 -28359 -27698 18060 47709
334 47709 24175 -17935 -3285 63204 71601 -15029 -80948 -44109 28066 46754 12561 -14776
346 -14776 8408 49733 32389 -28655 -29464 36155 61182 810 -66792 -64946 3476 62425 44420
359 44420 -10661 -6913 39379 29165 -35066 -55306 -4781 45299 30535 -37786 -71329 -12938
371 -12938 63370 53808 -7209 -20578 11131 15503 -23979 -59573 -39479 27911 55730 -3262
383 -3262 -58331 -21669 48322 49652 -4783 -38849 -19849 14453 575 -52586 -54297 20995 69578
396 69578 24907 -34739 -28344 20496 41500 3969 -49475 -42835 15835 30315 -20506 -42286
408d2286N1280N1977j2437n6313l1391L1659M6175k1952o2343O9O6060L2010l3209
421A9299l5353J2322M3126J5005m7559n0554K3443N5582n871n2586j1212M8790
433A4432M9321o757n4480k9016M0577L9194l7695n7494J2117N7354J9414l4598
445A2369l4978J8814N9941J5501o1375n0788K7240M4340j0917m1894r077M0031
457I207M5125j1841n6857j2366N5558K9561m8629n4818O898M4573K1107k8912
469a394l2729K6539N9589l401o5568l0163L8911L6379j8215m9675j9558M2703
481a6582N0429j6117n2117M667N3414J2121n0171m7122Q583M8284J9852m3050
493b7809l9030L6248N9053o994n2561j6296L2116K6571k2699n4016j3541N4943
$$ plain form
408 -42286 8994 60971 48534 -7779 -39170 -7511 38664 16712 -45631 -45562 20498 52508 19299
421 19299 -16054 -3732 39394 54399 6840 -43714 -20271 35311 29440 -23146 -34358 14432
433 14432 63753 56996 2516 -26500 14077 53271 15576 -41918 -29801 27553 46967 12369
445 12369 -22609 -3795 56146 71647 10272 -40516 -13276 31064 20147 -21747 -30824 9207
457 9207 54332 42491 -14366 -26732 28826 58387 9758 -45060 -38162 6411 27518 -1394
469 -1394 -34123 -7584 52005 48604 -16964 -47127 -8216 28163 9948 -39727 -59285 -16582
481 -16582 33847 17730 -34387 -29720 23694 35815 -14356 -61478 -52895 -4611 15241 -27809
493 -27809 -66839 -30591 28462 21468 -31093 -47389 -15273 11298 -11401 -65417 -78958 -24015
505b4015M3954l1218m5102J7712M9779R273m1799m0959J2085M8122K616n7266
517e6818k4382N4277N3645j4846m6033j1379L4269L0835k6057n5770j143N5706
529g696K2867l8368l0120K7397M9560J3445m0112m2076J7131M6519q074n2106
541d1633r252M8789L6272j5045l7134l404M4257L2323l5349n4554O719M5979R310
554B7278l0570j7164K5149M5028R053m3816l1720L2962M1362k0219m9840r011
566b1508L5920L2666p260l2409O67M7276K1609m3822m2766J5491L7089L799l0865
579A5887k5029K1014M7731P537m2271j7460L5960K5205k7804m3765p765L3890
591B3130L2188j6713m0758Q411N1843J4159m0755l1959J3178K8387N77l7538k8856
$$ plain form
505 -24015 19939 -11279 -56381 -38669 11110 20383 -21416 -62375 -50290 -2168 448 -56818
517 -56818 -81200 -26923 26722 11876 -34157 -45536 -11267 19568 -6489 -62259 -63402 -7696
529 -7696 15171 -23197 -53317 -25920 23640 37085 -3027 -45103 -27972 18547 10473 -41633
541 -41633 -50885 -2096 34176 19131 -18003 -21407 22850 55173 19824 -34730 -28011 17968 27278
554 27278 -3292 -20456 4693 49721 58774 14958 -16762 16200 57562 37343 -12497 -21508
566 -21508 14412 47078 39818 7409 8076 55352 76961 33139 -9627 5864 42953 46752 15887
579 15887 -9142 11872 59603 67140 24869 7409 43369 68574 40770 -2995 -10760 23130
591 23130 55318 38605 -2153 6258 58101 72260 31505 -454 12724 41111 41688 4150 -24706
604b4706K8896M8795n296m3218p140L6434K2398k3503m4762j4136L4501K9394
616C7657k7629l8271J9580M7789N223l6333k4511J5576L1692m282m9297k7345
628e0151L6448M1438j2164l2135J069L0368J8710k1461m2430l785M1040J5883
640B2830m1465l2417K4842M3425R716k6928k3495J6080L2033j3274n0366j1403
652e0422M2275K7879k0815l2305J190L7825K9974k1941m3127K177L6544o2l9992
665c0800j8883K7531L9441O259l4530k4670K9362L9528j6585m7253q208K9640
677i168J6793j7438k7002O187M4342K5233l3301l8757J4284L3859l154l4300k0851
690d3273J8649L5590K912l6058j0458M1256L0644k6237m1882m430K6405J7307
$$ plain form
604 -24706 4190 52985 47689 4471 -2669 33765 56163 32660 -12102 -26238 8263 37657
616 37657 10028 -28243 -8663 39126 44349 8016 -16495 -919 30773 26491 -22806 -50151
628 -50151 -13703 27735 15571 -16564 -15495 14873 33583 12122 -30308 -34093 6947 22830
640 22830 -18635 -51052 -26210 17215 26931 3 -23492 -7412 24621 11347 -39019 -50422
652 -50422 -8147 19732 -1083 -33388 -32198 5627 35601 13660 -29467 -27290 9254 9192 -30800
665 -30800 -49683 -22152 17289 23548 -10982 -35652 -6290 33238 16653 -30600 -38808 -9168
677 -9168 7625 -9813 -36815 -30628 13714 38947 5646 -33111 -18827 15032 11878 -22422 -43273
690 -43273 -24624 10966 13878 -22180 -32638 8618 39262 13025 -28857 -33287 -6882 10425
702A0425j7711l1103Q047M4123J4555l2868k1436K1082K7198m869l5702k6052
714d4311J8830L9128j886l6886k606L9291K1816k1983l1027k903K6546J5534k8497
727h954l5309J5845M4845Q051k8561j4176J8252K5946k033l7223k4756K5144L2821
740A9892j4588l5156M256L7184K2809j5625l2318m732L0870J4257l4776l1890
752c9817J8236L5013L745k2363j2800J8632L0942l365m1529j8839K8854K2557
764A9266k1191k9290M646L1697K2690j5788l0813N208L5032J676m1060k3242K0713
777b0456K8881n32k5085j4155K5527L5526j0338m1202q013K8670J2967k3794k8853
790d0857J685L5716K4967k2288l1289J4799L5249l871l5537j7675J5966K4059
$$ plain form
702 10425 -7286 -38389 -30342 13781 28336 -4532 -25968 -4886 22312 17443 -18259 -44311
714 -44311 -25481 13647 11761 -25125 -27731 11560 33376 11393 -19634 -22537 4009 19543 -8954
727 -8954 -44263 -28418 16427 24478 -4083 -18259 -7 25939 23906 -13317 -38073 -12929 19892
740 19892 5304 -29852 -25596 11588 34397 18772 -13546 -18278 12592 26849 -7927 -39817
752 -39817 -21581 13432 17177 -5186 -17986 646 31588 28223 -13306 -32145 -3291 19266
764 19266 -1925 -31215 -26569 5128 27818 12030 -18783 -13575 21457 23133 -17927 -41169 -20456
777 -20456 8425 7893 -17192 -31347 -5820 29706 19368 -21834 -29847 -1177 11790 -12004 -40857
790 -40857 -39172 -3456 21511 -777 -32066 -17267 17982 14111 -21426 -39101 -23135 924
802I24k303l0947j1524L5339L4354j4913l4045k543K3074R079j9824k7321M786
815c5864L7726J4511l2215k2586K6737L6332j946l1414k2170J0317K5327m433
827C22l1494l3M0041K2306k4418k8304M964L0729J7427k3676l6946L080L3487
840G485N877k4155m343L0003K5014j1775l4789j6002K7332L1623j6406l9826j037
853b0999L2878J6049j3424j4903J0012K8676N402l7923l3383K0091L8285o62l0328
866b29j2543K0838K8379l82k9127j0530K7949J6933k9614l4022O667L2044J6535
879C2898j4606k3149N859L2244P386l3610k2192J7897K1269r219k5596r455K4602
892D328K9670p271l3284l042L2670J1846k8992l0117K094K6173J5799j7049k2007
$$ plain form
802 924 -1379 -32326 -43850 -8511 25843 10930 -23115 -25658 -2584 6495 -13329 -40650 -35864
815 -35864 1862 16373 -15842 -38428 -11691 24641 22695 -8719 -30889 -20572 4755 322
827 322 -31172 -31205 8836 31142 6724 -21580 -16616 14113 31540 7864 -29082 -26002 7485
840 7485 13362 -10793 -15136 14867 39881 28106 -6683 -22685 4647 36270 19864 -19962 -20999
853 -20999 11879 27928 14504 -399 9613 38289 43691 5768 -27615 -7524 30761 30099 -229
866 -229 -12772 8066 36445 36063 6936 -3594 24355 41288 11674 -22348 -15681 16363 32898
879 32898 18292 -4857 1002 33246 40632 7022 -15170 2727 23996 14777 -10819 -20274 4328
892 4328 33998 26727 -6557 -9599 23071 34917 5925 -24192 -22098 4075 19874 2825 -19182
905a9182J5355L3201m270l4409j1761K3122K0387j0890l4365j6627K7647L4305
917B2513p538k6047M615K4777O74k7650k2679J0789L4180R355l4528k9071K2103
930a8507L7530L174k0588r051J1204R779j6741l2856L03M3494K6548k5701l4231
943b5643L139L0185J8315j2485k3649J406J9442p210l3304m799L8357L3127q651
956B8230l2552j7779J7608K7180o014k8415k809K2881K481k3612j1333K1664L4863
969C2393R342l2161l3107J0263L0104k223k6393m948K1109J4940r918k1131Q02
982a0928L2202J8986k7544l6364M461K6314P060j7161j5007J1523K9229O099k8942
995g2j7299K1904J9853j6413k7973l186K2793J9221j0697k7585J551L4837J6123
$$ plain form
905 -19182 -3827 29374 25104 -9305 -21066 2056 22443 11553 -22812 -39439 -11792 22513
917 22513 14975 -11072 -6457 18320 18994 -8656 -31335 -20546 13634 22989 -11539 -40610 -18507
930 -18507 19023 22197 1609 -7442 3762 13541 -3200 -36056 -35753 7741 34289 8588 -25643
943 -25643 -22504 7681 25996 13511 -10138 -8732 10710 3500 -29804 -34603 3754 36881 28230
956 28230 -4322 -22101 -4493 22687 16673 -11742 -14551 8330 10811 -12801 -24134 -2470 32393
969 32393 41735 9574 -23533 -13270 16834 14611 -11782 -16730 4379 19319 9401 -11730 -10928
982 -10928 21274 40260 12716 -23648 -19187 7127 14187 -2974 -17981 -6458 22771 28870 -72
995 -72 -17371 4533 24386 7973 -20000 -23186 -393 18828 8131 -19454 -17903 16934 33057
1008C3057k3909k5180K348J3771J306j5447j0146J9329K9794o704l5264j0025
1020b7070K7446K3144p895k6547j5532R740J4945q021j2583J8743L0915l802l4216
1033a0733k2657J1151K9138J2550k2179k6080P015K0011k885j1409J1958K4598
1045B0478N560k5596l6512n207L5106K7208j5618k5596K826J7049K879q581k444
1058h448J4852J7250j3250m0271j5526L1373L2030k445j9200p121J1040J2799
1070A3083r206j9274O516K7028j084l2441j8917J8486L0715J1506j6284j8263
1082h135P883J9777q344k6490k327K3087J2504j2112j9415J229K5438J9431j5804
1095A6722k6711N569K2639n84k2802j3326J0969K2311P254j6939j0208J9196J6028
$$ plain form
1008 33057 9148 -16032 -13684 87 1393 -14054 -24200 -4871 24923 18219 -17045 -27070
1020 -27070 376 23520 15625 -10922 -26454 -16714 -1769 -9790 -22373 -3630 27285 23483 -10733
1033 -10733 -33390 -22239 6899 19449 -2730 -28810 -21795 -1784 -4669 -16078 -4120 20478
1045 20478 26038 442 -36070 -41277 -6171 21037 5419 -20177 -17351 -302 2577 -6004 -8448
1058 -8448 6404 23654 10404 -29867 -45393 -14020 18010 15565 -3635 -10756 284 13083
1070 13083 3877 -15397 -8881 18147 17063 -15378 -34295 -15809 14906 26412 10128 -8135
1082 -8135 -252 19525 11181 -15309 -17636 5451 17955 5843 -13572 -12343 13095 32526 16722
1095 16722 -9989 -4420 18219 17635 -5167 -18493 -7524 14787 22041 5102 -5106 14090 30118
1108C0118j7331k6310J382K2016J3843j2027k5426l719K6798J9084j2846j3985
1120A597Q855J0817j1885k4461q956K0972L1911P9l2553j5950J9605K0592k521
1133A8102j1822l380N065q68j9562j8347J7742M0328J0321k8120k4648K420J7471
1146D702R661r409j1862O528R167j6226k1966J1817L6079J8040j6409l1569j4286
1159b5733J6309J9170p831j5888P882J4960o422j8430k813K0270K5300j622l3513
1172h361k3169J3846K1570l619j3051L481J4853O822j1449j7516L813K4953O676
1185A8849k6135k0570R673J9274M272j0204p993J1608J9999m857k6453p851J8751
1198a637J0817j3381j5395K744K0150J4499j2722k2050O431K5626L626k1835j5368
$$ plain form
1108 30118 12787 -13523 -12141 9875 23718 11691 -13735 -17454 9344 28428 15582 1597
1120 1597 10452 21269 9384 -15077 -24033 -3061 28850 28929 -3624 -19574 31 20623 18102
1133 18102 6280 2900 7965 7097 -12465 -30812 -13070 27258 37579 9459 -15189 -12769 4702
1146 4702 14363 4954 -6908 -380 8787 -7439 -29405 -17588 18491 36531 20122 -11447 -25733
1159 -25733 -9424 9746 1915 -13973 -6091 8869 2447 -15983 -18796 1474 26774 25152 -8361
1172 -8361 -31530 -17684 3886 267 -12784 -9303 5550 12372 923 -16593 -12780 12173 18849
1185 18849 -7286 -27856 -18183 1091 5363 -4841 -12834 -1226 18773 13916 -12537 -20388 -1637
1198 -1637 9180 -4201 -19596 -16852 3298 17797 5075 -16975 -10544 15082 18708 -3127 -18495
1211a8495M830J2818L189j1299m488K0471K0262j4345k9201l296K1265J4077p645
1224H143j9304o687J5067J1174j1384p069J9474K0439j1344k9631j6208J2658
1236a4672K6360P372k0350j3420J3839J2916r143r473J0174J7463J817k4456k8976
1249c0549L339L4163J7715j5343j5290N730R629k480j0859l880J4532J4804j6334
1262E177l1246j993K9416K1349n995j6355n970R226O354j3752j5803J2283K2843
1275A5534n248k5143q327J7827K3021K645k0593j5060J1640J3848j3503k0032
1287b3391N480K1756Q321j1762j5714K739K2589Q164k2778j9875J2184J7839m466
1300A086j7157o399J4575K0137j326k1085n265J9565P433k0268j8424O650K0400
$$ plain form
1211 -18495 -13665 -847 2342 -8957 -13445 7026 27288 12943 -16258 -19554 1711 15788 8143
1224 8143 -11161 -17848 -2781 8393 -2991 -10060 9414 29853 18509 -11122 -27330 -14672
1236 -14672 11688 19060 -1290 -14710 -871 12045 2902 -6571 3603 21066 22883 -1573 -30549
1249 -30549 -27210 6953 24668 9325 -5965 -235 9394 6914 -3945 -7825 6707 21511 5177
1262 5177 -26069 -28062 1354 22703 16708 353 -5617 3609 9963 -3789 -19592 -7309 15534
1275 15534 10286 -14857 -23184 -5357 17664 20309 -284 -15344 -3704 10144 -3359 -23391
1287 -23391 -17911 3845 12166 404 -15310 -12571 10018 18182 -4596 -24471 -12287 5552 1086
1300 1086 -16071 -22470 -7895 12242 10916 -10169 -15434 4131 11564 -8704 -27128 -20478 -78
1313g8J1158j3104j9266N921K4797M915j9834r826J1519Q935r262j8814l428K3052
1327c315K4403q186k6173l455J9172Q250j0610j1871J168J3177K757j7573j2002
$$ plain form
1313 -78 11080 -2024 -21290 -15369 9428 14343 -5491 -15317 -3798 5137 -4125 -22939 -26367 -3315
1327 -3315 21088 12902 -13271 -16726 2446 10696 86 -11785 -10617 2560 5317 -12256 -24258
$$ [...]
8191a40
##END NTUPLES=NMR FID
##END=
