##TITLE=1H_CA-8723-2
 CDCl3, 8 sc, 
 6.8.2020
##JCAMPDX= 6.0         $$ Bruker NMR JCAMP-DX V2.0
##DATA TYPE= NMR FID
##DATA CLASS= NTUPLES
##ORIGIN= UXNMR, Bruker Analytische Messtechnik GmbH
##OWNER= root
$$ XWIN-NMR		Version 3.5
$$ Thu Aug  6 09:43:10 2020 Russian Standard Time (UT+4h)  she@DPX200
##.OBSERVE FREQUENCY= 200.1314999998
##.OBSERVE NUCLEUS= ^1H
##.DELAY= (6, 6)
##.ACQUISITION MODE= SIMULTANEOUS
##.ACQUISITION SCHEME= undefined
##.AVERAGES= 8
##.DIGITISER RES= 18
##SPECTROMETER/DATA SYSTEM= spect
##.PULSE SEQUENCE= zg30
##.SOLVENT NAME= D2O
##.SHIFT REFERENCE= (INTERNAL, D2O, 0, 15.7039)
##AUDIT TRAIL= $$ (NUMBER, WHEN, WHO, WHERE, WHAT)
$$ ##TITLE= Audit trail, XWIN-NMR		Version 3.5
$$ ##JCAMPDX= 5.01
$$ ##ORIGIN= Bruker BioSpin GmbH
$$ ##OWNER= she
$$ F:/spectra/data/she/nmr/H-F/1/audita.txt
$$ ##AUDIT TRAIL=  $$ (NUMBER, WHEN, WHO, WHERE, WHAT)
(   1,<2020-08-06 09:41:49.67 +0400>,<she>,<DPX200>,
      <created by zg, POWCHK disabled, PULCHK disabled
       configuration hash MD5:
       00 E9 B6 7A A2 85 ED C7 34 08 36 98 17 FE 4E 26
       data hash MD5: 16K
       66 F1 0F D5 8A AB 42 03 0A 91 58 03 00 DF FD 7E>)
$$ ##END=
$$ 
$$ hash MD5
$$ 7B 8E 68 1D F7 E0 C2 F6 64 EA 12 ED FA 0E 24 51
##$RELAX= 
##$RELAX= 
##$RELAX= 
##$RELAX= 
##$RELAX= 
##$RELAX= 
$$ Bruker specific parameters
$$ --------------------------
##$DU= <F:/spectra>
##$EXPNO= 1
##$NAME= <H-F>
##$PROCNO= 1
##$TYPE= <nmr>
##$USER= <she>
##$AMP= (0..31)
100 100 100 100 100 100 100 100 100 100 100 100 100 100 100 100 100 100 
100 100 100 100 100 100 100 100 100 100 100 100 100 100 
##$AQSEQ= 0
##$AQ_mod= 1
##$AUNM= <au_zg>
##$AUTOPOS= <>
##$BF1= 200.13
##$BF2= 200.13
##$BF3= 200.13
##$BF4= 200.13
##$BF5= 200.13
##$BF6= 200.13
##$BF7= 200.13
##$BF8= 200.13
##$BYTORDA= 1
##$CFDGTYP= 0
##$CFRGTYP= 5
##$CHEMSTR= <none>
##$CNST= (0..31)
1 1 145 1 1 1 1 1 1 1 1 1 1 1 1 1 1 1 1 1 1 1 1 1 1 1 1 1 1 1 1 1 
##$CPDPRG= <>
##$CPDPRG1= <>
##$CPDPRG2= <>
##$CPDPRG3= <>
##$CPDPRG4= <mlev>
##$CPDPRG5= <mlev>
##$CPDPRG6= <mlev>
##$CPDPRG7= <mlev>
##$CPDPRG8= <mlev>
##$CPDPRGB= <>
##$CPDPRGT= <>
##$D= (0..31)
0 1.2 0 0 0 0 0 0 0 0.06 0 0.03 0 0 0 0 0.0002 0 0 0 0 0 0 0 0 0 0 0 0 
0 0 0 
##$DATE= 1596692509
##$DBL= (0..7)
120 120 120 120 120 120 120 120 
##$DBP= (0..7)
150 150 150 150 150 150 150 150 
##$DBP07= 0
##$DBPNAM0= <>
##$DBPNAM1= <>
##$DBPNAM2= <>
##$DBPNAM3= <>
##$DBPNAM4= <>
##$DBPNAM5= <>
##$DBPNAM6= <>
##$DBPNAM7= <>
##$DBPOAL= (0..7)
0.5 0.5 0.5 0.5 0.5 0.5 0.5 0.5 
##$DBPOFFS= (0..7)
0 0 0 0 0 0 0 0 
##$DE= 6
##$DECBNUC= <off>
##$DECIM= 24
##$DECNUC= <off>
##$DECSTAT= 4
##$DIGMOD= 1
##$DIGTYP= 9
##$DL= (0..7)
0 120 120 120 120 120 120 120 
##$DP= (0..7)
150 150 150 150 150 150 150 150 
##$DP07= 0
##$DPNAME0= <>
##$DPNAME1= <>
##$DPNAME2= <>
##$DPNAME3= <>
##$DPNAME4= <>
##$DPNAME5= <>
##$DPNAME6= <>
##$DPNAME7= <>
##$DPOAL= (0..7)
0.5 0.5 0.5 0.5 0.5 0.5 0.5 0.5 
##$DPOFFS= (0..7)
0 0 0 0 0 0 0 0 
##$DQDMODE= 0
##$DR= 18
##$DS= 0
##$DSLIST= <SSSSSSSSSSSSSSS>
$$ [...]
##$SUBNAM2= <"">
##$SUBNAM3= <"">
##$SUBNAM4= <"">
##$SUBNAM5= <"">
##$SUBNAM6= <"">
##$SUBNAM7= <"">
##$SUBNAM8= <"">
##$SUBNAM9= <"">
##$SW= 24.9337058888022
##$SWIBOX= (0..15)
0 0 2 0 0 0 0 0 0 0 0 0 0 0 0 0 
##$SW_h= 4990.01996007984
##$TD= 16384
##$TD0= 1
##$TE= 0
##$TE2= 300
##$TE3= 300
##$TEG= 300
##$TL= (0..7)
0 120 120 120 120 120 120 120 
##$TP= (0..7)
150 150 150 150 150 150 150 150 
##$TP07= 0
##$TPNAME0= <>
##$TPNAME1= <>
##$TPNAME2= <>
##$TPNAME3= <>
##$TPNAME4= <>
##$TPNAME5= <>
##$TPNAME6= <>
##$TPNAME7= <>
##$TPOAL= (0..7)
0.5 0.5 0.5 0.5 0.5 0.5 0.5 0.5 
##$TPOFFS= (0..7)
0 0 0 0 0 0 0 0 
##$TUNHIN= 0
##$TUNHOUT= 0
##$TUNXOUT= 0
##$USERA1= <user>
##$USERA2= <user>
##$USERA3= <user>
##$USERA4= <user>
##$USERA5= <user>
##$V9= 5
##$VALIST= <valist>
##$VCLIST= <CCCCCCCCCCCCCCC>
##$VD= 0
##$VDLIST= <DDDDDDDDDDDDDDD>
##$VPLIST= <PPPPPPPPPPPPPPP>
##$VTLIST= <TTTTTTTTTTTTTTT>
##$WBST= 1024
##$WBSW= 4
##$XGAIN= (0..3)
0 0 0 0 
##$XL= 0
##$YL= 0
##$YMAX_a= 177392
##$YMIN_a= -90243
##$ZGOPTNS= <>
##$ZL1= 120
##$ZL2= 120
##$ZL3= 120
##$ZL4= 120
##$ABSF1= 10
##$ABSF2= 0
##$ABSG= 5
##$ABSL= 3
##$ALPHA= 0
##$AQORDER= 0
##$ASSFAC= 0
##$ASSFACI= 0
##$ASSFACX= 0
##$ASSWID= 0
##$AUNMP= <proc_1d>
##$AZFE= 0.1
##$AZFW= 0.1
##$BCFW= 1
##$BC_mod= 2
##$BYTORDP= 1
##$COROFFS= 0
##$CY= 11.3945322036743
##$DATMOD= 1
##$DC= 2
##$DFILT= <>
##$DTYPP= 0
##$F1P= 16.9975609425685
##$F2P= -3.02152046262296
##$FCOR= 0.5
##$FTSIZE= 0
##$FT_mod= 4
##$GAMMA= 1
##$GB= 0.15
##$INTBC= 1
##$INTSCL= 1
##$ISEN= 128
##$LB= 0.24
##$LEV0= 0
##$LPBIN= 0
##$MAXI= 10000
##$MC2= 0
##$MEAN= 0
##$ME_mod= 0
##$MI= 1.114404
##$NCOEF= 0
##$NC_proc= 0
##$NLEV= 6
##$NOISF1= 3.799351
##$NOISF2= 2.8
##$NSP= 1
##$NTH_PI= 0
##$NZP= 0
##$OFFSET= 15.70392
##$PC= 1
##$PHC0= -9794.929
##$PHC1= 12.80093
##$PH_mod= 1
##$PKNL= yes
##$PPARMOD= 0
##$PSCAL= 0
##$PSIGN= 0
##$REVERSE= no
##$SF= 200.130013532006
##$SI= 16384
##$SIGF1= 3
##$SIGF2= 2
##$SINO= 400
##$SIOLD= 16384
##$SREGLST= <1H.CDCl3>
##$SSB= 0
##$STSI= 0
##$STSR= 0
##$SW_p= 3612.71676300578
##$SYMM= 0
##$S_DEV= 0
##$TDeff= 0
##$TDoff= 0
##$TI= <>
##$TILT= no
##$TM1= 0
##$TM2= 0
##$TOPLEV= 0
##$USERP1= <user>
##$USERP2= <user>
##$USERP3= <user>
##$USERP4= <user>
##$USERP5= <user>
##$WDW= 1
##$XDIM= 8192
##$YMAX_p= 0
##$YMIN_p= 0
$$ End of Bruker specific parameters
$$ ---------------------------------
##NTUPLES= NMR FID
##VAR_NAME=  TIME,          FID/REAL,        FID/IMAG
##SYMBOL=    X,             R,               I
##VAR_TYPE=  INDEPENDENT,   DEPENDENT,       DEPENDENT
##VAR_FORM=  AFFN,          ASDF,            ASDF
##VAR_DIM=   8192,          8192,            8192
##UNITS=     SECONDS,       ARBITRARY UNITS, ARBITRARY UNITS
##FACTOR=    0.0002004,     1,               1
##FIRST=     0,             0,               0
##LAST=      1.6414764,     0,               0
##MIN=       0,             -90243,          0
##MAX=       1.6414764,     177392,          0
$$ Real data points
##PAGE= N=1
##DATA TABLE= (X++(R..R)), XYDATA
0 0 0 0 0 0 0 0 0 0 0 0 -8 8 -8 8 -9 16 -16 18 -24 26 -33 39 -44 49 -58 66 -77 88 -98 111 -124 141 -159
33 -159 177 -196 221 -245 273 -301 334 -370 410 -453 501 -556 615 -685 761 -850 953 -1074
51 -1074 1220 -1397 1617 -1905 2294 -2853 3723 -5289 8987 -39837 8126 39306 -68923 -90243
65 -90243 -65377 -6322 -11955 -60186 -89038 -47061 19717 -20722 -82722 -70208 -18982 21478
77 21478 -72 -31182 -61408 -13938 41865 6596 -36224 -26867 28349 38063 19506 550 -15981
90 -15981 35197 65043 35989 -11600 5532 58397 50523 32164 4650 10016 53251 71245 36401
103 36401 -16327 19733 58151 43567 14221 -5852 14291 33576 43204 994 -28780 14803
115 14803 37764 20474 -16432 -14770 -1073 9239 18825 -22529 -35080 -3775 23991 2300
127 2300 -31884 -17358 -7988 10424 9064 -20430 -26138 -655 26806 -7306 -25185 -7625 7549
140 7549 24172 12097 -6839 -21085 12597 37374 4392 -8612 1277 21250 18162 6899 -4416
153 -4416 -10052 29855 33650 1098 -18322 -2319 19181 8273 6203 -11836 -14228 11013 11342
166 11342 -12564 -31860 -2799 9600 -3576 -14894 -33899 -23344 -4147 2914 -26868 -39578
178 -39578 -7115 -1892 -11193 -26070 -27257 -16568 -1594 3462 -32450 -34481 -6712 5206 -6006
191 -6006 -20741 -10396 -4790 13848 9323 -19889 -14479 11319 24937 -1015 -9778 669 8197
204 8197 25485 13713 -3897 -3343 24644 30424 -581 -2440 5708 18927 22463 10201 -4576
217 -4576 -2788 29935 23640 -3726 -8151 4903 17770 9310 2952 -13282 -4696 21288 11392 -8263
231 -8263 -12987 9434 12810 3061 -3732 -18400 -2182 16122 10589 -14351 -14904 11743 10829 5202
245 5202 -4326 -6293 6568 16805 10290 -16606 -6088 16361 16463 6885 -4019 736 7414 22335
259 22335 10758 -11927 1826 19027 17748 -2335 -5966 2312 9915 21774 3523 -11493 -1797
272 -1797 16160 11313 -9940 -5755 -698 8413 10262 -6662 -17263 -6172 18141 4729 -14992
285 -14992 -12400 -4432 5844 -182 -9778 -19003 -3052 15284 -3883 -17775 -13149 4300 7277
298 7277 -1042 -9892 -18882 2292 13337 -2445 -17199 -8265 11611 6255 -67 -9472 -8600 10555
312 10555 14550 -298 -17483 -107 14540 6989 -865 -9063 -1045 10713 15786 -2196 -14651
325 -14651 5833 14773 6966 -6580 -7086 2287 10729 13280 -8479 -12354 7194 15673 3730 -11092
339 -11092 -3548 2343 9693 6526 -11304 -9037 7487 16979 -1558 -11396 -1678 4646 10270 667
353 667 -10156 -8614 8784 13577 -7623 -10224 441 9714 7902 -2052 -8212 -7626 11571 9427
367 9427 -8893 -10711 989 10537 1669 -3490 -8409 -2317 13390 5672 -9935 -12652 4563 8648
381 8648 -1846 -5112 -8284 1188 8629 3046 -10369 -10051 8194 5570 -3312 -8154 -6687 2157 6246
396 6246 2752 -12477 -6480 8252 4496 -5003 -9936 -2032 1185 4430 -1096 -12806 -3836 6843
410 6843 5280 -7810 -7885 72 413 3443 -5507 -11359 -4462 6091 3368 -11211 -6272 9 2292
425 2292 1440 -5858 -7977 -3767 7863 401 -10514 -4902 1053 4366 -727 -3075 -6039 -153 9857
440 9857 129 -7284 -3763 6238 5614 -559 -678 -4256 4467 9683 2072 -5505 -1407 9517 4414
455 4414 749 -1126 -1280 5853 8273 2919 -6847 1146 9385 3711 -534 -3184 154 3462 5743
470 5743 -889 -8894 909 6597 2661 -4242 -3642 -72 1227 4697 -4358 -9159 -249 5180 684
485 684 -8005 -3315 -270 2654 3758 -4969 -6489 894 7973 -344 -6989 -907 1879 4996 2357
500 2357 -2297 -3986 3771 10590 52 -4145 256 5402 5993 1514 -899 -3435 6952 9379 -627
515 -627 -4520 783 7871 3212 15 -3673 -3019 6128 5575 -2875 -7443 1377 6420 55 -2878 -6064
531 -6064 -1862 3332 2345 -6194 -9942 2269 4009 -1130 -5379 -4926 -16 3008 2688 -7324 -6833 3832
547 3832 4922 -696 -5603 -803 2747 5403 3831 -4904 -1713 6374 8095 -486 -3035 3429 5277
562 5277 7585 3040 -1951 714 8447 9019 -1608 -1283 3585 6110 5868 186 -1789 224 8910 5671
578 5671 -3880 -2146 2565 5096 762 -2257 -4016 -1133 6139 999 -5898 -4709 2429 3705 -1949
593 -1949 -3350 -5133 -118 4204 -387 -6797 -4739 4821 2591 -1949 -3564 -2156 3287 4492 1356
608 1356 -5378 -683 7501 3717 -526 -2025 2075 4823 6174 2292 -3821 3061 8223 5166 -1246
623 -1246 -690 4533 5060 6049 435 -2521 3289 7689 3963 -3450 -551 3448 3935 2987 -2514 -2723 1654
640 1654 6447 592 -5452 -486 2832 3077 -248 -3228 -2868 1536 5741 -1950 -4746 121 4442 3226
656 3226 -852 -845 -911 4426 5891 -511 -2351 2478 7454 3555 818 1374 2643 7863 6374 1926 -369
673 -369 5604 9178 3623 2314 2462 5305 6820 5838 2261 -50 6835 7768 2894 244 1941 4935
689 4935 4681 4062 -390 -506 5367 4922 358 -2144 1453 2646 1590 1344 -2860 -615 3094 3661 -1292
706 -1292 -2911 1211 1828 1559 -444 -2422 -1086 2513 3326 -1818 -1473 1941 2854 2430 -31 30 48 4280
724 4280 3499 -1413 -438 2733 3940 1596 620 954 1080 4866 2954 -944 -621 3223 3947 288 119
741 119 -415 1468 3737 1452 -1886 -2247 3116 2177 -965 -1286 -1520 834 1621 473 -3353 -2149 2628
758 2628 971 -1398 -2655 -464 656 869 141 -3816 -774 2913 1593 -1512 -2107 1172 1538 2499
774 2499 499 -1987 634 3967 3024 -1556 124 3097 3222 3155 933 216 2157 5574 3148 -697
790 -697 1278 3551 4155 2736 840 613 2616 5637 1947 -1285 1064 3617 3551 647 436 -62 2381
807 2381 4410 457 -1865 -2 3813 2192 -340 -576 -328 2568 2587 -184 -2313 777 4281 1487
823 1487 -724 -982 519 2267 2140 -366 -2431 1839 3860 1135 -985 -248 2526 2253 1801 -1065
839 -1065 -1788 2489 3834 926 -2082 526 2584 2290 1662 -1393 -659 2396 3552 -100 -2827 536
855 536 2048 1311 -142 -1999 -593 1803 2725 -1981 -2795 298 1569 427 -1798 -2205 -825 1621
871 1621 1771 -2536 -2360 313 1635 -272 -2147 -1475 -216 1894 411 -2130 -1951 1474 2695 -806
887 -806 -1446 -635 837 2135 236 -1761 -1566 2676 2252 -835 -984 55 1888 1843 268 -1769 -571
904 -571 3121 1543 -660 -1501 1053 2079 1075 250 -1545 276 2713 1568 -1619 -1352 1841 1464
920 1464 813 -637 -1256 644 2186 1234 -2069 -1218 1849 1020 257 -1178 -610 591 1991 492 -2531
937 -2531 -234 1788 1227 -615 -1079 -130 649 1792 -23 -1685 -48 2018 1326 -1054 -541 81 945
954 945 1787 -388 -1731 -314 1659 628 -1195 -165 -75 1130 1020 -545 -1424 -46 2122 -64 -1473
971 -1473 -835 548 637 90 -525 -1752 546 1920 -343 -1451 -886 702 355 161 -760 -1194 839 1087
989 1087 -264 -1946 -98 621 -51 -155 -1493 -1094 579 1275 -433 -2062 582 925 252 -425 -1007
1006 -1007 -349 528 860 -987 -1661 706 1057 253 -818 -380 122 1026 1169 -959 -1341 802 1271 292
1024 292 -847 -41 149 1340 593 -889 -975 423 1830 -440 -656 -205 528 1130 469 -323 -873 1264
1042 1264 1413 -398 -864 58 927 623 132 -891 -550 1399 1238 -895 -945 92 681 118 -251 -1448
1060 -1448 -273 1147 840 -873 -1592 774 709 200 -153 -990 -39 972 480 -1419 -1139 1142 652 3
1078 3 -684 -624 115 799 282 -1757 -817 791 914 -502 -1192 -435 283 1321 -223 -1248 -485 738 971
1097 971 -716 -694 -129 394 737 -432 -1431 -450 876 625 -1140 -962 -460 651 109 -437 -1221 -313 1647
1116 1647 134 -1229 -810 544 686 141 -716 -1436 -141 1294 -190 -1386 -755 1067 831 -219 -652
1133 -652 -734 764 929 -69 -948 -200 1507 835 -127 -518 80 1146 1258 -288 -1164 410 1661 370
1151 370 -215 -273 808 732 838 -328 -944 835 1308 118 -703 -7 281 789 736 -659 -681 535 1191
1170 1191 19 -987 -128 135 890 198 -882 -505 965 1103 -324 -809 145 424 579 -214 -754 -641
1188 -641 1046 1044 -421 -653 264 1041 316 -114 -379 -117 1091 734 -499 -599 228 722 95 -87 -176 -77
1208 -77 1046 78 -570 -498 936 749 -233 -503 -399 70 552 411 -651 -873 805 186 -576 -635 -358 -126
1228 -126 287 38 -770 -236 580 296 -858 -621 264 117 410 -285 -664 -27 532 509 -394 -284 123 183
1248 183 324 214 -467 79 959 336 -397 -5 332 438 185 193 -175 330 1004 390 -548 12 560 628 344
1269 344 50 -43 28 860 186 -584 -163 378 286 -234 -176 -343 214 570 -87 -703 54 571 348 -221 -278 -56
1291 -56 313 219 98 -692 88 766 193 -269 -74 222 201 428 -90 -521 231 557 346 -383 -47 301 208
1312 208 264 -223 -595 306 579 213 -597 15 406 346 92 -175 -223 101 615 -261 -595 190 28 195 -166
1333 -166 -496 -255 454 619 -698 -776 -169 330 -72 -102 -225 -36 399 372 -352 -587 -246 460 6 -231 -293
1354 -293 -169 331 129 -386 -465 453 567 -108 -346 -512 213 402 183 -148 -324 532 632 -21 -451 64
1374 64 188 193 264 -439 -115 816 688 -122 -432 209 416 354 -114 21 -13 417 600 -274 -287 329 152 373
1396 373 -99 -245 -51 517 503 -656 -471 0 802 53 -154 -112 37 394 96 -256 -153 475 170 -195
1416 -195 134 90 114 509 -314 -391 -134 462 42 -499 -395 -162 289 254 207 -283 -200 519 -43 -465 -283 85
1438 85 387 171 -100 -364 -114 593 -91 -444 -206 61 13 132 -185 -290 106 272 -342 -995 -214 -87 275
1459 275 -11 -585 -340 151 -2 -224 -182 -207 -3 -133 -80 -590 -462 153 112 -83 -388 -20 159 -98 -250
1480 -250 -278 -363 366 563 -94 -284 158 29 -174 54 -68 -192 307 36 -327 -236 153 434 -105 -290 110
1501 110 325 205 38 -126 -183 275 284 -75 -93 -204 70 296 56 -148 -81 45 82 -203 -74 -168 100 399
1523 399 44 -243 -26 298 348 -279 -237 355 258 88 70 80 -128 129 402 -38 42 -126 286 180 -160 -160 -267
1546 -267 363 23 -229 -236 246 73 176 -269 -114 211 235 63 -151 -56 -163 65 -100 40 -217 -106 226
1567 226 5 -201 -243 363 198 -173 -63 -61 114 96 280 -380 151 177 306 71 -246 -180 26 -209 -120 -278
1589 -278 163 422 -193 -255 -369 168 168 166 -69 -217 81 175 -168 -422 37 230 254 238 63 -133 -38 343 90
1612 90 -342 119 388 209 -56 -150 -255 187 489 58 -245 -158 4 304 -156 -54 260 180 426 -91 -75 -26
1634 -26 320 -84 -78 -384 204 145 218 3 -133 -81 463 -98 -369 126 58 -35 62 62 -257 -155 88 170 -18 -12 47
1659 47 79 39 -177 -322 68 -254 -156 -506 249 216 284 155 -131 -155 104 168 -203 -377 140 242 452 -214 -41
1682 -41 -437 60 55 -257 -10 -8 2 34 -154 183 -122 351 439 -136 -427 67 -18 77 -323 -99 -43 -41 382 -328
1706 -328 -313 2 272 -205 -281 -80 -407 -26 284 -295 -584 467 167 -168 317 81 -206 37 -146 -69 -103
1727 -103 138 16 -170 -97 -101 166 196 143 103 103 -110 19 -49 -399 134 373 -35 -317 -256 97 -43 160 -22
1750 -22 -119 198 241 -144 -113 -229 116 129 23 -120 -10 116 -179 -164 -69 -246 -105 11 505 -7 -24 364 47
1773 47 -402 50 267 139 22 -67 59 -152 88 -25 40 69 37 13 47 38 -25 282 15 -75 -165 -46 262 121
1797 121 287 25 -56 180 92 -12 24 32 74 103 142 -44 -159 294 -13 10 -58 -135 70 24 116 -53 -229 27
1821 27 47 -167 -125 -135 117 -147 -364 -26 -233 -127 -5 -14 -53 -94 -232 -272 124 -34 -301 -80 88 -207 -214 -58
1845 -58 -139 72 33 -28 -96 294 43 -45 149 -114 337 -7 -186 61 67 58 -173 -10 -38 103 -25 47 -62 58
1869 58 -164 147 -54 -43 46 110 188 -87 -153 -92 202 117 48 -59 -119 112 203 -136 -62 -112 -139 -262 323 -10 -108
1894 -108 487 8 -45 -28 316 -77 -94 -95 -128 71 161 -34 55 241 332 115 -157 20 -29 -81 -2 -39 -372 190
1918 190 -88 303 -34 -137 45 -25 119 -301 -295 118 -116 174 -193 -296 1 -118 198 -271 0 84 308
1939 308 118 -135 77 -124 2 109 -292 49 70 386 162 -163 176 -154 -133 101 -27 -25 205 -377 124
1960 124 136 217 130 -175 196 -139 -538 121 118 -69 199 139 87 19 83 -104 48 -24 -26 -56 -12 66 182 -43 -40 -140
1986 -140 -69 -159 33 -32 -147 -120 -143 -262 50 80 143 103 204 -209 39 185 134 -397 -174 50 66 225 211 -11
2010 -11 -138 -133 119 -151 5 49 -101 -15 18 36 -129 -53 153 -173 -74 -137 329 -82 -117 -182 -245 234 49 16 -54
2035 -54 -10 236 -290 -31 39 242 276 167 104 179 249 57 -5 -5 20 235 247 293 75 -132 22 217 -80 -97 13
2060 13 -1 -13 61 171 -68 68 134 -31 -35 155 -166 -334 291 -109 82 100 -173 12 -63 253 72 -406 -182
2083 -182 -16 -1 466 -10 38 36 126 -263 -31 183 -30 12 -115 -187 -163 2 253 58 -42 -2 42 209 25
2106 25 -44 -133 169 -24 -65 41 -137 43 107 201 125 139 124 235 153 -208 86 -54 -44 -9 -104 -228 -179 274 -52
2131 -52 66 -93 -58 124 20 149 -218 -214 1 15 -294 -107 98 101 34 -62 -294 206 99 -78 -107 -101 -83 9 199
2156 199 129 -23 2 87 74 145 -178 -209 23 101 -81 -299 -295 245 -420 -61 215 49 -112 -246 -90 156 115
2179 115 -16 332 -164 4 134 -184 55 -223 -160 103 -46 -261 125 190 34 8 2 -193 -39 -41 -244 -315 119
2202 119 63 108 -411 103 6 132 17 59 -88 -196 400 -205 62 -22 176 60 117 -85 -191 11 213 -220
2224 -220 -236 103 -182 -40 -84 -279 -9 -380 93 131 50 183 -205 187 141 -32 79 278 132 177 22 115
2246 115 48 70 -290 -102 -14 340 89 -57 -114 18 66 -285 -116 165 -23 -148 58 -322 -147 -194 -37 184
2268 184 -14 -109 -205 26 56 301 -121 -8 -28 -91 232 53 152 32 -12 15 -86 201 -98 -344 -52 73 95
2291 95 241 196 -248 -86 -164 -182 77 3 -34 376 -60 -157 -272 19 15 374 -105 94 284 81 23 299 34
2314 34 36 244 207 16 36 207 -58 -172 48 106 204 -27 308 143 -3 -134 0 76 -220 123 29 174 3
2337 3 -153 -49 88 213 -137 221 165 223 166 -59 35 10 -77 444 -158 -110 153 5 -18 113 -48 79 -249
2360 -249 92 369 94 101 -304 -241 200 46 -117 81 -199 -74 74 46 79 -55 73 185 176 223 -98 -18 57
2383 57 150 85 239 11 -250 -23 176 54 -172 23 -11 18 323 11 99 -40 -54 123 -163 -53 84 -31
2405 -31 -277 83 99 -158 52 -140 -251 208 31 19 16 166 33 -27 55 -212 -315 -219 105 30 -115 107 11
2428 11 -10 145 -151 -92 -81 60 129 -276 97 132 194 99 -19 77 -56 360 121 -28 88 -19 14 397 56
2451 56 82 -343 -149 -63 -248 -63 -169 -97 69 -49 24 137 -334 56 -107 85 17 -176 -212 157 220 80 -207
2474 -207 98 -117 14 -39 57 -173 -42 -11 -16 19 -419 -30 326 44 191 -26 160 -151 236 114 195 278 -259
2497 -259 147 7 -88 242 302 341 174 -181 -56 -10 49 -38 16 3 -162 74 37 -208 300 -287 -61 -202 -32
2520 -32 122 -123 61 10 -175 74 -118 -4 -68 23 -250 -20 -191 103 91 -84 -344 -297 -196 -123 50 -169
2542 -169 96 150 -43 142 30 -19 219 -65 89 -126 145 -199 -91 26 224 -249 86 -54 16 105 -19
2563 -19 319 -238 30 48 53 66 125 38 110 -211 -176 -211 228 -182 38 2 -188 -5 -147 140 29 375 284 29
2587 29 -156 -194 -296 52 164 94 62 40 128 -22 12 218 -137 100 77 180 -49 -11 88 103 -227 -28 311 -129
2611 -129 -40 -94 -117 -152 -53 -10 -140 72 -2 -110 154 16 68 339 112 3 36 -32 87 -161 -218 -124 11 94
2635 94 94 -175 165 -100 16 -134 87 239 -2 25 -12 -33 73 2 -112 220 -153 178 108 237 129 11 -160
2658 -160 7 106 -249 -153 113 -54 -17 -385 100 137 134 111 2 48 -97 -371 0 -36 465 -108 34 110 32 -22
2682 -22 -77 -190 7 -28 5 192 -188 88 275 -308 3 154 85 42 -280 223 -39 -23 0 -69 -5 20 128 -125
2706 -125 -33 137 14 19 -78 106 81 121 -268 171 217 -139 31 -69 -309 -8 79 229 -159 -20 -75 159 -179
2729 -179 -163 222 -70 7 40 -94 -20 119 -106 44 -140 -31 75 -18 -41 -10 -244 154 -77 3 -69 -127 -121 42
2753 42 205 168 -124 -90 13 -103 46 -159 158 39 -193 -23 145 52 -36 -142 -9 63 374 114 112 -97 -275
2776 -275 -170 -47 97 159 -70 -146 -20 142 87 -228 17 -140 35 57 -247 64 91 35 29 -27 139 -74 34
2799 34 -72 -109 107 -50 -50 -26 -41 6 122 212 -80 89 129 -40 199 -140 78 -73 154 -101 85 72 23 -46
2823 -46 209 -239 -195 -18 -245 36 -163 91 -158 208 -50 154 17 -80 26 -217 -63 -140 190 -109 -10 57
2845 57 -196 -174 98 140 -82 -40 273 85 -92 -211 68 -107 160 78 -55 -80 -54 151 83 105 -312 35 -88
2868 -88 -359 33 -397 -75 -136 -205 -195 -145 -5 49 15 144 -68 -7 -398 -236 -94 -43 -210 -22 -45 -72 185 146
2892 146 -13 -57 18 148 -188 80 25 42 168 117 66 -146 -20 209 -9 105 -38 -113 11 -206 44 -341
2914 -341 87 203 -8 275 -3 10 -199 -107 -48 17 -63 1 -153 -248 202 47 52 225 -207 54 50 -55 -77 -202
2938 -202 107 -153 -23 -100 27 158 32 -77 109 91 82 22 -242 -153 -144 106 -23 191 -65 18 -117 -18 173
2961 173 438 8 -45 -73 71 57 314 298 -71 -211 86 37 86 373 39 76 -215 148 93 21 195 11 -26
2984 -26 108 172 -343 -182 -147 -4 -21 192 -216 54 -77 -417 33 97 -213 -45 68 -62 64 -69 -46 -209
3006 -209 162 -214 325 108 86 75 -51 34 0 -136 -145 -78 335 68 36 -51 -4 38 216 64 -10 217 -35 -133
3030 -133 41 -106 -242 -223 -104 -197 122 -128 -117 -49 -142 118 38 43 -309 234 11 58 -38 -46 -64 19 188 -235 -397
3055 -397 230 -25 -68 136 178 33 218 -93 117 106 56 -7 -28 288 -54 18 253 82 -122 280 50 -250
3077 -250 -121 374 23 224 -43 31 -311 -78 -37 136 -21 79 -65 112 -3 -4 -29 14 -23 -92 201 -139 -131
3100 -131 -331 -125 75 -263 197 199 -18 -29 -48 309 133 173 -61 -45 142 48 7 107 60 85 23 8 65 65 -159
3125 -159 112 163 -95 210 -19 -238 -177 23 -122 249 -47 -4 -175 -14 -198 40 -21 -57 104 -226 -28 -218
3147 -218 -72 -55 67 21 130 301 -133 230 -124 140 -217 162 54 -5 -60 -12 92 -55 140 -235 141 62
3169 62 -77 411 -180 143 -22 -77 20 -297 110 -9 -78 -124 54 1 170 192 101 245 117 -258 -171 80 70
3192 70 -129 -18 -19 290 34 39 140 94 -101 255 44 75 -213 124 -96 -38 -92 -378 107 -152 101 -152 -55
3215 -55 -213 154 190 46 -239 35 46 -6 -109 -122 -132 73 107 12 334 -56 86 22 -156 -127 60 243 -155
3238 -155 -140 -13 100 -164 -94 -272 289 -213 -21 83 -238 57 180 -27 -3 27 -129 247 -73 -160 34 -107
3260 -107 173 150 -191 -100 52 -285 -49 -28 -1 -47 248 -177 191 -230 -179 -63 -68 -117 80 -63 151 -108 96
3283 96 378 -113 -65 57 178 296 12 8 -38 -6 145 -25 60 -52 169 224 152 -134 -125 -95 -99 128 152 -52 -18
3308 -18 -138 241 253 107 18 11 -11 -123 -118 169 -177 -170 -180 -106 -40 357 230 -35 -6 -69 60 34 -43 62 55 38 -228
3335 -228 -155 -85 25 -245 53 -71 -78 217 170 -391 -174 321 246 188 95 -111 -205 -64 -101 75 -102 -273 6
3358 6 -146 -105 82 399 276 141 -52 -107 -138 347 25 -6 39 28 -129 179 -120 154 -148 -83 -66 -99 -197 152
3382 152 100 -198 -347 29 128 159 -15 45 66 12 -252 163 -71 17 4 -368 -11 -113 123 -157 -100 78 177
3405 177 -93 -233 131 223 47 -56 -7 -69 -128 43 -172 -17 55 54 -130 -60 41 284 62 26 44 -117 248
3428 248 -134 -136 144 253 72 137 36 107 36 91 -24 -232 -68 -232 -80 13 296 -327 121 -43 72 -108
3450 -108 0 30 135 261 194 -26 -208 251 -124 -419 -336 99 -104 211 14 -358 32 106 -193 -41 -86 55
3472 55 265 92 150 -172 65 -82 -24 87 -132 29 118 220 127 219 -165 14 308 242 -312 144 171 63 74
3495 74 220 -147 195 39 -150 319 -265 -174 60 37 -127 -56 -211 126 99 -280 -36 4 -137 105 145 -205
3517 -205 81 21 305 126 -51 -75 -174 -98 252 -94 6 -43 -157 -260 24 -154 -219 -58 202 59 -100 -17
3539 -17 -83 95 43 132 -167 141 12 26 -200 -87 -221 201 26 -56 -156 -218 -121 -310 -84 144 -165 -38 101
3562 101 -21 0 -322 73 -46 -60 -49 73 -98 -21 188 274 -3 154 -118 100 16 36 101 -164 71 -146 39
3585 39 61 -90 265 30 261 190 21 12 -50 295 -384 65 286 -73 -39 -262 94 58 163 136 -106 61 -123
3608 -123 236 -103 -35 130 -121 -211 34 163 170 141 154 133 138 -184 -96 -132 -114 47 -211 -64 -76 -151 88 -129 188
3633 188 -88 -44 27 119 -25 40 -389 -84 26 27 -173 -57 -78 34 59 232 268 12 117 252 65 -65 377
3656 377 5 -174 -66 137 -208 -34 239 28 105 159 -23 -405 87 -72 19 -286 172 -5 25 -85 -36 -132
3678 -132 -31 199 -321 277 279 220 34 124 -325 169 95 108 -149 -102 -325 133 -133 40 -95 37 -129 27
3700 27 119 59 -70 -300 109 121 253 85 -221 -59 -142 -222 55 17 -107 -89 48 83 167 -238 -18 -158 6
3723 6 -68 7 235 -44 120 0 -70 -13 31 -156 56 187 -163 121 339 -149 85 -85 -32 176 6 -141 -8
3746 -8 -320 -395 -263 40 29 -303 164 -13 -84 68 -191 76 72 -129 -252 -100 25 -48 -45 178 -359 96 -22
3769 -22 186 -230 -32 -127 -87 -64 -192 -76 89 -91 -170 25 67 115 -188 159 164 -257 41 -219 -331 -120 124
3792 124 -122 38 22 -275 -2 -34 -4 -140 -96 305 -124 219 -214 -99 187 78 55 168 -168 -73 -175 -56
3814 -56 188 -57 -58 -223 44 -24 67 -169 6 17 -55 126 -129 -96 101 274 -101 -83 -48 -191 177 -86 -46 77
3838 77 22 -5 -142 113 74 144 29 -175 36 215 93 -128 155 317 -96 -16 -140 182 203 64 -139 220
3860 220 104 -293 166 68 -223 -156 -357 81 100 198 34 -82 67 -361 31 90 423 -90 -210 77 18 -25
3882 -25 146 62 228 -188 -282 -45 -272 171 -104 181 256 36 71 41 -174 119 -22 -163 164 -31 204 160
3904 160 -328 38 76 104 -33 -84 -15 -151 -196 47 -26 -200 -125 37 -122 52 189 -64 -71 66 13 203 92
3927 92 264 -64 -167 62 376 -79 -114 -76 -77 110 -99 -41 158 -93 298 226 58 -293 19 -156 29 -118
3949 -118 22 125 -89 76 -469 -340 -198 -11 -105 195 -74 240 -281 -182 -2 91 291 -41 -178 41 -57
3970 -57 151 -142 -118 -50 128 -71 -1 -108 188 76 -21 -85 -5 253 188 60 -38 298 -19 -90 -180 126 315 -8
3994 -8 23 111 -191 -83 -27 159 -184 4 -180 27 -2 -63 123 109 126 86 108 -90 -84 -106 -143 95 32 260 -199
4019 -199 12 477 -144 -99 70 60 48 155 19 19 -177 -5 -114 -114 -231 78 111 -176 121 -135 2 292 -82
4042 -82 120 27 165 167 81 4 -76 212 -133 -255 -80 -128 -50 202 -143 -161 161 491 287 -260 372 -51 183
4065 183 -302 158 91 116 124 -25 -317 43 89 -233 -15 309 -129 115 23 -32 -278 -76 -214 51 -57 -179
4087 -179 65 -21 137 120 32 101 222 121 60 -116 193 -78 157 13 -65 -91 71 -26 197 -171 -139 -248 -258
4110 -258 -132 6 -245 -94 254 109 -93 -33 187 188 11 -8 -17 -63 220 139 -143 -89 415 -27 -180 106 181
4133 181 98 56 364 -202 135 185 -61 32 45 81 85 -89 -19 -19 -153 -68 47 194 -305 -151 -108 -51 -119 180 -299
4158 -299 -45 -28 -202 -109 217 -269 -376 -142 -44 -61 99 -55 42 -240 22 93 -6 -20 179 391 -123 122 -228
4181 -228 -68 33 -69 33 -126 -13 -266 -333 -78 255 50 -75 56 27 96 -74 125 -39 195 129 -263
4202 -263 -78 385 45 7 279 -129 243 53 -338 -121 -67 -7 -79 -116 151 -43 -24 35 49 54 38 -141 262 -17
4226 -17 157 157 27 -81 -102 -10 172 201 97 -144 5 199 -118 -56 177 223 40 18 154 -149 -60 241 -69
4249 -69 -147 248 -270 117 -112 -48 87 193 208 19 -293 0 97 140 115 -41 103 -410 309 -187 8 -102
4271 -102 -34 -8 112 133 92 -106 -110 217 179 14 -39 -176 -164 193 -203 108 -7 -239 -32 -40 -11 130 -99 -57
4295 -57 -18 -335 167 112 -261 63 -79 359 -178 -144 131 -73 -3 10 44 317 -148 17 -23 -5 -166 114 -49
4318 -49 180 -155 79 114 216 99 255 39 -28 65 110 42 -63 -183 54 -181 154 203 181 -112 0 -68 79
4341 79 -45 -87 2 209 134 -158 135 190 20 -159 -268 -169 79 118 -91 -87 -19 56 -57 160 103 -65 149 50
4365 50 203 3 325 -94 -127 -91 270 126 -115 -8 223 -123 18 -17 192 -107 -70 189 9 -135 274 -30
4387 -30 232 -85 63 -101 -46 125 -139 -152 -43 118 17 256 -243 -73 29 14 -320 -14 32 174 -189 1
4409 1 224 -123 -162 93 -161 39 -9 53 159 64 -49 9 137 -308 -95 221 -7 104 151 128 -103 60 5
4432 5 335 -8 91 -104 57 127 169 3 -93 103 -71 62 231 -122 49 -334 -135 -20 10 37 81 212 -69
4455 -69 111 417 224 185 -20 -182 -117 189 -197 160 -7 266 26 -15 283 -69 -44 -6 16 224 127 63 80
4478 80 115 50 94 65 -142 -106 297 107 -45 -80 -236 -96 -32 -26 42 35 -72 166 -47 164 -239 -214 -26 -138 40
4503 40 120 263 168 143 4 287 -150 -315 -173 -153 90 89 -82 -235 85 87 -136 58 135 -59 21 -143 69 164
4527 164 -55 -95 329 354 -138 -28 -141 36 111 -345 87 287 87 119 1 59 146 17 -21 392 103 -91
4549 -91 -54 243 94 -198 -63 -146 -143 -201 33 -162 52 67 3 -26 -116 153 202 82 -31 278 43 -107 -71 -209
4573 -209 208 30 -85 186 -34 -270 -182 44 -30 264 -30 -106 76 -175 -100 274 212 55 61 198 -268 -61
4595 -61 -4 125 188 -54 192 -45 65 29 205 18 -219 138 -149 115 306 -147 -141 -59 74 227 123 315
4617 315 96 180 -79 -79 -246 33 268 -72 252 -94 14 -206 206 -187 10 321 248 -159 137 -105 -225
4638 -225 63 -43 -205 261 -164 -194 -361 -36 224 45 -17 -290 280 88 25 91 -18 -23 -26 -283 235 -369 109
4661 109 141 -84 -166 -26 -208 -44 -7 -302 -266 -243 -5 46 -329 -6 115 -85 230 -49 66 179 3 -64
4683 -64 78 -230 116 -23 55 31 131 298 -170 -149 -28 203 -52 40 -324 -151 -56 1 -133 -86 97 108 179
4706 179 40 -18 -123 -70 30 316 -186 -34 121 -59 -183 53 2 -121 -302 -57 -215 -119 -259 -36 -91 -106
4728 -106 -120 -23 108 -277 6 -129 124 -12 -39 83 -37 48 25 78 153 38 -177 -71 152 -39 -49 145 178
4751 178 29 -33 -26 -151 -190 -7 87 -30 -107 17 244 175 -32 -18 -122 143 -160 -200 -371 83 -228 -178 -10
4774 -10 53 145 -268 -5 123 163 -57 16 -128 512 274 -49 271 -93 138 159 -73 -11 152 -205 53 67 307
4797 307 -57 216 -110 177 -74 -21 -42 -46 26 227 43 93 221 -171 96 140 72 64 -56 70 13 -18 49 -204
4821 -204 -75 252 -88 -179 -120 1 -26 128 -83 216 -152 -305 -13 26 56 264 133 -24 -4 -114 158 -291
4843 -291 88 -32 -38 -25 122 94 -160 323 -93 -15 116 -76 -62 -112 279 46 6 -206 -104 -146 72 -222 95
4866 95 130 -258 -115 71 -222 -77 -160 -40 127 121 152 180 -195 -117 68 99 315 179 -128 84 -102 -158 -231 -4
4890 -4 221 203 28 -182 -80 8 -76 291 245 235 94 -18 -293 -2 -139 45 -25 204 -240 -356 61 -131 -64
4913 -64 191 294 91 -17 140 119 -94 -70 237 191 194 131 35 -210 119 62 -161 123 -229 245 87 5 -67 168
4937 168 -12 -217 140 139 -107 -67 127 -204 250 -233 118 67 18 -137 -206 31 27 346 -80 243 302 -6 15
4960 15 8 9 -25 -225 -114 3 391 -43 -44 41 154 120 -19 -150 -176 95 26 168 59 66 132 215 -42 86 -165
4985 -165 -141 92 -22 -17 40 120 -83 -57 8 -105 159 79 -47 -193 -35 374 -172 46 30 154 163 -241 547 116
5009 116 103 -6 273 -139 56 -18 64 -102 -39 138 -368 -159 -94 -168 117 203 136 69 -120 -200 -114 96 -154 -251
5033 -251 -58 372 65 -32 183 -30 -174 44 75 -21 -79 -81 81 -114 -55 465 211 119 -169 226 -82 -119 -70
5056 -70 96 7 44 44 73 -173 43 208 -146 328 10 83 223 281 290 -128 -314 31 126 333 65 113 -48 -179
5080 -179 -60 3 -9 120 -271 206 279 54 47 -108 -111 84 158 65 75 130 179 -76 -36 193 -110 240 107 -142
5104 -142 -83 -21 189 -222 237 215 132 186 123 -108 128 -129 -141 -239 50 144 -51 -352 -121 -285 25 -260 9
5127 9 -7 14 -180 113 122 -78 206 -1 296 -13 -141 -201 97 66 25 85 69 -94 -37 -3 -23 91 50 79 2 -52
5153 -52 166 246 -96 243 91 52 32 120 -68 -17 254 180 -1 38 -96 6 124 142 -81 13 224 204 58 -31
5177 -31 13 -18 -18 25 17 -131 67 18 -173 -8 158 104 -2 44 -60 184 52 156 -186 29 -302 124 120 35 -32
5202 -32 -165 117 -172 53 184 309 239 155 -21 149 39 -45 124 190 -248 -24 173 -122 -193 -136 2 0 -131
5225 -131 -244 -245 70 75 -31 50 128 129 -103 27 58 -115 -24 102 -138 -213 3 -148 255 252 -102 -88 412 127 -31
5250 -31 -203 -155 33 -83 14 82 10 102 -82 -422 -366 -14 -37 -180 -52 -23 -137 -14 170 79 -60 129 -290
5273 -290 -52 94 -112 -98 -178 131 3 -47 -110 -174 -218 278 -30 151 162 -267 205 150 -81 52 16 12 -115 145
5297 145 134 -5 -279 25 -6 -127 51 -234 66 375 175 -17 101 28 168 -176 -101 203 78 -100 37
5318 37 -50 -89 -115 -130 87 33 445 -32 -196 32 -48 186 -124 -302 -222 26 86 -179 200 100 14 -224 165
5341 165 -47 -22 -118 -180 -118 149 -168 -131 18 385 289 -114 182 -103 160 381 -199 -92 54 107 -141 -105 79
5364 79 -30 229 -69 238 184 42 81 66 -170 -24 -366 126 92 -55 -12 210 10 23 23 -122 189 50 -73
5387 -73 94 -67 194 93 0 91 -81 288 124 152 -91 -135 3 -89 -139 61 106 -186 -7 48 -124 168 -120
5410 -120 -86 303 -222 13 146 181 -122 15 -203 -4 -209 78 219 58 1 -72 37 87 -191 -244 -156 75
5432 75 -50 45 -35 104 176 -76 -57 223 -75 35 27 -154 43 11 112 -176 128 -126 -117 -58 146 -307 -194 314
5456 314 -77 -57 -121 102 62 12 -87 1 -24 -382 402 95 -13 41 267 -125 -19 -70 73 -127 -32 -57 398 13
5480 13 -4 68 -173 89 -194 121 246 280 -28 -81 8 131 74 148 -55 352 121 353 124 173 55 52 126 -411
5504 -411 -159 -89 45 14 -54 146 -154 31 99 -136 40 -30 116 -145 -106 22 10 -96 162 -231 29 115 359
5527 359 -195 331 -294 -153 -93 -50 -1 58 -142 -77 -50 -41 -150 260 93 93 177 98 -40 -76 -120 -52 81 -123 221
5552 221 122 -201 -43 60 7 87 87 117 -94 153 189 139 -98 170 -21 -37 -246 5 -53 42 220 -11 -45 122
5576 122 -20 -97 44 -115 218 -180 73 -75 -48 163 1 -12 16 -14 251 338 -37 110 23 -93 -92 123 -26
5599 -26 -20 81 24 -121 -52 -313 -34 203 -61 276 215 -48 98 -115 128 -70 -77 12 275 -121 310 44 -86
5622 -86 -190 104 -119 -30 -134 204 -259 -33 -316 15 35 -304 -257 13 185 93 -55 220 94 257 40 -50
5644 -50 169 25 -323 -18 134 3 -180 5 100 -335 -73 168 -58 -82 15 38 52 -83 -16 -77 238 -226 -80
5667 -80 185 170 106 119 116 113 41 3 347 95 -62 -26 -51 76 117 69 -80 -200 30 88 146 -153 -26 -62 -49 15
5693 15 -114 -18 -42 83 -147 172 349 -217 -27 100 -100 11 2 90 -245 92 -140 257 182 -75 25 -101
5715 -101 -35 -88 -8 -175 55 143 -130 -255 178 118 332 -3 113 60 -50 159 97 -36 208 -200 -413 -125
5737 -125 -2 52 140 111 -25 -173 36 53 39 35 15 -89 -300 263 -236 104 -7 171 -57 -70 2 66 196 7
5761 7 -42 -85 -67 67 -12 -199 -259 -25 -46 -122 36 103 -79 -49 -86 -102 234 -146 -143 175 -57 -269 16 89 153 -321
5787 -321 -40 192 167 -6 -217 -182 -91 270 25 -25 233 224 -21 165 193 -424 195 -58 -407 -12 102 218
5809 218 -162 -284 -28 11 149 -139 -189 -82 -143 -15 -92 -127 -164 -22 -191 29 -202 -143 78 -143 -50 115 -93
5832 -93 122 -78 29 56 27 115 -85 2 -311 -119 76 211 -112 -162 295 33 -277 -48 208 178 -87 130
5854 130 81 -160 -127 -221 -106 40 158 51 339 110 178 -10 112 95 166 32 37 -62 77 43 -26 412 144 -65
5878 -65 -145 173 -61 -99 -14 22 97 28 30 -86 96 -138 -253 -107 -78 -74 13 74 -25 -33 -137 -63 174 -146 18 -122
5904 -122 -164 -184 -214 -38 58 -33 197 -89 194 31 -166 257 -11 19 48 16 4 -106 13 -15 -51 -82 282 142
5928 142 158 202 231 70 -34 -219 16 -61 29 20 189 -28 -100 -318 167 182 -111 -257 -17 -160 -75 -75 188 -295
5952 -295 154 -78 -17 -136 75 -131 -200 272 490 273 -142 127 -135 -176 -22 -34 -7 332 -90 297 -167 44
5974 44 -13 64 0 35 -7 -182 308 121 141 -249 58 291 -249 -86 121 -62 -91 -60 -132 29 1 -186 74 -109
5998 -109 56 -100 220 -117 -30 -123 13 162 -14 -302 -60 -22 379 29 -40 21 22 125 -168 -122 -164 101 238
6021 238 -103 -142 -11 204 -142 -215 231 176 172 -323 -292 30 -177 134 137 1 -215 -104 -162 -150 53 -9 -130 -81
6045 -81 -291 -82 -33 52 -213 86 118 23 -4 230 -88 -118 134 -208 79 -44 -109 90 82 -211 -40 -15 108 161
6069 161 -16 86 -173 -30 -253 -96 31 31 -125 48 -238 -198 38 -115 -237 -130 75 128 53 -304 -115 -4
6091 -4 -132 113 76 62 133 311 -102 -60 -358 -38 -103 28 -53 -5 278 -110 -110 -171 77 89 -219 -45 136 126 170
6116 170 -70 -144 -239 -95 -146 -164 -204 -229 -84 -63 -93 124 -17 -165 86 -28 50 117 108 -297 65 -73 -135 160
6140 160 234 31 101 241 -103 280 -133 -153 140 326 -118 92 99 -151 109 -178 -123 -175 -19 -104 -61 -282 121
6163 121 60 -320 231 27 182 -255 161 -342 216 -168 34 148 35 -77 -73 277 -73 93 -25 -68 -344
6184 -344 85 -7 56 -33 -68 -111 228 -7 204 -124 105 36 -9 134 251 -76 -403 34 209 -146 -361 -21
6206 -21 80 348 -185 -384 142 154 -23 73 -87 -123 320 218 67 -183 -84 7 -92 -96 26 165 -24 -74 -81 11
6230 11 -212 -151 -5 -207 91 66 -108 -191 64 80 -149 131 187 -136 162 64 -284 -105 -158 248 -253 229 96
6253 96 14 -183 -180 165 102 -190 10 31 -131 178 117 348 128 -69 193 -79 73 -16 47 12 -189 -131 -282 -90
6277 -90 -366 64 47 -566 171 215 -147 11 -21 434 -212 -33 -267 108 6 296 -119 31 169 145 -277 -135
6299 -135 181 121 -71 -149 -104 -254 123 76 32 -76 315 -156 212 120 0 118 56 435 64 -259 -31 -2 165
6322 165 -116 -179 16 -64 16 29 214 16 -135 -209 -98 -273 79 -132 183 -41 247 16 123 -86 147 102
6344 102 369 4 207 257 66 -384 -161 -96 20 87 -166 15 -124 0 -257 27 64 211 43 5 23 72
6366 72 -200 89 36 -36 117 58 -82 -15 -124 140 -49 -153 -76 -22 -21 -205 -263 129 190 -194 58 -76 -189 -26
6390 -26 -107 -87 -114 205 105 -46 -37 296 13 134 46 -324 -18 15 -210 -80 -347 -107 -113 -70 -16 254 33 164
6414 164 -231 -24 86 124 62 59 -230 15 89 90 -16 -85 -19 -17 113 17 -277 -98 -312 54 -179 -69 10 -196
6438 -196 -33 107 -129 53 -30 292 -48 -179 -215 162 95 -334 148 310 352 131 86 77 -39 -179 -32 73
6460 73 199 166 34 56 -106 0 80 -91 15 55 -85 -37 109 117 -66 -46 51 42 171 -210 79 47 -395 104
6484 104 -76 -187 -201 134 38 -148 -163 43 -109 9 176 -140 -154 128 37 173 -60 153 144 4 -80 104 -168
6507 -168 182 -50 61 -176 40 121 256 -53 24 -37 57 244 187 143 -253 258 237 -411 85 58 11 -226 285
6530 285 303 -73 299 42 -184 -209 67 202 146 -141 25 -76 -26 -75 -33 -99 38 1 96 -185 -218 282 -5
6553 -5 111 143 4 -148 -4 -114 76 283 -25 -170 -205 -142 -151 417 7 219 -75 127 -144 -196 -172 -57 -67
6576 -67 45 286 -273 81 101 -58 -230 132 -141 -120 -102 70 -96 -155 -33 -107 -116 126 161 -74 -291 -325 -163
6599 -163 218 -81 111 -54 385 120 -97 214 -73 193 -109 -150 83 -4 249 -154 112 -74 -199 -85 -25
6620 -25 66 61 42 -92 -130 131 17 -321 94 -108 71 -27 112 72 -40 208 147 152 63 -18 -34 -184 -13 -29 41
6645 41 -289 36 54 150 13 64 60 -162 -219 -7 -38 212 218 6 -92 60 156 2 69 234 -126 -258 128 86 -74
6670 -74 -28 80 293 172 21 -172 -87 223 -16 -52 107 54 75 -78 262 -110 66 323 75 -76 72 -73
6692 -73 189 172 118 -36 251 -76 -2 -223 133 -137 134 -102 -105 171 34 -253 17 -49 95 -4 21 91 168 10
6716 10 32 64 48 -17 -7 -253 -152 -126 118 -177 81 -198 15 20 -68 42 -81 164 -299 -143 -153 -215 -4 -242
6740 -242 -167 131 301 161 -133 -215 -43 134 78 -126 238 161 85 -66 87 113 27 -81 -17 9 151 28 -3
6763 -3 192 -299 -300 17 82 -140 22 -203 -145 88 214 64 107 38 415 87 49 -211 -167 130 298 129 102 192
6787 192 47 60 -55 -20 37 105 42 199 82 -105 -123 187 -155 92 244 228 -33 -354 367 -44 87 -123
6809 -123 16 -92 -226 -161 150 -80 -101 -83 -137 -102 0 -187 -142 148 117 -124 169 189 83 401 -134 95 -28
6832 -28 -351 -63 -144 -178 95 78 -38 -112 -30 127 62 -387 32 -198 176 -36 106 5 -13 56 -111 6 -110
6855 -110 -261 -292 73 -14 -86 -504 -11 166 -183 -105 15 28 8 407 79 328 91 161 84 37 105 195 144 221
6879 221 -13 -63 126 -134 74 38 114 40 75 -106 -74 40 -135 -158 71 43 -66 50 78 -46 14 -203 98
6902 98 -93 22 151 238 -160 134 234 134 85 56 34 286 2 28 -132 -221 -166 49 -33 -95 6 16 -82 -104
6926 -104 352 160 -75 -110 46 -171 54 57 292 33 -151 128 197 -16 405 63 187 70 17 82 -7 -6 15
6949 15 -70 215 -89 -131 67 180 133 245 293 180 70 9 216 203 109 -207 -139 -187 -265 -285 20 -50 60 -134
6973 -134 -123 162 186 29 231 259 -112 121 -42 323 -3 -27 -247 45 61 -232 146 -62 117 -29 18 44
6995 44 14 -49 -244 -51 -35 326 -29 245 -293 -17 177 36 122 68 -66 7 -186 134 -123 -154 -100 7 81
7018 81 11 237 157 -199 37 -61 -27 265 -59 147 122 10 159 48 158 115 275 -130 254 168 148 -255 -13
7041 -13 -149 -10 179 110 6 -182 -59 -68 -90 -80 -36 47 -80 8 -100 -251 130 179 -113 -165 232 -108 205 -58
7065 -58 121 -57 -222 -283 -75 -138 -126 -56 89 52 44 -225 134 -10 -356 89 -99 4 -126 -599 -229 33 -25
7088 -25 -397 -144 -36 2 168 86 -162 -163 110 -262 -448 132 -68 109 159 -14 46 -97 -115 -79 54 117 -84
7111 -84 13 117 276 -147 95 53 -154 141 18 169 275 50 -189 145 -140 -27 -85 -40 -18 -194 250 -178
7133 -178 -122 -127 -98 -78 -160 133 -189 -270 224 -158 -73 -204 -42 41 -174 195 71 -79 127 45 -82 -60 38 24
7157 24 -224 -35 -365 83 -395 -90 -101 58 266 -120 108 59 116 -82 -46 9 109 -148 162 50 -180 -319
7179 -319 -35 -385 26 38 -92 -55 84 -57 12 74 238 -169 -225 159 -2 140 401 -27 -2 -139 -16 -72
7201 -72 -120 -102 88 -23 168 -66 -31 -126 -81 -103 -137 -241 84 108 13 257 182 113 -116 51 99 -77 176 193 -63
7226 -63 -171 266 -158 -196 55 216 -31 -218 -61 110 3 -191 -125 -79 -79 -103 -122 139 232 -213 -122 94 -168
7249 -168 137 -13 62 -106 127 -178 -134 105 71 -69 131 -155 74 106 127 289 65 351 68 129 72 83 74
7272 74 37 65 104 65 -156 -83 260 311 -52 -181 -117 214 62 261 -38 -82 22 -157 -304 -97 -140 29 -129
7295 -129 241 -214 -63 -284 86 215 -59 -95 -84 -30 -36 -101 153 130 61 -146 -241 79 282 56 -209 68 28
7318 28 -46 131 175 -119 132 84 165 -270 41 113 90 -73 90 -41 -117 19 -28 -58 153 -89 -52 -39 -140 -262
7342 -262 -195 9 171 12 169 228 -99 236 -3 -102 228 -220 63 -368 53 -65 -229 -42 187 15 -64
7363 -64 64 -114 -18 -71 -182 -23 169 -119 -85 57 74 36 158 -90 121 -270 172 204 -5 8 117 -41 -89
7386 -89 -77 132 119 -215 -300 -44 -102 -155 -78 3 -10 -54 28 -133 -156 -281 -37 -88 173 -73 198 -58 -96 26 136
7411 136 6 -66 -186 109 -74 -179 90 -67 -120 -74 -167 -281 221 13 20 226 67 394 17 137 -109 189
7433 189 149 -72 17 -273 138 351 186 -117 330 -91 -156 6 66 149 138 -123 203 -165 126 -27 95 -96
7455 -96 25 -107 -297 -99 -41 -153 241 -107 -136 -167 -28 -11 -75 63 -258 190 127 186 99 94 187 64 137 80 -105
7480 -105 34 -27 134 -169 326 -62 -63 -95 32 226 -118 4 -105 -40 -11 177 -1 -12 -156 84 78 30 -244
7503 -244 236 -119 0 74 267 145 -90 160 5 62 -146 21 -62 14 -80 -191 -228 203 -232 231 130 -104
7525 -104 -41 -35 -275 -128 255 133 19 32 3 202 77 -35 -142 -43 135 -265 49 -157 -82 -252 115 29 -47
7548 -47 -122 197 -73 -59 158 -93 -141 -108 -253 63 99 -147 -220 -60 63 39 -162 -16 184 -198 272 -107 33
7571 33 -106 186 194 -24 -51 120 -111 -13 249 52 167 38 66 23 -1 200 -88 132 -162 -72 59 -217 17
7594 17 258 39 -114 -108 279 106 -335 -40 -238 173 -51 30 133 -52 -398 -128 137 287 -32 -139 173
7615 173 86 -33 -225 25 -274 96 -182 131 135 106 22 -139 -16 -9 -152 -60 169 -47 153 -154 -138 -97 -58 -211
7639 -211 -4 -195 55 178 -2 55 174 -95 42 282 121 327 -171 239 -156 -54 -53 -176 -103 -14 -121 -268
7661 -268 -60 -100 63 93 419 -161 -319 88 221 -153 -68 19 -208 67 -81 32 78 290 169 -60 -238 -4
7683 -4 236 92 -72 -41 18 -249 -82 55 -194 -141 210 -273 -114 233 -126 17 -49 -3 47 -350 90 -244 104
7706 104 163 -241 -127 -243 -32 -130 -190 117 154 -3 102 -7 -130 -71 -108 72 117 246 44 -116 37 57 11
7729 11 -83 103 -95 -73 9 -44 -393 -185 5 132 14 -193 112 -515 33 275 24 170 -99 124 136 -62
7751 -62 -62 -92 -208 121 67 -136 -54 133 -72 -48 -38 206 69 -118 110 22 22 -25 -71 -16 71 -52 -115 163 67 -138
7777 -138 -135 136 -42 -119 -212 43 66 237 -30 -49 -146 -230 -72 -223 279 -39 28 183 -20 -124 172 117 -199
7800 -199 37 -48 -30 -169 212 -22 11 -138 129 -136 -60 -28 -201 44 208 -98 33 -193 79 -43 224 89
7822 89 -14 103 151 -109 161 64 -54 250 -147 33 -106 -71 -78 129 -91 -354 136 65 30 -186 -51 64 -60
7845 -60 -13 -20 321 58 -170 -247 -358 -20 60 50 -118 211 282 -47 -148 304 -98 280 257 -12 -191 -101 80
7868 80 10 -15 -75 -95 194 92 80 -204 -11 -284 217 -93 64 -55 372 81 -76 125 153 -6 95 -159
7890 -159 113 54 13 318 -165 -222 -295 41 70 183 176 -44 -22 -250 121 -22 -170 134 78 -24 -126 243 93
7913 93 -440 74 -228 -226 -58 -150 -68 -65 68 114 -34 97 -85 -3 100 -53 73 324 -39 81 -119 -167 198
7936 198 -225 6 -138 224 270 79 93 81 88 17 -448 97 20 -89 -56 61 -15 175 158 28 81 176 225 -91
7960 -91 -17 -210 141 53 -100 50 217 -92 16 -38 -143 -139 115 -188 149 290 93 -40 53 -362 249 115
7982 115 -66 21 48 -31 150 -63 -115 328 16 -9 -7 -178 108 -28 175 -5 -38 -9 -35 -91 -184 181 -262 5
8006 5 72 -56 118 130 42 104 68 -117 -20 -219 -80 388 -156 -305 103 117 116 85 127 -7 -185 -77 -55 115 -171
8031 -171 -25 -255 490 243 -82 -152 173 -37 42 -179 110 -209 -83 13 42 86 220 -211 -53 10 336 -101
8053 -101 101 112 57 0 -205 -28 57 34 157 -164 -170 -34 -75 394 115 189 196 -7 115 237 159 202 116 -36 98
8078 98 266 25 47 -102 -48 -59 -272 -134 16 -155 81 7 -94 -105 -203 261 -134 -19 78 -67 17 155 388
8101 388 33 -538 44 56 24 30 -91 -295 -8 13 -198 76 -224 -77 -4 -179 -238 -147 -183 20 10 -94 -38 -75
8125 -75 -259 89 -137 -209 110 -172 -154 -128 223 219 -238 250 -42 109 -225 18 -161 133 -103 186 462 36
8147 36 297 -344 -178 367 45 -22 106 -150 -228 -299 -161 155 -37 70 21 -9 130 212 130 138 198 -116 63 70
8171 70 -57 41 116 -43 271 89 33 -40 196 41 133 -228 8 10 105 35 47 170 -57 -154
8191a54
$$ Imaginary data points
##PAGE= N=2
##DATA TABLE= (X++(I..I)), XYDATA
0 0 0 0 0 0 0 0 0 -8 8 -8 8 -10 16 -16 24 -25 32 -40 48 -55 64 -73 87 -97 113 -129 148 -168 191 -215 243
31 243 -273 307 -343 383 -426 474 -525 586 -647 717 -794 879 -972 1078 -1196 1328 -1481
48 -1481 1653 -1856 2094 -2379 2730 -3172 3751 -4544 5701 -7568 11083 -20090 94577 177392
62 177392 42192 23859 74687 129833 91407 56349 19333 78699 113957 69769 5012 20406
74 20406 89834 90817 54318 13636 -3635 48220 75493 46200 -17545 8769 61764 52249 25875
87 25875 -3516 8123 39411 61785 28557 -24431 15402 55812 52125 15474 2030 26503
99 26503 51024 71615 21980 -11399 29259 68543 55200 6767 15682 35440 55201 56176 13006
112 13006 3995 36249 70179 34290 -3601 12914 24579 39658 25810 1214 -10847 17707
124 17707 47561 5028 -19280 -9425 11272 16773 -185 -15600 -30822 3706 17238 -17025
136 -17025 -32717 -16761 12045 1736 -7791 -25665 -32784 6029 16573 -6625 -31125 -6187
148 -6187 15790 2495 -464 -12455 846 25823 30188 537 -20665 17506 32655 25496 14539
161 14539 6840 16427 29506 41048 9798 2113 33171 42510 29362 6386 10924 17888 36345
174 36345 41019 5819 3855 26700 39959 16113 -396 10204 13004 28705 18352 -7805 -9648
187 -9648 16308 32433 2938 -3774 2308 11240 20098 6240 -9658 -12667 21614 25294 -4998
200 -4998 -9437 1914 20191 18365 11079 -4686 -3377 29084 23585 758 -6074 15088 27844
213 27844 19512 14799 -1676 10361 33879 27099 1380 -5663 22935 25588 17146 7949 -1640 13119
227 13119 26823 23325 -5835 -3748 20368 16571 6091 -7417 -5992 3719 17744 10865 -19844
240 -19844 -10572 9641 11621 -5890 -14555 -7065 -4075 8558 -5867 -25386 -12964 7975 9250
253 9250 -13993 -14600 -9027 -1387 8973 -6277 -18342 -10869 13727 6729 -15610 -10337 -1412 11455
267 11455 9730 -2025 -13960 -3852 20160 6789 -8425 -5193 7588 14250 6541 -451 -12434
280 -12434 5826 23541 7958 -10494 -9237 11060 11006 5050 -3768 -10386 9246 17191 3257 -16327
294 -16327 -5284 14589 7728 139 -11954 -9105 6016 13775 -118 -19335 -702 13007 7199
307 7199 -4584 -10890 -1939 7016 13600 -6346 -18176 2086 14183 7376 -8804 -5872 1902 10571
321 10571 13288 -7587 -11705 4347 17678 4275 -10969 -2157 4710 13849 7372 -8373 -8775 7863
335 7863 19096 -2276 -11051 -2539 6539 10323 569 -7531 -8448 10903 15040 -6672 -12432 -3420
349 -3420 9351 4532 -3911 -10379 -9041 10872 7832 -9018 -14009 1220 10624 -797 -6432 -12650
363 -12650 -5200 8265 4237 -10631 -15315 4378 7417 -2374 -8145 -9737 629 6606 2746 -15041
377 -15041 -13281 6900 6508 -3261 -10830 -4947 1498 5061 1414 -14637 -6746 7105 6440 -6202
391 -6202 -11133 -442 2327 7353 -384 -11052 -3693 8146 7553 -8933 -7040 2129 4864 6101
405 6101 -2408 -6012 -816 11778 7064 -7705 -3239 3554 7321 2756 -2119 -4796 449 12974
419 12974 4539 -6182 -2691 6679 8287 -155 -1080 -4665 2164 10078 1575 -6731 -3689 8438 5238
434 5238 -557 -1912 -4266 3650 7061 1038 -8548 -2766 8810 3297 -1402 -3875 -1119 3934 6335
449 6335 1258 -8783 655 8486 4104 -1754 -2847 3101 3929 8282 947 -5698 3483 9043 5925
464 5925 -3509 -571 3903 5333 7485 -733 -3520 3516 10553 4564 -4486 822 2616 5178 3822
479 3822 -2479 -4619 657 9303 -409 -6254 -1644 2338 4493 -291 -3948 -7235 1265 6554 -3874
494 -3874 -8013 -3424 3323 1224 -2389 -4575 -6523 3148 4776 -2988 -8551 -1879 5955 811 -756
509 -756 -4139 -1961 5935 6322 -989 -7096 3640 8132 2761 -700 -2358 2682 6501 8119 -1286
524 -1286 -4402 6920 8837 3649 -2654 -698 3527 6488 6391 -3962 -3101 6193 8650 995 -5163
539 -5163 288 2098 4904 1069 -6475 -4063 3505 6427 -3782 -6049 -422 2131 3697 -1738 -5730
554 -5730 -4148 4569 5069 -5833 -4862 967 5217 2824 -1120 -2781 -1295 8024 4701 -3287 -2554 4213
570 4213 8073 2727 1387 -646 3428 10200 5820 -1541 -1324 8273 7864 2177 1161 150 5899 8111
586 8111 4878 -2383 -758 8622 5716 726 -2341 -258 3528 4950 1688 -6079 -1253 6112 3404
601 3404 -2878 -4880 282 1993 2996 -1728 -6879 -864 4948 2625 -5099 -3493 1581 2628 3273
616 3273 -2048 -4072 1157 6700 3341 -4063 -156 4072 5686 3811 -168 -479 3912 9696 3646
631 3646 -1761 2106 6469 7362 2753 1293 1040 5894 9557 1943 -1609 2238 7499 4886 273 72
647 72 -311 5323 5200 -307 -3329 1340 6447 1208 -2017 -2435 -551 3342 2074 -2308 -5844 1171
663 1171 4785 -555 -3078 -2674 1527 2238 1372 -2942 -4440 2906 3771 -260 -3548 -145 2953 2662
679 2662 2372 -1783 -1569 4057 5360 587 -2935 1969 3938 3771 2359 -1280 352 4345 5475 -1186
695 -1186 -2218 2580 3298 2645 -219 -984 -247 3703 3645 -2780 -2634 667 2012 -271 -2952 -2438 -2380 1453
713 1453 640 -3937 -3916 -90 1743 -2297 -2877 -2699 -1935 1281 -741 -3595 -4057 1189 1558 -1967 -1744
730 -1744 -1859 370 1687 781 -2478 -2339 3644 2302 51 -672 932 2507 2498 2755 -1502 -167 4324
747 4324 3292 372 -895 1932 2548 3243 1933 -1407 537 3772 3397 -1358 -1336 1855 1673 2006 -305
764 -305 -1911 -48 3282 2250 -2948 -1499 714 1439 463 -1429 -2016 -556 3257 747 -3280 -1132
780 -1132 1504 2653 -548 -1023 -1304 608 3768 446 -2151 -937 3209 2729 -120 179 -479 2445
796 2445 3698 679 -1878 -144 4603 2139 -103 -350 554 3019 2666 493 -2825 562 3714 1015
812 1015 -1215 -1641 851 1376 1516 -1094 -3282 432 2725 -72 -3155 -2347 412 53 69 -2929 -3265
829 -3265 145 2023 -628 -4045 -1381 422 448 -673 -3331 -2335 391 1974 -1903 -3662 -220 1188
845 1188 1245 -1280 -2130 -1544 1129 2556 -1961 -2760 455 2359 561 -1417 -845 -769 2082 1877 -2054
862 -2054 -2100 727 2986 -172 -1596 -730 405 2532 765 -2009 -2397 1240 2203 -1338 -1713 -1384 758
879 758 1095 236 -1942 -2017 1964 1764 -1382 -2432 -664 1323 392 -119 -2296 -1006 2399 1327 -1269
896 -1269 -2321 866 1448 683 -638 -2115 34 2228 1460 -1889 -1740 1725 1636 747 -1074 -1090 526
913 526 2348 1290 -1848 -821 1655 1406 -288 -1347 -235 287 2123 466 -2375 -622 1639 1577
929 1577 -1121 -1082 -224 733 1750 -476 -1941 -851 1667 871 -1928 -1084 -233 643 799 -807 -1702 -588
947 -588 2178 116 -1736 -1046 -110 706 -114 -818 -2085 -9 1716 -220 -1513 -842 904 855 73 -958
965 -958 -1778 157 1561 -152 -1724 -685 1210 170 -68 -394 -1039 717 1177 49 -2040 98 1578
982 1578 658 -61 -1072 -371 712 1395 -443 -1757 24 1010 353 -794 -437 189 662 1248 -609 -987
1000 -987 316 1393 301 -898 -450 -217 1002 961 -1062 -844 409 1554 -295 -1036 -24 -200 982
1017 982 252 -775 -1238 756 1548 -457 -1023 -429 838 784 146 -596 -1520 1153 1127 -536 -1125 -127 1033
1036 1033 739 353 -1033 -710 1038 1013 -773 -1255 360 993 260 191 -1188 -214 780 804 -1235 -1312 979
1055 979 256 -78 -929 -1038 -5 937 698 -1608 -1045 700 639 -61 -1057 -575 -359 714 352 -1619 -759
1074 -759 630 671 -872 -1105 -774 63 700 -226 -1397 -898 826 553 -1197 -725 -87 866 715 -172 -1178
1093 -1178 -706 1485 394 -917 -755 74 988 619 -73 -895 76 1837 501 -957 -528 645 1266
1110 1266 294 265 -820 567 1800 349 -962 -424 1328 842 210 -593 -523 868 1108 214 -1473 -254
1128 -254 1335 311 -94 -641 3 606 1299 -327 -1530 166 1136 414 -684 -690 159 844 1117 -205
1146 -205 -1096 557 1278 400 -1042 -192 392 878 467 -744 -797 523 1513 100 -1050 -81 549 1176
1164 1176 178 -467 -503 476 902 -657 -812 -92 523 392 -134 -579 -675 651 596 -1053 -1097 119 763 -379
1184 -379 -703 -914 -533 530 472 -1013 -1159 117 620 -523 -526 -777 -314 459 -44 -1000 -1175 282 553
1203 553 -23 -540 -467 -71 278 21 -786 -421 1002 500 -174 -698 314 187 237 7 -749 -162 583 648
1223 648 -483 -350 410 244 670 129 -579 -32 524 549 -680 -393 202 80 -6 -471 -401 -221 755 226
1243 226 -768 -232 89 101 -256 -77 -527 -312 541 -36 -688 -385 505 393 -262 -99 -240 178 618 81
1263 81 -554 -202 601 216 -58 -412 -107 424 557 129 -794 -396 838 -85 -101 -123 -84 231 329 -113 -600
1284 -600 -45 298 261 -799 -388 28 42 359 -667 -926 -175 609 -366 -990 -376 -73 198 -51 -563 -589
1304 -589 -178 411 -489 -808 -588 -71 -196 -314 -582 -690 -47 427 -428 -664 -126 93 -182 -446 -430 -342 386
1325 386 322 -305 -714 19 125 -322 -300 -219 -466 401 464 21 -824 -67 288 191 -157 -597 133 -16 330 -283
1347 -283 -704 287 195 -19 -294 -66 66 -203 415 -465 -384 317 475 -130 -438 -204 -187 22 227 -243 -252 184
1369 184 469 26 -593 309 376 97 -411 -465 -198 361 622 -624 -218 -76 250 406 -252 -577 -240 302
1389 302 229 -552 -399 -3 351 176 -63 -266 -235 388 -190 -612 -638 224 375 -593 -344 -221 152 412 -312
1410 -312 -471 -720 -7 204 -558 -399 -385 221 212 -400 -889 -413 464 -101 -429 -622 -77 -131 -22 -57 -1046 -127
1432 -127 176 -111 -572 -262 360 135 94 -268 -501 -69 520 115 -827 -265 57 -18 133 -380 -244 -15 373
1453 373 -109 -773 -315 12 204 -347 -212 75 76 539 -433 -657 95 676 -2 -363 -129 -67 430 -85 -316
1474 -316 -486 152 489 60 -258 153 -92 219 82 -169 -390 -154 500 -108 -70 -60 320 159 6 -61 -519
1495 -519 367 370 -109 157 -10 356 -223 388 236 -286 417 349 92 -243 202 397 287 -40 -193 -44 241
1516 241 138 -250 -306 20 143 -244 -291 -122 96 227 -59 -419 -369 15 238 -35 -393 55 107 125 39 -241
1538 -241 -167 102 158 -287 -270 183 74 135 67 -224 -220 255 -22 -166 -32 -127 83 -115 -207 -448 -192 89 172
1561 172 -165 -183 4 56 410 91 -352 -270 394 273 63 -272 231 139 -186 -85 -41 -88 45 544 75 -91
1583 -91 428 -126 141 50 -342 99 15 175 -348 -252 143 -103 -75 -77 -147 378 131 265 -313 -45 387 96 -3
1606 -3 -153 -44 284 203 91 -328 255 506 378 -47 -314 -122 250 249 46 -97 129 108 8 -120 214 73
1628 73 283 83 -10 -145 -75 175 59 70 61 -186 -6 -282 -148 -135 -25 327 -27 -478 -159 -58 260 165 -413
1651 -413 -224 43 352 121 55 -97 37 -26 -243 -113 -128 30 -46 61 -293 -63 64 -135 81 -171 -31
1672 -31 70 370 -431 -357 132 298 78 -256 -126 34 89 316 40 -161 93 65 54 -229 50 -147 -227 -46
1694 -46 -197 -206 286 417 -224 -107 -233 112 133 45 -41 63 7 193 -182 -375 87 297 97 -91 -193 -85
1716 -85 123 135 17 -164 118 133 -225 -78 65 -69 309 -235 -29 -72 -4 -149 -215 -15 -61 -31 93 133 -145
1739 -145 -123 153 -91 -321 142 -18 -74 40 3 -158 33 -163 34 36 -133 96 188 208 74 31 331 211 -16
1762 -16 -137 17 -165 275 182 -130 47 105 229 116 132 142 -242 4 231 82 -1 -89 68 -151 -295 -141
1784 -141 -188 183 148 -162 -233 -110 361 -20 11 -239 136 21 194 -38 -210 5 -127 76 -224 122 263
1805 263 -171 -309 35 -9 52 -81 -55 -175 18 268 -83 -112 -91 -73 242 274 -89 -77 40 122 -265 -264 31 130
1829 130 -98 43 -181 -352 107 94 -12 -47 137 223 87 -169 -466 -87 -182 -70 -13 -162 -141 198 323 100
1851 100 78 -74 204 395 -82 -366 -199 50 259 77 -221 -92 223 136 -41 -161 25 268 79 4 -171
1872 -171 -453 201 -94 -358 -231 50 -9 -112 -65 -370 140 281 276 -388 -7 77 215 45 -71 -288 67 475
1894 475 -12 -123 -269 112 -87 -259 -248 94 251 -248 73 -242 -90 -183 164 -101 -116 54 119 56 -285 -123
1916 -123 94 9 107 68 -31 105 -122 -40 -244 -192 51 -56 -111 114 185 260 158 -109 -85 -259 95 -314 -141
1939 -141 -142 -27 -35 63 68 138 14 10 13 0 -133 253 329 -143 95 -68 -135 -74 48 -58 -77 27 -52 -207 -250 -92
1965 -92 57 -97 -143 -124 -24 -113 -116 -259 -154 -206 48 -93 83 2 260 360 -186 74 -305 -225 -44 -36 -85 23
1989 23 -251 256 301 162 98 11 140 -54 5 -81 -41 -107 -32 -196 -270 -110 119 -146 -25 -70 61 202 -112 -106
2013 -106 -49 96 -248 -48 -20 352 -369 179 150 -180 -174 40 233 -69 -186 -91 30 33 -46 158 100 -145 55
2036 55 -312 -184 47 108 -80 80 -86 206 -45 312 239 87 167 308 -127 103 181 -89 -237 -2 77 -155
2058 -155 -99 318 133 68 -27 -102 23 -218 -142 -13 171 -221 143 144 -59 -16 220 15 18 -26 -37 -99 94 -126
2082 -126 -28 -214 67 89 -42 35 52 -98 -33 -167 46 -93 177 -86 35 64 302 -28 39 420 -244 139
2104 139 -221 -136 -299 248 -48 -16 -221 -213 121 121 -185 -102 -60 -31 -34 188 63 -6 27 209 220 -18 34 -8 -7 255
2130 255 60 -182 -263 -345 168 -328 -30 -110 15 -23 -87 11 133 -53 78 -63 -6 -12 -34 273 -6 -187 29
2153 29 286 -18 179 49 296 -45 88 136 159 2 -86 256 -6 -256 45 1 -160 -236 215 369 148 -217
2175 -217 121 15 265 108 -132 -221 -73 51 31 172 -57 -20 48 100 -398 8 -1 -32 -28 0 -218 144 31 -123
2199 -123 -14 10 76 -14 192 -140 59 -45 163 -122 -154 -269 316 80 68 -212 -268 -36 -17 -41 -33 52 -116 -36
2223 -36 -275 -34 105 -63 -227 115 19 382 267 217 -49 -18 -133 278 115 -135 179 41 43 -145 242 -117
2245 -117 90 -130 -151 -198 -15 0 -88 258 36 17 92 -48 -54 63 134 16 -105 -95 -143 130 -16 -79 -108 180
2269 180 -4 -225 -41 -94 76 -140 418 -83 14 29 -327 496 80 0 -40 -44 60 -90 -45 1 108 389 -158
2292 -158 -58 -201 85 335 -157 76 -262 -16 79 71 247 -100 -79 114 -154 -225 -126 -129 -35 -5 -195 40 -24 -45
2316 -45 -2 227 -191 -126 -66 86 77 -221 49 85 -36 -22 -62 -46 29 9 -17 55 115 259 149 -253 210 188 18
2341 18 -127 232 -57 -132 -79 -218 97 -150 62 110 102 -75 -108 69 -86 -7 5 92 -148 50 8 115 192 -33
2365 -33 74 -9 -68 -124 16 -114 72 330 49 -149 93 -316 -243 161 2 -88 -196 -199 -95 -111 195 -438 148
2388 148 -56 110 23 -130 49 -208 -52 107 -110 -88 -245 -11 130 111 67 -30 170 2 -224 -96 100 -38
2410 -38 -61 173 182 143 -330 133 8 40 48 -162 29 -155 -114 -347 -50 196 25 43 197 252 -73 156 -9 91
2434 91 -75 -23 -62 -114 -91 94 -34 198 176 -48 -58 -75 58 -119 -34 25 -58 134 -231 73 -161 -2 257 6
2458 6 -198 109 -24 -133 45 -385 -28 40 200 -95 129 118 58 -72 121 -165 -180 253 -10 -191 -37 172
2480 172 444 -238 -211 -140 108 -7 164 -263 132 -5 -195 -56 -42 363 64 47 -59 6 -19 -271 -212 309
2502 309 62 31 -133 48 -233 133 -111 1 -219 101 7 -59 -325 178 79 -309 -92 -1 -94 -177 86 335
2524 335 136 157 190 4 -95 -81 221 137 21 -157 -58 -55 -21 -165 -211 -96 -130 -55 -122 -17 -24 23 -27 -104 64 -276
2550 -276 142 -87 -2 70 -195 -222 208 44 -34 -74 9 39 -167 -147 104 4 68 70 -330 54 -54 -94 -47 143
2574 143 -127 -127 49 181 -249 -79 -16 14 121 -11 37 -11 221 52 128 328 -11 -53 -116 -177 -315 153 121 79
2598 79 7 -20 -259 107 -74 -39 -265 83 374 -23 277 34 -137 -199 14 141 -31 -248 72 -122 172 144
2620 144 -11 -343 135 265 27 -165 -274 53 -87 -188 -159 300 -169 -60 181 -16 55 -35 82 89 96 -115
2642 -115 -104 321 -190 -37 -58 -286 -73 -33 -215 -23 248 194 -92 -62 -173 -31 -20 17 82 92 77 -43 4 -42
2666 -42 -139 105 -37 164 -3 -2 176 143 57 -121 -141 15 2 -62 -13 -147 32 62 -71 21 388 -233 -112 45
2690 45 -41 388 -8 283 -9 37 -265 -40 84 -58 118 58 -158 -100 13 -279 -233 -145 220 166 71 65 85 48
2714 48 -81 137 -96 -68 182 121 207 -139 8 47 150 -35 43 16 -216 160 83 5 -38 3 218 -177 -29 60
2738 60 51 201 249 -11 202 -132 -220 39 67 -234 -21 -324 3 74 -202 171 -160 -72 148 135 19 266 60
2761 60 85 -108 -80 391 345 -45 137 30 202 323 -241 5 143 37 -124 70 201 355 -85 -111 -176 -39
2783 -39 -66 42 -358 189 -48 -126 -8 267 34 55 248 69 -49 270 335 44 283 -3 238 90 -12 -23
2805 -23 -18 6 248 -101 -132 -85 40 62 -33 14 -136 -321 -27 135 -69 -65 -76 47 -152 -92 193 11 140 -5
2829 -5 -193 33 -83 110 -98 160 24 75 61 72 72 -129 -201 390 323 -25 53 121 66 100 247 -217 -182 -315 23
2854 23 -138 99 -148 139 217 -124 34 13 -65 -138 -145 -131 -104 -135 -120 -128 28 58 -165 89 -50 492 -97 11 72
2879 72 35 175 61 8 126 37 -71 -309 -54 150 -37 106 157 245 110 -14 -19 -131 -169 58 -62 -133 114
2902 114 12 -98 -83 -47 36 10 67 95 -89 133 -234 -190 -74 -196 -51 90 -488 -31 -78 -99 187 -5 -285
2925 -285 108 203 -140 -95 281 -84 -103 94 104 -260 -289 107 33 -114 -177 14 35 494 -235 212 -32 -45 -204
2948 -204 43 11 27 266 -304 145 -49 30 -110 48 60 -111 -147 16 35 -144 307 121 20 85 36 38 -43 -38
2972 -38 -15 -60 -174 141 -57 -131 95 -88 129 9 -155 264 121 -183 -108 205 -142 -30 -4 82 39 -196 75
2995 75 -116 68 -154 -121 -48 202 -153 153 -261 6 -130 122 -7 -254 -250 -150 137 -62 -161 186 -30 48
3017 48 181 143 267 68 -98 -49 -30 -57 -210 -94 -121 -147 41 300 -298 -145 211 163 11 112 -90 -301 -90
3040 -90 186 -218 -280 375 -151 5 -86 -42 324 -122 284 107 -383 -222 41 50 -23 -76 182 47 -50 -79 224
3063 224 115 -121 69 56 -37 -94 70 -114 -125 -78 -7 8 -72 37 134 116 -46 19 24 -61 101 -206 49 34 224
3088 224 47 -60 -29 -372 142 -121 59 24 199 104 98 161 -63 -283 5 5 -102 22 219 -101 -237 -16 -251
3111 -251 -302 -76 -7 -1 361 79 117 105 73 45 31 -23 -117 151 -49 -234 71 -99 72 -168 -143 116 53 -360
3135 -360 66 -78 193 61 -33 -60 -200 -171 -35 159 205 -197 139 206 -43 -150 68 239 80 -81 -236 -80
3157 -80 -278 4 104 220 -189 -286 52 19 118 47 -196 -25 -188 265 174 -46 -75 -71 -202 211 19 62 169
3180 169 -68 106 44 -166 -138 267 -62 158 28 149 -74 -93 -62 -391 5 290 25 132 238 1 -182
3201 -182 -17 149 221 -21 186 223 -354 -71 -220 -221 84 -155 -112 -101 172 -113 129 -274 -41 284 -245 -155
3223 -155 -54 93 -45 67 -128 -142 -152 -56 -10 118 43 -165 -61 108 -88 -176 98 -68 -58 -350 361 86
3245 86 261 -183 -42 -302 -10 375 -148 95 223 11 -159 155 147 -85 50 -373 58 30 -109 159 336
3266 336 101 206 151 -22 54 -134 -131 7 -19 -30 92 -33 106 91 -225 -121 192 -98 38 -169 -134 92 -258
3289 -258 -80 56 -265 76 -58 224 50 2 -95 -93 250 -2 -79 211 79 163 203 279 201 10 114 89 245
3312 245 106 -12 -101 -139 -170 -67 221 -6 66 -64 84 -308 -68 124 115 90 121 -145 39 175 -122 77 -124
3335 -124 245 138 60 59 205 -121 -67 -76 -203 245 106 -12 190 43 -39 -66 -140 -82 96 -246 -137 186 466
3358 466 198 -23 194 -208 91 -159 -111 265 -5 -62 85 283 -77 50 -33 -258 4 193 -166 -9 -48
3379 -48 90 101 -110 -102 -81 151 -57 386 0 -77 38 -200 -30 -135 -8 29 -110 277 42 39 -23 -27 60 -47
3403 -47 182 55 -44 -11 98 -126 -279 -115 118 3 27 -133 -1 85 8 -78 -26 238 -125 95 -25 80 138
3426 138 -100 137 -112 125 -2 132 -132 -84 141 52 76 277 157 -141 133 142 327 9 -77 -18 62 113 -2
3449 -2 -198 48 172 -299 -91 -155 7 176 -109 61 133 73 -211 206 88 375 -37 -28 272 74 30 -21 -176
3472 -176 73 -191 -58 -132 213 17 7 -47 310 223 -51 7 -76 148 15 58 -46 -208 14 254 43 -59
3494 -59 -149 121 95 328 272 230 132 193 -19 -29 -185 -71 142 248 1 222 284 42 -91 13 72 -1 186 -43
3518 -43 168 -33 -13 23 -202 260 88 -170 -177 -31 -86 -48 -19 -172 103 -98 -152 -158 176 98 -272 9 1 -393 53
3543 53 -152 62 122 -158 41 9 -6 117 -36 -464 -103 -18 56 -100 133 256 -61 -41 -405 -265 -122 -132 -3
3566 -3 -35 35 -16 345 121 -63 235 104 -20 165 -79 359 250 -248 167 265 45 31 -106 75 3 -123 -31
3589 -31 -388 57 329 243 -72 -158 -89 90 296 220 -22 42 86 -32 19 -372 12 -50 -237 -173 -220 176 110 312
3613 312 54 25 46 -324 231 -4 -69 249 -348 -69 112 9 -81 -154 -28 -50 -6 9 12 -74 -214 302 -82 27
3637 27 -91 5 203 176 73 263 80 -106 38 -93 50 54 207 249 -67 140 -59 -140 -166 -66 -29 -74 161
3660 161 -189 112 70 108 125 194 111 -199 59 -100 90 25 -54 -8 -69 -123 63 -8 141 -112 148 107 124 142 -148
3685 -148 15 15 19 95 -255 -59 61 311 -2 -75 -103 -149 65 158 -261 202 -37 -84 -9 -97 73 -163 -63 53
3709 53 -181 105 -35 -160 143 -42 -74 -186 232 -251 -315 -213 132 69 -313 160 97 260 -348 -39 -154 -119
3731 -119 255 42 -122 29 26 60 -48 86 85 -122 -93 6 -65 129 -85 -371 -228 -71 64 -78 -16 101 145
3754 145 41 29 -22 22 -118 -3 124 125 38 -240 -71 10 87 -13 -95 -11 -89 -131 92 37 80 -37 192 223 -284
3779 -284 67 -68 -61 159 86 80 -171 -90 132 57 -171 -20 227 -128 -281 -199 202 -98 -240 -147 29 -103 -87
3802 -87 26 -133 -215 -173 116 -229 8 101 -188 -127 220 -282 -59 -221 69 -56 -84 117 11 -15 91 -135
3824 -135 -109 114 -237 -197 -232 8 100 -10 30 230 -40 33 15 187 32 -97 -153 255 -77 174 199 -140 177
3847 177 69 -103 126 -54 -258 -34 90 -116 -418 78 -71 -86 -43 74 -113 52 197 251 -27 -311 18
3868 18 42 51 264 -210 1 27 -55 -44 -82 42 98 -73 -92 79 -45 -116 -202 260 131 59 -67 -32 288 -120 -8
3893 -8 -183 50 -105 -181 -66 118 29 -120 90 -51 79 38 -110 226 326 -191 122 -123 -151 326 6 -68
3915 -68 171 -50 195 -46 150 -210 -66 84 124 -202 -131 -64 -457 -246 -132 189 170 163 73 109 -394 -117 19
3938 19 51 -47 -133 -32 157 110 170 -334 -57 213 -38 126 413 -21 129 8 -76 -32 20 123 234 179 44
3961 44 130 25 -21 -50 -178 -30 13 42 -28 -4 -264 -211 -1 -100 82 -379 3 101 -184 -155 39 -74 -115 155
3985 155 -168 252 -148 188 287 107 232 -73 86 158 -147 44 178 -34 234 -137 269 -76 79 220 -68
4006 -68 41 313 -6 -115 -108 -75 22 198 -31 -211 -171 178 100 83 -266 -105 43 30 -16 331 -104 -45 144 561
4030 561 45 219 72 -13 -99 -198 -125 -153 121 31 51 -36 126 16 -11 -247 -101 36 191 -104 -78 38 130 -9
4054 -9 312 -71 253 150 136 -189 -154 -6 166 -52 161 117 24 -86 -227 -79 -126 -96 199 139 80 74 70 111 -127
4079 -127 -37 -81 23 -122 -121 -63 50 205 49 -185 -24 171 61 -119 -163 256 316 62 29 -23 331 180 129
4102 129 122 114 -176 20 -2 -32 -157 11 259 -75 -132 -59 -143 -2 -292 -21 57 -124 -176 52 9 -1 358 -309
4126 -309 -77 136 5 -350 -214 182 -181 158 -233 -40 -340 135 56 -184 -124 100 238 0 -179 311 10
4147 10 42 24 182 -243 -60 -42 107 122 13 -165 147 220 149 29 298 -212 -39 -24 -88 60 99 111 4 72
4171 72 -169 -111 9 20 -202 128 -144 127 15 -78 242 195 -78 -156 -114 189 -208 -167 1 -180 18 30 38 218
4195 218 143 -156 125 92 8 15 -225 200 -131 119 -75 37 111 -289 100 -163 159 57 105 219 60 166
4217 166 -225 61 233 35 -7 -17 239 -88 -7 -162 101 239 -174 173 -41 16 -3 -257 3 -238 59 -105
4239 -105 -80 -63 -226 -41 307 -87 7 -156 -35 89 -97 -30 13 -439 -24 47 133 -2 31 4 67 -176 111
4262 111 125 138 240 9 -49 39 -103 -110 -47 6 -101 -313 157 -18 -278 200 -124 -145 -153 289 310 -141 83 5
4286 5 -137 -97 -46 -285 49 159 -107 -100 -160 -135 40 22 -1 -82 -80 -95 -92 -53 -101 -24 112 -205 -82 230 49 126 99
4313 99 25 -163 -34 -35 191 13 53 -319 307 154 108 -116 -161 -4 205 138 -72 7 -179 249 37 10 -8 6
4337 6 -29 136 -183 242 -95 197 96 -39 268 -121 -70 -110 -131 -64 41 -127 192 3 -43 127 -61 -198 -201
4360 -201 -57 168 -122 -315 -19 81 -164 -104 120 -81 -189 43 -299 5 -53 51 226 200 -8 -133 198
4381 198 163 61 41 71 -173 104 12 -25 226 -45 -67 274 -33 -50 -198 -143 -129 -40 -199 -110 325 -47 -22 356
4405 356 62 -178 -181 33 -17 -211 42 141 85 -63 379 106 -36 172 154 33 72 -121 52 421 -134 3
4427 3 26 19 9 -133 195 215 133 412 60 -60 -257 -108 37 44 -52 136 63 223 218 65 58 -286 -63 22 222 -106
4453 -106 81 11 154 -88 -15 -248 27 -119 149 84 -115 -77 -50 16 -200 -21 -41 -213 -92 41 -68 -20 -121
4476 -121 50 -10 189 120 221 89 371 34 -59 -50 -72 -14 -247 -79 32 159 -77 -54 55 -56 153 -219 -129
4499 -129 -85 -100 121 -37 -81 108 -3 84 11 30 368 -361 -80 44 -54 268 194 34 -50 324 -143 -3 35
4522 35 16 120 34 -68 -69 -161 -53 114 34 48 -47 13 -27 54 13 -130 -220 -49 -79 212 68 219 -86 -30 -26 336
4548 336 173 -306 -109 109 -290 -138 2 65 -174 -21 -72 299 -48 110 157 -307 422 -7 195 -93 5
4569 5 -101 -17 315 103 -225 64 -267 -79 25 304 -145 124 -35 199 -125 64 -65 274 -197 -20 159
4590 159 154 320 70 241 54 186 329 155 89 204 -280 -320 -5 -164 56 47 142 264 376 -192 70 99 -32
4613 -32 -12 -27 -244 32 -253 63 -207 142 135 177 -17 -229 85 9 -4 113 0 -51 0 264 -24 75 90 204
4637 204 68 181 97 -335 -154 -11 138 -40 138 18 -3 -143 22 -72 -168 -51 -16 -209 35 75 -99 51
4659 51 109 -2 261 -64 0 -79 184 114 48 329 203 378 186 244 30 -73 -130 -125 148 -32 37 -131 246 38
4683 38 9 48 68 7 280 -280 -218 254 -173 67 335 -209 -94 -45 -39 60 193 42 -136 -67 26 7 2 63 269
4708 269 94 336 24 194 33 -201 -33 39 102 -60 -51 13 39 103 224 48 177 191 -170 -12 284 -1 358
4731 358 -203 204 -178 25 -80 16 3 189 159 28 305 211 -55 88 -164 15 -196 -104 88 -34 -313 92
4753 92 233 -140 172 142 -51 10 66 -166 -42 10 90 6 90 -85 -186 -77 -16 47 174 155 -28 20 181 31
4777 31 182 18 -244 158 -159 156 231 65 -336 -246 -141 140 255 206 276 283 127 -138 58 -43 160 67 46
4800 46 -60 -29 80 54 -161 178 -3 214 125 -398 -8 -199 175 43 -46 336 -157 241 -17 219 -87 44
4822 44 -87 -242 6 -101 -183 -147 -170 96 -82 -62 383 94 -82 -133 -109 116 161 164 29 -79 -123 -205 22 -101
4846 -101 103 -35 -88 -44 96 190 68 125 -67 82 0 168 -33 302 -39 -111 161 194 107 -56 -13 -327 -248
4869 -248 -141 -205 -16 -96 -75 28 -94 -232 148 -121 -215 148 148 223 -147 -482 112 39 130 34 95 108 63 -298
4893 -298 88 -74 -35 -139 -88 -75 110 57 -159 -87 12 12 -487 -184 65 35 -7 -248 -151 -14 171 143 -114 -282
4917 -282 99 179 185 -178 107 -4 79 236 117 -95 283 -129 -30 -59 13 36 -232 187 55 142 -118 127 100
4940 100 -143 55 25 88 280 17 -57 -66 -69 31 -187 18 -166 -46 -18 -353 -1 -202 125 -46 11 -238 105
4963 105 57 -172 225 -107 171 -173 79 242 196 376 64 -224 -197 128 -44 -138 147 184 250 33 -90 35
4985 35 139 -71 25 27 -118 44 32 75 3 257 262 110 -122 222 -125 110 -59 -103 88 99 3 -174 229 -175
5009 -175 85 -264 -39 -44 23 226 -49 -15 -4 -37 210 222 110 255 -94 189 -135 8 -187 133 157 36 -179
5032 -179 -358 -43 -74 -35 42 107 -105 -148 0 -134 -70 125 10 210 -31 -195 -194 -141 -4 -361 -55 -140 -139 -130 -344
5057 -344 116 -134 151 97 84 91 161 -241 -73 -123 44 -134 77 -22 10 92 -228 -36 10 -90 116 6 485
5080 485 -58 235 -27 104 125 -110 99 90 138 -47 -56 -109 92 -46 28 -10 85 20 114 151 114 305 47 137 -121
5105 -121 -106 -415 207 -152 139 -139 53 -93 58 -20 -75 229 -81 -229 117 262 -320 216 107 448 7
5126 7 53 -77 -64 -89 -60 -47 -30 450 49 -158 101 -225 190 -83 114 258 -72 201 33 -320 123 -252 22
5149 22 -25 -22 -323 -177 -45 87 53 72 71 227 107 160 171 193 129 312 151 89 112 -3 -225 -210 134 5 357
5174 357 -241 141 -89 113 -232 -86 -114 37 62 -132 -75 -61 354 -139 -248 -176 116 -28 99 -56 -109 -140
5196 -140 -54 -191 183 99 -198 268 -27 -264 -107 14 -80 249 -27 -31 -19 78 123 -64 39 -87 67 -38 -195
5219 -195 -237 -29 70 -129 165 109 200 197 -77 -38 105 21 -175 91 180 -58 -206 97 52 37 13 -129 128 -116
5243 -116 -24 -228 -13 -7 113 69 -348 40 32 -91 43 79 211 195 253 82 10 4 -139 -69 83 -18 127 173 -69
5268 -69 98 118 -34 50 101 122 -8 -54 -166 299 -170 -295 -134 331 14 226 113 161 -439 -46 68 99 291
5291 291 -141 -22 -94 -47 139 24 5 -1 33 -131 24 -116 -73 -218 141 43 166 14 -315 77 182 89 -36
5314 -36 133 86 39 42 -29 -266 72 224 151 213 13 -42 67 13 76 -26 91 99 -168 135 45 224 -58 -78 -210
5339 -210 -251 -96 99 -138 -90 211 115 -15 -289 -34 217 256 -288 -46 -11 -27 -126 29 107 1 -26 -151 -158 -67
5363 -67 25 -42 -111 -106 231 229 105 82 -6 113 -72 -334 -34 -131 -52 141 -150 29 48 270 -111 -300 36 89 -52
5388 -52 196 -124 -382 116 135 -188 327 210 5 206 58 166 -17 28 162 254 249 -131 -106 247 -109 -192 -23
5411 -23 11 37 160 98 327 -10 275 -138 159 -14 28 -81 217 287 5 20 -239 -2 -201 224 30 -54 -44
5434 -44 -134 -48 184 42 -144 49 72 97 83 75 -58 -186 -246 -206 -97 52 142 -133 -11 -70 -65 190 -70 33 56
5459 56 188 -113 143 -34 -191 322 -124 -32 151 -19 233 226 -8 -48 239 112 136 -148 161 157 -56 113 82
5482 82 109 -105 -135 -10 -191 146 106 161 -49 -101 -105 -12 147 299 404 -190 -1 117 227 180 53 -125 -427
5505 -427 13 74 6 -128 -77 -57 178 -3 230 -193 35 47 204 124 -116 -110 99 -156 111 -66 203 147 -81
5528 -81 204 197 183 -87 -98 215 -111 -304 -254 327 29 58 47 -287 40 2 -157 32 -123 -85 -90 275 158 -23
5552 -23 -230 -123 77 -135 -263 -228 133 111 129 98 222 -84 -70 30 -135 -156 -134 31 48 20 -106 -43 3 -1 -112
5577 -112 11 -334 184 434 48 129 -215 -113 55 311 50 -43 237 84 178 102 241 3 -73 7 -149 205
5599 205 131 38 212 121 73 74 -76 218 220 164 -30 60 120 -117 171 39 -19 -429 301 231 123 -20 -10 -179 122
5624 122 -25 -172 95 44 73 111 81 -17 118 25 -3 -9 -173 15 -175 -159 91 79 -25 200 -38 11 -345 61
5648 61 181 -44 -32 240 -30 11 137 155 138 28 204 165 17 -67 98 -57 -7 -180 -86 157 -105 3 -72
5671 -72 226 54 120 -263 50 -49 -256 80 6 -174 116 218 -38 161 45 -89 29 88 291 -187 -239 76
5693 76 120 36 -19 59 228 -280 -130 -51 28 4 -132 -69 -123 157 -123 -137 -95 93 -62 157 -293 182 -136 63
5717 63 52 -176 -42 -129 -231 -51 -248 -227 77 -25 -79 38 -3 27 24 -196 58 -88 82 -66 -6 -75 -158 168
5741 168 -27 -5 -126 48 121 -187 169 51 -20 -128 -20 72 -161 9 190 -16 -375 -129 156 262 126
5762 126 117 -20 -12 75 -56 292 -7 -65 103 244 74 68 -164 160 -310 332 71 -260 -276 66 296 46 -166
5785 -166 203 -313 -92 108 -113 -185 -52 39 162 303 -69 225 -283 95 -163 73 -44 30 137 -148 -26
5806 -26 214 -16 -18 -93 46 34 232 239 -171 56 -239 108 74 -31 185 -20 -152 140 -65 -187 -284 -186 -95 -47
5830 -47 -352 3 -421 25 -149 -236 -159 80 78 -122 -135 190 182 -246 298 -68 12 -138 -264 159 229 173 131 182
5854 182 174 -8 -145 -112 -337 -206 -68 -6 -64 68 -21 204 -188 -177 52 -82 361 125 182 80 -177 20 -207
5877 -207 110 93 -155 52 -7 24 -199 -271 6 146 -12 -139 8 131 -216 150 58 64 -43 -58 102 -244 125
5900 125 -21 -67 92 -174 77 -386 115 -150 -44 -123 -22 -69 -175 111 -62 -1 305 -124 58 99 -1 -9
5922 -9 75 131 163 122 -249 243 88 8 -98 -37 -90 -164 108 -74 172 121 111 -269 -138 -1 27 278 -202 -309
5946 -309 122 -204 99 -153 41 -360 -239 163 -151 49 79 3 -194 -114 86 -118 -32 249 23 -38 -123 141
5968 141 -22 21 123 -51 -248 -65 108 56 4 198 -69 -135 -133 -43 53 -47 -232 -143 189 -201 -404 -80 362
5991 362 -5 -24 47 -49 -36 -86 316 155 134 -45 6 -295 -47 -22 141 -162 48 186 -158 206 140 -53 250
6014 250 150 -132 -474 300 99 -189 31 112 273 -43 30 -146 208 -30 -203 344 46 240 26 -69 52
6035 52 59 38 -31 -247 26 -406 44 205 285 58 11 -101 108 -66 -220 -50 47 67 -20 -125 -73 -236 251 -32
6059 -32 -18 -108 146 -72 -170 397 -93 -114 56 -211 -197 -172 311 300 37 45 75 58 472 197 -40 -274 -240 -26
6083 -26 -31 -127 106 93 185 -13 -4 155 22 175 -52 109 50 -167 100 -80 2 -18 -36 -32 -102 -100 -311 -219 -95 -59
6109 -59 148 146 -136 149 -183 126 79 34 -31 -5 -147 -19 -74 -230 88 -41 150 -76 24 53 79 -97 139
6132 139 91 -38 -222 -21 138 57 34 66 94 119 -240 23 103 -200 136 68 -5 -30 89 -20 -75 119 -17 83
6156 83 90 -16 71 237 -272 -118 -8 472 51 -227 -32 -34 -101 60 -111 111 -11 21 -133 204 -111 288 224
6179 224 25 -23 -111 270 91 138 -212 259 13 -222 -172 329 212 -164 96 13 -172 26 99 15 -91 -225
6201 -225 144 -351 9 139 -71 -134 -134 5 -39 -438 -100 -93 -87 139 -101 78 -42 -80 15 71 60 15 -191 -84
6225 -84 31 -88 -237 -258 127 302 -136 39 -111 160 -248 -259 94 -215 -194 4 64 -104 -4 -71 192 -189
6247 -189 230 -145 128 139 149 279 139 -37 -29 78 3 -83 147 37 -197 -285 202 79 320 83 -13 49 -146
6270 -146 123 185 -240 146 -117 95 68 82 -56 203 108 -169 -10 -211 -53 20 -142 -91 238 -340 284 -365
6292 -365 -302 -138 14 -203 289 50 -208 3 -253 69 -364 35 -69 5 6 65 -111 -32 -110 -166 121 -4 -146
6315 -146 97 91 84 -104 -208 129 -78 19 49 143 263 -65 226 -60 238 -95 200 114 -96 -29 -318 -39 54
6338 54 171 -145 -80 129 -145 -46 252 -111 14 116 -137 26 42 -209 -101 -177 149 -34 238 15 48 268
6360 268 -186 108 113 202 -47 251 -115 92 298 -17 28 191 -133 74 24 233 116 -255 -159 127 83 118 -11
6383 -11 -267 -221 -76 -25 -5 72 -100 142 -175 70 -169 -126 34 247 250 332 -63 -91 37 -146 52 4 243 -164
6407 -164 -276 86 -249 60 70 99 24 43 78 205 204 -35 -135 -187 46 18 281 25 -8 -132 -31 -1 -342 320
6431 320 72 178 211 19 -147 84 -54 -56 62 -48 -203 -220 -69 94 -4 -54 154 4 66 -134 85 227
6453 227 139 -35 -100 -251 -48 13 111 221 -78 -213 37 -207 158 53 166 53 77 -195 -246 -251 -237 -8 74
6476 74 163 60 -178 -175 -76 107 223 157 -75 43 -209 155 -224 41 155 97 221 -42 46 -344 -103 -37 208
6499 208 -105 55 -7 -15 -213 189 136 -115 -137 254 178 -256 -313 122 -29 79 -33 54 -66 -125 99 44 -42 -328
6523 -328 -195 124 110 -11 -32 8 77 113 -241 184 -209 -72 -93 -51 191 -378 121 -100 260 -110 -224 -151 85
6546 85 -29 109 172 -93 167 43 -85 21 44 178 47 27 57 -159 98 95 -86 282 149 150 119 -111 -49 121
6570 121 266 154 -31 -233 98 32 79 76 90 -134 41 154 -237 28 101 -52 -77 60 -99 19 -260 -89
6592 -89 63 -69 -19 -180 19 -143 -402 -6 170 74 -56 256 13 -355 123 -62 187 -153 -14 106 -374
6613 -374 165 66 -37 137 35 -224 224 -19 -281 -17 -103 103 283 389 125 -241 -125 -32 -193 -239 77
6634 77 20 26 -5 63 63 95 50 123 85 191 -10 248 -62 -62 -202 38 343 91 252 55 -16 82 -123 174 20
6659 20 35 151 29 82 -274 -135 -20 137 183 36 -95 -152 -74 84 -52 55 -47 -53 142 295 -86 34 -40
6682 -40 72 -139 -20 156 39 -264 -38 149 249 -34 -67 -82 255 318 232 46 17 120 -24 35 -23 -235 -31
6705 -31 -98 -40 174 24 182 -36 -15 1 86 -166 140 -18 111 -95 -212 -92 132 27 148 -257 -278 -158
6727 -158 89 78 164 31 -381 53 76 -88 -30 90 117 134 42 -85 -23 11 -32 46 -302 94 -51 -169 -83 59
6751 59 -141 -77 -242 -196 259 -103 -365 -59 19 -233 -61 -1 -16 47 185 61 -176 206 131 -169 0 19 -36
6774 -36 -327 221 -240 -48 42 -446 -170 -250 -281 15 90 28 77 359 -82 20 -187 47 99 148 321 70 266
6797 266 120 142 39 -130 -159 120 -68 8 35 164 73 -46 -279 -41 -76 92 190 -24 -26 -128 148 -63 -23
6820 -23 53 -242 121 134 64 -42 53 176 -27 -48 56 108 191 277 -337 -231 -128 125 161 -290 205 -503 -90
6843 -90 282 42 -119 -23 124 191 241 -204 -96 -317 129 130 211 65 9 -46 -5 -103 -268 305 -93 -208 211 -22
6867 -22 -113 -50 -208 320 -46 -65 87 22 -220 108 193 121 -12 -23 -114 159 -331 -54 -38 283 -13 -72 -77 76
6891 76 122 7 -236 96 114 -83 162 221 -100 -273 -137 -39 264 -62 38 -57 270 398 -18 21 116 -291 -126
6914 -126 24 -148 135 29 22 -180 -34 102 10 147 -47 53 -127 -23 -31 -205 83 -25 20 -182 83 -78
6936 -78 175 -48 153 26 -102 -240 -67 117 260 194 -19 84 -211 68 48 -32 -36 311 40 -138 -143 75 190
6959 190 -185 -24 -59 -152 -238 72 272 53 97 5 -4 117 6 -34 214 162 -107 27 -23 -131 44 144 -20
6982 -20 -255 43 -232 -83 -301 -80 19 -24 362 -232 225 42 68 -187 43 46 -148 -201 -1 -20 129 108 7
7005 7 151 -95 -123 87 -103 -168 23 -165 335 -52 104 -40 -74 214 -139 160 81 105 -174 143 -3 -6 -91
7028 -91 -40 -205 137 147 202 31 60 -60 117 -84 -241 -64 249 -56 43 127 -143 25 287 -2 -172 -62
7050 -62 -38 -153 190 52 199 -199 73 89 95 -30 -21 24 48 172 113 44 -17 -54 228 40 -13 105 96 -71 -416
7075 -416 -134 -3 -108 43 -76 -173 -58 34 398 172 332 -41 57 -46 35 191 -377 -35 60 78 -55 180
7097 180 -33 53 -433 -4 30 -243 54 -107 18 -186 133 1 -71 -190 20 -89 46 68 72 -46 -266 213
7119 213 -27 -251 209 -159 -96 -109 -172 -77 238 -115 258 -105 -43 265 -45 83 -40 -257 7 -85 144 -2
7141 -2 58 -178 123 147 244 103 138 -168 -281 34 83 145 -7 302 63 12 -149 -14 -40 -192 -124 92 -69 71
7165 71 -24 112 175 170 2 -284 47 -196 374 -280 -125 -99 -116 1 -88 61 -206 -42 -96 196 -155 181 -64
7188 -64 250 -278 112 48 -174 238 63 -87 -43 -43 -107 132 181 -141 -211 126 -290 157 -10 -18 8 -44 -41 24 -28
7213 -28 120 240 89 135 182 -18 -100 -15 36 60 -137 131 9 36 -143 -132 -153 72 -89 -121 88 -94 93 -20
7237 -20 -53 -68 18 55 124 187 0 347 -35 -17 -14 -34 162 -128 46 127 -10 -137 264 44 -171 124 96 4 -91
7262 -91 -201 -42 -43 139 -109 53 -13 -33 -12 -110 -67 13 38 -148 -1 122 -309 -81 -187 -154 111 -157 -34 164
7286 164 108 -87 -66 -229 70 9 -89 198 -14 19 -58 -70 -42 -150 -82 -318 -197 116 356 -76 -210 51 -156
7309 -156 -57 -234 5 -72 423 114 8 18 61 25 13 -42 20 -214 5 140 1 -9 -108 305 227 -3 90 4
7333 4 -84 39 73 -12 55 92 -372 82 16 131 -68 -245 -113 122 282 70 25 210 64 -61 -5 -31 -272 -230
7357 -230 6 -278 10 57 79 -151 85 -153 -35 -219 -110 75 262 -96 -83 -101 -98 49 13 -213 -49 -3 -28
7380 -28 37 26 42 -99 1 -43 117 -156 -83 -63 -172 -131 155 -4 -245 13 -109 -118 107 47 -163 -90 118 -36
7404 -36 253 98 190 37 -41 -123 180 145 -257 324 317 -131 -123 20 5 -75 233 125 85 10 -222 -65 212 117 -14
7429 -14 -4 -137 -119 -260 91 419 37 166 181 87 -242 59 -31 123 1 -37 26 125 -94 -80 -178 -265 -2 31
7453 31 183 -133 77 -160 -115 -96 -167 185 -152 -27 73 -77 -124 7 3 -329 50 -22 -240 136 9 208 207
7476 207 -207 -142 66 -195 44 -129 -12 102 -174 104 -154 -194 108 -207 -20 409 99 -161 46 -211 -231
7497 -231 149 -73 -221 -93 155 -94 -81 156 90 -9 248 -239 -208 170 185 26 5 -21 230 50 -104 126
7519 126 32 13 33 121 75 31 -65 -162 139 -4 -139 37 211 11 123 74 256 -147 -98 -42 -409 -202 -182 58
7543 58 -10 32 165 -18 -60 -176 -127 -19 17 -167 -135 132 -33 -61 -14 267 219 52 -52 -19 46 -36 -102 365 -307
7568 -307 192 36 28 -185 -46 98 5 74 6 130 -154 -147 -2 145 -56 89 -74 -109 87 80 39 -314 -293 203
7592 203 -266 -69 -41 15 -164 -130 -188 -57 137 275 -297 -328 -1 132 -167 117 127 125 -79 36 462 305 188
7615 188 105 218 -41 -203 -11 -11 86 11 29 48 -42 233 -34 145 250 -57 65 -176 -204 -56 0 212 119 168
7639 168 -178 170 -70 -132 -116 67 -29 16 145 -143 -277 -138 55 -61 121 227 15 120 43 -71 -45 -133
7661 -133 81 -123 39 -30 -129 -432 41 178 -200 -111 5 112 50 69 -442 177 167 -68 -8 14 -23 -34 -138
7684 -138 28 -196 -34 -527 -64 4 54 -8 63 470 16 -98 -100 83 -88 -91 -139 125 222 -52 121 132 144 254
7708 254 -113 70 -49 -262 -163 130 -65 180 100 61 43 30 -99 187 120 -167 -119 -68 -26 -261 189 -27 157
7731 157 145 14 -307 6 60 61 -13 118 -141 100 56 -2 64 41 170 -13 187 7 7 -18 -386 90 36 -196
7755 -196 -141 146 95 -94 -134 165 -242 -7 5 -68 -59 445 134 40 -270 -224 56 16 -139 55 242 250 -38 -184
7779 -184 253 175 134 -23 82 96 13 -168 -1 64 -95 0 222 19 111 34 58 -162 9 -66 -97 -89 29 4 -215
7804 -215 70 -94 -26 289 -263 -120 -301 -295 -111 -72 -36 -77 148 -250 -460 131 -11 -118 -4 -28 15 103 176
7827 176 -8 -112 -6 -163 116 129 98 10 10 11 84 -91 65 -193 -263 -95 -166 209 -235 75 -145 -205 260 -56
7851 -56 -151 -123 221 -21 -248 -61 -258 73 -138 154 51 73 165 25 -24 -49 -156 120 -27 -272 4 -55 -325
7874 -325 -101 -57 -132 -236 -31 234 -362 230 -48 246 -209 182 -138 4 47 16 208 240 -24 178 -78 -88
7896 -88 -108 -59 156 95 -168 109 153 -161 -58 63 63 119 19 34 -201 -125 -85 56 64 110 126 84 103 66 -87 -36
7922 -36 -116 -116 -3 -69 35 -227 -156 -39 2 -95 9 108 -246 51 59 177 175 -320 -313 111 -15 -182 108 -96 74
7947 74 -20 129 146 41 -217 101 223 -155 123 1 73 157 -140 -106 139 -4 120 -297 -21 59 -139 -23
7969 -23 32 232 76 -206 213 352 22 76 -242 125 -97 -180 35 -125 317 -149 -97 -35 -67 202 185 256 -121
7992 -121 -68 -33 -19 25 8 -108 -39 53 -173 -31 101 443 -35 -35 153 139 -65 -385 351 80 -104 224 200 -146
8016 -146 72 80 32 10 -163 100 162 -74 -14 104 146 189 20 -57 128 -248 -61 -178 -27 -68 -61 -87 98 242
8040 242 220 21 28 168 -158 111 109 -276 -306 -381 -227 311 63 97 -24 49 240 109 -72 -341 44 123 180 -175
8064 -175 13 87 251 21 -81 147 104 121 210 -66 -170 108 -183 78 245 -2 -51 -105 255 36 -76 -127
8086 -127 62 -98 89 15 136 -10 73 -50 -175 304 21 89 -90 -48 74 -88 -174 -20 -184 -73 -24 20
8108 20 -193 45 -206 -86 -102 -11 -249 162 143 89 143 183 -60 11 -174 -143 59 -167 -73 -209 -4 -203 21
8131 21 70 -31 14 -126 -136 166 -120 -192 -254 28 -151 -50 -47 -132 71 85 -162 -45 -174 -31 -164 28 64 10
8155 10 -18 -92 -200 127 325 28 105 86 83 29 -252 278 -197 137 123 10 206 109 140 2 38 -117 63 198
8179 198 145 88 -55 173 -29 56 -100 -25 -9 -6 41 186
8191A86
##END NTUPLES=NMR FID
##END=
