##TITLE=1H_CA-8722-1
 CDCl3, 8 sc, 
 10.7.2020
##JCAMPDX= 6.0         $$ Bruker NMR JCAMP-DX V2.0
##DATA TYPE= NMR FID
##DATA CLASS= NTUPLES
##ORIGIN= UXNMR, Bruker Analytische Messtechnik GmbH
##OWNER= root
$$ XWIN-NMR		Version 3.5
$$ Fri Jul 10 11:02:51 2020 Russian Standard Time (UT+4h)  she@DPX200
##.OBSERVE FREQUENCY= 200.1315
##.OBSERVE NUCLEUS= ^1H
##.DELAY= (6, 6)
##.ACQUISITION MODE= SIMULTANEOUS
##.ACQUISITION SCHEME= undefined
##.AVERAGES= 8
##.DIGITISER RES= 18
##SPECTROMETER/DATA SYSTEM= spect
##.PULSE SEQUENCE= zg30
##.SOLVENT NAME= CDCl3
##.SHIFT REFERENCE= (INTERNAL, CDCl3, 0, 15.7039)
##AUDIT TRAIL= $$ (NUMBER, WHEN, WHO, WHERE, WHAT)
$$ ##TITLE= Audit trail, XWIN-NMR		Version 3.5
$$ ##JCAMPDX= 5.01
$$ ##ORIGIN= Bruker BioSpin GmbH
$$ ##OWNER= she
$$ F:/spectra/data/she/nmr/H-F/1/audita.txt
$$ ##AUDIT TRAIL=  $$ (NUMBER, WHEN, WHO, WHERE, WHAT)
(   1,<2020-07-10 11:01:46.53 +0400>,<she>,<DPX200>,
      <created by zg, POWCHK disabled, PULCHK disabled
       configuration hash MD5:
       00 E9 B6 7A A2 85 ED C7 34 08 36 98 17 FE 4E 26
       data hash MD5: 16K
       BC 7D 82 BC DC 39 DB 3E D4 A4 E5 66 56 29 FD 87>)
$$ ##END=
$$ 
$$ hash MD5
$$ A8 BB E2 FF 06 2E E2 05 B3 54 75 32 36 74 C4 7D
##$RELAX= 
##$RELAX= 
##$RELAX= 
##$RELAX= 
##$RELAX= 
##$RELAX= 
$$ Bruker specific parameters
$$ --------------------------
##$DU= <F:/spectra>
##$EXPNO= 1
##$NAME= <H-F>
##$PROCNO= 1
##$TYPE= <nmr>
##$USER= <she>
##$AMP= (0..31)
100 100 100 100 100 100 100 100 100 100 100 100 100 100 100 100 100 100 
100 100 100 100 100 100 100 100 100 100 100 100 100 100 
##$AQSEQ= 0
##$AQ_mod= 1
##$AUNM= <au_zg>
##$AUTOPOS= <>
##$BF1= 200.13
##$BF2= 200.13
##$BF3= 200.13
##$BF4= 200.13
##$BF5= 200.13
##$BF6= 200.13
##$BF7= 200.13
##$BF8= 200.13
##$BYTORDA= 1
##$CFDGTYP= 0
##$CFRGTYP= 5
##$CHEMSTR= <none>
##$CNST= (0..31)
1 1 145 1 1 1 1 1 1 1 1 1 1 1 1 1 1 1 1 1 1 1 1 1 1 1 1 1 1 1 1 1 
##$CPDPRG= <>
##$CPDPRG1= <>
##$CPDPRG2= <>
##$CPDPRG3= <>
##$CPDPRG4= <mlev>
##$CPDPRG5= <mlev>
##$CPDPRG6= <mlev>
##$CPDPRG7= <mlev>
##$CPDPRG8= <mlev>
##$CPDPRGB= <>
##$CPDPRGT= <>
##$D= (0..31)
0 1.2 0 0 0 0 0 0 0 0.06 0 0.03 0 0 0 0 0.0002 0 0 0 0 0 0 0 0 0 0 0 0 
0 0 0 
##$DATE= 1594364506
##$DBL= (0..7)
120 120 120 120 120 120 120 120 
##$DBP= (0..7)
150 150 150 150 150 150 150 150 
##$DBP07= 0
##$DBPNAM0= <>
##$DBPNAM1= <>
##$DBPNAM2= <>
##$DBPNAM3= <>
##$DBPNAM4= <>
##$DBPNAM5= <>
##$DBPNAM6= <>
##$DBPNAM7= <>
##$DBPOAL= (0..7)
0.5 0.5 0.5 0.5 0.5 0.5 0.5 0.5 
##$DBPOFFS= (0..7)
0 0 0 0 0 0 0 0 
##$DE= 6
##$DECBNUC= <off>
##$DECIM= 24
##$DECNUC= <off>
##$DECSTAT= 4
##$DIGMOD= 1
##$DIGTYP= 9
##$DL= (0..7)
0 120 120 120 120 120 120 120 
##$DP= (0..7)
150 150 150 150 150 150 150 150 
##$DP07= 0
##$DPNAME0= <>
##$DPNAME1= <>
##$DPNAME2= <>
##$DPNAME3= <>
##$DPNAME4= <>
##$DPNAME5= <>
##$DPNAME6= <>
##$DPNAME7= <>
##$DPOAL= (0..7)
0.5 0.5 0.5 0.5 0.5 0.5 0.5 0.5 
##$DPOFFS= (0..7)
0 0 0 0 0 0 0 0 
##$DQDMODE= 0
##$DR= 18
##$DS= 0
##$DSLIST= <SSSSSSSSSSSSSSS>
$$ [...]
##$SUBNAM2= <"">
##$SUBNAM3= <"">
##$SUBNAM4= <"">
##$SUBNAM5= <"">
##$SUBNAM6= <"">
##$SUBNAM7= <"">
##$SUBNAM8= <"">
##$SUBNAM9= <"">
##$SW= 24.9337058887773
##$SWIBOX= (0..15)
0 0 2 0 0 0 0 0 0 0 0 0 0 0 0 0 
##$SW_h= 4990.01996007984
##$TD= 16384
##$TD0= 1
##$TE= 0
##$TE2= 300
##$TE3= 300
##$TEG= 300
##$TL= (0..7)
0 120 120 120 120 120 120 120 
##$TP= (0..7)
150 150 150 150 150 150 150 150 
##$TP07= 0
##$TPNAME0= <>
##$TPNAME1= <>
##$TPNAME2= <>
##$TPNAME3= <>
##$TPNAME4= <>
##$TPNAME5= <>
##$TPNAME6= <>
##$TPNAME7= <>
##$TPOAL= (0..7)
0.5 0.5 0.5 0.5 0.5 0.5 0.5 0.5 
##$TPOFFS= (0..7)
0 0 0 0 0 0 0 0 
##$TUNHIN= 0
##$TUNHOUT= 0
##$TUNXOUT= 0
##$USERA1= <user>
##$USERA2= <user>
##$USERA3= <user>
##$USERA4= <user>
##$USERA5= <user>
##$V9= 5
##$VALIST= <valist>
##$VCLIST= <CCCCCCCCCCCCCCC>
##$VD= 0
##$VDLIST= <DDDDDDDDDDDDDDD>
##$VPLIST= <PPPPPPPPPPPPPPP>
##$VTLIST= <TTTTTTTTTTTTTTT>
##$WBST= 1024
##$WBSW= 4
##$XGAIN= (0..3)
0 0 0 0 
##$XL= 0
##$YL= 0
##$YMAX_a= 428137
##$YMIN_a= -257637
##$ZGOPTNS= <>
##$ZL1= 120
##$ZL2= 120
##$ZL3= 120
##$ZL4= 120
##$ABSF1= 10
##$ABSF2= 0
##$ABSG= 5
##$ABSL= 3
##$ALPHA= 0
##$AQORDER= 0
##$ASSFAC= 0
##$ASSFACI= 0
##$ASSFACX= 0
##$ASSWID= 0
##$AUNMP= <proc_1d>
##$AZFE= 0.1
##$AZFW= 0.1
##$BCFW= 1
##$BC_mod= 2
##$BYTORDP= 1
##$COROFFS= 0
##$CY= 11.3945322036743
##$DATMOD= 1
##$DC= 2
##$DFILT= <>
##$DTYPP= 0
##$F1P= 16.9975609425685
##$F2P= -3.02152046262296
##$FCOR= 0.5
##$FTSIZE= 0
##$FT_mod= 4
##$GAMMA= 1
##$GB= 0.15
##$INTBC= 1
##$INTSCL= 1
##$ISEN= 128
##$LB= 0.24
##$LEV0= 0
##$LPBIN= 0
##$MAXI= 10000
##$MC2= 0
##$MEAN= 0
##$ME_mod= 0
##$MI= 1.114404
##$NCOEF= 0
##$NC_proc= 0
##$NLEV= 6
##$NOISF1= 3.799351
##$NOISF2= 2.8
##$NSP= 1
##$NTH_PI= 0
##$NZP= 0
##$OFFSET= 15.70392
##$PC= 1
##$PHC0= -9786.805
##$PHC1= 5.40092
##$PH_mod= 1
##$PKNL= yes
##$PPARMOD= 0
##$PSCAL= 0
##$PSIGN= 0
##$REVERSE= no
##$SF= 200.130013532006
##$SI= 16384
##$SIGF1= 3
##$SIGF2= 2
##$SINO= 400
##$SIOLD= 16384
##$SREGLST= <1H.CDCl3>
##$SSB= 0
##$STSI= 0
##$STSR= 0
##$SW_p= 3612.71676300578
##$SYMM= 0
##$S_DEV= 0
##$TDeff= 0
##$TDoff= 0
##$TI= <>
##$TILT= no
##$TM1= 0
##$TM2= 0
##$TOPLEV= 0
##$USERP1= <user>
##$USERP2= <user>
##$USERP3= <user>
##$USERP4= <user>
##$USERP5= <user>
##$WDW= 1
##$XDIM= 8192
##$YMAX_p= 0
##$YMIN_p= 0
$$ End of Bruker specific parameters
$$ ---------------------------------
##NTUPLES= NMR FID
##VAR_NAME=  TIME,          FID/REAL,        FID/IMAG
##SYMBOL=    X,             R,               I
##VAR_TYPE=  INDEPENDENT,   DEPENDENT,       DEPENDENT
##VAR_FORM=  AFFN,          ASDF,            ASDF
##VAR_DIM=   8192,          8192,            8192
##UNITS=     SECONDS,       ARBITRARY UNITS, ARBITRARY UNITS
##FACTOR=    0.0002004,     1,               1
##FIRST=     0,             0,               0
##LAST=      1.6414764,     0,               0
##MIN=       0,             -257637,         0
##MAX=       1.6414764,     428137,          0
$$ Real data points
##PAGE= N=1
##DATA TABLE= (X++(R..R)), XYDATA
0@%%%%%%%Qj6J6j6K4l2L6m4N6p0P8r0J11j31J51j78K07k36K73l14L56m04M58n17
$$ 0 0 0 0 0 0 0 0 8 -8 8 -8 16 -16 20 -24 32 -38 40 -50 61 -70 81 -97 110 -126 147 -167 189 -215 243 -274
31b74N81o52P30q17R14j017J129j252J390j543J708j891K093k317K569k853L172
$$ -274 307 -345 385 -432 482 -535 594 -658 732 -811 897 -994 1099 -1218 1351 -1502 1670
48A670l532L951m441N018n716O579p677R132j1165J4228j9429L0608r8094J16641
$$ 1670 -1862 2089 -2352 2666 -3050 3529 -4148 4984 -6181 8047 -11382 19226 -78868 37773
62C7773J26313k39749j81974J5039J68052Q0028m6264q3068K4939L0978n2604
$$ 37773 164086 -75663 -257637 -242598 -74546 5482 -40782 -123850 -98911 -67933 -120537
73a20537m3442J06795J21438k9887j55402q0198J08762K01039K8960j85362j25053
$$ -120537 -163979 -57184 64254 34367 -121035 -201233 -92471 108568 137528 -47834 -172887
84a72887J24112J68205o571j11004l2712P0844O6174l3954o5138M6346J14372
$$ -172887 -48775 119430 112859 1855 -30857 39987 106161 72207 7069 53415 167787
95A67787k3451j46931k8066J53446J24566o3718j73048p1229J34841J75832k8243
$$ 167787 144336 -2595 -30661 122785 247351 183633 10585 -60644 74197 250029 221786
106B21786j82568p4910R3199Q5320j8049n1043o595K2442k9241q8813k824J43140
$$ 221786 39218 -35692 57507 142827 124778 73735 67140 89582 60341 -28472 -31296 111844
118A11844Q2686j43710j90141J3602J75145J09217p7866j69182n6605J09778R4428
$$ 111844 194530 50820 -139321 -125719 49426 158643 80777 -88405 -145010 -35232 59196
129E9196n2661p5521K7777M7424l8677p1731Q780J05075P7612q2830j55558P161
$$ 59196 6535 -68986 -41209 6215 -32462 -104193 -95413 9662 87274 4444 -151114 -143953
141a43953J73108Q7387j00296j14483K0157J04508N4916n2896o5533M1529Q2559
$$ -143953 29155 116542 16246 -98237 -78080 26428 81344 28448 -37085 4444 87003
152H7003k4412q0818K5179J06512K8484q4089p9493M0983J34149N4916j18185
$$ 87003 62591 -18227 6952 113464 141948 57859 -21634 19349 153498 208414 90229
163I0229j22171N9444J44658K4438r6052o7830L1668O9905M871o3272r164P3818
$$ 90229 -31942 27502 172160 196598 100546 32716 64384 134289 139160 75888 66724 140542
175A40542J0623j07041o1374Q6958J09779j4448j27144r7480N2339J37356K6429
$$ 140542 151165 44124 -17250 69708 179487 165039 37895 -59585 -7246 130110 156539
186A56539j17246q1028M2954N3398j9790l6355J5550M5736r622r6784o1075R5589
$$ 156539 39293 -41735 1219 54617 34827 -1528 14022 59758 50136 -46648 -107723 -12134
198a2134J33676l4195j57968o5698R1076J16807Q890r7958p1093M9243P6386k0352
$$ -12134 121542 87347 -70621 -136319 -45243 71564 80454 -17504 -88597 -39354 37032 16680
210A6680n2748K7619N2568k3619o7996j0311P9951Q4229l5905j31920l6552J29182
$$ 16680 -36068 -8449 44119 20500 -47496 -57807 22144 106373 70468 -61452 -98004 31178
222C1178J08703n8267j21491k3313Q2329P6205j9488p3548q898N6861K170n9531
$$ 31178 139881 81614 -39877 -63190 19139 95344 75856 2308 -6590 50271 52441 -7090
234g090M193P8110K5357p7472q8092J3225J17978Q1706q3251j48870q652J24263
$$ -7090 -2897 75213 100570 23098 -64994 -51769 66209 147915 64664 -84206 -92858 31405
246C1405P1251n1383p7801j6824L5319J9486k6923l687N7943J6176r5375p9318
$$ 31405 102656 51273 -26528 -43352 -8033 11453 -15470 -19157 38786 54962 -40413 -119731
258a19731O3333J22977K5570j02196j12667J4375J29095P1030p8351r2864J7397
$$ -119731 -56398 66579 92149 -10047 -122714 -108339 20756 91786 13435 -79429 -62032
269f2032O2336Q846k7987k611L1630J2974n1782n4390N2823J12305k81j23424
$$ -62032 304 9150 -18837 -21448 10182 23156 -28626 -83016 -30193 82112 81831 -41593
281d1593o9058P4386J13443J6786r3763q3417L8358R7656J1221o4568j8327L6890
$$ -41593 -110651 -36265 77178 93964 201 -83216 -44858 52798 64019 -549 -18876 18014
293A8014O084l8152j4582M4364O0419j9105j07260n0084R9708J15718l3471j25328
$$ 18014 24098 -14054 -28636 15728 76147 57042 -50218 -100302 -594 115124 81653 -43675
305d3675n2029O6368Q8543M924p4502m1155M0699K7931l8537j6098N3878L5713
$$ -43675 -95704 -29336 59207 64131 -10371 -51526 -10827 17104 -21433 -37531 16347 52060
317E2060m9782p9075r352Q8692Q8420m2633j28836l4208J01413Q1243l3076p4986
$$ 52060 2278 -76797 -86149 2543 90963 48330 -80506 -114714 -13301 67942 34866 -40120
329d0120k0643M1718L4905k3493l0849L5904M5031m3757p6413J9279R5563M2967
$$ -40120 -60763 -19045 15860 -7633 -38482 -2578 42453 -1304 -77717 -58438 37125 80092
341H0092o4127r5566o346J02405P5641n6458r5446L317P0307K5492l1273k5667
$$ 80092 15965 -79601 -85947 16458 92099 35641 -59805 -56488 13819 39311 8038 -17629
353a7629J7578K8980k1568n5941J3924R2289K8947r2823q2578M0449J04029L8940
$$ -17629 -51 28929 7361 -48580 -34656 57633 86580 -6243 -88821 -48372 55657 94597
365I4597p1106r1501Q278R0291L4745n5907l5680K9633K1837k6545k8159K2363
$$ 94597 23491 -68010 -59732 30559 65304 9397 -26283 3350 25187 -1358 -29517 -7154
377g154N8822J2285q0281p2052N6524J13895P737r9555o7376L7767Q2836K4944
$$ -7154 51668 63953 -16328 -88380 -31856 82039 89776 -9779 -77155 -39388 43448 68392
389F8392n8421n1627K9777M2124k5690l4228L2977M8657j8837o8059l3003N6049
$$ 68392 9971 -41656 -11879 30245 4555 -29673 3304 51961 33124 -34935 -67938 -11889
401a1889Q7669m384j08132n9801O9997Q8919q313p0997l7461K9515M4966p844
$$ -11889 75780 71396 -36736 -96537 -26540 62379 54066 -16931 -54392 -24877 20089 12245
413A2245m0079J0571M6540j6597p0193p503P5809N4981l7894q9480l2013P5948
$$ 12245 -27834 -17263 29277 12680 -57513 -65016 10793 65774 27880 -61600 -93613 -17665
425a7665Q9044k4835r5141k6165N9758M3844j6274l1668K024K7978j229m5569
$$ -17665 71379 46544 -48597 -74762 -15004 28840 12566 -19102 -17078 10900 9671 -35898
437c5898r668P1375M9031o0800q6533J0585Q9657N7538m1463q9456j8686P5778
$$ -35898 -45566 25809 74840 14040 -72493 -61908 27749 85287 43824 -45632 -64318 11460
449A1460N4289l6460m8110J2488K8516q671k5714M411M2861K6654n0430p5352
$$ 11460 65749 29289 -18821 -6333 22183 13512 -12202 -7791 35070 61724 11294 -64058
461f4058J9670R8641L4781p5557p6949J1161P4088M1985m0694o1685O823M6675
$$ -64058 -44388 54253 89034 13477 -63472 -52311 21777 63762 23068 -38617 -31794 14881
473A4881l667l5777Q624L9366j208m9348l7625K9451P5898K0222q0379p3635L8928
$$ 14881 11214 -24563 -15939 23427 22219 -27129 -64754 -35303 40595 60817 -19562 -93197 -54269
486e4269Q8727J7813n7440m8599J2425M8372J3312l2405q754L7825P141n1254
$$ -54269 34458 52271 -5169 -53768 -41343 7029 20341 -12064 -20818 17007 24148 -27106
498b7106k1968N3871N9241j2487p0808m4282M9285Q9180P102p9846m3969M1450
$$ -27106 -49074 4797 64038 51551 -19257 -63539 -14254 74926 82028 2182 -41787 -337
510c37N1631O5k8878j0868J9813J2371l0106k2723M4906N4004l1356p9578j4526
$$ -337 51294 51359 22481 11613 31426 43797 13691 -9032 35874 89878 58522 -21056 -35582
523c5582O7527O1815j8104p9662l9096N2723O1567j8178n3245m905K5662R73k1824
$$ -35582 31945 93760 75656 -4006 -43102 9621 71188 53010 -235 -5140 20522 21495 -329
536c29p707K5844K8761k6414o7867o989P6775M8064n0837p6665p458O0589N0627
$$ -329 -8036 17808 46569 20155 -47712 -54701 22074 70138 19301 -57364 -64822 -4233 46394
549D6394k2058o1412j0519M3988J5094l0305n000L2208J1269l3418l6547J3884
$$ 46394 24336 -37076 -47595 -3607 11487 -18818 -23818 8390 19659 -13759 -50306 -36422
561c6422O4317L6336n4243p5008J5383Q2213L4403m2299n1073k8M3668K5694k3581
$$ -36422 27895 64231 9988 -65020 -49637 32576 66979 24680 -26393 -26421 17247 42941 19360
574A9360k0317K8373K1296l6894l4831L2480N8172N859n6381n3644K2776P8265
$$ 19360 -957 27416 48712 11818 -23013 9467 67639 73498 17117 -36527 -13751 64514
586F4514K6338o3693n5062K3967M9464N614l0068j9594J4025J9463j9965l4623
$$ 64514 90852 27159 -27903 -3936 45528 51142 21074 1480 15505 34968 15003 -19620
598a9620K0112N4511o467o9330l3317M4758O1287j55o5788m9999L3354O4293k97
$$ -19620 492 55003 48536 -20794 -54111 -9353 51934 51779 -14009 -64008 -30654 33639 33342
611C3342n1225j7793K5228J2816j5305j3875J5630L1129o953n6671k3700N9966
$$ 33342 -17883 -35676 -10448 2368 -12937 -26812 -11182 19947 12994 -43677 -67377 -7411
623g411O3398k4799p3336k5950M5867N9641J031n3250k7044L2579K6461k0189
$$ -7411 55987 31188 -42148 -68098 -22231 37410 38441 -14809 -41853 -9274 17187 -3002
635c002j2442K6811J9572k4070m0619l763N1590M9653k9155p8414j5565O4875
$$ -3002 -15444 11367 30939 6869 -33750 -37513 14077 63730 34575 -43839 -59404 5471
647E471M8832k3096n2382j8088K9396K9911j4766k9297J3145K6088k3367m1346
$$ 5471 54303 31207 -21175 -39263 -9867 20044 5278 -24019 -10874 15214 -8153 -49499
659d9499J0475M9281J8008m2101n6956M63O5897M0756m6291o6100L693N1072K3876
$$ -49499 -39024 10257 28265 -13836 -70792 -70329 -4432 36324 -9967 -76067 -72374 -21302 2574
672B574k1673k9862q96K1267K53k5234O522M4989O507n5213l8264L5726O6986
$$ 2574 -19099 -48961 -49857 -28590 -28337 -53571 -47049 -2060 4447 -50766 -89030 -53304 13682
685A3682J7689n4252o1273J4617P1940K9344l9054l3287J0231K0345J191o180
$$ 13682 31371 -22881 -84154 -69537 2403 31747 -7307 -40594 -30363 -10018 -8827 -15007
697a5007R265K4105J780m3605l1511M2969O6807l307o5272l9642K9283N9689J6910
$$ -15007 -5742 18363 20143 -23462 -54973 -12004 54803 51496 -13776 -53418 -24135 35554 52464
710E2464m5784m1180K0150L5999q433k3983P762J9091p358k9521j4720K7044M0722
$$ 52464 6680 -34500 -14350 21649 13216 -10767 -3005 16086 8728 -20793 -35513 -8469 32253
723C2253j1999o2908k4829N0074M8815j8556n5490k4587L0609M2590n153m2903
$$ 32253 20254 -42654 -67483 -17409 31406 12850 -42640 -67227 -36618 5972 819 -42084
735d2084j1521K7852N585k6241k313L0159J6668k5850m3137l618N4796M7061l2164
$$ -42084 -53605 -25753 -20168 -46409 -48722 -18563 -1895 -27745 -70882 -74500 -19704 27357 -4807
748d807o7255p559N3512L8458j2167l4008j0826K2715J6388j6825p902L3037K2681
$$ -4807 -72062 -79621 -26109 12349 182 -33826 -44652 -21937 -5549 -22374 -30276 2761 25442
761B5442l3309m0869J3617N3659L0794k8812n4145m850N4154L2698k8719l2982
$$ 25442 -7867 -48736 -35119 18540 49334 20522 -33623 -38473 15681 48379 19660 -13322
773a3322J1255K6141l56j9084p972K2423K4519j9938m2151N393M8630J5895l8589
$$ -13322 -2067 24074 23718 4634 -3338 19085 43604 23666 -18485 -13092 35538 51433 12844
786A2844l5660J1736M1158J5319l4292l7531J6647M0501l361l4998p625K2073
$$ 12844 -22816 -11080 30078 45397 11105 -26426 -9779 30722 27361 -7637 -15262 6811
798F811J0359j6097k1894P416L4687Q623m4804l4459L1250N0164L05m3247l1251
$$ 6811 17170 1073 -20821 -13405 21282 29905 -14899 -49358 -18108 32056 32361 -10886 -42137
811d2137J5295L9284J0092k8687j4438K2176Q348k6328j1863L0393L2334q866
$$ -42137 -26842 12442 22534 -6153 -20591 1585 9933 -16395 -28258 2135 34469 25603
823B5603m5192k7975L2987N8225K954n2771k8636K4777L2090J686j6681p599J2565
$$ 25603 -19589 -47564 -14577 43648 46602 -6169 -34805 -10028 22062 23748 7067 -532 12033
836A2033P279k1605j5998L0123L7647j7208m9541j2924L7736L9923o309m6903
$$ 12033 19312 -2293 -18291 11832 49479 32271 -17270 -30194 7542 47465 41156 -5747
848e747k3771L3217L6285j4118l2436k07J9979N423j2888r822J1285J9606j1297
$$ -5747 -29518 3699 39984 25866 -6570 -6777 13202 18625 5737 -4085 7200 26806 15509
861A5509l5845n73M5213K3440l5373m4769J171M4817L5174j9973m9371j0496L5032
$$ 15509 -20336 -20909 24304 47744 12371 -32398 -31227 13590 48764 28791 -20580 -31076 3956
874C956K1507j2871r079P002p63j5762j1911J4976L8669J3435m5607m9171J8006
$$ 3956 25463 12592 3513 10515 9752 -6010 -17921 -2945 35724 49159 3552 -45619 -27613
887b7613O0273K3784l2881m4322o974L3347K7359j2388k0044P631Q961j8850j3993
$$ -27613 32660 56444 23563 -20759 -27733 5614 32973 20585 541 8172 17133 -1717 -15710
900a5710K1745L0258k268l6770l1506J8791N1825J1502m6356l5876K0401L6893
$$ -15710 6035 36293 34025 -2745 -34251 -15460 36365 47867 1511 -34365 -13964 22929
912B2929N804k4439k1511P556K2297j694k1198L183K3049m173l1384p314K9019
$$ 22929 28733 4294 -17217 -9661 12636 10942 -10256 -7073 15976 11803 -19581 -26895 2124
925B124K8171j0648m4000k3689L6071M8649p317m6929j9367K1286K4608L093j4077
$$ 2124 30295 19647 -24353 -48042 -11971 36678 29361 -17568 -36935 -15649 8959 12052 -2025
938b025p458Q236L54k0159k954L4746K4389k6324m3636n405L8163L8740q066m5981
$$ -2025 -9483 -1247 -893 -21052 -24006 10740 35129 8805 -34831 -40236 -2073 36667 28601 -17380
952a7380k0839L0209K8270j0462j7124M479J0121m251j5334l497K3313K3214j8288
$$ -17380 -38219 -8010 20260 9798 -7326 -2847 7274 3023 -12311 -15808 7505 30719 12431
965A2431m0180m01M0272K1654k1336l1518l272K8056K1468j7331k8709Q268K7023
$$ 12431 -27749 -28150 12122 33776 12440 -19078 -22350 5706 27174 9843 -18866 -10598 16425
978A6425k105k2775l080J8791J1436j2802k4065K023L3569J5357l1794l2060J6015
$$ 16425 14320 -8455 -11535 7256 18692 5890 -18175 -16152 17417 32774 980 -31080 -15065
991a5065L5076Q254k3712k3905M176K5963P462k1407q050K0186P922k3025j6425
$$ -15065 20011 28265 4553 -19352 -15176 10787 18249 -3158 -11208 8978 16900 -6125 -22550
1004b2550J5887K9301O261l0770l2039J3129M2613R464l1496k0677J1424J5979
$$ -22550 -6663 22638 28899 -1871 -33910 -20781 21832 31296 -200 -20877 -9453 6526
1016F526L46j0510k906J3761P170k2254k0848K0245L4455k238l3903k0536J5286
$$ 6526 6872 -3638 -6544 7217 14387 -7867 -28715 -8470 25985 23747 -10156 -30692 -15406
1029a5406L2238Q555k8294k2277J6834K2493p972j7284M842J4825R04j5492j2146
$$ -15406 16832 25387 -2907 -25184 -8350 14143 6171 -11113 -6271 8554 9458 -6034 -18180
1042a8180J3326K7462l019l5323j3217K9546K7766r801k8783j2791J8928K6082
$$ -18180 -4854 22608 19589 -15734 -28951 595 28361 18560 -10223 -23014 -4086 21996
1054B1996l796k6492m013J9801L955j6191k726J6803J0632j2690k5415m583L2651
$$ 21996 18200 -8292 -12305 7496 11451 -4740 -7466 9337 19969 7279 -18136 -22719 9932
1067I932K7840k1513m0968l012L0573K1417q138k2435r895J3048J0809j0752o606
$$ 9932 37772 16259 -24709 -27721 2852 24269 16131 -6304 -16199 -3151 7658 -3094 -9700
1080i700J6981R402k1786k2577R674K9917J5252k1190l6193j932L7384K0613k1580
$$ -9700 7281 16683 -5103 -27680 -18006 11911 27163 5973 -30220 -32152 5232 25845 4265
1093D265k5057L597J5676N760p143p048P819J0453j1471k0001J0260K9893L078
$$ 4265 -20792 -17195 -1519 4241 -2902 -9950 -2131 8322 -3149 -23150 -12890 17003 20081
1106B0081k7867k0730J2381L1241J2859k5223k9258J0496L0364L844j8337p473
$$ 20081 -7786 -28516 -16135 15106 27965 2742 -26516 -16020 14344 18188 -149 -7622
1118g622Q352O085m981q339O032J9545J556k9858j6622K4997L1177m693l0678
$$ -7622 730 6815 1834 -6505 -473 19072 20628 -9230 -25852 -855 30322 25629 -5049
1131e049j9216J3271K9801O803k5122j5444J3832J0832r903p553J0317J1088n916
$$ -5049 -24265 -10994 18807 25610 488 -14956 -1124 9708 -195 -7748 2569 13657 7741
1144G741k1456j0545K1398K9171q943l6543j1724K5436K2548m398k1531j2193
$$ 7741 -13715 -24260 -2862 26309 17366 -19177 -30901 -5465 17083 12685 -8846 -21039
1156b1039J2467J6626o820j5486Q407J5079p929j9550Q7K0892J5795r806k9391
$$ -21039 -8572 8054 1234 -14252 -5845 9234 1305 -18245 -18158 2734 18529 8723 -20668
1169b0668p783K9359K4704j4861k7081j022J8905J1071n186j2166M02J3774m48
$$ -20668 -28451 908 25612 10751 -16330 -17352 1553 12624 7438 -4728 -4326 9448 9000
1182I000j7542l33K3351J0041j9278k0875L621K5006J7940j5636k9923j34K7635
$$ 9000 -8542 -8875 14476 24517 5239 -15636 -12015 12991 30931 15295 -14628 -14762 12873
1195A2873J0592j5454j1879M779Q258j281r177j689J5356R494k0249k2029J2174
$$ 12873 23465 8011 -3868 911 9169 7888 -1289 -2978 12378 21872 1623 -20406 -8232
1208h232K8469M705k2080k1065L668K4583J2679j8073j8804R227J4208n410j0416
$$ -8232 20237 24942 2862 -18203 -14535 10048 22727 4654 -14150 -4923 9285 3875 -6541
1221f541M210J1214J572j4159j4364J0779K7321K840k9850j6199J7455K2785K104
$$ -6541 -2331 8883 10455 -3704 -18068 -7289 20032 22872 -6978 -23177 -5722 17063 19167
1234A9167j6792j4624O380J8187M60j4898Q61J4953j230j6165m320J4521J6293
$$ 19167 2375 -12249 -5869 12318 12778 -2120 -1259 13694 12464 -3701 -8021 6500 22793
1247B2793k008k3453j4820K0009K7066n955k5952p213J3615J3090j074j1932m519
$$ 22793 20785 -2668 -17488 2521 29587 23632 -2320 -9533 4082 17172 16098 4166 -353
1260c53R689M582j3599o438J6629J3134j2800k0671k918J8590J8669o551k7850
$$ -353 9336 13918 319 -6119 10510 23644 10844 -9827 -12745 5845 24514 17963 -9887
1273i887q745K1763J5687j0375j4018J222P346J679o955m781R591J2512j1263
$$ -9887 -18632 3131 18818 8443 -5575 -4353 2993 4672 -2283 -7064 2527 15039 3776
1286C776k2269L825K4906R842j5462k0029j781K0138J6146j0664k0582K651J6424
$$ 3776 -18493 -14668 10238 20080 4618 -15411 -17192 2946 19092 8428 -12154 -9503 6921
1299F921O41j0062J13R151M407p989j3748K926K2731R803k1714k0675R837K2878
$$ 6921 7562 -2500 -2387 6764 11171 3182 -10566 -7640 15091 24894 3180 -17495 -7658 15220
1313A5220N994j3051j6068Q44J6405O196j3211n362J1178L741j2376p800Q748
$$ 15220 21214 8163 -7905 -7061 9344 15540 2329 -3033 8145 11886 -490 -8290 458
1326D58J4623J754j7902j8144J0444K6016K035k3282j2686Q951J3011J811r329
$$ 458 15081 16835 -1067 -19211 -8767 17249 19284 -3998 -16684 -7733 5278 7089 -2240
1339b240q021N736P967q743j0509J0194J4287o022j8378o695J2490J8505K83k2637
$$ -2240 -10261 -4525 3442 -5301 -15810 -5616 8671 2649 -15729 -22424 -9934 8571 8854 -13783
1353a3783j3949J6231J8883n444j4615k220P536N144l282p447M441J3049l381
$$ -13783 -27732 -11501 7382 1938 -12677 -14897 -7361 -2217 -5499 -12946 -8505 4544 1163
1366A163j8796k834K0666J3033j0269j7796n474J5618J8255m657k0183l224J5300
$$ 1163 -17633 -20467 199 13232 2963 -14833 -20307 -4689 13566 8909 -11274 -14498 802
1379H02N375q155l025N743N555l662j1401k595J7199J3495j4763k1019L507J9740
$$ 802 6177 -1978 -5003 740 6295 2633 -8768 -11363 5836 19331 4568 -16451 -12944 6796
1393F796R085q912j5213m170J3716R660r906r153P905P298q179r187L440J1821
$$ 6796 15881 6969 -8244 -12414 1302 10962 1056 -8097 -192 7106 -1073 -10260 -6820 5001
1407E001O360j0857j7824J782K2012P784j7164j3713N833J2144L948p860q912
$$ 5001 11361 504 -17320 -15538 6474 14258 -2906 -16619 -10786 1358 5306 -2554 -11466
1420a1466L783J0853m104j2881L678J4548J98j3307q349O609J5297N772j6228
$$ -11466 -7683 3170 -934 -13815 -10137 4411 4609 -8698 -17047 -10438 4859 10631 -5597
1433e597j6138J0135J8908n63j4155m453N953O211r69o781N8J1539K196j6235
$$ -5597 -21735 -11600 7308 6745 -7410 -11863 -5910 301 -668 -7449 -7391 4148 6344 -9891
1447i891q072J4643J5977l701j6557r480Q046J8043L513j6873q508J0753O880
$$ -9891 -17963 -3320 12657 8956 -7601 -17081 -9035 9008 12521 -4352 -12860 -2107 4773
1460D773o405l533M688N885j389j1047p353J2771J7868n859k1208m868J4482J2505
$$ 4773 -1632 -5165 -477 5408 4019 -7028 -14381 -1610 16258 10399 -10809 -15677 -1195 11310
1474A1310k760j1948p501Q210J1001n548j0068N334R355m310j0092Q2R122R103
$$ 11310 8550 -3398 -10899 -2689 8312 2764 -7304 -1970 7385 3075 -7017 -6935 2187 11290
1488A1290n218j6535l725J8401J3245j2529j6076Q02J2280Q118l338j1273k280
$$ 11290 6072 -10463 -14188 4213 17458 4929 -11147 -10345 1935 10053 6715 -4558 -6838
1501f838R230K061r192J126J1691J151j2587r424N306J6328Q940j3265k1207J499
$$ -6838 2392 4453 -4739 -3613 8078 9229 -3358 -12782 -7476 8852 17792 4527 -16680 -15181
1515a5181K1032Q447r912r635l60M452L179k605j475P183L694j3152j1429J1129
$$ -15181 5851 14298 4386 -5249 -5609 -1157 2022 -583 -2058 5125 8819 -4333 -15762 -4633
1529d633J7060Q23j4624j2888L494J7198Q164j3342j2687O439J0243k097o070
$$ -4633 12427 13250 -1374 -14262 -10768 6430 14594 1252 -11435 -4996 5247 3150 -2920
1542b920N9M120K618m423p408M147J3370j130j6528n132J2721J2144l170j3587
$$ -2920 -2861 1259 3877 -546 -7954 -3807 9563 8433 -8095 -13227 -506 11638 8468 -5119
1556e119r214Q478J6320r5j4644m806P586L294k777m42L142K362k351j0590l481
$$ -5119 -14333 -5855 10465 10370 -4274 -9080 -1494 1800 -977 -1419 1723 4085 1734 -8856 -12337
1571a2337J5474J3113r903j8507k310J2562J1430m87j1608p723P139P345n032
$$ -12337 3137 16250 6347 -12160 -14470 -1908 9522 9035 -2573 -10296 -3157 4188 -844
1584h44l477P010L894p220q164O06R529J0130n206j5948k788J4806P332q230p531
$$ -844 -4321 2689 6583 -637 -8801 -8195 1334 11464 6258 -9690 -12478 2328 9660 1430 -6101
1599f101K061O449K828o216o959N192J0658l272j1574K12R658K696n722n987J107
$$ -6101 -4040 2409 5237 -979 -7938 -2746 7912 4640 -6934 -6722 2936 5632 -90 -6077 -4970
1614d970Q823M661j0255j0548P337J3300j617r759m054K985O797J170p295k357
$$ -4970 3853 8514 -1741 -12289 -4952 8348 6731 -3028 -7082 -4097 2700 3870 -3425 -5782
1628e782R033K898j0822o534Q822R865l26q917q611K857J2338K979r791m011O725
$$ -5782 3251 6149 -4673 -11207 -2385 7480 7154 -1763 -10374 -7517 4821 7800 -1991 -6002 723
1643G23K344o059k408L863P685K247r898j0973O249J6015J543j1782n921L581
$$ 723 3067 -2992 -5400 -1537 6148 8395 -1503 -12476 -6227 9788 11331 -451 -6372 -2791
1657b791N726K024l613k214N323L271q667p254R216J1277k453j0610n822M157
$$ -2791 2935 4959 1346 -868 4455 7726 -941 -8195 1021 12298 9845 -765 -6587 -2430
1671b430J0875L569j0991p269Q337P590n227o430J439N102K101l344o746K542
$$ -2430 8445 12014 1023 -6246 2091 9681 4454 -1976 -537 4565 6666 3322 -3424 -882
1685h82Q976j339j1582j096J0819N251o955r419l014R863J1578m899j4277l155
$$ -882 8094 6755 -4827 -5923 4896 10147 3192 -6227 -9241 622 12200 7301 -6976 -10131
1699a0131R366M870k905j624J54l50j973m835J204J1791O544j2849j4514L658
$$ -10131 -765 4105 1200 -424 -270 -620 -2593 -7428 -6224 5567 12111 -738 -15252 -11594
1713a1594J4482P795m558j2117n926Q488Q980l715m100L431J125n257k748M350
$$ -11594 2888 10683 6125 -5992 -11918 -3430 5550 1835 -2265 1166 2291 -2966 -5714 -1364
1727a364P140L157o907j1578K769J4764M599j1461p663L631Q241L196n084p586
$$ -1364 5776 8933 2026 -9552 -6783 7981 12580 1119 -6544 -2913 5328 8524 3440 -4146
1741d146K092Q922p22o983Q91N121j323n192j054M401P062m54j2232q169J0202
$$ -4146 -2054 6868 6146 -837 54 5175 3852 -1340 -2394 2007 9069 8615 -3617 -11786 -1584
1756a584J3801k186j2623o569L720P983L964n184m978K456J045n789j59Q934M409
$$ -1584 12217 10031 -2592 -9161 -5441 2542 6506 1322 -3656 -1200 -155 -5944 -6103 2831 7240
1771G240o708r829l075Q309J2351r72j3841o365Q417P027k132l622j031K051K136
$$ 7240 532 -9297 -12372 -4063 8288 7316 -6525 -12890 -4473 2554 422 -3200 -4231 -2180 -44
1786d4l293l620M633Q090l951r740L78Q377M381l705o348k194P550P544o465q774
$$ -44 -3337 -6957 -2324 5766 1815 -7925 -7547 830 5211 1506 -4842 -7036 514 8058 1593 -7181
1802g181L212P904R02m316l137P65M230J030n300j575Q136K878q870o271N167
$$ -7181 -3969 3935 4837 521 -2616 -1851 2379 3409 -1891 -3466 4670 7548 -1322 -7593 -2426
1817b426P670K521n569q970j3R887L240p106l311M272J385l090k970J391M963
$$ -2426 5244 7765 2196 -6774 -6787 3100 6340 -766 -4077 195 1580 -1510 -4480 -3089 1874
1832A874L559o703r119L431J0724J585p781m068J866L783K259m145l038N233M699
$$ 1874 5433 -1270 -10389 -6958 3766 5351 -2430 -6498 -4632 -849 1410 -2735 -5773 -540 4159
1847D159o300o931M664P783N41m783n292O2P931L896o887m656N453M724l501l459
$$ 4159 -2141 -9072 -4408 3375 3916 -867 -6159 -6097 1834 5730 -1157 -5813 -360 4364 863 -2596
1863b596N02M113L141k369o748P84R128Q90p626l334N469M531n02n127m206M020
$$ -2596 -2094 2019 5160 2791 -3957 -3173 5955 6845 -781 -4115 1354 5885 5383 256 -3950 70
1879G0P680j801p794o36O041O78l318j157J297L036N77o583l976P636P886m659
$$ 70 7750 5949 -1845 -2481 3560 4238 920 -237 1060 4096 4673 -1910 -5886 1750 9636 4977
1895D977r027j288N271N024O86o055l820M266L375l610k144N115K021l858m217
$$ 4977 -4050 -5338 -67 4957 5643 -412 -4232 34 3409 -201 -2345 2770 4791 933 -3284
1910c284k33N531O087k403j0065j506Q972M951m286l941n4K545K993j499l667
$$ -3284 -3517 2014 8101 5698 -4367 -5873 3099 8050 3764 -177 -231 2314 5307 3808 141
1925A41K194N076k923o072K705O154P90l952m321j8O572M793o038p552K915O835
$$ 141 2335 7411 4488 -1584 1121 7275 8065 4113 -208 -226 6346 11139 5101 -2451 464 7299
1941G299J29l284k523M83K173O88l350j208N310J036p150l610N390N386l32n418
$$ 7299 7428 4144 1621 2104 4277 4965 1615 407 5717 6753 -397 -4007 1383 6769 6437 1019
1957A019n744J152P925K329p021l696L590J506j428p92N26J884P77m417m152M734
$$ 1019 -4725 -3573 4352 6681 -340 -4036 -446 1060 -368 -1160 -634 1250 2027 -2390 -6542 -1808
1973a808P634k204p883k177M715M705O34m570m338L626N172k571l685K707L019
$$ -1808 5826 3622 -4261 -6438 -1723 2982 3616 -954 -5292 -1666 3506 935 -2750 -43 2976
1988B976j602k729o72K815M687n70p006k578P389M777l826m828l77L361L375l23
$$ 2976 1374 -1355 -2027 788 5475 4905 -2101 -4679 2710 7487 3661 -1167 -1544 1817 5192 4869
2004D869m881m74N337j95n230j55N072J446l658l544q07M827N144l900q000J091
$$ 4869 -12 -486 4851 4656 -574 -729 4343 5789 2131 -1413 -2220 2607 7751 3851 -4149 -3058
2020c058O485J227l615k478j22K629R67k819k795M412L225m823n034K858M979
$$ -3058 3427 4654 1039 -1439 -1561 1068 2035 -784 -3579 833 4058 -765 -5799 -2941 2038
2035B038J248l433n122n79O670L275n667l936L404K773j075j683n35J549K236
$$ 2038 3286 -147 -5269 -5848 822 4097 -1570 -5506 -2102 671 -404 -2087 -2622 -1073 1163
2050A163j630n016J729P070L51o428k714L248M343J526l475m917K324N776q29
$$ 1163 -467 -5483 -3754 3316 3667 -2761 -5475 -2227 2116 3642 167 -4750 -2426 3350 2521
2065B521n045J308L392j20k488j306P38M077J683n507m371N067N407j774m637
$$ 2521 -2524 -1216 2176 2056 -432 -1738 -1000 3077 4760 -747 -5118 -51 5356 3582 -1055
2080a055j730K161L571P42m448k098M101K072m239k018L653K182j546k882k175
$$ -1055 -2785 -624 2947 3689 -759 -2857 1244 3316 -923 -2941 712 2894 1348 -1534 -3709
2095c709K644N536j305o610j413N187L059k380k626o58J458K546j341l995K783
$$ -3709 -1065 4471 3166 -3444 -4857 330 3389 1009 -1617 -2275 -817 1729 388 -3607 -824
2110h24M034k075n004Q57L919J920j432l929k343M808M397l063m588J064L133
$$ -824 3210 1135 -3869 -3012 907 2827 1395 -2534 -4877 -69 4328 1265 -3323 -2259 874
2125H74jj495o56M12K285J02m383r77N728K428m804l377J456L362J995j502m824
$$ 874 873 -622 -1278 -866 1419 1521 -2862 -3839 1889 4317 -487 -3864 -2408 954 2949 1447 -3377
2142c377k67N242J377m306j149L178J43j494j607N06K411K476l221n034K290N838
$$ -3377 -3644 1598 2975 -1331 -2480 698 841 -653 -2260 -1754 657 3133 -88 -5122 -2832 3006
2158C006j60l681j992N81L059J573k282l205K601L177k713k615K496K246p26j958
$$ 3006 2846 -835 -2827 -2246 813 2386 104 -3101 -500 2677 -36 -2651 -155 2091 1365 -593
2174e93k444J322M684J322n742k802L830L432j280k198j216L99K796l09k770k21
$$ -593 -3037 -1715 2969 4291 -1451 -4253 -423 3009 1729 -469 -1685 -1286 1510 1201 -1569 -1790
2190a790L585j63m350k11L266J464o69l109k579L031M908j865n460L6L366P01
$$ -1790 1795 1632 -2718 -2929 337 1801 1132 -1977 -4556 -1525 3383 1518 -3942 -3906 -540 161
2206A61j021q32q83J322Q73k419k105L878L169l643l932J110K827J895q96l726
$$ 161 -860 -1692 -2575 -1253 -380 -2799 -4904 -1026 2143 -1500 -5432 -4322 -1495 400 -496 -4222
2222d222j392L729K637l377j962K336J457j182j178j030J205L416r61m651K49
$$ -4222 -5614 -1885 752 -2625 -4587 -2251 -794 -1976 -3154 -4184 -2979 437 -524 -5175 -4926
2237d926M677P76l388j057N49K190J483k186l493K266M204j259l701J99K295O10
$$ -4926 -249 527 -2861 -3918 -3369 -1179 304 -1882 -5375 -3109 1095 -164 -3865 -3666 -1371 -761
2253g61p13j349n81K665J653l188l092K926L487j100k250j143M88K579J210k932
$$ -761 -1474 -2823 -3404 -739 914 -2274 -5366 -2440 1047 -53 -2303 -3446 -2958 -379 831 -2101
2269b101j497L371J571l783j267K228K030K69j775l043N65M619P19l494j132K327
$$ -2101 -3598 -227 1344 -2439 -3706 -1478 552 821 -954 -3997 -3432 1187 1906 -1588 -2720 -393
2285c93K61j160K63L38J455J410l004l442K142M991n58l100j486Q81J458J371
$$ -393 -132 -1292 -1029 -691 764 2174 -830 -4272 -2130 2861 2303 -797 -2283 -1402 56 1427
2301A427j395j913J891J816k213k425K540K193n91k402r42J18L309Q54m253j345
$$ 1427 32 -1881 10 1826 -387 -2812 -272 1921 1330 -1072 -2014 -1896 1413 2267 -1986 -3331
2317c331L512J993k012k430j45J488K135j09l256o18K954K40k158M43K462q0k131
$$ -3331 181 2174 162 -2268 -2413 -925 1210 1101 -2155 -2773 181 421 -1737 -1294 1168 1088 -1043
2334a043j818M99L481L368k615n675L69M437J619j98j897j421K14J837l53j90
$$ -1043 -2861 -2362 1119 4487 1872 -3803 -3434 1003 2622 2424 527 -894 -680 1157 804 614
2350F14K568J002l944k562K789L049J373j744l719r16M283K616l004k117J397
$$ 614 3182 4184 240 -2322 467 3516 4889 3145 -574 -1490 2793 5409 2405 288 1685
2365A685J461q36n73l33L47J691n13l012O10K832n73l059m88K416J542m92k724
$$ 1685 3146 2310 1737 1404 1751 3442 2929 -83 527 3359 2786 -273 -761 1655 3197 2705 -19
2382a9l213J881M824N5m348j152O45Q50Q17Q12j164j99m19k264p64M595K788l341
$$ -19 -3232 -1351 3473 3528 -820 -1972 -1327 -477 340 1152 -12 -211 -630 -2894 -3658 937 3725 384
2400C84l669r31K711L361J280l520l425K549J933j106Q0J566j62q68n25p91R15
$$ 384 -3285 -4216 -1505 1856 3136 -384 -3809 -1260 673 -433 -353 1213 1051 183 -342 -1133 -218
2417b18L572p74l742l2L021P05j748j73l18J567J899j897l380R66L733q0j227
$$ -218 3354 2580 -1162 -1194 1827 2532 784 611 293 1860 3759 1862 -1518 -552 3181 3101 1874
2434A874j048k92k85J105k30j26J588k70l329k193L302L364m10k804k431j158
$$ 1874 826 534 249 1354 1124 998 2586 2316 -1013 -3206 96 3460 3050 246 -2185 -3343
2450c343L288K496j955j968Q44M8j615J27J932J34L40j567k668J075L418p2k943
$$ -3343 -55 2441 486 -1482 -638 -590 -2205 -2078 -146 -12 328 -1239 -3907 -2832 586 514 -2429
2467b429p3J585j3q20rr17J601K376j668l183N23K927L41k72l44j312j02J042
$$ -2429 -2502 -917 -930 -1750 -1759 -2676 -1075 1301 -367 -3550 -3027 -100 241 -31 -375 -1687 -1789 -747
2485g47n74J53K251J054l564k271J711K950J082o72k878j739K053K490j113j149
$$ -747 -1321 -1168 1083 2137 -1427 -3698 -1987 963 2045 1373 -1505 -3244 -1191 1299 186 -963
2501i63J184m44j782O07O45Q71O54p00l154L70L238J42k404m66J352O12j08j321
$$ -963 221 -223 -2005 -1398 -753 118 772 72 -3082 -2712 526 668 -1736 -2202 -850 -238 -346 -1667
2519a667j325J301K803k46l162NQ85J30Q69P75p62O3J15j887l26L937J912k999
$$ -1667 -2992 -1691 1112 866 -2296 -2291 -1406 -1276 -407 368 -394 -331 -216 -2103 -2429 1508 3420 421
2537D21k785j14J869K782J633k744k585J338J209m81R33J396j219j793l61O03
$$ 421 -2364 -2478 -609 2173 3806 1062 -1523 -185 1024 543 1476 2872 1653 -140 -501 102
2553A02J560K059j173l429l26L137M61j003p42o06M97J595r68k162O43K329j068
$$ 102 1662 3721 2548 -881 -1207 1930 2391 1388 646 40 537 2132 1164 -998 -355 1974 906
2570I06j239M22Pp32K35r5J11J534j19l058j740L013K781n93j879j857m41K479
$$ 906 -333 89 96 -636 -401 -496 -385 1149 1030 -2028 -3768 -755 2026 1433 -446 -2303 -2744 -265
2588b65K380j011j918O03m24j370J381K521k2r59j488j662J896L840m1l138j029
$$ -265 2115 1104 -814 -211 -635 -2005 -624 1897 1875 916 -572 -2234 -338 3502 3461 323 -706
2605g06J550Q67O08k4q49o19J997o45j952J322J682r81j378J006pM78K38j522
$$ -706 844 1711 2319 2295 1446 827 2824 2179 227 1549 3231 2250 872 1878 1871 2349 2587 1065
2623A065o28J926J368k396k051J151J436P09k50j765j803J186J627j246m28J562
$$ 1065 437 2363 3731 1335 -716 435 1871 2580 2330 565 -1238 -52 1575 329 -99 1463
2639A463p16k215m5J137J004J094j366l110j39L572M04j852l75P6L0M54L02o59
$$ 1463 747 -1468 -1513 -376 628 1722 356 -2754 -2893 679 1083 -769 -1144 -1068 -1038 -584 -282 -941
2657i41N77J133j520j392J341J381J80r64l1j94L45J297j359q95J942J486j749
$$ -941 -364 769 -751 -2143 -802 579 759 -205 -236 -430 -85 1212 -147 -1042 900 2386 637
2674F37j428P55L01J325M16j217j287J543M43j436K94J423j66p56o98j55N07J696
$$ 637 -791 -36 265 1590 2006 789 -498 1045 1488 52 346 1769 1603 847 149 -6 501 2197
2692B197k66k856o15K344M11p65K41k47o84P13K44j651J130J648j163k098J067
$$ 2197 1931 -925 -1540 804 1215 450 691 444 -240 473 717 -934 196 1844 681 -1417 -350
2709c50J191m31J55m63n52M84J691j677j331J633J218j015k75m23l68J221J097
$$ -350 841 410 565 102 -450 34 1725 48 -1283 350 1568 553 278 -145 -513 708 1805
2726A805j071j100J159N11j667N12J468n13o21J84j092k54K887l50k192l24Q21
$$ 1805 734 -366 793 1304 -363 149 1617 1104 483 667 -425 -679 2208 1858 -334 -658 163
2743A63L26k04K84p24k39R69q33j020R29J426j435r88O42O8J57N34j037j094J480
$$ 163 489 285 569 -155 -394 575 -258 -1278 -349 1077 -358 -1346 -704 -636 -479 55 -982 -2076 -596
2762e96J241j417j130J263N83j002N30m05l17J188Q11j610j90J709L80j588J77
$$ -596 645 -772 -1902 -639 -56 -1058 -528 -933 -1250 -62 749 -861 -1051 658 1038 -550 -373
2779c73Q10J13J188n43j564J16K397L7j186K30L93k64M00K90n01J33J189q04j185
$$ -373 437 550 1738 1195 -369 -253 2144 2181 995 1225 1618 1354 1754 2044 1543 1676 2865 2061 876
2798H76O12J494o15n47l50k77J62J203q05j352Q90Q50j330l41M74J2n61L19n62
$$ 876 1488 2982 2367 1820 1470 1193 1355 2558 1753 401 1291 2141 811 470 944 956 395 714 152
2817A52p60J350M89k154k09J686m85q24J23l18l00J157O6j587k78J887j75j776
$$ 152 -608 742 1231 -923 -1132 554 69 -755 -632 -950 -1250 -93 -27 -1614 -1892 -5 -180 -1956
2835a956R25L70l56L97J72j121R16J477p44j534R79R03o62P91k95p73O15J073
$$ -1956 -1031 -661 -1017 -620 -448 -1569 -653 824 80 -1454 -475 428 -234 557 262 -511 104 1177
2853A177q13o97R13M39o53l63O73K4L93j5q47m55J384K75j435l72Q64l0k00M68
$$ 1177 364 -333 580 1019 366 3 676 700 1093 1078 231 -224 1160 1435 0 -372 492 462 262 730
2873G30j019l64J177m14j257J36J057m48o77M59m57n33J440p94j283N34J434j025
$$ 730 -289 -653 524 110 -1147 -1011 46 -402 -1079 -620 -1077 -1610 -170 -964 -2247 -1713 -279 -1304
2891a304n70O53J38k60J97j23j060J062J120j270p66J499L58j015M78l3k58P47
$$ -1304 -1874 -1221 -1083 -1343 -1146 -1269 -2329 -1267 -147 -1417 -2183 -684 -326 -1341 -863 -896 -1154 -407
2909d07P32j362o60J620N00j178o6N96j39J66M45r73j44J231J17j569N63M06k70
$$ -407 325 -1037 -1697 -77 423 -755 -821 -225 -364 -198 247 -726 -870 361 478 -1091 -528 -122 -392
2928c92o5K32q98K29Q68m19j194P15O21n65r34Q75m05k40R45j141o83J188Q96
$$ -392 -457 -225 -1123 -894 -26 -445 -1639 -924 -303 -868 -1802 -927 -1332 -1572 -627 -1768 -2451 -1263 -367
2947c67j392n51J028O4p14Q43o40k97J094P27j895J37J325O2m92L57j31o8J111
$$ -367 -1759 -2310 -1282 -1218 -1932 -1089 -1729 -2026 -932 -205 -2100 -1963 -638 -576 -1068 -711 -842 -910 201
2966B01J32j157k79J401K22o11L57L77n62M28k0m26K38J439q98q71P10R18o00
$$ 201 333 -824 -1103 298 520 -91 266 643 81 509 489 63 301 1740 842 -29 681 1599 999
2985I99J84n95m92K28J008m23j270J027L83q74m55N65r2j09N99j174m86J031K91
$$ 999 1183 588 96 324 1332 909 -361 666 1049 175 -280 285 193 84 683 -491 -977 54 345
3004C45j124p9Q12o58LK43n00p09J257L86j210j47R15l25n61J104l36j77M74j73
$$ 345 -779 -858 -46 -704 -701 -458 -958 -1667 -410 -24 -1234 -1381 -466 -791 -1352 -248 -584 -761 -287 -460
3024d60m35P64R47q37r33P93M88l66P89J01j042L45J169m20p16J360r3r20K73
$$ -460 -895 -131 816 -21 -954 -161 327 -39 750 851 -191 154 1323 903 187 1547 1454 534 807
3043H07L32m39N10N17j129k58J449l11q50Q5O53l92l5L76q17m41R14J85r43K94
$$ 807 1139 700 1210 1727 598 340 1789 1478 628 713 1366 974 939 1315 498 57 971 1156 213 507
3063E07K81r40K02N46k42k42L50q02j111J319J207j220j03o4m49J28J157l86n28
$$ 507 788 -152 50 596 354 112 462 -340 -1451 -132 1075 -145 -248 -312 -761 -633 524 138 -390
3082c90J43K15p19K08J205J43p91K60l45k53J309J30p76n68J373l05m90L64k06
$$ -390 -247 -32 -751 -543 662 805 14 274 -71 -324 985 1115 339 -229 1144 839 349 713 507
3101E07k4N74L66r13j44J025m30o63J048Qq96n21Q27m51N64P60j262j075M75Q01
$$ 507 483 1057 1423 510 366 1391 961 298 1346 1354 458 -63 764 313 877 1637 375 -700 -225 576
3121E76j21Q0j93j001n79J141l16j47J015l27j572j21J090l0L41Nj001o09J047
$$ 576 455 535 342 -659 -1238 -97 -413 -560 455 128 -1444 -1565 -475 -505 -164 -159 -1160 -1769 -722
3140g22N24r72K44L26m31j87O44l5n25Q84L40j318M17O37r43Q7J163N6n74R3k46
$$ -722 -198 -1170 -926 -600 -1031 -1218 -574 -609 -1134 -250 90 -1228 -811 -174 -1117 -1030 133 189 -385 -292 -538
3161e38m26M30K017r98j140l5K18K61J149L00j743k09Q43p13K87J424k98j276
$$ -538 -964 -534 1483 485 -655 -690 -472 -211 938 1238 -505 -714 129 -584 -297 1127 829 -447
3179d47q21J041J30O26M03j673o12P63L64m23M59M64j226O3N23n63M3R61j66o85
$$ -447 -1268 -227 -97 529 932 -741 -1353 -590 -226 -649 -190 274 -952 -889 -366 -929 -886 75 -91 -776
3199g76N02L42r20l03J137k11L4N16o90j176J063J540n38l61r7r40K94J237L96
$$ -776 -274 68 -852 -1155 -18 -229 -195 321 -369 -1545 -482 1058 520 159 62 -878 -584 653 1049
3218A049q25J4k31q31N91J588J92j408J67k97o10J061J149j057o60K59o1j73P72
$$ 1049 224 238 7 -824 -233 1355 1547 139 306 9 -601 460 1609 552 -108 151 90 -83 689
3237F89K09q08j97L42q06%R79n39o10Q31m1n92rK6m21M31J411j328j004J66J275
$$ 689 898 90 -107 235 -571 -571 408 -131 -741 90 49 -543 -552 -526 -947 -516 895 -433 -1437 -1271 4
3258Dm66N95J60j481k01Q06O38p5O88m24j534J1J282O89L5Rj472n19J243J004
$$ 4 -462 133 293 -1188 -1389 -583 55 -20 668 244 -1290 -1279 3 692 727 736 -736 -1255 -12 992
3278I92k15n90L20j023P4J185L99o91J56j5j101N41J444j042n16O47m50L1N00
$$ 992 777 187 507 -516 -442 743 1142 451 607 592 -509 32 1476 434 -82 565 115 146 646
3297F46j06j080Q05O94j68j049o0L02m35J222M65j227o21N38m91N88J378l68j435
$$ 646 540 -540 265 959 791 -258 -318 -16 -451 771 1236 9 -612 -74 -565 23 1401 1033 -402
3316d02n87L21O62R21N51r59j143K11J094n2N93j7j213J8M04K89K9P40o10q69
$$ -402 -989 -668 -6 915 1466 507 -636 -425 669 617 1210 1193 -20 -2 402 691 720 1460 850 -19
3336a9L4J088K1l86J77m14l52O93J93q99Q39L17j002q8M82o32l10M70L44o72L44
$$ -19 15 1103 1124 738 915 501 149 842 1035 136 975 1292 290 202 684 52 -258 212 556 -116 228
3357B28j46j204K41J301O95j083n60o69k59J237P04n07j117L15n20K20J083N34
$$ 228 82 -1122 -881 420 1115 32 -528 -1197 -1456 -219 485 -22 -1139 -824 -1344 -1124 -41 493
3375D93j013m69j15m63R57J042j83j343J55O81j81M48R44j033j10J024l09n08
$$ 493 -520 -989 -1104 -1567 -610 432 249 -1094 -939 -258 -439 9 953 -80 -190 834 525 17
3393A7N63M05o09M60K36l55l87O54k22kM91j34p57k62Q48N24k67rr45n29Q46P77
$$ 17 580 985 376 836 1072 717 330 984 762 760 1251 1117 360 98 946 1470 1203 1194 249 -280 566 1343
3415A343o50j27k03o99m57R10P56m77l52m71o43L04R21j98q30K74l93k38L77O91
$$ 1343 693 566 363 -336 -793 117 873 396 44 -427 -1070 -766 155 -43 -873 -599 -992 -1230 -853 -162
3435a62r30J5M49o09k50O62K39m95R1Q02q01j1L99j70o2Q16J47r14J60M79J3M79
$$ -162 -1092 -1077 -628 -1237 -1487 -825 -586 -1081 -990 -188 -989 -1000 -601 -771 -833 -17 130 -784 -624 -145 -132 347
3457C47L71p09o96N60O24l54P98qr73Q7O6M20r8Q97l74j550L82O84J12K34l5n21
$$ 347 718 9 -687 -127 497 143 941 933 -40 47 113 533 435 1332 958 -592 -210 474 586 820 785 264
3479B64m97P36K46q28K16N32o75n16P46j83n96N67l69l20N9R44j116o5R86k27
$$ 264 -233 503 749 -79 137 669 -6 -522 224 41 -555 12 -357 -677 -618 326 -790 -855 131 -96
3499i6k94J51l02o26N31J020q12m65O51k48k70O12L52o03L36q9m49N35Q82j90
$$ -96 -390 -239 -541 -1167 -636 384 -428 -893 -242 -490 -760 -148 204 -399 -63 -152 -601 -66 816 626
3519F26q16K24R8k98O96J85k88m36K36j07l09P31J45q58j36L06l3J40J29l47p05
$$ 626 -190 34 132 -166 530 715 427 -9 227 120 -189 542 687 -171 -307 -1 -34 106 235 -112 -817
3540h17N72M70p31J17K18m06R3K61j16n23L81j27m74P5M28l90l47O18l35q3M93
$$ -817 -245 225 -506 -389 -171 -577 -484 -223 -339 -862 -481 -608 -1082 -1007 -579 -969 -1316 -698 -1033 -1116 -623
3561f23J86j021L67N46k42l3K84k02k68L63M66m15j72P95j60m63N81L99m77L58
$$ -623 -437 -1458 -1091 -545 -787 -820 -536 -738 -1006 -643 -177 -592 -764 31 -129 -592 -11 388 -89 269
3581B69j25l39K84P36m79n82Q63K2j96l10O21r1j83M01k48k21J67J98n33J88L84
$$ 269 144 -195 89 825 346 -236 627 649 453 143 764 673 490 891 643 422 589 787 254 442 826
3602H26k83m07L13j99j65L59Q6p19Q0L86k65n44O99l83m14N39l01m55M92L42l34
$$ 826 543 136 449 250 85 444 530 -189 -109 277 12 -532 167 -216 -630 -91 -392 -847 -355 -13 -347
3623c47m05K94J47j91O9L90o72L46M30o27j38P83J9o72K61L43l84K95M44n20j72
$$ -347 -752 -458 -311 -502 -433 -43 -715 -369 61 -566 -704 79 98 -574 -313 30 -354 -59 385 -135 -307
3644c07O53n3n23M65K02n11O11k70j19r1L66j5l29L18L20n75jK52m20K1M19j17
$$ -307 346 293 -230 235 437 -74 537 267 148 57 423 408 79 397 717 142 141 393 -27 -6 413 296
3666B96m29K42K81n93l6L65r7J25o8p6m09J26O42n46lJ87j23j64L76j35k38M91
$$ 296 -133 109 390 -203 -239 126 29 154 86 10 -399 -273 369 -177 -180 7 -116 -280 96 -39 -277 214
3688B14p3m72L55K98pl85j3M99l05K70j48n3o0P09k02l43L15Q3l70L09J52p3q2
$$ 214 141 -331 24 322 315 -70 -83 416 111 381 233 180 120 829 627 284 599 682 312 621 773 700 618
3711F18O54m24o45N81L78o39L6J26j75N46q1q3n29M62J1m96k7L75l53J40k74P3
$$ 618 1272 848 203 784 1162 523 559 685 510 1056 975 892 363 825 836 340 313 688 335 475 201 274
3733B74o19J054m30m07O2L50J99m45M03m90l60L12J0o74O89M55o77j90K73o6k21
$$ 274 -345 709 279 -128 -66 284 483 38 441 -49 -409 -97 -87 -761 -72 383 -294 -484 -211 -277 -498
3754d98M64M5n46K33Q52r50p6M06J23k30J22J84j031P16N22m36j67N37J54o01
$$ -498 -34 11 -535 -302 550 -400 -476 -70 53 -177 -55 129 -902 -186 336 -100 -267 270 424 -177
3774a77J72K79q9l3K14q07K70O47L5o53M8K38j18K75o1k42j45O31j1n46M26L62
$$ -177 -5 274 185 152 366 -441 -171 476 511 -142 -94 144 26 301 240 -2 -147 484 473 -73 353 715
3796G15k95r42R37k68J40L95n02m93M75L55k57K15l3j31l14L94o7m35K63M69r21
$$ 715 420 -522 415 147 287 682 180 -313 162 517 260 475 442 311 -3 391 324 -111 152 621 -300
3817c00QP45k56k12J27q8j59M80P1o53k24M40l86j81M27J7k42m1N8l62J27Q17
$$ -300 -292 453 197 -15 112 24 -135 345 416 -237 -461 -21 -407 -588 -161 -144 -386 -427 -369 -731 -604 213
3839B13k81q20M42j67rK34J72p47J46M82k63l65L10M88l76r3M98k62m75Q14l30
$$ 213 -68 -888 -446 -613 -622 -388 -216 -963 -817 -335 -598 -963 -653 -165 -541 -634 -136 -398 -873 -59 -389
3860c89k14L19M29m19L0L31J57k84K27j94o1R58n20l71L25R1j42N9K11n24L85
$$ -389 -603 -284 145 -274 -244 87 244 -40 187 -7 -68 890 370 -1 324 415 273 332 543 19 404
3881D04K80j4o85J42O13j74l30J45pm23o6R41n52R5M5o48k70J98N60k62J08l81
$$ 404 684 670 -15 127 740 566 236 381 374 -49 -115 826 274 369 414 -234 -504 -306 254 -8 100 -281
3903b81o07L29P44m68k11J83N3l89K83J14n3k85M5m41K40O43k09m06l0P71n2l97
$$ -281 -888 -559 185 -283 -494 -311 -258 -647 -364 -250 -303 -588 -543 -984 -744 -101 -310 -716 -746 25 -27 -424
3925d24M96l40m74P24J77o66M41L18j37l56N93J67j80m3L0n63R63L45n08n43L74
$$ -424 72 -268 -742 -18 159 -507 -66 252 115 -241 352 519 339 296 326 -237 726 1071 563 20 394
3946C94L1J6L88l43n51q4N96k05M68K20k95r01n2L71J54L51l16n85k00N73Q2l50
$$ 394 425 441 829 486 -65 -149 447 242 710 930 635 -266 -318 53 207 558 242 -343 -543 30 112 -238
3968b38J30J29q45L03N12p74j7Q74m09l55N26L67n13N8J76j11K97J08n01n67J083
$$ -238 -108 21 -824 -521 -9 -783 -800 74 -335 -690 -164 203 -310 -252 -76 -187 110 218 -283 -850 233
3989B33M26j07r17O57l74K63N34O6p41O74L3p18M71P40l54j38On20M13N03P1p04
$$ 233 659 552 -365 292 -82 181 715 781 40 714 747 29 500 1240 886 748 754 234 647 1150 1221 517
4011E17j97N21j14l30N57j41k73p5rn35K39Q09o10l37q1Pj62L43l05j52J96M41
$$ 517 320 841 727 397 954 813 540 465 456 -79 160 969 359 22 -59 -52 -214 129 -176 -328 -132 309
4033C09p63m11M61O56o26M3k35m41M32N91l69l24M08n14l79P21L69L8j51O4n67
$$ 309 -454 -865 -404 252 -374 -331 -566 -1007 -575 16 -353 -677 -269 -783 -1162 -441 -72 -34 -185 -121 -688
4054f88m0J020j47k23j92P9J6L20K38k95O5L63l79l15L40M45J40p35L04Q6k31
$$ -688 -728 292 145 -78 -270 -191 -175 145 383 88 153 516 137 -178 162 607 747 12 316 402 171
4075A71N59l76j97M84L8l36m50K04J72M34n8k70p88M79Q5j82J74M48n15l93j93
$$ 171 730 354 157 641 679 343 -107 97 269 703 645 375 -413 66 151 -31 143 591 76 -317 -510
4096e10O32j08L38j35q35j06O23N85p92J99j97k38L75L41l08M4M54j77p86N72
$$ -510 122 14 352 217 -618 -724 -101 484 -308 -109 -306 -544 -169 172 -136 -92 362 185 -601 -29
4116b9M94k66k03j3J33j73P38o10m47L00O39m36j66K96n51L30K37K88o09M17m0
$$ -29 465 199 -4 -17 116 -57 681 71 -376 -76 563 127 -39 257 -294 36 273 561 -48 369 329
4137C29l51j73Q31J62r73r3k29K3J233r3p72l02R2O9NK69J14m32k02N8q5L02M08
$$ 329 -22 -195 636 798 -175 -268 -497 -474 759 666 -106 -408 -316 -247 -242 27 141 -291 -493 -435 -520 -218 190
4160A90o01m23k74P29j18J18k8o84J42Q60l16m67N54p9m9P5J50k47J38L20n86
$$ 190 -411 -834 -1108 -379 -497 -379 -407 -1091 -949 -89 -405 -872 -318 -397 -446 -371 -221 -468 -330 -10 -596
4181e96K24P87m16m79Q2K03M22K52k50m51l12N48O19o99K07J54l30j0M87K01j80
$$ -596 -372 415 -1 -480 -398 -195 227 479 229 -222 -534 14 633 -66 141 295 -35 -45 442 643 463
4202D63n7m95m55Q17M22j6n81k50k4O2N92j48n8O7k57n24K74L7J94k78k00J96
$$ 463 406 -89 -544 273 695 679 98 -152 -176 -114 478 330 272 339 82 -442 -168 -131 63 -215 -415 -219
4224b19n8K10L62q41LQ65l71n01N9M00j88M53K03j081j31N93Qk22K50J7j76r0
$$ -219 -277 -67 295 -546 -543 322 -49 -550 -491 -91 -279 174 377 -704 -835 -242 -234 -456 -206 -189 -365 -455
4246d55J17N2L02J99j68r86P34M14Q4j87l0n8k28L53l62j57N12M52q99K53L41
$$ -455 -338 -286 16 215 47 -939 -205 209 293 106 76 18 -210 143 -219 -376 136 588 -311 -58 283
4267B83j56Q0J14n99m2M13K79m08k34N41p4k08j25J19m2L64J90n81l49O52j29
$$ 283 127 207 321 -278 -320 93 372 -36 -270 271 197 -11 -136 -17 -59 305 495 -86 -435 217 88
4288H8j99K74j33J2K17m28m1M07L18l51p85N47M77j62j14O0n61L04L36j50l45
$$ 88 -111 163 30 42 259 -169 -210 197 515 164 -621 -74 403 241 127 187 -374 -70 266 116 -229
4309b29M32L46o12L9J32L4L4J49n95k56J054j21l93j73M24K80k56l49l33J58R15
$$ -229 203 549 -63 -24 108 142 176 325 -270 -526 528 407 14 -159 265 545 289 -60 -393 -235 680
4330F80k50p73K30M02l00j82N25j20j7J65k81l62K34R34q04m51L56l3L54k32K61
$$ 680 430 -343 -113 289 -11 -193 332 212 195 360 79 -283 -49 885 81 -370 -14 -47 307 75 336
4351C36j72j09N08q49L05M08k2k33j19l41K9N44j44k04l25L82L99n37j50L14k62
$$ 336 164 55 563 -286 19 427 405 172 53 -288 -259 285 141 -63 -388 -6 393 -144 -294 20 -242
4372b42K21J84n84J49J65R4n22K85L81O4l14L5o37O99M68o01m46L44N96l76J14
$$ -242 -21 163 -421 -272 -107 -13 -535 -250 131 195 -119 -84 -721 -22 446 -155 -601 -257 339 -37 77
4393G7Ok48k4N34k82k54P8O32n45l57O72K06l12J13l58l71R40Qj50p7L52l08J82
$$ 77 83 -165 -189 345 63 -191 -113 519 -26 -383 289 495 183 296 -62 -433 507 515 365 288 640 332 514
4416E14l01L54l34J01K26o95P1R77m88o06R9L50q1O7r6l06K2L74k57l45K83j31
$$ 514 213 567 233 334 560 -135 -64 913 425 -181 -82 268 187 254 158 -148 -126 248 -9 -354 -71 -202
4438b02k49J14K23o35K99J39k25n97L43N14l72l25K84j80J99J96j2o13P63l24
$$ -202 -451 -337 -114 -749 -450 -311 -536 -1133 -790 -276 -648 -973 -689 -869 -670 -474 -486 -1099 -336 -660
4458f60j85Q9O35n1l78r1q2L7Q07l78l31o7Q73n2p87J77L02K58p1K42n10K93P62
$$ -660 -845 -756 -121 -172 -550 -641 -723 -686 121 -257 -588 -655 218 166 -621 -444 -142 116 45 287 -223 70 832
4481H32q41j49J77N77k35J48k24o4j05O91m95k76J56M54j87Ml47j00J30K25n08
$$ 832 -9 -158 19 596 361 509 285 221 116 807 312 36 192 646 459 463 116 16 146 371 -137
4502a37n1L52L58o20j10K2k99Q14p8r14J2P47q8n93M35J82m18q3j19P1J18L87
$$ -137 -188 164 522 -98 -208 -186 -485 329 251 -663 -651 96 8 -585 -150 32 -386 -469 -588 -517 -399 -12
4524a2k79p79P54M91l16k52l07M25J33M39o66n5K38L29n69Q0N18r7J29n7j90Q7
$$ -12 -291 -1070 -316 175 -141 -393 -700 -275 -142 297 -369 -424 -186 143 -426 -346 172 75 204 147 -43 44
4546D4M68L33j050o3M46L7J08L9Mo3R6mn26L08L20j14l21K06l93N45j71l19j69
$$ 44 512 845 -205 -268 178 215 323 362 366 303 399 395 -131 177 497 383 62 268 -125 420 249 -70 -239
4569b39J74M92j88p91M47J1K41o66J38j26M16n6m72j55N11K78k93k03J16J52K58
$$ -239 -65 427 239 -552 -105 -94 147 -519 -381 -507 -91 -147 -619 -774 -263 15 -278 -481 -365 -213 45
4590D5k0l84j66P29N8l47J58J88n7k83j3J2N25L15l14o27N62K23J66p91M62l48
$$ 45 25 -359 -525 204 262 -85 73 261 204 -79 -92 -80 445 760 446 -181 381 604 770 -21 441 93
4612I3L97M13r64j9O36K08m00j01L66k16j16k66J94m15M05O03q78J7J72J32%m39
$$ 93 490 903 -61 -80 556 764 364 263 629 413 297 31 225 -190 215 818 -60 -43 129 261 261 -178
4634a78n0J8L33j47r9l01L20M70j032O4L91Nrm3j68o00J210Mo00Q6J33L35j80
$$ -178 -228 -210 123 -24 -123 -424 -104 366 -666 -602 -211 -206 -215 -258 -426 -1026 184 188 -412 -326 -193 142 -38
4657c8L8k42k17P33j15p80L96O81l08n34K57M2K51J34L1l93K06K09R7n46M32L09
$$ -38 0 -242 -459 274 159 -621 -225 456 148 -386 -129 -87 164 298 329 -64 142 351 448 -98 334 643
4679F43l51j64j21l6P55p4n21l03M23N61n16j97j62r4O56l96J0o4R4k7l41R3J95
$$ 643 292 128 7 -29 726 652 131 -172 251 812 296 99 -63 -157 499 103 113 49 143 116 -225 -132 63
4702F3k80j3o5j45M74L86l06o50K83L55J27k09k54J98j04k7k05m7M70on08J42
$$ 63 -217 -230 -295 -440 34 420 114 -536 -253 102 229 20 -234 -36 -140 -167 -372 -419 51 45 -463 -321
4724c21J10M21j38K4n10j62R48J01j52l96K19O0k57O6J66r2L24q4o63L83L08K35
$$ -321 -211 210 72 96 -414 -576 372 473 321 -75 144 204 -53 13 179 87 411 327 -336 47 355 590
4746E90p56P8K7N91l36n4n21M76K48m13j00L36K43n99j06K99j3Q4L62r18j31N87
$$ 590 -166 -88 -61 530 194 140 -381 95 343 -70 -170 166 409 -190 -296 3 -10 74 436 -482 -613 -26
4768b6O10n84k56j60j00L73O58m59n73M94k0l39J9N51j80j76q7k48K91N32J21
$$ -26 584 0 -256 -416 -516 -143 515 56 -517 -23 -43 -382 -363 188 8 -168 -255 -503 -212 320 441
4789D41q33j43Q74K49k26qk84J7K07R8l15J99J68k91n56O83R7R4k42r6l82M42
$$ 441 -392 -535 339 588 362 354 70 87 294 392 77 276 444 153 -403 280 377 471 229 133 -249 193
4811A93O52q37k21K43L33o0jo82M54J73M4o93K18M14N5n29l67O06J63O5p4q71
$$ 193 845 8 -213 30 363 303 302 -380 74 247 291 -402 -184 230 285 -244 -611 -5 158 223 149 -722
4833g22M55O67n6q42K70j64L23k10j68K66K60J28m45rJ26M82o8n69L6m6L39L41
$$ -722 -267 400 344 -498 -228 -392 -69 -279 -447 -181 79 207 -238 -247 -121 361 293 -276 -240 -286 53 394
4855C94p96k50N05N45l22j52lK20J22m43j16J09M15r7k68n0R3N62n94K74q9j90
$$ 394 -402 -652 -147 398 76 -76 -79 141 263 -180 -296 -187 228 131 -137 -187 -94 468 -126 148 59 -131
4877a31O51k16n51J22L23N1m37J05M06j31j52J44l16J34M90k29k72J09N1M21n21
$$ -131 520 304 -247 -125 198 249 -188 -83 323 192 40 184 -132 2 492 263 -9 100 151 572 51
4898E1K13l39J97K37l80jL07l5P2m48O0j31L37K51m41l19J71N03l28j03N12m63
$$ 51 264 -75 122 359 -21 -22 285 250 322 -126 -66 -197 140 391 -50 -369 -198 305 -23 -126 386 -77
4920g7K6j88J52K96K2l02n99K69O86n5l62J9j97m5P22j38m91K82P0J07q75O74
$$ -77 -51 -239 -87 209 231 -71 -670 -401 285 230 -132 -113 -310 -355 367 229 -262 20 90 197 -678 -4
4942dM70k39J6m49j50N79K74l47l55K81K62p2j20l00J4K47J12j69m4n9N04l86
$$ -4 466 227 243 -206 -356 223 497 150 -205 76 338 266 146 -154 -140 107 219 50 6 -53 451 65
4964F5j18M93J81k46o26j73L35P07N4p22l53M41J85k1K8m19J99K74o73j47L23
$$ 65 -53 440 621 375 -251 -424 -89 618 672 -50 -403 38 223 202 230 -189 10 284 -389 -536 -213
4985b13N81Mo34j70N95n8L63o12m41L92N81p74J19J81N9J16M2l63p9R27k27n82
$$ -213 368 372 -262 -432 163 105 468 -144 -585 -193 388 -386 -267 -86 -27 89 131 -232 -311 616 389 -193
5007a93J9P25M8o92N3J97K87J04j7q75L44L44J23j92J6Q9k23j1R5J62k09N43n56
$$ -193 -174 551 599 -93 -40 157 444 548 531 -344 0 344 467 275 291 380 157 146 241 403 194 737 181
5030A81n55J77P00K4l36k36l28N96M71o92p1J51J42k78k81M40K65j04j81o64L13
$$ 181 -374 -197 503 527 191 -45 -373 223 694 2 -69 82 224 -54 -335 105 370 266 85 -579 -266
5051b66L78K44p33k15Q30M2k41k94J33j37L51N4o85M56N34m62k55j55J97M05n7
$$ -266 112 356 -377 -592 238 280 39 -255 -122 -259 92 146 -539 -83 451 -11 -266 -421 -224 181 124
5072A24j88m28K77L58k9m04K76L36q8jm00N3O62l22n14PN39Q5P6n42j65N22O8
$$ 124 -64 -492 -215 143 114 -290 -14 322 234 233 -167 -114 548 226 -288 -281 258 343 419 -123 -288 234 302
5095C02O2p29K58K24K67o89J22N14j98l60j37J87J71K01l25n19K1Q79K0o38j15
$$ 302 364 -365 -107 117 384 -305 -183 331 133 -227 -364 -177 -6 195 -130 -649 -628 251 271 -367 -482
5116d82J99L4L97m00m23O33nl55j20J31L95J68m66n29K00N56M33p45k16J85L84
$$ -482 -283 -249 148 -252 -675 -42 -47 -402 -522 -391 4 172 -294 -823 -623 -67 366 -379 -595 -410 -26
5137b6K88l99j19K24L38q4n50M6P74k40o06K9M48O6K69m71n47M72L97p2k89m82
$$ -26 262 -137 -256 -32 306 222 -328 -282 492 252 -354 -325 123 189 458 -13 -560 -88 309 237 -52 -534
5159e34N60p4Pr4n2L06J65n00m77Q44N1j16n3o62J86N05K11m34n33R45j04l30
$$ -534 26 -48 -41 -135 -187 119 284 -216 -693 151 202 86 33 -629 -443 62 273 -161 -694 251 147 -183
5181a83l0J83L23j44n37l71K31M80R0n5m69K60M53n18p2k58N77L27j51o87J90
$$ -183 -213 -30 293 149 -388 -759 -528 -48 42 -13 -482 -222 231 -287 -359 -617 -40 287 136 -551 -361
5202c61O89j16o13M02J57R1j46k70j99L59O93m79m34K2N26L9j2m46n1L77L01n83
$$ -361 328 212 -401 1 158 249 103 -167 -366 -7 686 207 -227 -205 321 360 348 -98 -149 228 529 -54
5224e4k2M69j00m41j86P0L35J74k56l61j31L05M47l15n1J11j81J16j35m83P22
$$ -54 -76 393 293 -148 -334 -264 71 245 -11 -372 -503 -198 249 -66 -117 -6 -187 -71 -206 -689 33
5245C3L18o01k12L44Q32n88m34j26J38N82K87p15j99N2N56l83l6n8K56j14K66
$$ 33 351 -250 -462 -118 714 126 -308 -434 -296 286 573 -142 -341 -289 267 -116 -152 -210 46 -68 198
5266A98j21j8P80m05o40j39K63M16j34j35m16M79L60j17k64k81M72O1m74M02o4
$$ 198 77 59 839 434 -206 -345 -82 334 200 65 -351 128 488 371 107 -174 298 359 -115 287 223
5287B23J3O9k65q2M72J25l89m63p1O69P5j38l46J49j3K33l61k49M95J82j90o38
$$ 223 236 305 40 -42 430 555 166 -297 -368 301 376 238 -108 41 28 261 -100 -349 146 328 138 -500
5309e00R7M28L51k73p90O2O42M79m21j76K96l28J04N4j49J04N04p56k25J05M64
$$ -500 -403 25 376 103 -687 -625 17 496 75 -101 195 -133 -29 25 -124 -20 484 -272 -497 -392 72
5330G2K57m20m63N3P09L87m91j51J19j6J50m37L00k3PK10n46j8N76J21l88k04
$$ 72 329 -91 -554 -501 208 595 104 -47 72 56 206 -231 69 46 53 263 -283 -301 275 396 8 -196
5352a96J89M36j34k99l79n7L85K52m00JK93j8l79J20j1N91j33n59j66K83M67R5
$$ -196 -7 429 295 -4 -383 -440 -55 197 -203 -202 91 73 -306 -186 -197 394 261 -298 -464 -181 286 381
5374C81q30j52O26J5j53J62m96J15M87l51j95M19M90l32m83J88K90q9K03n04j07
$$ 381 -449 -601 25 40 -113 49 -447 -332 155 -196 -391 28 518 186 -297 -109 181 92 295 -209 -316
5395c16K60M66k8n35J99L5L95l42l52M44M53l49m60J49K05P9m53R5k12M96r0Q6
$$ -316 -56 410 382 -153 46 81 476 134 -218 226 679 330 -130 19 224 303 -150 -55 -267 229 139 225
5417B25o43m5Q86k6l67l15M10j79R1l83J15M03L03l49o21K63O70k09j29l82J35
$$ 225 -418 -463 423 397 30 -285 125 -54 37 -346 -231 172 475 126 -495 -232 438 229 100 -282 -147
5438a47p8L71k83J26L4L4l15j29L78q7J76l97l7k13M99O55o64j66K04L5L76l75
$$ -147 -225 146 -137 -11 23 57 -258 -387 -9 -96 80 -317 -354 -567 -68 587 -77 -243 -39 -4 372 -3
5460ck34m27Q20J19j78n8J44j77l00J68J0J97Q1l99j49K09M50j5m25j55o9M52
$$ -3 -237 -664 156 275 97 39 183 6 -294 -126 -116 81 162 -237 -386 -177 273 258 -167 -322 -391 61
5482F1J95l03j64M24j6j02n6K92O5k12l39j69N80L33j66n78j77M23K08j2j84n0
$$ 61 256 -47 -211 213 197 95 39 331 396 184 -155 -324 256 589 423 -155 -332 91 299 287 103 53
5504E3oM24k59l50K04N03k29o96J20P37l08%l89n6L42J34k60k60J86J72J43l02
$$ 53 47 471 212 -138 66 569 340 -356 -236 501 193 193 -196 -252 90 224 -36 -296 -110 62 205 -97
5526i7l46N28K13n38J2k53O54J81k98p50L53O49j22j14j05k7J89K74m62j42N20
$$ -97 -443 85 298 -240 -228 -481 173 354 56 -694 -341 308 186 72 -33 -60 129 403 -59 -201 319
5547C19P1l41r0L4J14K02k22l23j16O47K15o45l9l5M20j08Q5l52J33M61l61k82
$$ 319 390 49 -41 -7 107 309 87 -236 -352 295 510 -135 -174 -209 211 103 188 -164 -31 430 69 -213
5569b13M48J16pn79j03L07K28O11r09l43N42J32Nl49j19K05Q8k43K02j5R7K72
$$ -213 235 351 344 -235 -338 -31 197 808 -101 -444 98 230 235 -114 -233 -28 60 -183 19 4 101 373
5591C73q71k10R73J43j12k99l50J72N43l67M0k13J61m1n7j40M19m6J40m84k87
$$ 373 -498 -708 265 408 296 -3 -353 -181 362 -5 35 -178 -17 -58 -115 -255 164 118 258 -226 -513
5612e13O67L64l22l90J28p3K72n6k43P4J03L66q1n49M63o7k70k00M39K1Q8l29
$$ -513 154 518 196 -194 -66 -139 133 77 -166 -92 11 377 296 -253 210 143 -127 -327 112 133 221 -108
5634a08j45R9L97L00o48j21J44K79K37L8q09L50LJ60l32LM87j43k14o37L80P13
$$ -108 -253 -154 243 543 -105 -226 -82 197 434 472 -337 13 16 176 -156 -153 334 191 -23 -660 -280 433
5656D33k2j61q05K46M27L61r35K86K2N59n58K76l82N02N0m92o7M55QL72p93l58
$$ 433 411 250 -555 -309 118 479 -456 -170 -148 411 -147 129 -253 249 299 -193 -260 195 203 575 -218 -576
5678e76M99M75K90m72m46J26O17m15l80M15K39j22q6m80M98R4J30n86J6L72J71
$$ -576 -77 398 688 216 -230 -104 513 98 -282 133 372 250 164 -316 182 276 406 -180 -164 208 379
5699C79k14j97j65L11K71l14n4Q8kk18j5l6J85L90q6n91J27J83M18l81m18P6j52
$$ 379 165 -32 -197 114 385 71 17 105 103 -115 -130 -166 19 409 323 -268 -141 42 460 79 -339 -263 -415
5722d15N63j83j10N5K91k64k70N7M71j1k92o31M12L86L47k28m32j12M98j8M0l44
$$ -415 148 -35 -145 -90 201 -63 -333 -276 195 184 -108 -739 -327 59 406 178 -254 -366 132 114 154 -190
5744a90K31j02L61m00l34O22J58k21m51L4Q24r5l35n12K1L94J71k71j9j11J68
$$ -190 41 -61 300 -100 -434 188 346 125 -326 -292 532 437 102 -410 -389 5 176 -95 -114 -225 -57
5765e7j10N1Q1J38J53j21m00j44Q26j91k25p04M56K47M43l61m06K99p9N9k77K2
$$ -57 -167 -116 -35 103 256 135 -265 -409 417 226 1 -703 -247 0 443 82 -324 -25 -104 -45 -322 -300
5787c00N36j71k90q7M17L55k29m91k58K87P02j82m12m87M45M14k95r2l21M88J93
$$ -300 236 65 -225 -312 105 460 231 -260 -518 -231 471 289 -123 -610 -165 249 -46 -138 -459 29 222
5808B22m46l5K36L26j79l86m9J79J30M20q32kL99K18O1l06m8O4J75l7l27K48J46
$$ 222 -224 -259 -23 303 124 -262 -311 -132 -2 418 -414 -416 -17 201 262 -44 -92 -28 147 110 -217 31 177
5831A77k02k31K15k3J94k29l88J95K22O90l30n93j47J47J35L10j85m0P0j63k58
$$ 177 -25 -256 -41 -64 130 -99 -487 -292 -70 620 290 -303 -450 -303 -168 142 -43 -83 -13 -176 -434
5852d34K05L88K15l27p60L95P17M1k73n33J30K69K21r9l59J95K58m02p1m5K34
$$ -434 -229 159 374 47 -713 -318 399 440 167 -366 -236 33 254 155 -204 -9 249 -153 -224 -269 -35
5873c5K38m87j33K70O15q2p10J1L13n7M81l12k90Q1J69l25K49K6J42J0o21o1L38
$$ -35 203 -284 -417 -147 468 386 -324 -313 0 -57 424 112 -178 -97 72 -253 -4 22 164 174 -447 -508 -170
5896a70M92k08j89k66K65J70K05l33N5j73L33j85J59l28M56j21m99M2M76K09r7
$$ -170 322 114 -75 -341 -76 94 299 -34 21 -152 181 -4 155 -173 283 162 -337 -295 181 390 293
5917B93n10k03M78J12j16n74R1M18j14J33j40J01J46o7J02l50J69K53j68m25J16
$$ 293 -217 -420 58 170 54 -520 -429 -11 -125 8 -132 -31 115 48 150 -200 -31 222 54 -371 -255
5938b55J01P50k67m80j33O71J93k41l18K9L35J3k83l36L51N25n85l37J49L66K4
$$ -255 -154 596 329 -151 -284 387 580 339 21 50 385 398 115 -221 130 655 70 -267 -118 248 272
5959B72j23m34O9L48k23L23m08j05M60k48k6Q1K46k21j65o02N65M68K88m23q62
$$ 272 149 -285 -216 132 -91 232 -176 -281 179 -69 -95 -14 232 11 -154 -756 -191 277 565 142 -720
5980g20M84M72j15k50L01n13K51J8j02j70L38K66m37k6K33K57M4n35j22J94K88
$$ -720 -236 236 121 -129 172 -341 -90 -72 -174 -344 -6 260 -177 -203 30 287 331 -204 -326 -132 156
6001A56K87m07o45P98J62k62nK5K48n5l47n9J10K96l22k54j9K87L59r6k6l68N0
$$ 156 443 36 -609 189 351 89 84 109 357 302 -45 -104 6 302 -20 -274 -293 -6 353 257 231 -137 -87
6024h7J44L06o13J39m5N32l67j55j7M10o8l18j57L31M57k40n52J92N3K86r7m60
$$ -87 57 363 -250 -111 -156 376 9 -146 -163 247 179 -139 -296 35 492 252 -300 -108 -55 231 134 -326
6046c26K13L36j33l10K20Oj25M1j78j02O45J13j96p14K69L75O7k11j00J84J33
$$ -326 -113 223 90 -220 0 6 -119 -78 -256 -358 287 400 204 -510 -241 134 201 -10 -110 74 207
6067B07k47J43m09L72n9j18r2K80J55n2O2l87j97N60Q2l61m81M86L48m57O4j77
$$ 207 -40 103 -306 66 7 -111 -203 77 232 180 242 -145 -342 218 300 -61 -542 -56 292 -165 -101 -278
6089b78J42R6J88j64J42K18K2p37j97L77L59j18m33J91j60P59l12l07K56M8j91
$$ -278 -136 -40 148 -16 126 344 366 -371 -568 -191 168 50 -383 -192 -352 407 95 -212 44 92 -99
6110i9Pk14K90N73m98k63l24O89L33l12l48k89M98P2M21l05l11K19l9o8k72J50
$$ -99 -92 -306 -16 557 59 -204 -528 161 494 182 -166 -455 43 115 536 231 -80 139 100 32 -240 -90
6132i0oQl78K50N08K46k69n30k29N43J98l63K42k54M93l52j26k61jM65R3m08K44
$$ -90 -96 -88 -466 -216 292 538 269 -261 -490 53 251 -112 130 -124 369 17 -109 -370 -371 94 187 -221 23
6155B3j33K51j47l16K62K21L15k33o34l4O67n0K2j27r5O7L7j69O5K87k89K09l02
$$ 23 -110 141 -6 -322 -60 161 476 243 -391 -425 242 192 214 87 -8 59 96 -73 -8 279 -10 199 -103
6178a03J19K56k09K44m68K02k7N66k87n71K34N9j99K24k42N27J05l19j51M2O45
$$ -103 16 272 63 307 -161 41 14 580 293 -278 -44 15 -184 40 -202 325 430 111 -40 2 647
6199F47j38p92j5M07K01L46o59j0k4O3K37k67J15J15k6l85L3O25k12j05m52j08
$$ 647 509 -283 -298 109 310 656 -3 -13 -37 26 263 -4 111 226 200 -185 -152 473 261 156 -296 -404
6221d04J85P62k87j48k33K9j27K34p3k82O71k34m11O7K93K14l32l63J10M74K86
$$ -404 -219 543 256 108 -125 -96 -223 11 -62 -344 327 93 -318 -251 42 256 -76 -439 -329 145 431
6242D31j57l68m62O40J63k15k36J62K62k13L74l34K81J12o43K3j26O18j18L7k66
$$ 431 274 -94 -556 84 247 32 -204 -42 220 7 381 47 328 440 -203 -180 -306 312 194 231 -35
6263c5j19K75L08n22j29M10k37K59R3k39P2K07k80k62n6N15K03k35n97K87M62
$$ -35 -154 121 429 -93 -222 188 -49 210 303 64 136 343 63 -199 -255 260 463 228 -369 -82 380
6284C80j63j36l28K27M5K21l30J33N9m32K31rq7L46j86j17J82j55M24m0j29k96
$$ 380 217 81 -247 -20 25 246 -84 49 108 -324 -93 -102 -189 157 -29 -146 36 -119 305 265 136 -160
6306a60J73L9K22M8l36RL7j69j3K43L2J63l23r8J64Q1m1j42j59J52L52j56Km25
$$ -160 13 52 274 322 -14 -5 32 -137 -150 93 125 288 -35 -133 31 112 71 -71 -230 -78 274 118 120 -305
6330c05M16j0q4k42L49j76L7j40P4k7L53J84l14n67K41P25j83m19M0J36K60n65
$$ -305 111 101 17 -225 124 -52 -15 -155 -81 -108 245 429 115 -452 -211 514 331 -88 -48 88 348 -217
6352b17J11J99L9K87o50L7K52L1j64j60j21K63O40l88m64J75M22l39j44K25O9
$$ -217 -106 93 132 419 -231 -194 58 89 -75 -235 -356 -93 547 159 -305 -130 292 -47 -191 34 103
6373A03j87J41m51L04L16j66N6q54P10J55K14l39p6j16oK44k06N4L82J82k78k52
$$ 103 -84 57 -394 -90 226 60 116 -738 -28 127 341 2 -74 -190 -196 48 -158 -104 278 460 182 -70
6395g0m7J38K00m19J77m07Q42k13N6o04J18K93N2l03J2n4K01N42j028N46L26o8
$$ -70 -117 21 221 -198 -21 -428 414 201 257 -347 -229 64 116 -187 -175 -229 -28 514 -514 32 358 290
6417B90m11J3K72k49J04j2m96N53J28k0m32M3K29j45J50K95k57J11P2m60J5L5
$$ 290 -121 -108 164 -85 19 7 -489 64 192 172 -260 -217 12 -133 17 312 55 166 238 -222 -207 -172
6439a72N26m93m02J60L18Q4k64P6L5K18J69n10n3K43j02p3k71O74p1L19n47j09
$$ -172 354 -139 -541 -381 -63 21 -243 -167 -132 86 255 -255 -308 -65 -167 -240 -511 163 92 411 -136 -245
6461b45J06j05L55j88k28O9N41J92l55m47L40j07K57l10K64P6J48k52m43L43L17
$$ -245 -139 -244 111 -77 -305 -236 305 497 142 -305 35 -72 185 -125 139 215 363 111 -332 11 328
6482C28O5j44o60L60j30N31l28l10J00J47J41k53N6L20K29o38j3k04R68n52k38
$$ 328 393 249 -411 -51 -181 350 22 -288 -188 -41 100 -153 -97 223 452 -186 -199 -403 565 13 -225
6503b25j53K24%L69k71j7l1J28J29k68l1J85R5L8m48J52N66l31j39j06k25N28
$$ -225 -378 -154 -154 215 -56 -73 -104 24 153 -115 -146 39 134 172 -276 -124 442 111 -28 -134 -359 169
6525A69J80o83M2J89Q2J33k99K43J47j82p0j20K45J77l64K92p00N66K54k66l8
$$ 169 349 -334 -292 -103 -21 112 -187 56 203 21 -49 -169 76 253 -111 181 -519 47 301 35 -3
6546cN4k00P18l20m75Q8K58O8k53k91L87n6M0k66j23M85M19m86l81J37K43K70
$$ -3 51 -149 569 249 -226 -138 120 188 -65 -356 31 -25 15 -251 -374 111 530 44 -337 -200 43 313
6568C13m17J44l97M83k40K2j01L45J1k95j78K55J31J43J03l87j1K32o1L8m51J14
$$ 313 -104 40 -357 126 -114 -92 -193 152 163 -132 -310 -55 76 219 322 -65 -76 156 95 133 -318 -204
6590b04K18J84m01N7K10K27j70k78o1K55M08p40k2j8N62J12k60k13oM25l20Q7
$$ -204 14 198 -203 -146 64 291 121 -157 -218 37 445 -295 -317 -335 227 339 79 -134 -140 285 -35 52
6612E2k64N03J22k84n6rK86r9l51J24j44K92K94p86L45m42N78j29Q7j02N4m1K12
$$ 52 -212 291 413 129 73 64 350 251 -100 24 -120 172 466 -320 25 -417 161 32 119 17 71 30 242
6635B42m10K50L9kn46P1M51P1r1l51j92L40K24O2o3j39j63r6K89q8J5O7J10j95
$$ 242 -168 82 121 119 -427 -356 95 166 75 -276 -468 -128 96 158 95 -44 -207 -303 -14 -102 -87 -20 90 -105
6659a05j19L06R3l58R7j8J3Q2Q5l23j4L12K46l89M61l30K46j37j62j02L18j9k73
$$ -105 -224 82 175 -183 -86 -104 -91 -9 76 -247 -261 51 297 -92 369 39 285 148 -14 -116 202 183 -90
6682i0q2J45K76L6k05m64L24L54m62J93j32J44q4K96o6l30L97R6k87o6k77L94
$$ -90 -172 -27 249 285 80 -384 -60 294 -168 25 -107 37 -47 249 183 -147 250 346 59 -7 -284 110
6704A10QN3m71K99l8K0K7m67O15L4j10k93O9K33J5k24K07k92jK64K6k88J21J78
$$ 110 118 171 -300 -1 -39 -19 8 -459 156 190 80 -213 -144 89 104 -120 87 -205 -206 58 84 -204 -83 95
6728I5J62n44K10M9L88k18n12M77J46k4n02j49M05M06k25J7l55K17K31o7k59l8
$$ 95 257 -287 -77 -28 360 142 -370 107 253 229 -273 -422 -17 389 164 181 -174 43 274 207 -52 -90
6750i0K89j11k26j19N07o07O0L21j03K2L12k71m15O66k84M15j74m08K81J50J95
$$ -90 199 88 -138 -257 250 -357 -297 24 -79 -57 255 -16 -431 235 -49 366 192 -216 65 215 410
6771D10m12l3j41J54L53n17K73p9K19P5o00P0K8L85k73n0J54R2k14L4j35J28J91
$$ 410 -2 -35 -176 -22 331 -186 87 8 227 302 -298 -228 -200 185 -88 -138 16 108 -106 -72 -207 -79 112
6794A12p1k36L99j34l8ml10K82j04M2J30n48L38L64j78J06j39j23J45q9q2j89
$$ 112 41 -195 204 70 32 28 -282 0 -104 -62 68 -480 -142 222 44 150 11 -112 33 -56 -138 -327
6816c27M39j11p3J50Nj77O79o49l33N30J34K30m27k97k7N73n33J54k13K81M1J52
$$ -327 112 1 -72 78 83 -94 585 -64 -397 133 267 497 70 -227 -254 319 -214 -60 -273 8 49 201
6838B01m32n5M02J8k69j39M04k36J74j0l66Q9K09j23J08o0q0K83N7k78L17J33
$$ 201 -231 -286 116 134 -135 -274 130 -106 68 58 -308 -219 -10 -133 -25 -85 -165 118 175 -103 214 347
6860C47R6p01l4L47L4j7l10m25L92L66k35k4J83L46k22p8k08K23K29l15Q9k60
$$ 347 443 -258 -292 55 89 72 -238 -663 -271 95 -140 -164 19 365 143 65 -143 80 309 -6 83 -177
6882a77J08J77R4m67Q2L69J74k4l14j22J02N1K5k68K39K78k57p1k12K12j79K57
$$ -177 -69 108 202 -265 -183 186 360 336 22 -100 2 53 78 -190 49 327 70 -1 -213 -1 -180 77
6904G7j75j54M35k31K33n54L65K91J9k87j11JM76l32l10n9L01p7q7R5n0M06p5
$$ 77 -98 -252 183 -48 185 -369 -4 287 306 19 -92 -91 385 53 -257 -316 -15 -92 -179 -84 -134 272 197
6927A97k49k99L61J69J26k21N7K6k26J00J55k29K23K89n16p2L01rK2l41J00k0
$$ 197 -52 -351 10 179 305 84 141 167 -59 41 196 -33 190 479 -37 -109 192 183 205 -136 -36 -56
6949e6J76J94m43o4M02l63J48o7J94j32m9q4K74Nk08M26l51k49M01q8p2l05J52
$$ -56 120 314 -129 -193 209 -154 -6 -73 121 -11 -60 -144 130 135 -73 353 2 -247 154 66 -6 -311 -159
6972a59O3p2M55m76J97R1j38J5r9J03J92N7l85j36K30K60l65L94n93M73M8l03
$$ -159 -96 -168 287 -189 8 99 -39 -24 -123 -20 172 229 -156 -292 -62 198 -167 227 -366 107 155 -148
6994a48K7k7N1J13j81M6J67L56l71m4J9J63jjn34L18J27L6j44p2K28k21R5mk6
$$ -148 -121 -148 -97 16 -165 -119 48 404 33 -11 8 171 170 169 -365 -47 80 116 -28 -100 128 -93 2 -2 -28
7019b8J82n5M8l43L90P0l47J06Q0j91J49l1o2L7M4k33L10M0J06j24k6k74lK53
$$ -28 154 99 147 -196 194 264 -83 23 103 -88 61 30 -32 5 49 -184 126 166 272 148 122 -152 -155 98
7043I8q8O1m35M2K82L1J58J7k32l70N60k0k85J72j36L73l63N3k2O4J08j75j39
$$ 98 10 71 -364 -322 -40 -9 149 166 -66 -436 124 104 -181 -9 -145 228 -135 -82 -104 -40 68 -107 -246
7066b46q2Q55k41l34J7L05k45n5J08q0%J72k90N2J56o4J01k65n0K75j08K87m85
$$ -246 -328 527 286 -48 -31 274 29 -26 82 2 2 174 -116 -64 92 28 129 -136 -186 89 -19 268 -217
7089b17M46J97qm80J4N1J97m10j07M31l51K91j38r9K90K4J67j52j69J9n0J81P8
$$ -217 229 426 418 -62 -48 3 200 -210 -317 114 -237 54 -84 -183 107 131 298 146 -23 -4 -54 127 205
7112B05m35l04Q13N5m71K87k88J38L22j73j62J17L33n06k77L46O8l9J35j8k44
$$ 205 -230 -534 279 334 -137 150 -138 0 322 149 -13 104 437 -69 -346 0 68 29 164 146 -98
7133i8J4J28l01J21J42K7M0l83K90J82l1K2j06j55M1R5j6j47l8K74p5K47k45K3
$$ -98 -84 44 -257 -136 6 33 73 -310 -20 162 131 153 47 -108 -67 28 12 -135 -173 101 26 273 28 51
7157E1J05j08j17j11J79j69L56l45R9j9k5L3%J52p1J82j76M5J28l5p6K40k68j27
$$ 51 156 48 -69 -180 -1 -170 186 -159 -60 -79 -104 -71 -71 81 10 192 16 61 189 154 78 318 50 -77
7181g7K26N4k74jO3L5o2M4M9j4O30n68j52J03j05o4J87N0j6r4j10o8K43J58k86
$$ -77 149 203 -71 -72 -9 26 -36 8 57 43 673 105 -47 56 -49 -113 74 124 108 14 -96 -164 79 237 -49
7206d9l2K8N33m15Ok11n9L61N4j11k13K64r5j16O7O4k37kK66k15l80N69M8L6k90
$$ -49 -81 -53 480 65 71 -140 -199 162 216 105 -108 156 61 -55 12 76 -161 -163 103 -112 -492 77 125 161 -129
7231a29Q9L29l54K34m25L93J64k48j00q1K25K6k13J46K36J54k89j84o8PK99j44
$$ -129 -40 289 -65 169 -256 137 301 53 -47 -128 97 123 -90 56 292 446 157 -27 -95 -88 211 67
7253F7j29l3L07N9k59j15J73L9J19l83n7J82K30o2l91L50%l91L92K2m13J44mM36
$$ 67 -62 -95 212 271 12 -103 70 109 228 -155 -212 -30 200 138 -253 97 97 -294 98 120 -293 -149 -153 283
7277B83j20k01j04J25K8J3j04M72k61j48j52J58J69l40j53J45M17n3j83J7J08
$$ 283 163 -38 -142 -17 11 24 -80 392 131 -17 -169 -11 158 -182 -335 -190 227 174 -9 8 116
7298A16K0PJ71l23J6l3K63N9l8L25k92m85N8J38j91M09k66K7%k8K01l08J20J49
$$ 116 136 143 314 -9 7 -26 237 296 258 583 291 -194 -136 2 -189 220 -46 -19 -19 -47 154 -154 -34 115
7322A15J10l79L04l00K07j1P1P5l44K87K0k6l98K03J21p3J33k03J31L7k31j8J71
$$ 115 225 -154 150 -150 57 46 117 192 -152 135 155 129 -269 -66 55 -18 115 -88 43 80 -151 -169 2
7345Bj5l0m4j5K8L6L17l81j1M6J46K5k39J52m5j92N57k11lJ48k08P2j87K41L6
$$ 2 -13 -43 -87 -102 -74 -38 279 -102 -113 -67 79 104 -135 17 -28 -220 337 126 123 271 63 135 -52 189 225
7370B25R5o33J70K20j40J98k65Q4K86K02p60M97k56l9M26J93m38q2J5P0j62j25
$$ 225 320 -313 -143 77 -63 135 -130 -46 240 442 -318 179 -77 -116 310 503 65 -17 -2 68 -94 -219
7392b19J79O5K48l50k21J55M00j36k42P7K46k61N7l8J21J32j88j15KN1J52K11
$$ -219 -40 25 273 -77 -298 -143 257 121 -121 -44 202 -59 -2 -40 81 213 25 -90 -88 -37 115 326
7414C26l81k40O5M06l40l4N8j43K69j60J05Q5L04l57l7k75L95P2k06J61j00j18
$$ 326 -55 -295 -230 176 -164 -198 -140 -283 -14 -174 -69 16 320 -37 -74 -349 46 118 -88 73 -27 -145
7436a45J14K02K3n5j86k77M18j78K03k30K78r2k44K06Kl29J18J54q7L11l30j28
$$ -145 -31 171 194 139 -47 -324 94 -84 119 -111 167 75 -169 37 39 -290 -172 -18 -105 206 -124 -252
7458b52j80M34J82n13J60M62k37m6M4j40L66m77J3K58j90K63J2j42J14R6k56%
$$ -252 -432 2 184 -329 -169 293 56 10 54 -86 280 -197 -184 74 -116 147 159 17 131 227 -29 -29
7480b9j16J63n7M7j35L6J03J53l95L36j64L86n8k28k7j58J60J91J97m76J49j51
$$ -29 -145 18 -39 8 -127 -91 12 165 -230 106 -58 328 270 42 15 -143 17 208 405 -71 78 -73
7502g3p9J14n3K17R0k89J63k59M65k79n0m97L42L06J38k51k2K00k50J03J43j10
$$ -73 -152 -38 -91 126 216 -73 90 -169 296 17 -33 -530 -188 118 256 5 -17 183 -67 36 179 69
7524F9K8Lk18M6j1K76q8k03J14k21L86L2k24l65N33J44n61K67j26j63K91j32q1
$$ 69 97 100 -118 -72 -83 193 105 -98 16 -205 181 213 -11 -376 157 301 -260 7 -119 -282 9 -123 -204
7547b04K09J15Qj76k19M46k21L03m67K22j74M0N30m52J67J0K16k51n20L01L69
$$ -204 5 120 128 -48 -267 179 -42 261 -206 16 -158 -118 412 -40 127 137 353 102 -418 -117 252
7568B52m2m90L43j1P6P9M2k63j70K34k91K31r2o4K73j77j56K32n8m3J19K80m58
$$ 252 210 -280 63 52 128 207 249 -14 -184 50 -241 -10 -102 -166 107 -70 -226 6 -52 -95 24 304 -154
7591a54K26k67J87l0o1M06R6n82j2L06o7j71J56l34K84K7kj03J88l8l16K99r6
$$ -154 72 -195 -8 -38 -99 307 403 -179 -191 115 48 -123 33 -301 -17 10 8 -95 93 55 -261 38 -58
7614e8J07Qk36r9N01j97k03J44j24j1M53m06K50n55N38M6k02O9N0j41M5k32O7
$$ -58 49 57 -179 -278 223 26 -177 -33 -157 -168 285 -121 129 -426 112 158 -44 25 75 -66 -21 -253 -186
7637a86J49N93m76k66O4R6O6j62J40j87J63K97m20K38k86J93Q8N1l70j09P1J02
$$ -186 -37 556 80 -186 -122 -26 40 -122 18 -169 -6 291 -129 109 -177 16 104 155 -215 -324 -253 -151
7659a51L65n53J94l4K79m76N80k05J17j98j00j24M17k72J93k81R8k6Q9k4l5J53
$$ -151 214 -339 -145 -179 100 -376 204 -1 116 -82 -182 -306 111 -161 32 -249 -151 -177 -88 -112 -147 6
7681Fk49N39l84K53Mk6k94O3q4K03k20L10j11L6K6j58mN0j00P7P1Q2n7M1k9j01
$$ 6 -243 296 -88 165 169 143 -151 -88 -172 31 -189 121 10 46 72 -86 -90 -40 -140 -63 8 90 33 74 45 -56
7707e6L8l03K39J43r4j69R5K58Q4k22o9K00K09n78K83Q4j99k7q9L1J39M1j53k20
$$ -56 -18 -321 -82 61 -33 -202 -107 151 235 13 -56 144 353 -225 58 142 -57 -84 -173 -142 -3 38 -115 -335
7731c35L66J34k05r7j1Q6J16K81n57J81q2P7R4l56M9K64j39K54R5k63l3M47m4
$$ -335 31 165 -40 -137 -148 -62 54 335 -222 -41 -123 -46 48 -308 -259 5 -134 120 215 -48 -81 366 322
7754C22n98L73R5J48n38L22k08K08q6k25J65pm9N6J31j39q3J56J79j01k93K28
$$ 322 -276 97 192 340 -198 124 -84 124 38 -187 -22 -29 -78 -22 109 -30 -113 43 222 121 -172 56
7776E6M4K00m83L67N0l10K2M03k60j24J15j36J13k17J58R2Q6r7n6N2k9j46j56
$$ 56 100 300 -183 184 234 -76 -54 349 89 -35 80 -56 57 -160 -2 90 176 79 23 75 46 -100 -256
7799b56L06J29l5j9k4l41k9K82qM63m40o1j18O2J35n0R5n9l1k09j0Q0o0r2N39
$$ -256 50 179 144 125 101 -240 -269 13 5 468 28 -33 -151 -89 46 -4 91 32 1 -208 -218 -138 -198 -290 249
7824B49l95L53j00LpLo4oJ23J61j02m70M02n7p1k08J13rJ97j49Q1J03l56L34k74
$$ 249 -146 207 107 110 103 106 42 36 159 320 218 -252 150 93 22 -186 -73 -82 115 -34 47 150 -206 128 -146
7849a46J83R0m9K2j33j78J57K01j84J88m07M78o7k31n3k11L03j20j4j12K67J40
$$ -146 37 127 78 100 -33 -211 -54 147 -37 151 -256 222 155 -76 -129 -340 -37 -157 -171 -283 -16 124
7871A24q3k78L86k82K76m15J04o1L43l05m0J69J87q5N0j64J14j12J04K43k37k20
$$ 124 41 -237 149 -133 143 -272 -168 -229 114 -191 -231 -62 125 40 90 -74 40 -72 32 275 38 -182
7893a82L36k76J54r1J26J4R0J15l87K99r2J7l65M21j71o5P5m5k6K87p5k20j97
$$ -182 154 -122 32 -59 67 81 171 286 -101 198 106 123 -242 179 8 -57 18 -27 -53 234 159 -61 -258
7916b58K99N3M1k80L6J53l19M28k15Q7Q8j14j72o5K46K4J46k18J17l67M70q3j44
$$ -258 41 94 135 -145 -109 44 -275 153 -62 25 113 -1 -173 -238 8 32 178 -40 77 -290 180 97 -47
7939d7J71o6m4R3l13R6J88J41l82J56J26K2j47j52j0J77J03r8M0j82K70k35J45
$$ -47 124 58 14 107 -206 -110 78 219 -163 -7 119 141 -6 -158 -168 9 112 14 54 -128 142 -93 52
7962E2J56r7q4J50j32R6m1j48k12M04o8n8J48j3k09N6r5Q2l92L37j5K22j10J03
$$ 52 208 111 27 177 45 141 100 -48 -260 144 76 18 166 153 -56 0 -95 -13 -405 -68 -83 139 29 132
7986A32j68L17j93j92kj2M70m0k09j29J27j85K30j79k41M07k46J71J12j31J26
$$ 132 -36 281 88 -104 -106 -118 352 312 103 -26 101 -84 146 -33 -274 133 -113 58 170 39 165
8007A65pk14O2l97K92j02M62j8j57r1K21k21KJ19m92M99L2N5m0k68j74K99J87
$$ 165 158 -56 6 -391 -99 -201 261 243 86 -5 216 -5 -3 116 -376 123 155 210 170 -98 -272 27 214
8030B14k0l87J93q3j12J54K30o5o9Q2R0j60k7N6j28M4O5p8k9K81l78O5j61J09
$$ 214 194 -193 0 -83 -195 -41 189 124 55 137 227 67 40 96 -32 12 77 -1 -30 251 -127 -62 -223 -114
8054a14J57J68n75M70r3J3J1k45L60k70J37j29Q5O1Mj77K69j26J44m48L84j05
$$ -114 43 211 -364 106 13 26 37 -208 152 -118 19 -110 -25 36 40 -137 132 6 150 -298 86 -19
8076a9r6N06q4l42O6j48J68L19m76L50j99j3k83K71K01l11P5L1p0j37J61J79k09
$$ -19 -115 391 307 -35 31 -117 51 370 -106 244 45 32 -251 20 221 -90 -15 16 -54 -191 -30 149 -60
8099f0k24J89J82o0J15j92J2K78l43K12j1jj80M60n77O35m83M42n67J53j71J79
$$ -60 -284 -95 87 27 142 -50 -38 240 -103 109 98 97 -83 377 -200 435 -48 394 -173 -20 -191 -12
8121a2K42l53l5J62O2j13J52j20j25k8J49k6L1k5K50j79k7k02K99Q9j02l40K99
$$ -12 230 -123 -158 4 66 -47 105 -15 -140 -168 -19 -45 -14 -39 211 32 5 -197 102 191 89 -251 48
8144D8k01Q9N20m63K85m99K89l17K38K29k40j9j22J7N0L06l40K16r6K2L52m85
$$ 48 -153 -64 456 -7 278 -221 68 -249 -11 218 -22 -41 -163 -146 -96 210 -130 86 -10 12 364 -121
8166a21N7P6J29j71l8j18K39L92l21l67L16m8o9l2K7l5N3j19L44l90M46Q5n43
$$ -121 -64 12 141 -30 -68 -186 53 445 124 -243 73 25 -44 -76 -49 -84 -31 -150 194 -196 250 335 -208
8189b08m2M5
$$ -208 -250 -205
8191b05
$$ Imaginary data points
##PAGE= N=2
##DATA TABLE= (X++(I..I)), XYDATA
0@%%%jRqQj6J7k5L6m4N6o7Q1j02J21j40J66j96K29k71L14l61M18m78N45o22P07
$$ 0 0 0 0 -1 8 0 8 -8 9 -16 20 -24 32 -35 46 -56 65 -75 91 -105 124 -147 167 -194 224 -254 291 -331 376
29C76p99R00j014J138j273J421j584J763j959K176k412K669k956L275l625M014
$$ 376 -423 477 -537 601 -672 749 -835 928 -1031 1145 -1267 1402 -1554 1721 -1904 2110
45B110m452M944n502O143o883P749q786J0052j1634J3678j6434K0388k6574L7706
$$ 2110 -2342 2602 -2900 3243 -3640 4109 -4677 5375 -6259 7419 -9015 11373 -15201 22505
59B2505o4012K38690K30954l48597j29974R2090K07476K4149r6915j13721K6079
$$ 22505 -41507 197183 428137 79540 -50434 41656 249132 273281 176366 62645 88724
70H8724L7759l2310m1866Q6660O5679q4467j61435k5387J33222J45918n3165k09803
$$ 88724 126483 94173 52307 138967 204646 120179 -41256 -66643 66579 212497 159332 -50471
82e0471r3026J58761J51240o4814j51007k0933Q5231N1407m9523o3538L9075Q8539
$$ -50471 -143497 15264 166504 101690 -49317 -70250 14981 66388 16865 -46673 -7598 80941
94H0941l8828j29722N850J62720P9274j15226j54323K465J70339J37997q1776
$$ 80941 42113 -87609 -81759 80961 160235 45009 -109314 -106849 63490 201487 119711
105A19711j88181k5908J49276R5752m4755o6776M77L2006q603m5206K5449J22622
$$ 119711 -68470 -94378 54898 150650 105895 39119 39596 71602 62999 17793 43242 165864
117A65864L7446j56820j42326Q7921J97967N1833j37549j55809K395J44843Q4082
$$ 165864 203310 46490 -95836 -7915 190052 241885 104336 -51473 -49078 95765 179847
128A79847q1885r3918K9763N2392l9194n8853K6107Q6295K4858j08126j27054
$$ 179847 97962 4044 33807 86199 47005 -11848 14259 100554 125412 17286 -109768
139a09768M5521J70665L9320j48304j12140N6035J11421K0160q0473o6445M2579
$$ -109768 -64247 106418 145738 -2566 -114706 -58671 52750 72910 -7563 -74008 -31429
150c1429P3530l2483q0483K8114R5219n18r8778n1573O9981J13896P840j31163
$$ -31429 42101 9618 -70865 -42751 52468 51950 -46828 -98401 -28420 85476 93316 -37847
162c7847r0517R6945J45916j2519j22602m8756O6032P6529n020o2718o651O6854
$$ -37847 -128364 -31419 114497 101978 -20624 -69380 -3348 73181 68161 5443 -1208 65646
174F5646Q397r0004k9513J06093Q8244n7756j28141m3921R5921J25801j2678j38257
$$ 65646 74043 -15961 -45474 60619 148863 91107 -37034 -80955 14966 140767 128089 -10168
186a0168o5003P6879O9464k9012m5040J1780L0598k2942p6967k4471J00068R5107
$$ -10168 -75171 1708 71172 42160 -2880 8900 39498 16556 -60411 -84882 15186 110293
198A10293p7585j60990k0928J28830R6612m4364j18712n0750O9877P7416l2763
$$ 110293 32708 -128282 -149210 -20380 76232 31868 -86844 -137594 -67717 9699 -23064
209b3064o6120J9641M7834k9523o0207J2870P8591M6407o3289j12891M111J41456
$$ -23064 -89184 -69543 -21709 -51232 -111439 -98569 -19978 26429 -36860 -149751 -145640 -4184
221d184P9371r6989j20519J9598J11156N9461m5977p5796L513O7859J2197n1032
$$ -4184 75187 -21802 -142321 -122723 -11567 47894 1917 -73879 -70366 -2507 9690 -41342
233d1342P926P1906Q258q0547n2435N6196J12618L6527j08574j22291M0840J48577
$$ -41342 -33416 38490 46748 -33799 -86234 -30038 82580 119107 10533 -111758 -70918 77659
245G7659M7619r0407q2399J1608N6786K3998k5685j1613L6926Q43q3005m6633
$$ 77659 125278 34871 -47528 -35920 20866 44864 19179 7566 44492 45335 -37670 -84303
257h4303Q6171J05250k5757j25242p7408O0310J29272L0872j11784r3781M2635
$$ -84303 1868 107118 81361 -43881 -121289 -60979 68293 99165 -12619 -106400 -63765
268f3765P9123m22m3917r231K3650K382m3072l0450N7054Q4624l2595j25999l4424
$$ -63765 15358 14936 -28981 -38212 -14562 -12180 -55252 -85702 -28648 55976 23381 -102618 -137042
281a37042J06588R8115k9242j09964n5021O9701R9570q127q2222j8329M9639J3693
$$ -137042 -30454 67661 38419 -71545 -126566 -56865 42705 34578 -47644 -65973 -16334 -2641
293b641l2195l257M4966L5999l5430q5267j0770J14492Q9450p1742j27776j0161
$$ -2641 -34836 -38093 6873 42872 7442 -77825 -88595 25897 115347 43605 -84171 -94332
305i4332J02956P9296k7502q5647k9110N6647L9004l4389j8890M6067K1080n7780
$$ -94332 8624 87920 60418 -25229 -54339 2308 41312 6923 -11967 34100 55180 -2600
317b600n8138K5953R0657M9528p2929j17508M178J22345O3157o9648q4719J050
$$ -2600 -60738 -34785 55872 105400 32471 -85037 -80859 41486 104643 34995 -49724 -48674
329d8674N7577L1453k8746l3364K6802L4078m3274o0667L6718Q9778R646q7255
$$ -48674 8903 40356 11610 -21754 5048 39126 -4148 -64815 -28097 61681 71327 -15928
341a5928p3602L1849J05736M5361q4154r2806K7840Q7487J5600m9764k6985K0610
$$ -15928 -89530 -57681 48055 93416 9262 -83544 -55704 31783 47383 -2381 -29366 -8756
353h756K4997j8830l8872K2279P5548L676r9144n6849P2910R9688j008r3455p1149
$$ -8756 16241 -2589 -41461 -19182 56366 60042 -39102 -95951 -23041 76647 75639 -17816 -88965
366h8965M0042R7556J7961p4161l9613L9652K8336k6166k1526K7077M1762r162
$$ -88965 -48923 48633 66594 -7567 -47180 -7528 20808 -5358 -26884 193 41955 32793
378C2793p3831m0523P4871R8389k6961j14607m1408P2210Q1777l063p3853m3319
$$ 32793 -41038 -81561 -6690 91699 64738 -49869 -91277 -19067 62710 59647 -14206 -57525
390e7525M2280M9734k4437l5253L0530L8672l0090n9511m162O7531O3282l4133
$$ -57525 -15245 34489 10052 -25201 5329 44001 13911 -45600 -49762 17769 81051 46918
402D6918j04534k9141R5135Q0954l9878q5176j8730M9751M4822j5235m2386O407
$$ 46918 -57616 -86757 8378 89332 49454 -35722 -54452 -4701 40121 24886 -17500 -11093
414a1093L9911j5764n8401Q376P6869K9727o3685p7835L869Q8717O4009n3869
$$ -11093 28818 13054 -45347 -36971 39898 69625 5940 -71895 -68026 20691 84700 30831
426C0831r9439m098Q0431L9256l6340l9749M973K6523j337l5051m37O0263K6996
$$ 30831 -68608 -72706 7725 46981 10641 -29108 -24135 2388 1051 -34000 -34437 25826 52822
439E2822p2066o9775M0802R5036K5608o9663p8925J1076Q8788M2768n5230n4061
$$ 52822 -19244 -89019 -48217 46819 72427 2764 -76161 -65085 23703 66471 11241 -42820
451d2820K2779L8719p256k2353R901L4919Q524m9021m9975M1716R3174P486r2142
$$ -42820 -20041 18678 11422 -10931 -1030 33889 42413 -6608 -56583 -14867 78307 85793 -6349
464f349n9592M6653Q2267J9359n8592n6949K1284N6235k018l9160N844L5437r576
$$ -6349 -65941 -19288 62979 82338 23746 -33203 -11919 44316 42298 3138 8982 44419 34843
477C4843m6610j6374M3109N8027q406q5692n1161O2999Q6283j1691p8972l9333
$$ 34843 -11767 -28141 14968 72995 64589 -21103 -72264 -9265 77018 65327 -13645 -52978
489e2978L2853N0125L068m1109j5240L1251M930m5562j2183N5832L9773l8672
$$ -52978 -20125 30000 33068 -8041 -23281 7970 12900 -32662 -44845 10987 50760 12088
501A2088o9679j5710O5055P1599k1840r0361k9156O3501N3120j7375m0531p066
$$ 12088 -57591 -73301 -8246 63353 41513 -48848 -78004 -14503 38617 21242 -19289 -26355
513b6355K2485J3033k1907j3325M0325L8526m1110o8570J2852Q0452M1842m5021
$$ -26355 -3870 9163 -12744 -26069 14256 52782 11672 -56898 -44046 36406 78248 33227
525C3227p5103j1020P0335N6379l4412o0521M005L9066M371k1385k688K2684J5425
$$ 33227 -41876 -52896 17439 73818 39406 -21115 -17110 21956 26327 4942 2254 24938 40363
538D0363l0460m9788J2002P5739K6180p0490o8464K1144P1987L0731m4616o2610
$$ 40363 9903 -39885 -27883 47856 74036 3546 -64918 -43774 28213 58944 14328 -48282
550d8282N62N2272J3685l6798j2094K7660L652l5815k3233K6042N1571Q862o5093
$$ -48282 -47720 4552 18237 -18561 -30655 -2995 657 -35158 -58391 -32349 19222 28084 -37009
563c7009n9701L7461Q3848J1411o5580m7040K0612N0721J7449l1020k3773K5164
$$ -37009 -96710 -59249 24599 36010 -29570 -76610 -55998 -5277 12172 -18848 -42621 -17457
575a7457K0221l1124k3980M0366M8632j4025n9787k8640M5656P2484L780p3780
$$ -17457 2764 -28360 -52340 -11974 36658 22633 -37154 -65794 -20138 52346 56126 -17654
587a7654m2775M5917N7478n760l8610j3796K0231K0478j5423k4919K1866M4136
$$ -17654 -60429 -14512 42966 37206 -1404 -15200 5031 25509 10086 -14833 7033 51169
599E1169j7135o5966j3022O0472M8533k6267o9377k9050M9880N9974j7877o3165
$$ 51169 34034 -31932 -44954 15518 64051 37784 -31593 -60643 -10763 49211 31334 -31831
611c1831j4328L4842J3745k0206j4382J2494J7870j6697m6984q194O1096M2286
$$ -31831 -46159 -11317 2428 -17778 -32160 -19666 -1796 -18493 -65477 -73671 -12575 29711
623B9711m8438p4925k811O3032M6181k2974o1078j8677M3417L0110k3322j7679
$$ 29711 -18727 -93652 -96463 -33431 12750 -10224 -71302 -89979 -46562 -16452 -39774 -57453
635e7453K2582J4265k6670k7993J5378N1272K8806m3053o5934R863P9308L8260
$$ -57453 -34871 -20606 -47276 -75269 -59891 -8619 20187 -22866 -88800 -78937 371 38631
647C8631m2975n2271K555M4151L0234j7811k8297J4494K8096j6711l1034K1781
$$ 38631 -4344 -56615 -54060 -9909 20325 2514 -25783 -11289 16807 96 -30938 -9157
659i157M8842K570m8436l7243K4782O6026K1918n9941n7482K5147O2088J2570
$$ -9157 39685 42255 -6181 -43424 -18642 47384 69302 9361 -48121 -22974 39114 51684
671E1684l7777l0417O517K4653J706k2141K413L2493m005n5248k2733M9265N3448
$$ 51684 13907 -16510 -9993 14660 16366 -5775 -3362 29131 25126 -30122 -52855 -3590 49858
684D9858j2470o6775m4328L5410P1388R443n9609l6610K2151K7299j786j0413
$$ 49858 37388 -29387 -73715 -38305 33083 42526 -17083 -53693 -31542 -4243 -6029 -16442
696a6442M067J2095o573l5213j3782M9227N2537k5698p0479j8923N2366N5569
$$ -16442 -12375 -280 -6853 -42066 -55848 -6621 45916 20218 -50261 -69184 -16818 38751
708C8751l104n4383l1502L4026M2674j0465k7647Q560K1325p461k2986J29L1425
$$ 38751 35647 -18736 -50238 -16212 26462 15997 -11650 -3090 18235 10774 -12212 -12083 19342
721A9342K8825k0928n3155n168O1244L9497l6228n5176l767M5248L7002j7460
$$ 19342 48167 27239 -25916 -31084 30160 69657 33429 -21747 -25514 19734 56736 39276
733C9276m5638o236L4874R553k5473k974K6955O035l1329l0504J3458N1231K5151
$$ 39276 -6362 -12598 22276 31829 6356 3382 30337 36372 5043 -25461 -12003 39228 64379
746F4379m8321o2175J2199O4072K6236l3917m0054k550K7919J5800j7509j1342
$$ 64379 16058 -46117 -33918 30154 56390 22473 -17581 -20131 7788 23588 6079 -5263
758e263K4398J3374l5554l0899K7289N1382R066m3998m5019J2754N8649K2833
$$ -5263 19135 32509 -3045 -33944 -6655 44727 53793 9795 -35224 -22470 36179 59012
770E9012m1886l4648K0313L0367l767k0059k241K1223J5898k2048l2592J4473
$$ 59012 17126 -17522 2791 33158 29391 9332 7091 28314 44212 22164 -10428 4045
782D045M7825N494m5674k6567K6525L9892K207l9262k8860K5263M0390j0105l9493
$$ 4045 51870 57364 11690 -14877 11648 51540 53747 14485 -14375 10888 51278 41173 1680
795A680m053K7296Q244j9773j6306J1066K6557k252m2871k2470L9805M3048j7949
$$ 1680 -2373 24923 33167 13394 -2912 8154 34711 32459 -10412 -32882 6923 49971 32022
808C2022n1596j8719K9000L7843j738l6180j5707K2675J1235k3522q060K9448
$$ 32022 -19574 -38293 -9293 28550 26812 -9368 -25075 -2400 8835 -14687 -22747 6701
820F701K0828k2860m1129q566M2813M6719j5545n9604j7815M0883L4326q686k3536
$$ 6701 27529 4669 -36460 -45026 -2213 44506 28961 -30643 -48458 -7575 26751 18065 -5471
833e471o489J3743Q214j5189q737K8735K7564k5356m5424M446M7562K9265k2954
$$ -5471 -11960 1783 9997 -5192 -13929 14806 42370 17014 -28410 -23964 23598 52863 29909
846B9909m5394r693M2367L3539k3542l5745O169K6516L361j5278p549J0949J3479
$$ 29909 -15485 -25178 17189 50728 27186 -8559 -2390 24126 27487 12209 4660 15609 29088
859B9088j2251k8090O357M1767J0364m4355l6440J9185M7404J7281l5743m7192
$$ 29088 16837 -11253 -4896 36871 47235 2880 -33560 -14375 33029 50310 14567 -32625
871c2625K531M4120J7900k4067j7550O031J405j2071l378J7862K5139n014m7085
$$ -32625 -30094 14026 31926 7859 -9691 -3660 -2255 -14326 -17704 158 25297 20283 -26802
884b6802l3007L5358N8906L620n0915l8380J2149M1545K0994k1701k5869O994
$$ -26802 -59809 -24451 34455 38075 -12840 -51220 -39071 2474 23468 1767 -24102 -17108
896a7108J3651j2393q723K2837K2458j4101l5793j4680L0906M5571l523n2021
$$ -17108 -3457 -15850 -24573 -1736 20722 6621 -29172 -43852 -12946 32625 29102 -22919
908b2919k5404L5021L9341n504l1624j5090J5678K3586l014k1179K115K1668n085
$$ -22919 -48323 -13302 26039 20535 -11089 -26179 -10501 13085 10071 -11108 -8993 12675 7590
921G590k6506L75L1482J7870k2048l8642n733M3975L8584k3408n1487p852L5078
$$ 7590 -18916 -18541 12941 30811 8763 -29879 -35612 8363 46947 23539 -27948 -35800 -722
934g22K5088p566j9951q043Q736M420j2826O03K9436J1657l4659l6054J2292M4861
$$ -722 24366 16800 -3151 -11194 -2458 1962 -10864 -10261 19175 30832 -3827 -39881 -27589 17272
948A7272K4232k5100m6149q458M0117K7564j8927k3695N801J2017m236j1597K010
$$ 17272 41504 16404 -29745 -38203 1914 29478 10551 -13144 -7343 4674 438 -11159 -9149
961i149K0011J2673k2705l3031J0250M2821J1592l2226k8105R058L1098J3514
$$ -9149 10862 23535 830 -32201 -21951 20870 32462 236 -27869 -18811 12287 25801
973B5801k2948k6570J2853K8467m533k5248n52K0982P139j6645j7403Q384K9489
$$ 25801 2853 -23717 -10864 17603 13070 -12178 -12730 8252 15391 -1254 -18657 -10273 19216
986A9216O419l4397k4555K5659L5552l354l1313j8240J4000K6416L230k3145r074
$$ 19216 25635 -8762 -33317 -7658 27894 24540 -6773 -25013 -11013 15403 18633 -4512 -13586
999a3586J9969P448k1905j0760K1123K3655o988l1724j9928K4057M0046j548l9303
$$ -13586 6383 13831 -8074 -18834 2289 25944 18956 -12768 -32696 -8639 31407 29859 -9444
1012i444j7164K0996J9590l743j2800k395J0992L732j8583j2933K3285K8479j3240
$$ -9444 -26608 -5612 13978 10235 -2565 -4960 6032 9764 -8819 -21752 1533 30012 16772
1025A6772l6896r747K6300K8128l295l1798j7377K2236K3524j2080j9776O261
$$ 16772 -20124 -29871 -3571 24557 21262 -10536 -27913 -5677 17847 5767 -14009 -7748
1037g748J4796k963j4706o036J5773J9606j0009l2097m934L4252K1481k0633k9867
$$ -7748 7048 4085 -10621 -16657 -884 18722 8713 -23384 -28318 5934 27415 6782 -23085
1050b3085j952K5288K0808j0769k7578j089K3886N052j6926k623J6563N692j5471
$$ -23085 -25037 251 21059 10290 -17288 -18377 5509 10561 -6365 -8988 7575 13267 -2204
1063b204j7783N771L1121J6671k9290l6611J0041L9147J4311k0093k3629k547
$$ -2204 -19987 -14216 16905 33576 4286 -32325 -22284 16863 31174 11081 -12548 -15095
1075a5095J7846J2318j0688q459J3273O564k0887j5650J7990K8004J723k8380
$$ -15095 2751 15069 4381 -4078 9195 15759 -5128 -20778 -2788 25216 26939 -1441
1087a441k7581J0006L9168J2574l0915k5327J1675K0747K127j0635p253N750Q103
$$ -1441 -29022 -19016 20152 32726 1811 -23516 -11841 8906 11033 398 -6855 -1105 6998
1100F998j0059j5175J1955K5324m871l1042j2333K2302K6980N63l0199k2515J8067
$$ 6998 -3061 -18236 -6281 19043 14172 -16870 -29203 -6901 20079 20642 -9557 -32072 -14005
1113a4005L2103j761k5243p001J3148P151n697n284N666J3956l470k5316p768
$$ -14005 18098 16337 -8906 -15907 -2759 4392 -1305 -6589 -923 13033 9563 -15753 -23521
1126b3521K9988K5405j6121l2756p264K3660K7285k221k8889j2715J9663J4417
$$ -23521 6467 31872 15751 -17005 -24269 -609 26676 24455 -4434 -17149 2514 16931
1138A6931j0888q090J0056Q298r635j6597j112K3077K1002j7037l5855j431L2655
$$ 16931 6043 -2047 8009 16307 6672 -9925 -11037 12040 33042 16005 -19850 -21281 11374
1151A1374J8312j5296k4024n214J6932J5283r218j6622O608J4187r167j7818N299
$$ 11374 29686 14390 -9634 -14848 2084 17367 8149 -8473 -1865 12322 3155 -14663 -9364
1164i364K0615P172j6754k4301J105L1223J7404k3599k7965O711K3773P311j1447
$$ -9364 11251 18423 1669 -22632 -21527 9696 27100 3501 -24464 -17753 6020 13331 1884
1177A884j2376K162J2780m42j4206Q13K1410M704k2508j5340J3596K4756P502
$$ 1884 -10492 -8330 4450 4008 -10198 -9385 12025 16729 -5779 -21119 -7523 17233 24735
1190B4735k1020k5312Q241L0869P672k1918j1976R724J0389k207p468M62J2193
$$ 24735 3715 -21597 -13356 17513 25185 3267 -8709 1015 11404 9197 1729 2191 14384
1203A4384M544j8677j5451J7784K6719m186k7568j4110J3406K4575N006k2261
$$ 14384 18928 251 -15200 2584 29303 25117 -2451 -16561 -3155 21420 26426 4165
1215D165j7909J2881J6752o988j2482M431R696k894j3119p805J2777K0898n538
$$ 4165 -13744 -863 15889 8901 -3581 850 10546 7652 -5467 -13272 -495 20403 14865
1228A4865l0682j0203K3875K1392q613k1451r650J1024J6925j898j7001l69J4045
$$ 14865 -15817 -26020 -2145 19247 10634 -10817 -20467 -9443 7482 5584 -11417 -11786 2259
1241B259j682j5483m29J6083J0524r319k0807n988K3555K2360j3168k8063j083
$$ 2259 577 -14906 -15335 748 11272 1953 -18854 -24842 -1287 21073 7905 -20158 -21241
1254b1241K1035J1435o328j2295k671J0875M948j0958m191J5940R723j6173j6830
$$ -21241 -206 11229 4901 -7394 -10065 810 5758 -5200 -9391 6549 16272 99 -16731
1267a6731O204K0903J1182j3225k4708j271K6214J3639j6481j5963M710J0106
$$ -16731 -10527 10376 21558 8333 -16375 -17646 8568 22207 5726 -10237 -5527 4579
1279D579P06o411l404P865P621j1753j8168Q625K4270K798k2527j6224O661K0899
$$ 4579 5285 -1126 -4530 3335 10956 -797 -18965 -10340 13930 16728 -5799 -22023 -15362 5537
1293E537R866j6508k0627O092J8735j089j2709k61Q646P56q817q720O006J9031
$$ 5537 15403 -1105 -21732 -15640 3095 2006 -10703 -10964 -2318 -1562 -10379 -19099 -13093 5938
1307E938L036k4553j5668J7382K3070j878j8572j1937O624J7233L872j4603o241
$$ 5938 8974 -15579 -31247 -13865 9205 7327 -11245 -23182 -16558 675 4547 -10056 -16297
1320a6297J2099M686j1819m636J1931J1140l890j6889j0294J5725K3842m493k6097
$$ -16297 -4198 488 -11331 -15967 -4036 7104 3214 -13675 -23969 -8244 15598 11105 -14992
1333a4992p757J6880J3940k210j1934n723P362Q257o979q801R868J2410q863j7452
$$ -14992 -22749 -5869 8071 5861 -6073 -11796 -4434 3823 -3156 -11957 -2089 10321 1458 -15994
1347a5994L63J6495J2990o768k2111p545K0135J7880j0759j7925R71J0658M021
$$ -15994 -15631 864 13854 7086 -15025 -22570 -2435 15445 4686 -13239 -12268 -1610 2411
1360B411m667n959L775R508m407j6261J129K0738P990j6418j6356K797J7451J3726
$$ 2411 -2256 -8215 -4440 5068 661 -15600 -14471 6267 14257 -2161 -18517 -15720 1731 15457
1374A5457r946k1059L20J8317N649j1088m327O387L937m316p724J530J4888P981
$$ 15457 5511 -15548 -15228 3089 8738 -2350 -6677 -290 3647 -669 -8393 -6863 8025 16006
1388A6006j7010j7965J0236K1918L349j4753j3745K262J5519P744j1471j0080
$$ 16006 -1004 -18969 -8733 13185 16534 1781 -11964 -9702 5817 13561 2090 -7990
1400g990Q272Q145q278p924O819J0428R81j2231j2759O761K0970L083k0869j1604
$$ -7990 282 8427 149 -7775 -956 9472 10453 -1778 -14537 -7776 13194 16277 -4592 -16196
1414a6196J1655J3165n08j0257p380N491R872l752j1889L736J3839k555j4446
$$ -16196 -4541 8624 8116 -2141 -9521 -4030 5842 2090 -9799 -6063 7776 5221 -9225
1427i225m167J0501J3030j114j7153j0800J3500J9046n416j7323k380R955O208
$$ -9225 -13392 -2891 10139 9025 -8128 -18928 -5428 13618 8202 -9121 -11501 -1546 4662
1440D662k678o365O68Q909Q98j4062m251J6686J2682j0376j6895k458J3381J5627
$$ 4662 1984 -4381 -3713 5196 6094 -7968 -12219 4467 17149 6773 -10122 -12580 801 16428
1454A6428k451j8234o646J3834Q501p796n002N966M275l793q440j617J2403J2920
$$ 16428 13977 -4257 -10903 2931 11432 3636 -1366 4600 8875 5082 -3358 -4975 7428 20348
1468B0348r719k1139J53J9591Q992q582j2962l385J0340R428o211j0897M959R392
$$ 20348 10629 -10510 -10357 9234 18226 9644 -3318 -6703 3637 13065 6854 -4043 916 10308
1482A0308n528r977K931J0068L596q070j2741M78J8378Q373j6266j6185O850J5060
$$ 10308 4780 -5197 -2266 7802 11398 3328 -9413 -8935 9443 17816 1550 -14635 -7785 7275
1496G275M181q487j0372q2R876K864q455p66R834l65j2825n497J0543J3497J423
$$ 7275 11456 2969 -7403 -7485 2391 5255 -3200 -3966 5868 5503 -7322 -12819 -2276 11221 12644
1511A2644j5961j6676Q406K2607M439j6469j0162M055P437K547k211k388M810
$$ 12644 -3317 -19993 -11587 11020 15459 -1010 -11172 -7117 320 2867 656 -1732 3078
1524C078J455j1036o737J3406J5259o014j6981p330R831J6143L238j5942j1714
$$ 3078 4533 -6503 -13240 166 15425 9411 -7570 -14900 -5069 11074 14312 -1630 -13344
1537a3344J0054J2581l906q038J093M527P12l442m820M964R964l336j4915k196
$$ -13344 -3290 9291 5385 -2653 -1560 2967 3679 237 -4583 381 10345 7009 -7906 -10102
1551a0102J5781Q780q692j3488l034J1538J3733m354j6225l406J1210M811m912
$$ -10102 5679 14459 5767 -7721 -10755 783 14516 10162 -6063 -9469 1741 6552 1640
1564A640j395K295Q53l873o231M94J3524Q400j4053j7495M243J6954P470o572
$$ 1640 245 2540 3393 -480 -6711 -6217 7307 15707 1654 -15841 -11598 5356 12826 6254
1578F254j2726m482R047Q386n116n348N723L000q164n968M723R851M532q143j4071
$$ 6254 -6472 -10954 -1907 6479 1363 -3985 1738 4738 -3426 -9394 -4671 5180 9712 1569 -12502
1593a2502J615J6145N815j1497q401N422P414M25o259m894N677R079l752j1515
$$ -12502 -10887 5258 11073 -424 -8825 -3403 4011 4436 -1823 -6717 -1040 8039 4287 -7228
1607g228J831J1153J781q349l807L698P420J887r694p350R323J2390m626j1912
$$ -7228 -5397 5756 7537 -812 -4619 -921 6499 8386 -1308 -8658 665 13055 8429 -3483
1621c483j653O974O157r07o958j979P971K602j0024m693J0498Q670n046j0581
$$ -3483 -5136 1838 7995 7088 130 -1849 6122 8724 -1300 -5993 4505 13175 8129 -2452
$$ [...]
8191e71
##END NTUPLES=NMR FID
##END=
