##TITLE=1H_CA-8720-1
 CDCl3, 8 sc, 
 6.7.2020
##JCAMPDX= 6.0         $$ Bruker NMR JCAMP-DX V2.0
##DATA TYPE= NMR FID
##DATA CLASS= NTUPLES
##ORIGIN= UXNMR, Bruker Analytische Messtechnik GmbH
##OWNER= root
$$ XWIN-NMR		Version 3.5
$$ Mon Jul  6 10:27:39 2020 Russian Standard Time (UT+4h)  she@DPX200
##.OBSERVE FREQUENCY= 200.1315
##.OBSERVE NUCLEUS= ^1H
##.DELAY= (6, 6)
##.ACQUISITION MODE= SIMULTANEOUS
##.ACQUISITION SCHEME= undefined
##.AVERAGES= 8
##.DIGITISER RES= 18
##SPECTROMETER/DATA SYSTEM= spect
##.PULSE SEQUENCE= zg30
##.SOLVENT NAME= MeOD
##.SHIFT REFERENCE= (INTERNAL, MeOD, 0, 15.7039)
##AUDIT TRAIL= $$ (NUMBER, WHEN, WHO, WHERE, WHAT)
$$ ##TITLE= Audit trail, XWIN-NMR		Version 3.5
$$ ##JCAMPDX= 5.01
$$ ##ORIGIN= Bruker BioSpin GmbH
$$ ##OWNER= she
$$ F:/spectra/data/she/nmr/H-F/1/audita.txt
$$ ##AUDIT TRAIL=  $$ (NUMBER, WHEN, WHO, WHERE, WHAT)
(   1,<2020-07-06 10:26:28.64 +0400>,<she>,<DPX200>,
      <created by zg, POWCHK disabled, PULCHK disabled
       configuration hash MD5:
       00 E9 B6 7A A2 85 ED C7 34 08 36 98 17 FE 4E 26
       data hash MD5: 16K
       97 5A 66 4A 66 CD 93 07 1E B9 8C 0A 95 54 8A 87>)
$$ ##END=
$$ 
$$ hash MD5
$$ C1 58 6A 8A 71 38 42 B1 8A 6A CA 9C 72 78 32 82
##$RELAX= 
##$RELAX= 
##$RELAX= 
##$RELAX= 
##$RELAX= 
##$RELAX= 
$$ Bruker specific parameters
$$ --------------------------
##$DU= <F:/spectra>
##$EXPNO= 1
##$NAME= <H-F>
##$PROCNO= 1
##$TYPE= <nmr>
##$USER= <she>
##$AMP= (0..31)
100 100 100 100 100 100 100 100 100 100 100 100 100 100 100 100 100 100 
100 100 100 100 100 100 100 100 100 100 100 100 100 100 
##$AQSEQ= 0
##$AQ_mod= 1
##$AUNM= <au_zg>
##$AUTOPOS= <>
##$BF1= 200.13
##$BF2= 200.13
##$BF3= 200.13
##$BF4= 200.13
##$BF5= 200.13
##$BF6= 200.13
##$BF7= 200.13
##$BF8= 200.13
##$BYTORDA= 1
##$CFDGTYP= 0
##$CFRGTYP= 5
##$CHEMSTR= <none>
##$CNST= (0..31)
1 1 145 1 1 1 1 1 1 1 1 1 1 1 1 1 1 1 1 1 1 1 1 1 1 1 1 1 1 1 1 1 
##$CPDPRG= <>
##$CPDPRG1= <>
##$CPDPRG2= <>
##$CPDPRG3= <>
##$CPDPRG4= <mlev>
##$CPDPRG5= <mlev>
##$CPDPRG6= <mlev>
##$CPDPRG7= <mlev>
##$CPDPRG8= <mlev>
##$CPDPRGB= <>
##$CPDPRGT= <>
##$D= (0..31)
0 1.2 0 0 0 0 0 0 0 0.06 0 0.03 0 0 0 0 0.0002 0 0 0 0 0 0 0 0 0 0 0 0 
0 0 0 
##$DATE= 1594016787
##$DBL= (0..7)
120 120 120 120 120 120 120 120 
##$DBP= (0..7)
150 150 150 150 150 150 150 150 
##$DBP07= 0
##$DBPNAM0= <>
##$DBPNAM1= <>
##$DBPNAM2= <>
##$DBPNAM3= <>
##$DBPNAM4= <>
##$DBPNAM5= <>
##$DBPNAM6= <>
##$DBPNAM7= <>
##$DBPOAL= (0..7)
0.5 0.5 0.5 0.5 0.5 0.5 0.5 0.5 
##$DBPOFFS= (0..7)
0 0 0 0 0 0 0 0 
##$DE= 6
##$DECBNUC= <off>
##$DECIM= 24
##$DECNUC= <off>
##$DECSTAT= 4
##$DIGMOD= 1
##$DIGTYP= 9
##$DL= (0..7)
0 120 120 120 120 120 120 120 
##$DP= (0..7)
150 150 150 150 150 150 150 150 
##$DP07= 0
##$DPNAME0= <>
##$DPNAME1= <>
##$DPNAME2= <>
##$DPNAME3= <>
##$DPNAME4= <>
##$DPNAME5= <>
##$DPNAME6= <>
##$DPNAME7= <>
##$DPOAL= (0..7)
0.5 0.5 0.5 0.5 0.5 0.5 0.5 0.5 
##$DPOFFS= (0..7)
0 0 0 0 0 0 0 0 
##$DQDMODE= 0
##$DR= 18
##$DS= 0
##$DSLIST= <SSSSSSSSSSSSSSS>
$$ [...]
##$SUBNAM2= <"">
##$SUBNAM3= <"">
##$SUBNAM4= <"">
##$SUBNAM5= <"">
##$SUBNAM6= <"">
##$SUBNAM7= <"">
##$SUBNAM8= <"">
##$SUBNAM9= <"">
##$SW= 24.9337058887773
##$SWIBOX= (0..15)
0 0 2 0 0 0 0 0 0 0 0 0 0 0 0 0 
##$SW_h= 4990.01996007984
##$TD= 16384
##$TD0= 1
##$TE= 0
##$TE2= 300
##$TE3= 300
##$TEG= 300
##$TL= (0..7)
0 120 120 120 120 120 120 120 
##$TP= (0..7)
150 150 150 150 150 150 150 150 
##$TP07= 0
##$TPNAME0= <>
##$TPNAME1= <>
##$TPNAME2= <>
##$TPNAME3= <>
##$TPNAME4= <>
##$TPNAME5= <>
##$TPNAME6= <>
##$TPNAME7= <>
##$TPOAL= (0..7)
0.5 0.5 0.5 0.5 0.5 0.5 0.5 0.5 
##$TPOFFS= (0..7)
0 0 0 0 0 0 0 0 
##$TUNHIN= 0
##$TUNHOUT= 0
##$TUNXOUT= 0
##$USERA1= <user>
##$USERA2= <user>
##$USERA3= <user>
##$USERA4= <user>
##$USERA5= <user>
##$V9= 5
##$VALIST= <valist>
##$VCLIST= <CCCCCCCCCCCCCCC>
##$VD= 0
##$VDLIST= <DDDDDDDDDDDDDDD>
##$VPLIST= <PPPPPPPPPPPPPPP>
##$VTLIST= <TTTTTTTTTTTTTTT>
##$WBST= 1024
##$WBSW= 4
##$XGAIN= (0..3)
0 0 0 0 
##$XL= 0
##$YL= 0
##$YMAX_a= 806302
##$YMIN_a= -628740
##$ZGOPTNS= <>
##$ZL1= 120
##$ZL2= 120
##$ZL3= 120
##$ZL4= 120
##$ABSF1= 10
##$ABSF2= 0
##$ABSG= 5
##$ABSL= 3
##$ALPHA= 0
##$AQORDER= 0
##$ASSFAC= 0
##$ASSFACI= 0
##$ASSFACX= 0
##$ASSWID= 0
##$AUNMP= <proc_1d>
##$AZFE= 0.1
##$AZFW= 0.1
##$BCFW= 1
##$BC_mod= 2
##$BYTORDP= 1
##$COROFFS= 0
##$CY= 11.3945322036743
##$DATMOD= 1
##$DC= 2
##$DFILT= <>
##$DTYPP= 0
##$F1P= 16.9975609425685
##$F2P= -3.02152046262296
##$FCOR= 0.5
##$FTSIZE= 0
##$FT_mod= 4
##$GAMMA= 1
##$GB= 0.15
##$INTBC= 1
##$INTSCL= 1
##$ISEN= 128
##$LB= 0.24
##$LEV0= 0
##$LPBIN= 0
##$MAXI= 10000
##$MC2= 0
##$MEAN= 0
##$ME_mod= 0
##$MI= 1.114404
##$NCOEF= 0
##$NC_proc= 0
##$NLEV= 6
##$NOISF1= 3.799351
##$NOISF2= 2.8
##$NSP= 1
##$NTH_PI= 0
##$NZP= 0
##$OFFSET= 15.70392
##$PC= 1
##$PHC0= -9792.214
##$PHC1= 17.20087
##$PH_mod= 1
##$PKNL= yes
##$PPARMOD= 0
##$PSCAL= 0
##$PSIGN= 0
##$REVERSE= no
##$SF= 200.130013532006
##$SI= 16384
##$SIGF1= 3
##$SIGF2= 2
##$SINO= 400
##$SIOLD= 16384
##$SREGLST= <1H.CDCl3>
##$SSB= 0
##$STSI= 0
##$STSR= 0
##$SW_p= 3612.71676300578
##$SYMM= 0
##$S_DEV= 0
##$TDeff= 0
##$TDoff= 0
##$TI= <>
##$TILT= no
##$TM1= 0
##$TM2= 0
##$TOPLEV= 0
##$USERP1= <user>
##$USERP2= <user>
##$USERP3= <user>
##$USERP4= <user>
##$USERP5= <user>
##$WDW= 1
##$XDIM= 8192
##$YMAX_p= 0
##$YMIN_p= 0
$$ End of Bruker specific parameters
$$ ---------------------------------
##NTUPLES= NMR FID
##VAR_NAME=  TIME,          FID/REAL,        FID/IMAG
##SYMBOL=    X,             R,               I
##VAR_TYPE=  INDEPENDENT,   DEPENDENT,       DEPENDENT
##VAR_FORM=  AFFN,          ASDF,            ASDF
##VAR_DIM=   8192,          8192,            8192
##UNITS=     SECONDS,       ARBITRARY UNITS, ARBITRARY UNITS
##FACTOR=    0.0002004,     1,               1
##FIRST=     0,             0,               0
##LAST=      1.6414764,     0,               0
##MIN=       0,             -628740,         0
##MAX=       1.6414764,     806302,          0
$$ Real data points
##PAGE= N=1
##DATA TABLE= (X++(R..R)), XYDATA
$$ [...]
$$ plain form
3037 -1294 -4316 -1824 3343 4534 -517 -4070 -2967 2445 5752 2405 -3355 -4201 900 4215 2423
3052 2423 -1267 -3566 -1473 2947 3378 -193 -1950 -794 698 1705 1850 -137 -1955 -1353 597 1987
3068 1987 2345 225 -2547 -1670 2193 3219 590 -2806 -3222 41 3626 2584 -2615 -3803 93 3329
3084 3329 2641 -602 -3011 -2682 1218 2653 200 -2044 -1498 -914 419 2108 726 -1626 -1728 -224
3100 -224 1234 1408 -485 -3291 -2457 2070 3884 793 -3473 -4030 -132 4200 3296 -2904 -5604 -1559
3116 -1559 3034 3474 -295 -3870 -3084 1901 3914 367 -3534 -3041 -329 2322 2434 -1072 -4104 -2301
3132 -2301 1876 3479 2041 -1835 -4721 -2161 3368 4530 -435 -4934 -3707 1839 5888 3168 -4152
3147 -4152 -6074 325 6164 3947 -2601 -6399 -2622 4961 6641 -166 -5361 -3478 2706 5574 2520
$$ packed form
3037a294l022K492N167J191n051l553J103N412L307l347n760q46N101L315j792
3052B423l690k299K093M420M31l571j757J156J492J007J45j987j818O02J950J390
3068A987L58k120k772Q77L863J026k629l396m16L263L585j042n199j188L896L236
3084C329o88l243k409L29L900J435k453k244N46N84J333J689j382k352j02J504
3100b24J458J74j893k806Q34M527J814l091m266n57L898M332r04o200k700M045
3116a559M593M40l769l575P86M985K013l547l901M93K712K651J12l506l032J803
3132b301M177J603j438l876k886K560N529J162m965m499J227N546M049k720p320
3147d152j922O399N839k217o548l798L777P583J680o807n195J883O184K868l054
$$ plain form
3162 2520 -3026 -5236 -607 4606 4303 -438 -3937 -3048 1299 5448 3640 -3058 -5404 -1045 4641
3177 4641 5397 191 -5918 -4477 4005 7720 1932 -5479 -5811 675 7114 5300 -3287 -7791 -1455
3192 -1455 5906 6036 -367 -5781 -4399 2438 6460 2108 -4537 -5075 -573 4211 4388 -529 -5601 -3889
3208 -3889 3097 5948 2296 -4292 -6709 -2006 5799 5881 -2060 -7008 -3763 3878 6741 1685 -6469
3223 -6469 -6681 1628 7381 3137 -4928 -7362 -1348 6014 6213 -1541 -7267 -4046 3376 5605 1364
3238 1364 -4246 -5827 -753 5331 3884 -1637 -4918 -2906 2469 5383 1864 -5359 -6027 -211 5730
3253 5730 4765 -1723 -6634 -3647 4616 6878 502 -6295 -5216 1775 6045 3136 -4315 -6520 -19
3268 -19 6530 4439 -1842 -5461 -2712 2856 5468 597 -4740 -3881 1228 4618 3758 -1038 -4740 -2873
$$ packed form
3162B520n546k210M629N213l03m741l499Q89M347M149j808o698k346M359N686
3177D641P56n206o109J441Q482L715n788p411l32O486O439j814q587m504O336
3192a455P361J30o403n414J382O837M022m352o645n38M502M784J77m917n072J712
3208c889O986K851l652o588k417M703P805Q2p941m948L245P641K863n056q154
3223f469k12Q309N753m244q065k434O014P362J99p754n726L221P422K229m241
3238A364n610j581N074O084j447n521l281K012N375K914l519p223o68N816N941
3253E730r65o488m911K987Q263K262o376o797J079O991M270k909p451k205O501
3268a9O549k091o281l619K749N568K612m871n337Q59N109L390q60m796l702J867
$$ plain form
3284 -2873 3367 5156 937 -3683 -4419 -73 4970 4817 -1855 -5653 -1775 4024 5336 465 -5107
3299 -5107 -4156 2473 5851 2032 -4331 -4320 546 4846 4194 -1133 -5184 -1759 3341 3864 656 -2464
3315 -2464 -3109 84 3653 2892 -870 -2938 -1260 1373 3310 1483 -2980 -3779 727 3865 2798 -1320
3331 -1320 -3956 -2328 2945 4855 -1 -4469 -2994 1686 3930 1808 -2253 -3678 471 3607 1992
3346 1992 -1882 -3140 -1403 1324 2478 525 -2458 -2045 446 1477 1577 -24 -2561 -2886 349 2366
3362 2366 764 -1784 -3048 -1613 2162 2960 -501 -3724 -2003 1412 2462 703 -2660 -3222 12
3377 12 3216 1229 -1704 -2363 -964 1157 1648 -565 -2475 -1741 418 855 890 12 -1624 -1787 514
3394 514 1905 1018 -961 -2193 -1493 1196 2792 60 -2935 -1711 1745 2563 985 -2133 -2953 335
$$ packed form
3284b873O240J789m219m620p36M346N043j53o672l798L878N799J312m871n572
3299e107R51O629L378l819o363J1M866M300o52n327m051L425N100N23l208l120
3315b464o45L193L569p61l762k068J678K633J937j827m463p99M506L138j067m118
3331a320k636J628N273J910m856m468J475M680K244k122m061j425M149L136j615
3346A992l874j258J737K727J154j953k983M13K491J031J00j601k537l25L235K017
3362B366j602k548j264J435L775P98l461l223J721L415J050j759l363n62L234
3377A2L204j987k933o59J399K121M91k213j910P34K159M37L5q78j636j63K301
3394E14J391q87j979j232P00K689J596k732k995J224L456Q18j578l118q20L288
$$ plain form
3410 335 3334 1723 -1752 -2484 -604 1719 2904 604 -1618 -1039 1074 1631 1161 89 -1195 -1225 1268
3427 1268 2647 1132 -851 -1567 -167 2478 3266 -371 -3048 -1662 2573 3742 1030 -2153 -2813 1036
3443 1036 4284 2317 -2224 -3094 -29 2785 2977 -179 -2752 -1207 2219 3080 713 -1269 -2117 -612
3459 -612 2103 2724 -120 -2547 -2194 766 2802 2145 -1580 -3417 -1183 3091 3060 -664 -3701 -3210 1261
3476 1261 4416 1224 -3594 -3285 830 3203 1971 -1974 -4145 -1379 2666 2669 -1141 -3334 -2365 938
3492 938 2945 1524 -2067 -3456 -1110 1320 2221 145 -3014 -3037 563 3399 1519 -2233 -4071 -1027
3508 -1027 2850 3505 -940 -5030 -2740 2546 4036 642 -3514 -3774 323 4061 2130 -2689 -4129
3523 -4129 -743 2897 2949 39 -3562 -2464 1778 3292 1301 -1565 -2876 -1066 2524 3362 -59 -2781
$$ packed form
3410C35K999j611l475p32J880K323J185k300k222N79K113N57m70j072j284l0K493
3427A268J379j515j983p16J400K645P88l637k677J386M235J169k712l183o60L849
3443A036L248j967m541q70L065K814J92l156k573J545L426Q61k367j982q48J505
3459f12K715O21k844k427L53K960K036o57l725j837K234M274l1l724l037M91M471
3476A261L155l192m818L09M115K373j232l945k171K766M045Ll810k193R69L303
3492I38K007j421l591j389K346K430R01k076l159k3L600K836j880l752j838L044
3508a027L877O55m445m090K290N286J490l394m156k60M097L738j931m819j440
3523d129L386L640N2k910l601J098M242J514j991k866j311J810L590Q38l421k722
$$ plain form
3539 -2781 -2065 1250 3485 2275 -2074 -4249 -530 3946 3259 -946 -3854 -2195 2607 4466 1257
3554 1257 -3631 -3097 1462 3850 2061 -1574 -3503 -747 3408 3121 -668 -2950 -1545 1462 2909
3569 2909 1674 -1691 -3159 -395 2402 2549 365 -2290 -2617 968 3847 2012 -2250 -3250 -645
3584 -645 2962 3179 -583 -4107 -2126 2947 3681 607 -3090 -3131 388 3776 2227 -2564 -3197 -227
3600 -227 2207 2599 -289 -2593 -2161 1178 2596 775 -1606 -2509 -1025 1412 2421 221 -2792 -2063
3616 -2063 747 2465 1510 -1651 -3745 -834 2763 2593 -1107 -3066 -1605 1815 3493 698 -3041
3631 -3041 -2893 761 2440 781 -1536 -2596 -1007 1911 1915 -447 -1996 -1385 367 1324 1265 -742 -2466
3648 -2466 -1084 1411 2088 368 -1681 -2540 -118 2556 1723 -1341 -2793 -718 1464 2224 -190 -2731
$$ packed form
3539b781P16L315K235j210m349k175L719M476o87m205k908J659M802J859l209
3554A257m888N34M559K388j789l635j929K756M155k87l789k282J405L007J447
3569B909j235l365j468K764K797J47k184k655l27L585K879j835m262j000K605
3584f45L607K17l762l524J981N073P34l074l697m1L519L388j549m791o33K970
3600b27K434L92k888k304M32L339J418j821k381r03J484K437J009k200l013P29
3616b063K810J718r55l161k094K911L597j70l700j959J461L420J678k795l739
3631c041J48L654J679j659k317j060J589K918Mk362j549O11J752R57n9k007j724
3648b466J382K495O77j720k049q59K422K674q33l064j452K075K182P60k414k541
$$ plain form
3664 -2731 -1610 1732 2365 205 -2054 -1905 -96 2266 1702 -1064 -2364 -350 1112 1492 1380 -800
3680 -800 -1482 171 1664 1008 -84 -1113 -1106 803 2527 1352 -1412 -1757 163 2193 2067 -43 -2543
3697 -2543 -1178 2148 2559 378 -1675 -1041 1113 2536 1585 -1329 -1907 351 1881 1669 135 -912
3713 -912 -993 968 2030 1206 -660 -964 -583 463 2189 583 -1376 -1491 807 2137 1312 -626 -2473
3730 -2473 -1066 2025 2393 -235 -2297 -961 781 2103 569 -1955 -2220 99 1947 529 -1314
3745 -1314 -1834 -1147 569 1288 -262 -2083 -1088 -270 925 1106 -788 -2378 -1973 486 1676 398 -1429
3762 -1429 -1902 -725 1949 1328 -1819 -2605 -960 1136 1613 -199 -2900 -2291 1170 2512 616 -1748
3778 -1748 -1860 -590 1360 1258 -435 -2081 -520 942 1004 573 -769 -1350 -132 1455 1217 -113 -1503
$$ packed form
3664b731J121L342O33k160k259J49J809K362n64k766j300K014J462L80j12k180
3680h00o82J653J493o56j092j029PJ909J724j175k764l45J920K030j26k110k500
3697b543J365L326M11k181k053O34K154J423r51k914n78K258J530k12j534j047
3713i12q1J961J062q24j866l04L81J046J726j606j959j15K298J330q25j938j847
3730b473J407L091L68k628k062J336J742J322j534k524k65K319J848j418j843
3745a314n20O87J716P19j550j821R95Q18J195J81j894j590M05K459J190j278j827
3762a429m73J177K674o21l147p86J645K096M77j812k701O09L461J342j896k364
3778a748j12J270J950j02j693j646J561J462O2m31j342n81J218J587k38j330j390
$$ plain form
3795 -1503 -1085 279 2488 1628 -1436 -1706 248 2287 1635 -355 -2379 -1300 2013 2563 -7 -2167
3811 -2167 -1593 932 2552 1490 -1420 -2106 127 1654 1055 -283 -1339 -798 679 1588 609 -983
3827 -983 -1347 -465 925 1545 27 -1833 -1635 832 2352 1307 -796 -1930 -826 1897 2118 -1138
3843 -1138 -2137 -1134 1169 1910 356 -2039 -1777 1046 2126 750 -1402 -1603 -615 844 1500 -114
3859 -114 -1285 -1050 367 1314 1142 166 -1348 -832 1194 1582 203 -1492 -1416 548 2359 1743 -1487
3876 -1487 -2427 -342 1725 1510 -172 -2019 -1299 1244 2077 -103 -1547 -1120 502 1875 727 -1005
3892 -1005 -1927 -400 1239 1022 488 -590 -924 -145 1293 1098 -274 -1404 -695 474 1333 679 -1448
3909 -1448 -2002 440 1902 1093 -967 -2278 -809 1581 2021 -518 -2421 -1483 1044 1784 518 -1271
$$ packed form
3795a503M18J364K209q60l064k70J954K039o52j990k024J079L313N50k570k160
3811b167N74K525J620j062k910o86K233J527n99j338j056N41J477R09r79j592
3827i83l64Q82J390O20j518j860J98K467J520j045k103j134J104K723K21l256
3843a138r99J003K303P41j554k395K62K823J080j376k152k01R88J459O56j614
3859a14j171K35J417R47j72r76j514N16K026L88j379j695P6J964J811o16l230
3876a487r40K085K067k15j682j847P20K543Q33k180j444M27J622J373j148j732
3892a005r22J527J639k17n34j078l34P79J438j95j372j130P09J169Q59o54k127
3909a448n54K442J462q09k060j311J469K390M40k539j903R38K527P40j266j789
$$ plain form
3925 -1271 -1752 277 1474 1109 -751 -1240 -454 633 1363 834 -864 -1333 -25 892 1304 319 -1492
3942 -1492 -1342 438 1653 634 -941 -1419 -231 1898 1683 -616 -2119 -633 1692 1856 185 -1447
3958 -1447 -1481 643 2022 764 -996 -1078 -90 802 1163 80 -1343 -903 807 1224 789 -269 -1307
3975 -1307 -724 967 1790 66 -1708 -1331 371 1650 1338 -1023 -1916 -231 2090 1153 -327 -1878
3991 -1878 -1321 1504 1949 -282 -1820 -1273 622 1479 1045 -641 -1733 -695 726 928 -96 -1160
4007 -1160 -1255 -474 1152 847 -621 -1914 -548 684 1078 424 -1623 -2023 231 2036 961 -1165 -1727
4024 -1727 -456 1530 1724 -989 -2469 -729 1263 1404 -30 -1258 -1681 452 1970 868 -996 -1336
4040 -1336 -360 395 1054 545 -1104 -907 488 1162 1141 -124 -1365 -892 1320 1932 -47 -1625 -1328 249
$$ packed form
3925a271m81K029J197l65j860m89P86J087P30n29j698m69J308R17M12r85j811
3942a492J50J780J215j019j575m78J188K129k15k299j503J486K325J64j671j632
3958a447l4K124J379j258j760q2R88Q92L61j083j423M40J710M17m35j058j038
3975a307N83J691Q23j724j774L77J702J279l12k361q93J685K321r37j480j551
3991a878N57K825M45k231j538N47J895Q57m34j686j092J038J421K02j024j064
4007a160r5P81J626l05j468j293J366J232L94o54k047m00K254J805j075k126n62
4024a727J271J986J94k713j480J740J992J41j434j228m23K133J518j102j864l40
4040a336R76P55O59n09j649J97J395O74k1j265j241M73K212O12j979j578K97J577
$$ plain form
4058 249 1950 1509 -1007 -1880 -142 2142 1457 -384 -1353 -686 1559 1863 564 -1571 -686 728 1517
4075 1517 1018 -342 -1185 -275 870 1295 201 -449 -855 -119 975 1104 -195 -1241 -200 1003 1131
4092 1131 350 -1345 -1429 489 2068 802 -1309 -1444 -436 1194 941 -497 -1807 -872 1269 1013 -310
4109 -310 -1093 -699 103 1106 622 -1090 -1120 -140 562 513 158 -926 -1030 -146 855 393 48 -937 -1073
4128 -1073 64 1155 -88 -1393 -722 72 909 570 -984 -1454 -265 1696 782 -808 -933 -493 647
4145 647 894 -71 -994 -686 255 541 72 -71 -502 -166 619 684 -39 -160 -487 -646 381 723 106 -1148
4165 -1148 -608 620 579 609 -550 -875 323 1205 380 -625 -680 -286 485 569 30 -985 -252 531 875
4184 875 -218 -112 -75 -159 243 444 -38 127 414 -84 216 472 30 -532 -405 571 569 713 -392 -1110 -428
$$ packed form
4058B49J701m41k516q73J738K284o85j841r69O67K245L04j299k135Q85J414P89
4075A517m99j360q43R10J145M25j094o50m06P36J094J29j299j046J041J203J28
4092A131p81j695q4J918J579j266k111j35J008J630k53j438j310R35K141k56j323
4109c10p83L94Q02J003m84j712l0R80P02m9l55j084j04Q84J001m62l45r85j36
4128a073J137J091j243j305O71P94Q37l39j554m70J189J961r14j590j25M40J140
4145F47K47r65r23L08R41K86m69j43m31L36P85O5p23j21l27j59J027L42o17j254
4165a148N40J228m1L0j159l25J198Q82q25j005n5L94P71Q4n39j015P33P83L44
4184H75j093J06L7q4M02K01m82J65K87m98L00K56m42n62J27R76kJ44j105p18O82
$$ plain form
4205 -428 1356 1057 -291 -730 117 606 694 -225 -704 -376 556 765 123 -344 -155 -120 757 1001 149 60
4225 60 -322 27 257 1009 544 -862 -475 650 741 699 -290 -907 -155 1381 953 -678 -920 -3 890 1196
4245 1196 163 -1267 -900 577 628 31 -781 -618 -422 549 837 -304 -646 -521 -83 317 -54 -436 -1163
4264 -1163 -670 536 777 55 -698 -1196 235 1256 494 -1068 -1159 -55 997 593 -577 -1832 -701
4281 -701 1228 1092 -812 -1336 -725 -82 967 306 -1225 -1260 -22 577 546 68 -1063 -1093 -117 1074 186
4300 186 -1019 -1505 -531 772 1399 -171 -1646 -847 677 1333 399 -1121 -1440 -16 1881 945 -1079
4317 -1079 -1376 -7 1319 1243 -203 -1518 -1310 695 1480 303 -1031 -733 80 1132 1146 -121 -988
4334 -988 -317 820 834 146 -700 -1299 132 1480 1026 -487 -953 -917 990 1889 579 -1554 -1270 1028
$$ packed form
4205d28J784k99j348m39Q47M89Q8r19m79L28R32K09o42m67J89L5Q77K44q52q9
4225F0l82L49K30P52m65j406L87J125R1m2r89o17P52J536m28j631k42R17Q93L06
4245A196j033j430L67J477N1n97q12J63J96R71K88j141l42J25M38M00l71l82p27
4264a163M93J206K41p22p53m98J431J021p62j562r1J104J052m04j170j255J131
4281g01J929j36j904n24O11O43J049o61j531l5J238N99l1m78j131l0R76J191q88
4300A86j205m86R74J303O27j570j475P99J524O56r34j520l19J424J897r36k024
4317a079k97J369J326p6j446j315K08K005P85j177j334K98Q13J052J4j267q67
4334i88O71J137J4o88q46n99J431J348m54j513m66L6J907Q99j310k133K84K298
$$ plain form
4352 1028 1676 886 -657 -1507 27 2010 1331 -786 -1691 -357 1113 1670 178 -1038 -895 526 1308
4369 1308 646 -453 -1032 -487 627 1440 97 -1150 -625 232 1297 965 -370 -1492 -392 1419 1057
4386 1057 -285 -1170 -1174 403 1865 365 -1251 -1124 347 1115 826 -655 -1136 -500 1322 862 -89 -1407
4404 -1407 -684 327 1344 569 -594 -919 -18 643 421 -279 -587 -758 243 1155 628 -551 -1038 126
4422 126 1117 946 -348 -1321 -608 1009 1042 29 -712 -666 507 1257 650 -1027 -946 608 992 636 -239
4441 -239 -899 -354 857 513 -138 -330 -155 233 -14 671 -72 -711 -225 568 447 228 -648 -800 -287 646
4461 646 598 -527 -814 -36 480 829 -49 -903 -392 424 695 -120 -207 -289 439 570 124 -790 -231 239 55
4482 55 -200 -126 -14 -266 199 -23 -696 -475 233 -77 -112 291 -136 -214 16 233 -72 -21 -200 -418 -279 379
$$ packed form
4352A028O48p90j543q50J534J983o79k117r05J334J470N57j492j216J43J421P82
4369A308o62j099n79N45J114Q13j343j247N25Q57J065l32j335j122J100J811l62
4386A057j342q85mJ577J462j500j616J27J471P68k89j481m81O36J822m60r51j318
4404a407P23J011J017p75j163l25R01O61k22p00l08j71J001R12n27j179m87J164
4422A26R91j71j294r73P13J617L3j013p41M6J173P50o07j677Q1J554L84l56q75
4441b39o60N45J211l44o51j92J75L88k47O85p43o39M86P93j21k19q76j52N13R33
4461F46m8j125k87P78N16L49q78q54N11Q16K71q15q7q2P28J31m46r14N59M70j84
4482E5k55P4J12k52M65k22o73K21P08l10l5M03m27p8K30K17l05N1j79k18J39O58
$$ plain form
4504 379 101 -394 -144 216 -201 -391 -167 -359 -196 602 -153 -620 -253 252 248 15 23 -532 237 625 128
4525 128 -669 -126 191 118 -199 -386 -508 -212 667 136 -611 -273 98 318 389 167 -266 -228 247 221 138 -60
4547 -60 -189 -360 234 504 -248 -508 -154 159 572 338 -663 -771 36 906 427 -721 -758 -307 866 1176
4567 1176 -359 -728 -586 677 757 -56 -834 -920 492 1225 -8 -390 -594 -137 467 665 256 -838 -749
4586 -749 85 1053 586 -138 -885 -506 472 927 -289 -1166 -285 390 967 434 -838 -1442 51 1744 624
4605 624 -854 -1139 143 888 1060 -427 -1382 -115 774 1303 400 -623 -1008 171 1124 771 -448 -781
4623 -781 -295 194 771 365 -724 -1071 26 1064 964 -382 -1439 -1114 1270 1428 -452 -1366 -860 635
4641 635 961 428 -1239 -1652 196 1289 713 -740 -908 -350 597 863 -307 -1099 -729 496 824 93
$$ packed form
4504C79k78m95K50L60m17j90K24j92J63P98p55m67L67N05mk33Qn55P69L88m97
4525A28p97N43L17p3l17j87j22K96Q79n31p47L38L71K20P1k22m33L8M75k6q3j98
4547f0j29j71N94K70p52k60L54L13M13k34j001j08Q07Q70m79j148l7M51J173L10
4567A176j535l69J42J263Q0q13p78q6J412P33j233l82k04M57O04J98m09j094Q9
4586g49Q34R68m67p24p47L79R78M55j216q77Q81O75N77n33j272o04J493J693j120
4605F24j478k85J282P45J72j487r55J267Q89N29r03j023l85J179R53l53j219l33
4623g81M86M89N77m06j089l47J097J038j00j346j057L25K384J58j880r14N06J495
4641F35L26n33j667m13J848J093n76j453j68N58R47K66j170p92L70J225L28p31
$$ plain form
4659 93 -522 -1302 -128 1009 773 -48 -1115 -648 268 1016 538 -1432 -1255 -11 1034 429 -427 -1574
4677 -1574 -653 1270 1239 -125 -1273 -604 410 1526 892 -1029 -1116 668 1789 595 -593 -1017 -306
4694 -306 834 1270 80 -1042 -337 543 1087 825 -316 -1001 -321 1077 1105 14 -990 -329 262 1262
4712 1262 847 -946 -1248 204 1529 895 -547 -1178 -404 1004 1151 -299 -933 -99 578 785 34 -942
4730 -942 -1161 656 1204 488 -621 -659 -360 460 685 198 -1044 -717 470 426 564 -35 -953 -417 803
4749 803 638 -326 -1009 -597 230 1004 288 -1067 -1311 151 734 552 -680 -1292 -308 786 994 -549
4767 -549 -862 -377 413 611 -171 -1059 -605 209 1059 -205 -520 -642 -332 314 275 -202 -571 -288 627 492
4787 492 127 -265 -618 97 971 402 -402 -801 49 424 649 117 -811 -562 808 754 -183 -655 -937 203
$$ packed form
4659I3o15p80J174J137k36q21j067M67R16P48m78j970J77J244J045o05q56j147
4677a574R21J923l1j364j148O69J014J116o34j921q7J784J121j194j188m24P11
4694c06J140M36j190j122P05Q80N44k62j141o85O80J398K8j091j004O61N91J000
4712A262m15j793l02J452J325o34j442o31P74J408J47j450o34Q34O77K07p51r76
4730i42k19J817N48p16j109l8K99Q20K25m87j242L27J187m4J38n99r18N36J220
4749H03j65r64o83M12Q27P74p16j355k44J462N83j82j232o12R84J094K08j543
4767e49l13M85P90J98p82q88M54Q14Q50j264l15j22L10O46l9m77l69K83R15j35
4787D92l65l92l53P15Q74n69q04l99Q50L75K25n32r28K49J370n4r37m72k82J140
$$ plain form
4807 203 697 439 -726 -860 -95 250 330 -590 -558 -714 400 570 -623 -879 -351 15 140 434 -406 -576
4827 -576 -205 463 184 -110 -505 -450 202 990 233 -851 -561 173 701 314 -197 -449 -164 826 824 -294
4847 -294 -649 -205 564 900 292 -789 -125 1054 749 66 -343 -339 253 798 646 -497 -587 76 409 510
4867 510 283 -234 -540 600 685 527 -581 -652 -152 681 794 274 -767 -1 622 549 430 -650 -842 288
4887 288 1523 438 -946 -1052 108 882 694 -299 -1209 -511 981 847 -220 -677 -680 377 885 409
4905 409 -702 -972 -161 705 243 22 -779 -529 282 1015 251 -909 -1081 -126 1079 709 -441 -1572
4923 -1572 -175 961 994 -174 -1060 -815 309 1264 571 -1026 -1051 342 1133 468 -465 -1324 -772 994
4941 994 1101 -502 -923 -905 122 1078 422 -860 -948 -89 825 499 -391 -951 -611 535 1093 221 -838
$$ packed form
4807B03M94k58j165j34P65L45Q0r20L2j56J114J70j193k56N28L66J25K94q40j70
4827e76L71O68k79k94l95N5O52P88p57j084K90P34N28l87n11k52K85R90kj118
4847b94l55M44P69L36o08j081O64J179l05o83m09MN92N45j52j143r0O63L33J01
4867E10k27n17l06J140Q5j58j108p1N00Q33J13n20j041P66O23p3j19j080j92J130
4887B88J235j085j384j06J160P74j88r93r10O98J492j34j067m57lJ057N08m76
4905D09j111k70Q11Q66m62k21q01K50Q11P33p64j160j72R55J205l70j150j131
4923a572J397J136L3j168q86K45J124R55o93j597k5J393P91o65r33q59N52J766
4941I94J07j603m21J8J027R56o56j282q8Q59R14l26q90n60L40J146N58q72j059
$$ plain form
4960 -838 -1016 224 972 769 -461 -1164 -233 1115 1105 -363 -1426 -557 350 1336 656 -1209 -773 618
4978 618 763 616 -731 -1241 -43 1038 891 -222 -776 -554 632 1071 668 -543 -1152 187 932 662
4996 662 12 -980 -697 574 1449 -67 -1018 -704 389 1035 968 -551 -1249 -118 1488 940 -431 -864
5014 -864 -472 629 1163 -69 -1245 -529 786 977 229 -503 -1071 -61 1096 1084 -508 -755 -372 627
5032 627 694 291 -995 -1039 305 819 287 -453 -977 -534 879 971 -34 -1050 -494 805 1260 127 -696
5051 -696 -1122 568 1144 439 -746 -1180 -372 746 848 -454 -1272 -632 837 901 -89 -739 -835 -78 658
5070 658 780 -241 -1069 -72 290 783 372 -813 -678 628 1190 204 -744 -793 -56 891 956 -438 -1072
5089 -1072 -532 797 627 -3 -915 -887 597 1055 -61 -929 -778 269 785 822 -250 -926 -426 682
$$ packed form
4960h38j78J240P48k03j230p03R31J348j0j468j063Q69R07R86o80j865M36J391
4978F18J45j47j347n10J198J081j47j113n54K22J186M39m03j211o09J339P45k70
4996F62o50r92K83J271Q75j516r51L14J093O46o7j519o98J131J606n48j371m33
5014h64L92J101N34j232j176P16J315J91p48p32n68J010J157j2j592k47L83R99
5032F27O7m03j286m4J344N14n32p40n24M43J413R2j005j016N56J299M55j133q23
5051f96m26J690N76p05j185m34Q08J118J02j302q18O40J469O4r90o50r6P57P36
5070F58J22j021q28R97L62M93m11j185J35J306N62r86r48m9P37R47O5j394o34
5089a072N40J329j70o30r12K8J484M58j116q68J51J047N16L7j072o76N00J108
$$ plain form
5107 682 701 49 -886 -608 256 1071 504 -389 -729 -29 714 650 -340 -1123 -743 600 1323 160 -1038 -558
5127 -558 129 986 821 -415 -1275 89 1187 790 -166 -841 -448 590 1147 -34 -804 -794 236 1177
5145 1177 374 -713 -890 -411 1029 663 -281 -857 -548 692 966 227 -742 -871 399 935 617 -13
5163 -13 -801 -590 1093 894 -285 -1024 -435 596 1026 389 -855 -1117 167 1097 285 -495 -1206 -643 878
5182 878 935 -327 -1040 -548 625 795 275 -659 -803 -65 934 283 -412 -813 -355 186 1095 178 -926
5201 -926 -763 548 1016 485 -532 -977 -280 802 891 -468 -1190 -164 540 1080 209 -1054 -1108 464
5219 464 1343 60 -502 -876 -189 770 707 -203 -934 -234 746 828 213 -648 -821 402 1015 473 -829 -668
5239 -668 -32 822 911 112 -1093 -705 491 879 386 -1061 -1019 -92 1092 444 -783 -1248 -166 756 723
$$ packed form
5107F82J9o52r35K78Q64Q15n67q93l40P00P43o4r90p83L80J343P23j163j198M80
5127e58O87Q57j65j236q60J364J098l97r56o75L93J038N57j181p70J0J030R41
5145A177q03j087j77M79J440l66r44n76L09J240K74p39r69j29J270N36l18o30
5163a3p88K11J683j99j179p39N89J031M30o37j244k62J284R30q12p80p11N63J521
5182H78N7j262p13M92J173J70n20r34j44P38R99o51o95m01M58N41R09r17j104
5201i26J63J311M68n31j017m45O97J082Q9j359p22J026P04N40q71j263n4J572
5219D64Q79j283n62l74O87R59o3r10p31P00R80Q2o15q61j73J223O13n42j302J61
5239f68O36Q54Q9p99j205L88J196L88m93j447M2R27J184o48j227m65J082R22l3
$$ plain form
5258 723 -115 -1099 -667 470 1444 165 -736 -562 37 922 589 -446 -1203 -385 849 712 106 -979
5276 -979 -641 636 1110 206 -1045 -894 240 677 734 -204 -1060 -656 427 1079 -511 -944 -800 191 1104
5295 1104 453 -827 -1109 123 1024 337 -368 -1093 -502 609 1097 -265 -1135 -519 494 972 601 -653
5313 -653 -1197 214 1184 622 -263 -887 -354 321 806 92 -906 -895 69 579 521 -474 -1219 -590 1224 796
5333 796 -351 -1222 -595 609 1174 85 -984 -972 340 1029 451 -442 -835 -216 1014 1032 -408 -671
5351 -671 49 1107 959 -178 -722 -763 322 1109 354 -545 -422 -11 417 1065 250 -1215 -545 860 840
5370 840 423 -941 -983 -109 1265 863 -464 -924 -251 955 1088 35 -1174 -756 776 1242 308 -763
5388 -763 -937 254 1382 576 -803 -772 23 934 1149 271 -624 -631 413 638 330 -708 -916 75 818
$$ packed form
5258G23q38r84M32J137R74j279r01J74N99Q85l33j035p57Q18J234j37o06j085
5276i79L38J277M74r04j251J51J134M37N7r38q56M04J083O52j590m33J44R91R13
5295A104o51j280k82J232R01o87p05p25N91J111M88j362q70O16J013M78l71j254
5313f53n44J411R70n62q85o24N33O75M85p14r98J1R64N10n8r95p45O29J814m28
5333G96j147q71O27J204N65j089j069J2J312O89n78q93l93O19J230J8j440k63
5351f71P20J058j48j137n44m1J085P87p55q99J23M11M28O48q15j465O70J405k0
5370H40m17j364m2Q74J374m02j327m60O73J206J33j053j209M18J532M66r34j071
5388g63j74J191J128q06j379L1P95R11K15q78q95pJ044K25l08j038k08R91P43
$$ plain form
5407 818 927 -420 -1306 -181 1045 890 159 -1172 -1067 138 1284 479 -1109 -1004 -6 896 743 -20
5425 -20 -1701 -718 983 1137 -44 -1022 -710 221 951 908 -821 -1512 -159 943 679 -281 -947 -719 804
5444 804 1136 274 -1154 -1139 -157 1256 1005 -586 -1800 -258 1101 1274 -312 -1269 -1074 397 1396 67
5462 67 -1051 -1102 57 1046 621 -444 -1476 -634 901 1158 -223 -833 -851 139 1405 486 -1140 -821
5480 -821 51 983 591 -614 -1177 -837 366 1296 270 -1155 -1078 99 1139 956 -775 -1342 -389 1174
5498 1174 931 -453 -1199 -485 736 1284 409 -976 -860 357 1269 978 -773 -1105 11 955 995 -200
5516 -200 -692 -709 782 941 399 -673 -777 154 878 671 -465 -923 -333 920 1235 -80 -997 -878 540
5535 540 769 656 -585 -1095 -93 1207 918 -456 -1023 -320 786 1211 156 -1189 -845 406 1177
$$ packed form
5407H18J09j347q86J125J226j55p31j331J05J205J146q05j588J05R98R02j53p63
5425b0j681R83J701J54j181r78L12R31P30m3j729o91J353J102k64r60o66K28J523
5444H04L32q62j428J5R82J413k51j591j214J542J359J73j586r57J95J471R99j329
5462F7j118n1J159R89m25j065j032Q42J535K57j381o10j8R90J266r19j626L19
5480h21Q72R32l92j205n63L40J203R30j026j425P7J177J040j83j731n67R53J563
5498A174k43j384p46P14J221N48q75j385J16J217R12k91j751l32J116R44M0j195
5516b00m92j7J491J59n42j072j04R31P24k07j136m58N90J253L15j315r17J19J418
5535E40K29j13j241n10J002J300k89j374n67P03J106M25j055j345L44J251P71
$$ plain form
5552 1177 318 -251 -1083 -135 988 734 -218 -792 -393 479 715 264 -748 -1095 342 792 281 -361 -1115
5571 -1115 -405 939 1059 -541 -1027 -562 575 792 353 -782 -1235 337 1367 459 -676 -739 -29 728
5589 728 695 -224 -868 -712 504 939 26 -629 -855 320 742 749 -768 -1132 305 438 566 143 -732 -438
5609 -438 482 866 248 -655 -683 58 941 524 -518 -1105 -99 886 812 -199 -558 -673 646 908 401
5628 401 -772 -1012 454 725 465 -529 -1239 -242 675 944 37 -764 -503 486 975 350 -768 -858 645
5647 645 975 513 -18 -763 -36 939 922 -206 -995 -423 287 870 654 -733 -1259 366 767 579 -601
5666 -601 -1096 -321 791 938 -168 -1362 -615 545 1318 788 -722 -1035 -17 1059 475 -602 -1138
5683 -1138 -400 635 915 -263 -1351 -496 726 1245 90 -607 -865 32 1061 880 -632 -898 -260
$$ packed form
5552A177q59n69q32R48J123k54r52n74L99Q72K36m51j012l47J437M50n11o42p54
5571a115P10J344J20j600m86M65J137K17m39j135m53J572J030r08j135o3P10P57
5589G28l3r19o44J56J216M35r13o55k26J175M22Pj517l64J437J33J28m23q75K94
5609d38R20L84o18r03k8P41Q83m17j042n87J006R85p4j011l59j15J319K62n07
5628D01j173k40J466K71k60r94p10R97R17K69r07q01K61R89M89o25j118r0J503
5647F45L30m62n31p45P27R75j7j128p89N72P10N83k16j387n26J625M01j88j180
5666f01m95P75J112J47j106j194P47J160P73n30j510l13J018J076n84j077n36
5683a138P38J035K80j178j088Q55J222N19j155o97k58Q97J029j81j512k66O38
$$ plain form
5700 -260 755 861 270 -1047 -971 435 1387 275 -784 -1126 -20 1186 989 -795 -1556 -171 1067
5717 1067 1152 208 -1105 -1169 283 1115 495 -865 -1153 -77 944 846 -255 -1252 -556 645 1127 49
5735 49 -1084 -1109 -165 1151 1088 -1218 -1270 -206 1017 1046 -87 -1514 -972 960 1576 294 -1245 -1166 -137
5754 -137 1335 885 -846 -1485 -703 1076 1264 -1 -1068 -996 463 1414 242 -693 -1117 72 940 713
5772 713 -568 -1276 -609 760 1108 132 -825 -1245 -94 1359 984 -630 -1531 -365 1361 1390 37 -1549
5790 -1549 -973 917 1915 43 -1083 -1268 549 1525 1063 -809 -1377 -182 1249 1056 -155 -966 -894
5807 -894 396 1617 528 -1088 -838 26 1013 776 -202 -1283 -620 661 1158 -7 -1155 -1171 296
5824 296 1313 910 -969 -1530 231 1213 891 -356 -1388 -582 783 1432 347 -1123 -823 51 1099
$$ packed form
5700b60J015J06n91j317P6J406R52j112j059l42J106J206j97j784p61J385J238
5717A067Q5r44j313o4J452Q32o20j360k88J076J021r8j101r97O96J201M82j078
5735D9j133k5R44J316o3k306n2J064J223K9j133j427N42J932O16j282j539P9J029
5754a37J472m50j731o39P82J779J88j265j067P2J459R51j172r35m24J189Q68k27
5772G13j281p08O67J369L48r76r57m20J151J453l75j614r01J166J726K9j353j586
5790a549N76J890R98j872j126j85J817R76m62j872n68J195J431j93j211q11P2
5807h94J290J221j089j616K50Q64R87k37r78j081O63J281M97j165j148j6J467
5824B96J017m03j879n61J761R82l22j247j032Q06J365O49j085j470L00Q74J048
$$ plain form
5841 1099 762 -206 -1336 -269 1048 1075 125 -921 -845 86 1078 541 -831 -1057 232 1183 903 -493
5859 -493 -1553 -571 661 877 -211 -790 -653 731 1212 681 -756 -1219 -89 1049 775 -271 -910
5876 -910 -618 858 1121 -145 -878 -640 423 854 375 -489 -818 186 862 614 -489 -1050 -762 738
5894 738 900 -36 -948 -795 103 906 310 -302 -940 -97 744 744 -322 -916 -258 811 968 216 -970 -737
5914 -737 574 1076 146 -696 -867 -348 982 674 -137 -753 -328 503 544 145 -214 -694 313 964 339
5933 339 -640 -918 -214 491 699 -280 -847 -361 779 444 3 -503 -701 404 703 214 -1080 -584 -39
5952 -39 417 698 -238 -986 -235 671 822 -12 -769 -104 165 876 375 -508 -756 257 911 385 -455 -761
5972 -761 -716 217 694 151 -969 -518 227 773 258 -526 -994 -201 1249 674 -225 -546 -650 580 727
$$ packed form
5841A099l37r68j130J067J317K7r50j046P6R31R92n37j372k26J289R51k80j396
5859d93j060R82J232K16j088n79J37J384M81n31j437m63J130J138k74j046o39
5876i10K92J476K63j266p33K38J063M31m79q64l29J004O76k48j103n61K88J500
5894G38J62r36r12J53Q98Q03n96o12o38Q43Q41%j066n94O58J069J57p52j186K33
5914g37J311N02r30q42j71N19J330l08q11o16M25Q31M1l99l59m80J007O51o25
5933C39r79k78P04P05K08r79n67M86J140l35m41n06j98J105K99m89j294M96N45
5952c9M56K81r36p48P51R06J51q34p57O65K69P11n01q83k48J013O54n26q40l06
5972g61M5R33M77n43j120M51P45N46n15p84m68P93J450n75q99l21j04J230J47
$$ plain form
5991 727 -23 -1122 -948 407 947 367 -650 -1041 -291 1264 809 -428 -1445 -326 707 1108 327
6008 327 -1076 -968 282 1112 551 -909 -853 -154 1094 717 -378 -1454 -398 879 1073 497 -799
6025 -799 -896 373 1506 811 -729 -995 -184 720 1263 -170 -875 -774 794 1176 720 -714 -1211 255
6043 255 1381 1187 -617 -1149 -423 859 1165 133 -1476 -968 548 1376 530 -973 -1337 117 969
6060 969 1159 -537 -1420 -635 929 1080 200 -1188 -1536 229 1138 721 -1026 -1391 -520 1084 1239 83
6078 83 -1471 -855 903 1361 95 -1307 -1224 -43 1373 930 -1064 -1616 -153 969 1008 124 -1645 -854
6096 -854 488 1249 769 -922 -1328 -87 1273 1335 -349 -1574 -560 841 1062 479 -797 -1475 34
6113 34 1535 794 -605 -1145 -282 1098 1254 -124 -1308 -783 1034 1621 129 -1310 -1195 343 1476
$$ packed form
5991G27p50j099J74J355N40n80j017l91P50J555m55j237j017J119J033M01p81
6008C27j403J08J250Q30n61j460N6O99J248l77j095j076J056J277J94n76j296
6025g99r7J269J133o95j540k66Q11R04N43j433p05J01J568L82m56j434m97J466
6043B55J126j94j804n32P26J282L06j032j609N08J516Q28q46j503l64J454Q52
6060I69J90j696q83P85J564J51q80j388l48J765R09m17j747l65Q71J604J55j156
6078H3j554O16J758M58j266j402Q3J181J416m43j994n52J463J122L9q84j769P91
6096h54J342P61m80j691m06J241J360O2j684j225J014J401K21n83j276o78J509
6113C4J501p41j399n40Q63J380J56j378j184N25J817N87j492j439J15J538J133
$$ plain form
6130 1476 905 -846 -1497 -279 1206 1203 205 -1285 -1018 600 1489 208 -1037 -1081 -119 1240 1290 -414
6148 -414 -1311 -626 728 1139 374 -980 -1070 717 1588 827 -828 -1375 -107 1204 1301 25 -1058 -782
6166 -782 1109 1186 7 -983 -1179 -83 1197 897 -627 -770 -193 698 1084 62 -971 -1044 274 913
6184 913 360 -945 -1192 85 917 941 -448 -1269 -311 632 952 353 -1042 -1070 307 1545 346 -893
6202 -893 -839 -80 659 772 -556 -1046 -489 570 880 57 -692 -630 40 729 295 -649 -992 73 550 275
6222 275 -286 -952 -630 315 841 -268 -818 -823 452 731 195 -781 -605 -108 695 496 -194 -839 -553 444
6242 444 690 -84 -827 -370 409 1064 6 -36 -590 197 634 470 -366 -329 -226 532 633 159 -842 -558
6262 -558 364 626 286 -433 -402 120 626 876 -531 -681 -53 404 693 11 -399 -603 294 954 -53 -628
$$ packed form
6130A476n71j751o51J218J485lr98j490K67J618Q89j281j245m4R62J359N0j704
6148d14q97O85J354M11p65j354r0J787Q71p61j655n47J268J311R7j276j083K76
6166g82J891P7j179r90j96J096J280l00j524j43N77Q91L86j022j033p3J318O39
6184I13n53j305k47J277Q32K4j389q21R58R43L20n99j395k8J377J238j199j239
6202h93N4P59P39J13j328m90N57J059L10q23p49O2O70O89m34r44l43J065M77k75
6222B75n61o66L22R45N26j109n50nJ275K79n36r76J76M97Q03j99o90o45K86R97
6242D44K46p74p43M57P79O55j058m2n54P87M37j64q36L7J03P58J01m74j001K84
6262e58R22K62l40p19L1N22N06K50j407j50O28M57K89o82m10k04Q97O60j007n75
$$ plain form
6282 -628 -454 194 881 532 -402 -841 46 702 707 -135 -692 -184 551 1024 323 -902 -559 37 629 699 -333
6303 -333 -852 -20 882 794 -399 -600 -580 224 1023 559 -927 -915 147 931 593 -552 -887 -468 941
6322 941 1076 -148 -1016 -643 552 823 459 -829 -1149 41 1163 680 -715 -1330 -340 692 1234 81
6340 81 -1271 -1149 677 859 209 -939 -1061 52 1394 522 -444 -1050 -548 797 1245 195 -1336 -1109
6358 -1109 351 1092 685 -907 -1435 -437 1015 1488 -380 -1452 -1111 685 1072 519 -962 -1562 30
6375 30 1409 885 -684 -1610 -575 1051 1362 37 -1106 -880 409 1348 567 -966 -1359 -284 1146
6392 1146 1148 -623 -1608 -384 763 1226 298 -1368 -1188 469 1556 692 -930 -1413 -506 1083 1322 -142
6410 -142 -1474 -954 952 1741 602 -1152 -1440 184 1664 1085 -786 -1084 -474 806 1796 -113 -1368
$$ packed form
6282f28J74O48O87l49r34m39Q87O56Nq42n57N08P35M73p01j225L43N96N92P0j032
6303c33n19Q32R02q8j193k01K0Q04P99m64j486J2J062P84l38j145l35M19J409
6322I41J35j224q68L73J195K71l64j288l20J190J122m83j395o15R90J032N42j153
6340H1j352J22J826J82o50j148j22J113J342q72r66o06N02J345M48j050j531K27
6358a109J460P41m07j592n28R98J452M73j868j072L41J796L87n53j481o00J592
6375C0J379n24j569r26J035J626L11j325j143K26J289R39p81j533l93J075J430
6392A146Kj771r85J224J147M63r28j666J80J657J087q64j622m83R07J589K39j464
6410a42j332N20J906P89j139j754k88J624J480n79j871k98O10J280R90j909j255
$$ plain form
6427 -1368 -831 769 1429 488 -613 -1156 -227 1441 1126 -660 -1003 -564 871 1298 463 -1127 -1015 414
6445 414 1448 579 -705 -1297 -605 1159 1659 36 -1336 -700 516 1301 618 -914 -1488 -289 1229
6462 1229 1039 -258 -1232 -474 801 1422 337 -994 -815 249 1146 508 -639 -1433 -283 828 1120
6479 1120 -472 -1285 -707 251 1127 420 -824 -1257 555 1456 520 -521 -1249 -571 754 1051 115 -982
6497 -982 -732 670 961 356 -360 -647 94 1028 814 -604 -756 -467 367 788 170 -1074 -857 290 719
6516 719 191 -294 -902 -52 684 769 -159 -944 -322 497 802 -101 -684 -990 381 605 334 -784 -834 -11
6536 -11 630 835 -192 -904 -257 257 684 -77 -379 -745 191 827 482 -516 -724 -47 745 532 -139 -600
6556 -600 -592 270 253 57 -350 -397 -134 662 73 -507 -369 -53 611 413 -182 -336 80 597 545 28 -787 -525
$$ packed form
6427a368N37J600O60r41j101n43R29J668l15j786l43M39J435M27q35j590J12J429
6445D14J034q69j284n92O92J764N00j623j372O36J216P85o83j532n74J199J518
6462A229j90j297r74P58J275O21j085j331J79J064Q97o38j147p94J150J111K92
6479A120j592q13N78R58Q76p07j244m33J812R01r36j041p28O78J325K97r36j097
6497i82K50J402K91o05p16k87P41R34k14j418j52K89Q34M21o18j244K17J147M29
6516G19n28m85o08Q50P36Q5r28p85O22Q19L05r03n83l06J371K24k71j118n0Q23
6536a1O41K05j027p12O47N14M27p61l02l66R36O36l45r98k08O77P92k13o71m61
6556f00QQ62j7j96m07m7K63P96n89n80J38L16O64j98n95j54M16N17n2n17q15K62
$$ plain form
6578 -525 400 583 92 -582 -677 289 484 441 -309 -345 -130 348 495 -354 -745 -125 537 320 -28 -567 -363
6599 -363 239 804 188 -738 -416 350 388 460 -87 -1162 -447 644 903 75 -481 -488 89 940 623 -606
6619 -606 -1030 67 867 636 -435 -672 -372 626 1222 168 -441 -656 -374 945 566 -631 -1191 -127
6637 -127 931 694 -71 -795 -664 273 992 51 -1083 -680 504 936 510 -536 -1391 -248 1150 909
6655 909 -265 -734 -499 399 1356 432 -896 -1036 248 1402 910 -626 -1181 -587 850 1531 161 -1201
6673 -1201 -906 368 1475 642 -633 -1037 -304 1131 906 -314 -1116 -925 875 1424 104 -1195 -1125
6690 -1125 757 994 877 -550 -1559 -414 1122 1221 -209 -1175 -968 516 1372 492 -1140 -1456 95
6707 95 1505 830 -328 -1525 -1069 1094 1379 -151 -1276 -921 340 1264 594 -1226 -1579 -28 1483
$$ packed form
6578e25R25J83m91o74r5R66J95m3p50l6K15M78J47q49l91O20O62k17l48n39K04
6599c63O02N65o16r26L22P66L8P2n47j075P15J091K59q28n56pN77Q51l17j229
6619f06m24J097Q00k31j071k37L00R98N96j054o09k15K82J319l79j197n60J064
6637a27J058k37p65p24J31R37P19r41j134M03J184M32m26j046q55J143J398k41
6655I09j174m69K35Q98R57r24j328j40J284J154m92j536n55N94J437O81j370j362
6673a201K95J274J107q33j275m04P33J435k25j220q02J91J800N49j320j299P0
6690a125J882K37j17j427j009J145J536R9j430r66K07J484Q56q80j632l16J551
6707I5J410o75j158j197M56K163K85j530j125L55J261R24o70j820l53J551J511
$$ plain form
6724 1483 932 -684 -1330 -875 604 1531 368 -1445 -1148 -23 1387 765 -660 -1411 -285 1258 1235
6741 1235 -561 -1617 -1106 440 985 455 -940 -1494 141 1248 1025 -156 -1111 -312 896 1471 -160
6758 -160 -1447 -1276 375 1345 1021 -576 -1241 -180 971 1140 -304 -1262 -555 784 1348 265 -1260
6775 -1260 -1092 188 1022 1102 -494 -1510 -714 1082 1163 -23 -950 -1088 519 1520 727 -829 -1059 90
6793 90 1184 1045 -157 -975 -623 902 1331 128 -1015 -680 215 1339 666 -456 -1427 -291 1147
6810 1147 850 -476 -826 -674 534 1456 280 -703 -634 315 977 978 -304 -777 -349 983 981 -294 -797
6829 -797 -376 383 923 535 -692 -1137 132 987 420 -474 -430 -425 341 868 -90 -678 -459 -24 745 455
6849 455 -459 -602 -166 846 620 -257 -322 -131 337 873 71 -471 -575 57 305 94 -727 -858 -193 531
$$ packed form
6724A483n51j616o46M55J479R27j163j813K97J125J410o22j425p51J126J543k3
6741A235j796j056N11J546N45n30j395n54J635J107k23j181r55P99J208N75j631
6758a60j287J71J651R70l24j597o65J061J151J69j444r58P07J339N64j083j525
6775a260J68J280Q34Q0j596j016P96J796Q1j186r27j38J607J001p93j556k30J149
6793I0J094j39j202q18L52J525M29j203j143L35Q95J124o73j122r71J136J438
6810A147k97j326l50J52J208R22j176r83O9R49O62Jj282m73M28J332kj275n03
6829g97M21P59N40l88j227m45J269Q55n67q94M4NP66N27r58n88K19M35P69k90
6849D55r14j43M36J012k26q77o5J91M68N36q02n42j04O32K48k11q21j31O65P24
$$ plain form
6869 531 403 -333 -641 -346 179 437 -93 -619 3 219 486 -181 36 -576 189 497 386 -333 -749 -133
6889 -133 480 195 -189 -674 -397 221 829 120 -646 -287 110 339 180 -427 -719 24 669 429 -498 -525
6909 -525 24 194 600 33 -497 -342 235 406 80 -335 -779 -204 678 624 -355 -573 147 734 426 220
6929 220 -728 -379 495 773 160 -783 -305 -68 389 559 -242 -794 -161 547 435 252 -869 -894 495 1092
6949 1092 161 -632 -629 -64 901 884 -333 -1122 -269 815 984 -179 -815 -673 323 1003 639 -738 -1183
6968 -1183 137 1147 702 -306 -1174 -883 944 988 296 -712 -791 410 1169 987 -993 -1291 115 1109
6986 1109 763 -473 -939 -900 603 1184 151 -1051 -1212 -39 920 829 -476 -1366 -491 939 1003 -108
7004 -108 -1209 -1210 69 1113 594 -1000 -1376 -176 1327 1127 -475 -1649 -875 1179 1341 -3 -1046
$$ packed form
6869E31j28p36l08K95N25K58n30n26O22K16K67o67K17o12P65L08j11p19m16O16
6889a33O13k85l84m85K77O18O08p09p66L59L97K29j59o07k92P43O45k40r27k7
6909e25N49J70M06n67n30J55N77J71l26m15m44N75Q82n4r79k18P20N87l08k06
6929B20r48L49Q74K78o13r43M78K37M57J70q01n52O33P08j12j83j121k5J389N97
6949A092r31p93LN65R65j7j217p89Q53J084J69j163o36J42R96O80l64j377m45
6968a183J320J010m45j008q68K91J827M4o92j008p9J201P59j82j980k98J406R94
6986A109l46j236m66L9J503N81j033j202j61J173R59r1j305q90Q75J430O4j111
7004a08j101jJ279J044n19j594l76J200J503k00j602j174P74K054J62j344j043
$$ plain form
7021 -1046 -810 388 1595 782 -457 -1419 -392 1043 1360 -52 -1016 -798 595 1542 606 -1170 -1367
7038 -1367 -87 1256 812 -464 -1520 -556 1033 1299 334 -1123 -1338 250 1454 794 -909 -1456 -499
7055 -499 969 1093 -336 -1162 -859 719 1498 567 -910 -1319 187 1225 803 -438 -1273 -524 1193
7072 1193 1428 -18 -1397 -1026 400 1155 823 -828 -1117 -104 841 984 -324 -1430 -890 712 1115
7089 1115 592 -1165 -1049 352 1342 845 -569 -993 -70 701 930 77 -936 -775 331 1150 459 -918
7107 -918 -875 117 926 1000 -628 -1003 -381 747 1173 -13 -853 -1036 207 1265 302 -897 -813 -190 917
7126 917 777 -305 -852 -679 530 999 -215 -850 -569 -19 890 1055 -314 -1104 -14 675 914 -247
7144 -247 -864 -678 350 882 382 -779 -413 -26 854 722 -404 -963 -438 555 564 -40 -766 -487 255 851
$$ packed form
7021a046K36J198J207q13j239r62J027J435L17j412r64K18J393R47r36j776j97
7038a367J280J343m44j276j056R64J589K66r65j457k15J588J204o60j703n47R57
7055d99J468J24j429q26L03J578P79r31j477m09J506J038m22j241q35P49J717
7072A193K35j446j379L71J426P55l32j651k89J013R45J43j308j106N40J602M03
7089A115n23j757J16J401R90m97j414m24R23P71K29q53j013J61J106Q19o91j377
7107i18M3R92Q09P4j628l75O22J128M26j186q40j83J243J058r63j199Q4O23J107
7126I17j40j082n47J73J209M69j214o35K81N50R09J65j369p90J090O89K39j161
7144b47o17J86J028N32n00j161L66L87Q80j32j126n59N25R93Ro04p26K79P42N96
$$ plain form
7164 851 258 -315 -638 41 571 537 -473 -550 -386 484 457 -288 -537 2 -109 499 385 -656 -326 172
7184 172 175 181 -150 -274 -105 552 321 -227 -571 -263 274 356 372 -651 -413 0 477 124 -375 -324 139 355
7206 355 311 -368 -628 -42 227 398 -107 25 -425 -9 220 97 -616 -129 223 630 307 -15 -741 -90
7226 -90 553 549 -222 -547 -312 131 615 184 -154 -439 -52 236 -39 -480 -579 -173 317 496 -104 -792 -191
7247 -191 531 382 45 -633 -248 176 742 138 -609 -634 -166 717 434 15 -732 -438 220 706 -156 -925
7267 -925 -545 52 709 506 -766 -951 -138 861 572 4 -1083 -558 489 729 222 -539 -846 64 1314
7286 1314 706 -392 -1325 -138 753 724 13 -1076 -796 826 1134 365 -1197 -968 215 1125 881 -498
7304 -498 -872 -573 980 860 565 -585 -817 395 1354 846 -805 -1210 -221 931 1108 263 -1251 -895
$$ packed form
7164H51n93n73l23O79N30l4j010p7J64Q70k7p45k49N39j11O08j14j041L30M98
7184A72LOl31j24J69O57k31n48l44L08N37Q2J6j023K38M13M77l53m99N1M63K16
7206C55m4o79k60N86K69J71n05J32m50M16K29j23p13M87L52M07l23l22p26O51
7226i0O43mp71l25K35M43M84m31l38k85L87K88k75m41r9M06M90J79o00o88O01
7247a91P22j49l37o78L85M24N66o04p47k5M68Q83k83m19p47K94O58M86q62p69
7267i25L80N97O57k03j272j85Q13R99k89n68j087N25J047K40n07p61l07R10J250
7286A314o08j098r33J187Q91k9p11j089K80J622L08p69j562K29J183R10k44j379
7304d98l74K99J553j20k95j150k32J212R59n08j651m05R89J152J77q45j514L56
$$ plain form
7322 -895 519 1345 234 -724 -1011 245 1225 1062 -537 -1334 -577 1077 1054 83 -1012 -1128 455 1199
7340 1199 634 -582 -1450 -381 805 1131 -222 -1232 -759 831 1206 344 -877 -1224 176 1332 1023
7357 1023 -585 -1335 -197 800 1072 -134 -1343 -878 417 1186 446 -902 -1136 -245 963 871 -370
7374 -370 -1457 -570 658 1142 347 -1267 -902 179 1339 755 -1075 -1284 -289 805 998 24 -1293
7391 -1293 -525 578 1058 227 -744 -1244 -137 1244 806 -636 -1410 -510 598 1021 341 -979 -1068 339
7409 339 1046 576 -661 -814 -168 845 1086 10 -1055 -471 881 1255 315 -850 -997 185 746 348
7427 348 -232 -1093 -287 659 964 232 -1049 -677 377 1023 249 -510 -678 -6 987 1113 -199 -966 -245
7446 -245 686 1213 -30 -798 -549 59 809 406 -488 -778 -429 730 563 1 -475 -377 161 652 534 -503
$$ packed form
7322h95J414Q26j111r58k87J256R80j63j599p97P57J654k3r71j095j16J583P44
7340A199n65j216q68J069J186L26j353j010M73J590L75q62j221l47J400J156l09
7357A023j608p50J138R97K72j206j209M65J295P69p40j348k34Q91J208r2j241
7374c70j087Q87J228M84p95j614L65J081J160n84j830k09R95J094J93r74j317
7391a293P68J103M80q31r71n00J107J381m38j442p74R00J108M23o80j320q9J407
7409C39P07m70j237j53O46J013K41j076j065N84J352L74r40j165j47J182N61l98
7427C48n80q61Q06R46L05p32j281L72J054O46p74p59j68O72R93J26j312p67P21
7446b45R31N27j243p68K49O08P50m03q94k90L49J159j67n62m76R8N38M91j18j037
$$ plain form
7466 -503 -665 116 483 88 -459 -624 -61 368 650 31 -713 -736 366 502 -38 -469 -438 148 687 444
7486 444 -522 -437 -319 598 391 -81 -760 -320 107 328 -143 -126 -470 -44 257 329 -413 -606 -379 557 491
7507 491 -38 -450 -319 201 154 -12 -193 70 -58 90 35 -214 -54 124 509 413 -426 -651 -114 -178 290
7528 290 -84 -590 -87 198 139 -63 -392 -145 38 363 271 -376 -225 22 397 137 -164 -346 -184 470 452
7549 452 173 -326 -596 -24 210 109 -277 -477 397 501 136 -416 -518 -20 349 778 -27 -601 -180 242
7569 242 422 208 -341 -543 -271 911 501 -239 -674 -208 412 626 33 -846 -368 284 813 378 -360 -544
7589 -544 80 924 566 -440 -1019 -62 629 699 108 -343 -595 208 923 491 -308 -528 -307 804 1049 -84
7609 -84 -1102 -284 457 828 266 -822 -1017 -51 1144 500 -1061 -932 -102 628 779 -77 -990 -449 254
$$ packed form
7466e03j62P81L67l95n47j65N63M29K82o19p44k3J102J36n40m31L1N86N39k43
7486D44r66Q5J18R17k07m72o79M40M27K21m71J7l44M26L01P2p42j93K27R36o6
7507D91n29m12J31N20m7j66j81K63j28J48n5k49J60J78L85r6q39k25N37o4M68
7528B90l74n06N03K85n9k02l29K47J83L25r2o47J51K47L75k60l01j82J62O54j8
7549D52k79m99k70N72K34j01l86k00Q74J04l65n52j02M98L69M29q05n74M21M22
7569B42J80k14n49k02K72J182m10p40m35M66O20K14n93q79M78O52N29m35p38j84
7589e44O24Q44l58j006n79R57O91P0n91m51k52Q03P15m32p99k20K21J111K45j133
7609h4j018Q18P41L71n62j088j95R66J195o44j561J29Q30P30J51q56r13N41P03
$$ plain form
7628 254 1004 177 -772 -815 -276 883 725 -652 -1253 -238 490 999 0 -794 -884 14 1392 458 -889
7647 -889 -763 -426 795 794 -236 -1213 -580 1049 871 186 -870 -1173 -240 1195 603 -556 -1277 -530 645
7666 645 992 -34 -1319 -865 463 930 673 -776 -1076 -95 1005 965 -351 -1067 -556 707 776 352
7684 352 -822 -681 207 1024 723 -790 -801 -14 947 1057 -171 -1235 -774 255 1278 439 -800 -1026
7702 -1026 -369 880 862 -453 -945 -613 479 1216 -197 -908 -875 405 1313 835 -559 -880 -139 779
7720 779 758 -364 -873 -534 720 1103 428 -829 -1199 -83 934 834 -188 -724 -634 544 744 25
7738 25 -1062 -759 676 1001 360 -492 -855 -31 937 606 -490 -1011 -61 354 729 449 -859 -1098 6
7757 6 720 841 -108 -748 -87 424 733 -30 -912 -697 272 696 118 -701 -843 52 752 336 -80 -656 -394
$$ packed form
7628B54P50q27r49m3N39J159j58j377o01J015P28N09r99p94r0Q98J378r34j347
7647h89J26L37J221jj030r77O33J629j78o85j056l03R33J435n92j159p21P47J175
7666F45L47j026j285M54J328M67k57j449l00R81J100m0j316p16N11J263O9m24
7684C52j174J41Q88Q17l01j513j1P87R61J10j228j064M61J029J023q39j239k26
7702a026O57J249j8j315m92L32J092P37j413p11L3J280R08m78j394l21P41R18
7720G79k1j122n09L39J254L83o75j257l70J116J017j00j022n36R0J178K00p19
7738B5j087L03J435L25o41q52l63Q24R68l31j096n21R50M15L75k80j308k39J104
7757FP14J21r49o40O61N11L09p63q82K15R69M24n78q19j42Q95P00m16m16n76K62
$$ plain form
7778 -394 520 730 112 -509 -780 435 624 -22 -536 -637 -10 419 410 -104 -626 -166 -4 595 389 -296
7798 -296 -444 62 359 560 -96 -372 -197 138 385 385 -592 -135 341 311 359 -378 -216 -99 744 261 -150
7819 -150 -561 -233 38 419 115 -352 -216 184 188 -153 -173 -144 -119 321 135 -340 -16 348 234 -241 -171 -368
7841 -368 -261 292 61 -183 128 -11 313 321 33 -68 -67 22 325 344 -69 -218 -31 76 162 -30 -223 338
7863 338 388 215 -211 -219 -498 397 489 -122 -853 -280 167 198 51 -512 -571 128 420 201 -27 -353 -77 223
7885 223 498 -242 -639 -517 182 590 607 -328 -490 -198 348 348 -254 -666 -130 306 812 181 -740 -529 20
7906 20 737 449 -325 -876 -167 169 669 -368 -687 -322 205 631 -67 -740 -564 243 769 420 -477 -620
7926 -620 -200 859 697 -89 -680 -409 290 842 119 -691 -496 -150 937 553 -84 -693 -558 664 998
$$ packed form
7778c94R14K10o18o21k71J215J89o46n14j01O27M29rn14n22M60J62N99k06o85
7798b96j48N06K97K01o56k76J75L35K47%r77M57M76l0M8p37J62J17Q43m83m11
7819a50m11L28K71L81l04m67J36M00Ml41k0K9K5M40j86m75L24L64j14m75P0j97
7841c68J07N53k31k44L11j39L24Qk88j01JQ9L03J9m13j49J87J07Q6j92j93N61
7863C38N0j73m26qk79Q95R2o11p31N73M47L1j47n63n9O99K92k19k28l26K76L00
7885B23K75p40l97J22O99M08J7r35j62K92N46%o02m12N36M36N06o31r21K11N49
7906B0P17k88p74n51P09L36N00j037l19L65N27M26o98o73J76Q07N26l49q97j43
7926f20M20J059j62p86n91K71O99N52p23q10J95L46J087l84o37o09J35J222L34
$$ plain form
7945 998 362 -843 -736 466 767 697 -291 -760 -415 1041 989 -128 -1154 -681 495 976 324 -681
7963 -681 -943 -191 1061 825 -347 -668 -138 878 1062 136 -1171 -775 313 926 866 -534 -1201 108
7981 108 875 718 -37 -1189 -299 583 1259 204 -1039 -1089 325 878 421 -461 -975 -255 694 889 -164
8000 -164 -1108 -698 363 873 374 -397 -1394 -218 817 751 -426 -814 -496 271 1003 265 -1145 -1226 265
8019 265 947 476 -611 -730 -745 589 1180 -111 -965 -582 362 800 228 -587 -1059 -11 877 612 -390
8038 -390 -1005 -845 357 958 154 -829 -696 276 656 359 -286 -996 -328 1004 645 -196 -756 -515 438
8057 438 681 77 -682 -592 59 747 540 -291 -711 -393 731 851 187 -544 -435 393 987 389 -361 -781
8077 -781 19 865 580 -4 -542 -530 375 1193 265 -260 -460 -91 511 380 140 -681 -226 622 715 79 -856
$$ packed form
7945I98o36j205J07J202L01p0r88m69L45J456n2j117j026M73J176M81o52j005
7963f81k62P52J252k36j172l21N30J016J84r26j307L96J088O13o0j400o67J309
7981A08P67j57p55j152Q90Q82O76j055j243n0J414N53m57q82n14P20R49J95j053
8000a64r44M10J061N10m99p71r97J176J035o6j177l88L18P67P32p38j410q1J491
8019B65O82m71j087j19j5J334N91j291q54L83R44M38n72q15m72J048Q88k65j002
8038c90o15J60J202O01q04r83J33R72L80k97o45p10O68J332l59q41n60K41R53
8057D38K43o04p59R0O51O88k07q31m20L18J124J20o64p31J09Q28N94n98p50m20
8077g81Q00Q46k85n84n38J2R05Q18r28n25k00L69O02j31k40q21M55Q48R3o36r35
$$ plain form
8098 -856 -393 377 911 343 -338 -364 152 650 629 -80 -609 -349 377 556 -13 -306 -203 250 352 189 -496
8119 -496 -385 -91 409 481 -141 -262 -467 -24 491 -20 -288 -145 -95 451 220 -179 -266 -60 403 365 -62
8140 -62 -30 -216 -235 166 -17 -389 -327 -138 336 -242 -97 46 162 -11 -32 -291 -361 -115 -197 -295 0 -318 -224
8163 -224 273 121 -285 -34 6 -32 70 -222 -264 -117 -34 -105 -153 -76 -274 -126 -80 17 -210 -150 66 290 -8
8186 -8 -214 -144 -370 56 235
$$ packed form
8098h56M63P70N34n68o81k6N16M98k1p09n29K60P26J79n69k93J03M53J02j63o85
8119d96J11K94N00P2o22j21k05M43N15n11k68J43N0N46k31l99q7K06M63l8m27
8140f2L2j86j9M01j83l72O2J89M74n78J45J43J16j73k1k59p0K46q2r8K95l18R4
8163b24M97j52m06K51M0l8J02k92m2J47Q3p1m8P7j98J48M6R7k27O0K16K24k98
8186hk06P0k26M26J79
8191B35
$$ Imaginary data points
##PAGE= N=2
##DATA TABLE= (X++(I..I)), XYDATA
$$ plain form
0 0 0 0 0 -8 8 -8 16 -16 17 -25 40 -41 52 -67 81 -97 117 -139 163 -195 228 -261 304 -352 401 -460 525
27 525 -594 674 -765 856 -961 1080 -1207 1346 -1504 1669 -1853 2058 -2281 2521 -2795 3097
43 3097 -3425 3797 -4216 4680 -5216 5835 -6552 7400 -8426 9683 -11279 13380 -16278
56 -16278 20550 -27521 40856 -75696 358281 806302 26141 -445302 -290889 362583 620595
67 620595 275157 -301619 -346814 95940 463224 279397 -160712 -365354 -80732 327176
77 327176 367875 -56453 -429532 -349084 80037 371494 223075 -230632 -461314 -183124
87 -183124 277357 352054 -26199 -404632 -332708 111078 391061 134656 -326384 -382234 46919
98 46919 428111 315719 -150538 -408870 -133395 338850 409757 13243 -333140 -226131
$$ packed form
0@%%%qJ6j6K4l2L3m2O5q1R3j19J48j78K14k56L02l58M23m89N65o56P53q61R85
27E25j119J268j439J621j817K041k287K553k850L173l522L911m339M802n316N892
43C097o522P222q013Q896r896J1051j2387J3952j5826J8109k0962K4659k9658
56a6278L6828m8071O8377j16552M33977M48021p80161m71443J54413O53472K58012
67F20595l45438n76776m5195M42754L67284j83827m40109k04642K84622M07908
77C27176M0699m24328l73079Q0448M29121K91457j48419m53707k30682K78190
87a83124M60481P4697l78253l78433P1924M43786K79983k56405m61040n5850M29153
98D6919L81192j12392m66257k58332K75475M72245P0907l96514l46383J07009
$$ plain form
108 -226131 179855 412847 208825 -184191 -287287 5373 313318 281148 -37364 -301168
118 -301168 -225970 113503 316015 128663 -213481 -304368 -64008 213955 191737 -136961
128 -136961 -383427 -226306 134313 230599 -58791 -381556 -348330 23338 292125 113200
138 113200 -291006 -414130 -140768 165390 163076 -105918 -306799 -190912 92287 181806
148 181806 -2466 -191934 -159345 42216 189333 111412 -113410 -212689 -58692 169158
158 169158 237620 97146 -105877 -152628 27900 221904 187623 -15640 -135055 -49693 124077
169 124077 171836 21368 -131186 -64794 132242 186587 25062 -163295 -173701 1433 152168
180 152168 82118 -117051 -189821 -77209 50790 60439 -31875 -118466 -101918 -20143 1696
$$ packed form
108b26131M05986K32992k04022l93016j03096K92660L07945l2170l18512k63804
118c01168P5198L39473K02512j87352l42144r0887K40360K77963k2218l28698
128a36961k46466J57121L60619R6286k89390l22765L3226L71668K68787j78925
138A13200m04206j23124K73362L06158k314k68994k00881J15887K83199Q9519
148A81806j84272j89468L2589K01561J47117p7921k24822r9279J53997K27850
158A69158O8462j40474k03023m6751J80528J94004l4281k03263j19415Q5362J73770
169A24077M7759j50468j52554O6392J97036N4345j61525j88357j0406J75134J50735
180A52168p0050j99169p2770J12612J27999R649r2314q6591J6548Q1775K1839
$$ plain form
191 1696 -56594 -102207 -88649 -38474 18362 29176 -30594 -84743 -59552 9094 55890 47542
203 47542 -18541 -73995 -30075 68706 100296 52703 8661 17617 69421 108656 78346 20511
215 20511 24586 71262 79683 60566 61619 74042 75984 63345 37229 35593 77788 90712 24806
228 24806 -38442 -17808 41505 61548 20417 -39838 -38863 33517 59759 -23554 -108256 -87865
240 -87865 -3843 43728 1178 -99989 -144435 -65170 40087 49284 -24857 -95851 -105666 -43830
252 -43830 25005 11381 -61467 -85339 -28179 46851 67115 -2051 -93030 -66170 79978 161992
264 161992 66021 -99303 -144460 -3176 185618 196634 4969 -141707 -57200 136692 198347
275 198347 60593 -115488 -115528 67769 190126 79839 -115496 -150142 7027 169645 150150
$$ packed form
191A696n8290m5613J3558N0175N6836J0814n9770n4149K5191O8646M6796q348
203D7542o6083n5454M3920R8781L1590m7593m4042Q956N1804L9235l0310n7835
215B0511M075M6676Q421j9117J053J2423J942j2639k6116j636M2195J2924o5906
228B4806o3248K0634N9313K0043m1131o0255R75P2380K6242q3313q4702K0391
240h7865Q4022M7571m2550j01167m4446P9265J05257R197p4141p0994r815O1836
252d3830O8835j3624p2848k3872N7160P5030K0264o9166r0979K6860J46148Q2014
264A61992r5971j65324m5157J41284J88794J1016j91665j46676Q4507J93892O1655
275A98347j37754j76081m0J83297J22357j10287j95335l4646J57169J62618j9495
$$ plain form
286 150150 -47236 -203782 -134336 63854 145828 29057 -151724 -203303 -59000 123964
296 123964 116623 -78346 -216700 -136373 62114 148960 4752 -218642 -233627 7208 209408
307 209408 125841 -130916 -247778 -75703 194543 228728 -28458 -248798 -149660 135917
317 135917 265085 101176 -154368 -189083 54559 281247 210807 -55603 -196565 -67329
327 -67329 172952 250379 68690 -157901 -148917 80140 248312 162138 -81884 -214145 -69475
338 -69475 190816 231183 -20438 -260863 -201186 87383 269846 119269 -202110 -298636 -45001
349 -45001 230012 179563 -126289 -316004 -164202 149498 237814 -14983 -279960 -219250 80864
360 80864 255610 111564 -181229 -282142 -66275 210599 219445 -26042 -222283 -150782 107528
$$ packed form
286A50150j97386j56546O9446J98190Q1974j16771j80781n1579J44303J82964
296A23964p341j94969j38354Q0327J98487Q6846j44208k23394j4985K40835K02200
307B09408q3567k56757j16862J72075K70246L4185k57186k20340R9138K85577
317A35917J29168j63909k55544l4715K43642K26688p0440k66410j40962J29236
327f7329K40281P7427j81689k26591Q984K29057J68172q6174k44022j32261J44670
338f9475K60291M0367k51621k40425N9677K88569J82463j50577l21379r6526K53635
349d5001K75013n0449l05852j89715J51802L13700Q8316k52797k64977O0710L00114
360H0864J74746j44046k92793j00913K15867K76874Q846k45487j96241P1501K58310
$$ plain form
371 107528 266647 137691 -130498 -206005 55 231684 217160 -28961 -222253 -112878
381 -112878 190533 310892 87736 -201191 -206070 70097 292446 182732 -140287 -278193
391 -278193 -59151 228407 227758 -40755 -247530 -154780 121236 236602 39413 -226039 -237735
402 -237735 -5903 185216 126506 -111203 -254231 -126265 123349 194189 10701 -207645
412 -207645 -218024 -5587 193473 132960 -122616 -248745 -81181 178029 226165 9583
422 9583 -216734 -169155 107188 263032 101648 -161986 -198686 27466 245165 197253 -55689
433 -55689 -191706 -40974 189392 212016 18268 -157803 -123292 75302 201819 103839 -90392
444 -90392 -147084 -19034 135919 146826 -6093 -161308 -134414 41144 144690 53270 -122239
$$ packed form
371A07528J59119j28956k68189p5507K06060K31629j4524k46121j93292J09375
381a12878L03411J20359k23156k88927m879K76167K22349j09714l23019j37906
391b78193K19042K87558o49k68513k06775R2750K76016J15366j97189k65452j1696
402b37735K31832J91119n8710k37709j43028J27966K49614P0840j83488k18346
412b07645j0379K12437J99060o0513k55576j26129J67564K59210M8136k16582
422I583k26317M7579K76343J55844j61384k63634l6700K26152K17699m7912k52942
433e5689j36017J50732K30366K2624j93748j76071L4511J98594J26517r7980j94231
444i0392n6692J28050J54953J0907j52919j55215K6894J75558J03546r1420j75509
$$ plain form
455 -122239 -181482 -46417 134966 131493 -67683 -212063 -123751 75211 140872 -684 -180087
466 -180087 -171558 23281 156008 67828 -107623 -148813 -24418 110774 99796 -42026 -132922
477 -132922 -58710 77313 112935 34489 -55977 -64398 21920 108834 89394 -11166 -72724 -36503
489 -36503 53472 105372 53235 -52164 -72774 23594 109321 76732 -33128 -99002 -45462 65568
501 65568 84275 -23312 -111646 -69307 35384 71710 6405 -82518 -89889 -12564 35541 -8280
513 -8280 -70454 -73826 -35336 -2726 -155 -24527 -41201 -27342 -11834 -14063 -13190 -9985 -24853
526 -24853 -34018 -13135 13753 20210 9501 -6173 -4652 25832 44448 20023 -5319 5908 26157
539 26157 29148 25084 23012 27321 39218 36815 19677 23002 42214 31518 -3043 -8574 20862
$$ packed form
455a22239n9243J35065J81383l473j99176j44380Q8312J98962O5661j41556j79403
466a80087Q529J94839J32727q8180j75451m1190J24395J35192j0978j41822r0896
477a32922P4212J36023L5622p8446r0466q421Q6318Q6914j9440j00560o1558L6221
489c6503Q9975N1900n2137j05399k0610R6368Q5727l2589j09860o5874N3540J11030
501F5568J8707j07587q8334M2339J04691L6326o5305q8923p371P7325M8105m3821
513h280o2174l372L8490L2610K571k4372j6674J3859J5508k229Q73L205j4868
526b4853r165K0883K6888O457j0709j5674J521L0484J8616k4425k5342J1227K0249
539B6157K991m064k072M309J1897k403j7138L325J9212j0696l4561n531K9436
$$ plain form
552 20862 45369 32504 -12540 -35397 11515 70740 46787 -37214 -72855 -23987 43419 47953
564 47953 -24590 -89140 -54445 37438 63600 -1164 -70232 -69962 -5429 52156 27342 -54227
576 -54227 -86993 -31863 41998 63716 17152 -54466 -65157 12592 87022 63664 -28121 -83307
588 -83307 -36118 73856 119183 31997 -78326 -60413 64806 141450 75854 -59750 -106507
599 -106507 3814 136261 113473 -35125 -117385 -35978 106484 142708 22854 -115497 -101587
610 -101587 42753 128541 54711 -84889 -134685 -38359 101022 115068 -18677 -136573 -101682
621 -101682 35454 116966 46217 -107645 -162955 -38574 117073 113249 -40823 -157846 -96321
632 -96321 82741 164756 33844 -152906 -155860 26897 169322 107269 -81906 -167985 -35426
$$ packed form
552B0862K4507j2865m5044k2857M6912N9225k3953q4001l5641M8868O7406M534
564D7953p2543o4550L4695R1883K6162o4764o9068K70O4533N7585k4814q1569
576e4227l2766N5130P3861K1718m6564p1618j0691P7749P4430k3358r1785n5186
588h3307M7189J09974M5327q7186j10323J7913J25219P6644o5596j35604m6757
599a06507J10321J32447k2788j48598q2260Q1407J42462L6224j19854j38351J3910
610a01587J44340Q5788p3830j39600m9796R6326J39381J4046j33745j17896L4891
621a01682J37136Q1512p0749j53862n5310J24381J55647l824j54072j17023O1525
632i6321J79062Q2015j30912j86750k954J82757J42425o2053j89175q6079J32559
$$ plain form
643 -35426 159144 169199 -13637 -156870 -95656 87493 175398 60963 -120887 -143186 22435
654 22435 167694 124894 -46820 -154647 -77570 99054 158697 18859 -152316 -152042 13215
665 13215 152486 103373 -87600 -194658 -76986 119496 147032 -29719 -200808 -166178 41472
676 41472 174145 60734 -157387 -201492 -20285 159527 126200 -76075 -206124 -103068
686 -103068 107822 162429 3358 -159877 -132690 49114 177647 103513 -86955 -159079 -26280
697 -26280 144912 154994 596 -141377 -104814 81245 198635 101805 -89397 -143948 -1810
708 -1810 169004 162189 -27862 -175119 -90041 121203 192346 41703 -145014 -145331 42758
719 42758 189671 104036 -112773 -190449 -45945 131364 132686 -35817 -173748 -113671 68827
$$ packed form
643c5426J94570J0055j82836j43233O1214J83149Q7905j14435j81850k2299J65621
654B2435J45259m2800j71714j07827P7077J76624N9643j39838j71175K74J65257
665A3215J39271m9113j90973j07058J17672J96482K7536j76751j71089L4630K07650
676D1472J32673j13411k18121m4105J81207J79812l3327k02275j30049J03056
686a03068K10890N4607j59071j63235K7187J81804J28533p4134j90468p2124J32799
697b6280J71192J0082j54398j41973L6563J86059J17390r6830j91202n4551J42138
708a810J70814o815j90051j47257Q5078K11244P1143j50643j86717l17J88089
719D2758J46913q5635k16809p7676J44504J77309J322j68503j37931O0077J82498
$$ plain form
730 68827 145815 31569 -125961 -148862 -23461 105598 87668 -60767 -156923 -81355 72979
741 72979 128184 26736 -116769 -133916 8081 139850 92144 -75824 -155972 -51680 118044
752 118044 153535 7248 -140429 -96680 81628 165017 58566 -102438 -128854 8227 141941
763 141941 106894 -45603 -119335 -32761 95077 117756 15985 -94803 -87435 24616 99000
774 99000 50781 -52831 -95884 -35078 68069 94816 3917 -97223 -85173 19858 89881
785 89881 42947 -70977 -116160 -24699 92802 85381 -30887 -104081 -49765 62988 97674
796 97674 7327 -95353 -74965 37633 96059 41165 -44428 -60933 7488 79500 67400 -8703
808 -8703 -50579 -19918 34514 57709 32307 -17644 -34378 7085 55201 54896 10802 -34134 -36149
$$ packed form
730F8827P6988j14246j57530k2901J25401J29059j7930j48435r6156P5568J54334
741G2979N5205j01448j43505j7147J41997J31769m7706j67968q0148J04292J69724
752A18044L5491j46287j47677M3749J78308Q3389j06451j61004k6416J37081J33714
763A41941l5047j52497p3732Q6574J27838K2679j01771j10788P368J12051P4384
774I9000m8219j03612m3053O0806J03147K6747r0899j01140J2050J05031P0023
785H9881m6934j13924m5183R1461J17501p421j16268p3194N4316J12753L4686
796I7674r0347j02680K0388J12598N8426n4894q5593j6505O8421P2012j2100p6103
808h703m1876L0661N4432K3195k5402m9951j6734M1463M8116l05m4094m4936k015
$$ plain form
821 -36149 14251 56873 28958 -35467 -51500 -4214 45181 40623 -14329 -53095 -22489 30331
833 30331 24834 -27542 -53292 -26426 13786 22603 -8617 -38074 -23185 9530 10538 -10028 -16665
846 -16665 -11381 -10303 -12159 -11745 -1400 16667 16096 -7728 -15846 8193 25444 13520 -4716 -9134
860 -9134 2927 20574 20539 1620 -1747 17284 28368 21621 12824 2160 -6998 -1546 13903 21582
874 21582 17174 -2071 -23717 -12165 31541 46095 3373 -44316 -40774 6533 40220 12840
886 12840 -50964 -63678 -377 52206 24721 -42814 -68584 -24408 38307 37350 -33589 -81230
898 -81230 -42894 27024 46670 3111 -52215 -56452 1907 54589 35751 -29525 -66219 -38927
910 -38927 28140 66802 26699 -49915 -62678 9195 78538 63909 -20811 -81265 -36691 67601
$$ packed form
821c6149N0400M2622k7915o4425j6033M7286M9395m558n4952l8766L0606N2820
833C0331n497n2376k5750K6866M0212Q817l1220k9457J4889L2715J008k0566o637
846a6665N284J078j856M14J0345J8067n71k3824q118K4039J7251j1924j8236m418
860i134J2061J7647l5j8919l367J9031J1084o747q797j0664r158N452J5449P679
874B1582m408j9245k1646J1552M3706J4554m2722m7689L542M7307L3687k7380
886A2840o3804j2714O3301N2583k7485o7535k5770M4176O2715r57p0939m7641
898h1230L8336O9918J9646m3559n5326m237N8359N2682j8838o5276l6694K7292
910c8927O7067L8662m0103p6614j2763P1873O9343j4629q4720o0454M4574J04292
$$ plain form
922 67601 93930 1295 -90275 -63913 49392 117686 53812 -72848 -105729 -2782 100998
933 100998 77009 -37107 -105307 -52891 57292 93648 10541 -84036 -73146 19991 79715
944 79715 39358 -59727 -106011 -36739 70312 84528 -8570 -98140 -83092 25503 108586 59008
956 59008 -70919 -119867 -26297 91294 93148 -20630 -112370 -61500 79740 132102 24657
967 24657 -104967 -97263 34164 133361 80362 -66723 -126120 -21829 114824 120040 249
978 249 -100995 -71756 52397 120981 46625 -79622 -103179 -3170 100969 92473 -24036
989 -24036 -115209 -64836 69346 120229 23898 -105396 -120624 -726 116756 83330 -65337
1000 -65337 -140661 -46717 97251 117385 -10101 -135848 -105200 48538 131080 40341 -103282
$$ packed form
922F7601K6329r2635r1570K6362J13305O8294o3874j26660l2881J02947J03780
933A00998k3989j14116o8200N2416J10183L6356q3107r4577J0890R3137N9724
944G9715m0357r9085m6284O9272J07051J4216r3098q9570J5048J08595Q3083m9578
956E9008j29927m8948R3570J17591J854j13778r1740N0870J41240N2362j07445
967B4657j29624P704J31427R9197n2999j47085n9397J04291J36653N216j19791
978B49j01244K9239J24153O8584p4356j26247k3557J00009J04139q496j16509
989b4036r1173N0373J34182N0883r6331j29294j5228J19898J17482l3426j48667
1000f5337p5324R3944J43968K0134j27486j25747L0648J53738Q2542r0739j43623
$$ plain form
1011 -103282 -123614 -1703 117814 96888 -39944 -123728 -50841 80932 109965 11282 -97992
1022 -97992 -91795 28024 123579 79366 -49548 -106820 -30470 88483 115733 14099 -102126
1033 -102126 -90406 37187 119582 60148 -62882 -101560 -7389 108774 95372 -39536 -126145
1044 -126145 -57101 78377 115640 10715 -113265 -106399 27472 123041 64543 -65780 -113502
1055 -113502 -35097 71376 81262 -16448 -99728 -63549 42549 88882 28554 -66369 -87632
1066 -87632 -4470 88771 75370 -31260 -102629 -57831 51741 106121 40374 -69972 -86746
1077 -86746 12840 99692 68285 -36656 -90295 -28490 75184 88444 -7278 -85053 -46422
1088 -46422 54320 95031 31479 -62439 -77179 3935 75636 49964 -32067 -70133 -29772 41101
$$ packed form
1011a03282k0332J21911J19517k0926j36832q3784P2887J31773K9033r8683j09274
1022i7992O197J19819R5555m4213j28914n7272P6350J18953K7250j01634j16225
1033a02126J1720J27593Q2395n9434j23030l8678R4171J16163j3402j34908q6609
1044a26145O9044J35478L7263j04925j23980O866J33871R5569n8498j30323m7722
1055a13502P8405J06473R886r7710q3280L6179J06098M6333o0328r4923k1263
1066h7632Q3162R3241j3401j06630p1369M4798J09572N4380o5747j10346j6774
1077h6746R9586Q6852l1407j04941n3639O1805J03674J3260r5722p7775L8631
1088d6422J00742M0711o3552r3918j4740Q1114P1701k5672q2031l8066M0361P0873
$$ plain form
1100 41101 63600 10124 -56168 -55066 4967 49081 30932 -30062 -69659 -36427 35574 56516
1112 56516 2554 -56105 -50136 10417 55762 26720 -47137 -69396 -8345 54812 43924 -20367
1124 -20367 -59296 -26587 41608 60396 6875 -45036 -34657 11354 36032 18841 -14108 -23050
1136 -23050 5028 30654 21063 -3801 -14223 -6121 11842 24297 11320 -17874 -26657 -6344
1148 -6344 20845 32443 13251 -22312 -30848 -329 23616 11042 -15948 -24657 -9496 11242
1160 11242 9604 -14121 -20713 2331 17961 4379 -15336 -20802 -11284 1947 3504 -5315 -3482
1173 -3482 7024 1319 -13211 -7699 12779 20707 6211 -16609 -23017 404 26702 18421 -8194
1186 -8194 -11840 7957 23385 19087 -939 -15267 -3383 18412 19466 2485 -8483 -7500 3185
$$ packed form
1100D1101K2499n3476o6292J102O0033M4114j8149o0994l9597L3232P2001K0942
1112E6516n3962n8659N969O0553M5345k9042p3857k2259O1051O3157j0888o4291
1124b0367l8929L2709O8195J8788n3521n1911J0379M6011K4678j7191l2949q942
1136b3050K8078K5626r591k4864j0422Q102J7963J2455j2977k9194q783K0313
1148f344K7189J1598j9192l5563q536L0519K3945j2574k6990q709J5161K0738
1160A1242j638k3725o592K3044J5630j3582j9715n466R518J3231J557q819J833
1173c482J0506n705j4530N512K0478P928j4496k2820o408K3421K6298q281k6615
1186h194l646J9797J5428m298k0026j4328J1884K1795J054j6981j0968R83J0685
$$ plain form
1199 3185 21438 25681 4801 -17311 -16260 3886 23979 17798 -17312 -39173 -9685 36118 36512
1212 36512 -8977 -45676 -30300 24050 49101 4629 -55181 -50101 10713 48557 21780 -34244
1224 -34244 -51555 -4705 48864 37014 -23403 -56424 -27629 25572 48142 14573 -39173 -47433
1236 -47433 1058 48249 43045 -4613 -46897 -36007 21333 54928 17395 -43066 -48145 9248
1248 9248 63967 48235 -28909 -73878 -21077 63270 69430 -10627 -79518 -58201 31537 82593
1260 82593 29992 -58174 -70099 2820 64133 42796 -33413 -76315 -33065 46115 60120 -4613
1272 -4613 -66672 -55506 15051 69762 42906 -42078 -84304 -32156 50568 67787 1924 -72848
1284 -72848 -65111 24732 87671 40571 -56308 -81909 -7078 77093 68488 -28644 -94884 -40760
$$ packed form
1199C185J8253M243k0880k2112J051K0146K0093o181l5110k1861K9488M5803L94
1212C6512m5489l6699J5376N4350K5051m4472n9810N080O0814L7844k6777n6024
1224c4244j7311M6850N3569j1850o0417l3021K8795N3201K2570l3569n3746q260
1236d7433M8491M7191n204m7658m2284J0890N7340L3595l7533o0461n079N7393
1248I248N4719j5732p7144m4969N2801Q4347O160q0057o8891K1317Q9738N1056
1260H2593n2601q8166j1925P2919O1313k1337p6209m2902M3250P9180J4005o4733
1272d613o2059J1166P0557N4711k6856q4984m2226N2148Q2724J7219o5863p4772
1284g2848P737Q9843O2939m7100r6879k5601P4831Q4171q605r7132o6240N4124
$$ plain form
1296 -40760 66902 92816 11347 -75096 -66140 26789 91328 45599 -53842 -82875 -11762 69373
1308 69373 69879 -6232 -73670 -49896 39097 82926 29525 -55199 -76424 -12060 67285 66900 -18828
1321 -18828 -83838 -44604 49967 85508 20492 -72192 -80965 11350 90647 54336 -50984 -92353
1333 -92353 -22890 74422 86426 -3020 -83970 -54671 44193 85890 25623 -58697 -68991 6864
1345 6864 80319 60958 -26267 -70431 -21898 57669 78477 15799 -62944 -64329 17047 81901
1357 81901 53097 -29605 -70863 -22518 61966 79994 3348 -74586 -56121 31176 79330 31456
1369 31456 -56934 -79108 -2148 79872 61744 -30226 -82444 -38110 45101 69368 4346 -71235
1381 -71235 -61764 15699 63536 31111 -36254 -62687 -17682 46044 48953 -12826 -62376 -42794
$$ packed form
1296d0760J07662K5914q1469q6443Q956R2929O4539m5729r9441k9033P1113Q1135
1308F9373N06p6111o7438K3774Q8993M3829n3401q4724k1225O4364P9345l85q5728
1321a8828o5010L9234R4571L5541o5016r2684q773R2315P9297l6311j05320m1369
1333i2353O9463R7312J2004q9446q0950K9299R8864M1697o0267q4320j0294P5855
1345F864P3455j9361q7225m4164M8533P9567K0808o2678p8743j385Q1376O4854
1357H1901k8804q2702m1258M8345Q4484J8028p6646p7934J8465Q7297M8154m7874
1369C1456q8390k2174P6960Q2020j8128r1970n2218M4334Q3211K4267o5022p5581
1381g1235R471P7463M7837l2425o7365k6433M5005O3726K909o1779m9550J9582
$$ plain form
1393 -42794 18306 54908 26064 -37344 -59406 -7483 52799 48085 -13141 -60189 -39022 28827
1405 28827 61160 13782 -51552 -49908 13765 60238 37029 -29410 -60394 -15393 46768 45323
1417 45323 -13473 -52916 -30493 23798 48650 14982 -36065 -40582 2015 34441 22177 -16201
1429 -16201 -41095 -24675 17149 34357 6506 -28525 -30852 -1921 27795 23812 -15358 -42765
1441 -42765 -20705 21537 31168 494 -31982 -28583 11651 39530 16151 -27077 -34100 -1936
1453 -1936 26479 21057 -8821 -27930 -9792 21450 24138 1560 -13368 -8395 4016 12862 7216
1466 7216 -7198 -10152 -629 6222 9146 8840 -352 -9137 -3374 9006 9643 -199 -10371 -12399 -17
1481 -17 13874 8553 -7053 -8038 2589 7460 3738 -3480 -8292 -2959 3524 41 -5287 1326 6855
$$ packed form
1393d2794O1100L6602k8844o3408k2062N1923O0282m714o1226m7048K1167O7849
1405B8827L2333m7378o5334J644O3673M6473k3209o6439l0984M5001O2161j445
1417D5323n8796l9443K2423N4291K4852l3668n1047m517M2597L2426j2264l8378
1429a6201k4894J6420M1824J7208k7851l5031k327K8931K9716l983l9170k7407
1441d2765K2060M2242R631l0674l2476L399M0234K7879k3379m3228p023L2164
1453a936K8415n422k9878j9109J8138L1242K688k2578j4928M973J2411Q846n646
1466G216j4414k954R523O851K924l06r192q785N763J2380O37r842j0172k028J2382
1481a7J3891n321j5606r85J0627M871l722p218m812N333O483l483n328O613N529
$$ plain form
1496 6855 1497 -3503 696 6390 7074 -904 -11940 -7200 12224 16942 -1663 -14775 -3924 15997
1510 15997 23453 6793 -17435 -16373 10406 24515 7869 -14200 -15452 2636 21718 20541 -1937
1523 -1937 -18258 -8422 10468 16345 7182 -10603 -21683 -7591 18466 22982 1305 -20785 -20583
1536 -20583 5467 29153 14850 -25948 -39274 -5922 31695 28441 -11585 -41874 -21519 28946
1548 28946 42424 -243 -42379 -33977 10350 38360 18078 -27218 -39321 -804 36992 29677
1560 29677 -8933 -34371 -21297 18078 38031 10680 -30310 -34771 1294 38284 37350 -5343
1572 -5343 -42768 -25863 27594 49506 11006 -40535 -45050 5545 54119 37578 -27364 -54818
1584 -54818 -10042 47518 47936 -9350 -57766 -37279 28752 56403 11222 -44916 -44911 6508 49904
$$ packed form
1496F855n358n000M199N694O84p978j1036M740J9424M718j8605j3112J0851J9921
1510A5997P456j6660k4228J062K6779J4109j6646k2069j252J8088J9082j177k2478
1523a937j6321R836J8890N877r163j7785j1080J4092K6057M516k1677k2090K02
1536b0583K6050K3686j4303m0798j3326L3352L7617l254m0026l0289K0355N0465
1548B8946J3478m2667m2136Q402M4327K8010k0282m5296j2103L8517L7796p315
1560B9677l8610k5438J3074L9375J9953k7351m0990m461L6065L6990r34m2693
1572e343l7425J6905N3457K1912l8500n1541m515N0595M8574j6541o4942k7454
1584e4818M4776N7560M18n7286m8416K0487O6031K7651m5181n6138NN1419M3396
$$ plain form
1597 49904 35352 -22317 -53921 -21721 32625 43424 3480 -42510 -42515 7704 52182 34476 -24800
1610 -24800 -53418 -19263 37423 51582 640 -56913 -45371 23981 64449 25971 -41416 -57826
1622 -57826 -1714 60409 49328 -24914 -67422 -26777 42198 57730 5927 -51690 -45282 17990
1634 17990 58734 26489 -34278 -52637 -12540 39250 43658 -7583 -52577 -35017 23416 53244
1646 53244 21859 -36367 -56064 -10451 48095 44466 -18664 -61575 -32870 32690 59675 13097
1658 13097 -53022 -53165 13975 60662 29677 -38052 -62051 -13767 50545 52204 -10969 -56971
1670 -56971 -30832 30057 53150 16179 -39342 -48537 291 46157 34563 -15790 -44570 -21356
1682 -21356 29168 49614 12039 -41204 -44048 5460 46188 32471 -21167 -52202 -19741 39919
$$ packed form
1597D9904j4552n7669l1604L2200N4346J0799l9944m5990nN0219M4478j7706n9276
1610b4800k8618L4155N6686J4159n0942n7553J1542O9352M0468l8478o7387j6410
1622e7826N6112O2123j1081p4242m2508M0645O8975J5532n1803n7617O408O3272
1634A7990M0744l2245o0767j8359M0097N1790M408n1241m4994J7560N8433K9828
1646E3244l1385n8226j9697M5613N8546l629o3130m2911K8705O5560K6985m6578
1658A3097o6119j43O7140M6687l0985o7729k3999M8284O4312J659o3173m6002
1670e6971K6139O0889K3093l6971n5521r195M8828M5866j1594n0353k8780K3214
1682b1356N0524K0446l7575n3243k844M9508M0728j3717n3638l1035L2461N9660
$$ plain form
1694 39919 50813 -639 -48139 -35461 18863 49914 17468 -40055 -48983 2719 47462 32077
1706 32077 -18481 -44946 -17097 31881 41950 166 -39868 -30819 10846 36568 21926 -17390
1718 -17390 -34842 -7640 30959 33865 495 -30563 -26637 10100 38272 20992 -22119 -34410
1730 -34410 -1620 35488 34422 -4070 -35860 -20290 24582 38522 4860 -30905 -26566 10213
1742 10213 36999 22055 -16986 -30332 -2879 26595 22435 -4588 -24540 -16819 9683 23521
1754 23521 8480 -14040 -16367 -732 15322 16033 -2981 -21801 -15862 7093 18506 7248 -12878
1767 -12878 -20405 -3830 19627 19076 -6496 -22758 -11290 9080 15286 980 -17434 -14376 6938
1780 6938 17220 4529 -10817 -10749 -229 8570 5858 -7064 -11663 -3137 3553 2873 1666 -236
$$ packed form
1694C9919J0894n1452m7500J2678N4324L1051l2446n7523q928N1702M4743j5385
1706C2077n0558k6465K7849M8978J0069m1784m0034R049M1665K5722j4642l9316
1718a7390j7452K7202L8599K906l3370l1058L926L6737K8172j7280m3111j2291
1730c4410L2790L7108j066l8492l1790J5570M4872J3940l3662l5765M339L6779
1742A0213K6786j4944l9041j3346K7453K9474m160k7023j9952P721K6502J3838
1754B3521j5041k2520k327J5635J6054P11j9014j8820N939K2955J1413j1258k0126
1767a2878p527J6575K3457n51k5572j6262J1468K0370O206j4306j8414L058K1314
1780F938J0282j2691j5346O8J0520Q799k712j2922m599Q526O690o80j207j902
$$ plain form
1794 -236 -3696 -3678 354 1783 219 -2544 -7716 -6964 2102 7052 -246 -6858 -4750 1174 5538 2735
1810 2735 -6898 -11028 -2986 3994 1866 -2033 -2964 -3440 -1134 3189 3170 244 -2745 -6672 -6549 2777
1826 2777 8827 783 -9691 -7403 4797 14230 9256 -8700 -17212 -1826 16705 12830 -6958
1839 -6958 -17353 -6399 14065 20856 3551 -16621 -11682 8263 16995 7350 -9687 -16181 -3327
1852 -3327 15547 16727 -382 -13490 -9717 5840 18386 11560 -11040 -22037 -5261 18080 20847
1865 20847 137 -21676 -17240 13183 31536 10591 -22681 -26862 1473 28559 21784 -12841
1877 -12841 -31655 -8091 27832 30216 -646 -26332 -18746 12733 31157 11876 -20982 -25879
1889 -25879 1470 27018 24610 -2208 -25195 -16236 16033 31084 10617 -20684 -28203 -3025
$$ packed form
1794b36l460J8M032J429j564k763n172P52R066M950p298o612K108N924M364k803
1810B735r633m130Q042O980k128l899r31m76K306M323j9k926k989l927J23R326
1826B777O050q044j0474K288J2200R433m974j7956q512J5386J8531l875j9788
1839f958j0395J0954K0464O791j7305k0172M939J9945Q732r645j7037o494J2854
1852c327J8874J180j7109j3108L773J5557J2546o826k2600j0997J6776K3341K767
1865B0847k0710k1813M436L0423J8353k0945l3272m181K8335K7086o775l4625
1877a2841j8814K3564L5923K384l0862k5686P586L1479J8424j9281l2858m897
1889b5879K7349K5548k408k6818k2987Q959L2269J5051k0467l1301p519K5178
$$ plain form
1901 -3025 28825 28872 -6860 -33435 -15848 23179 35441 5832 -33367 -33694 8070 39929 19091
1914 19091 -26401 -39121 -4712 34230 32808 -9362 -42000 -23716 20056 33908 4543 -30563
1926 -30563 -32610 1665 32690 22413 -16314 -35678 -14890 20195 29835 1742 -34544 -34471 5200
1939 5200 36659 21781 -20731 -40171 -14365 29442 36752 -5139 -43908 -30512 17056 39628
1951 39628 11925 -32378 -39189 2985 41285 26353 -21527 -42541 -14895 27205 34240 -1392
1963 -1392 -37454 -28576 13027 35941 17032 -19729 -34583 -9960 26610 29842 -4681 -34424
1975 -34424 -24608 13333 36615 18000 -24053 -37033 -2365 35717 29461 -12298 -40172 -20467
1987 -20467 25013 41222 5705 -35598 -29148 13952 40298 19900 -22802 -36805 -5088 32553
$$ packed form
1901c025L1850M7l5732k6575J7587L9027J2262k9609l9199l27M1764L1859k0838
1914A9091m5492j2720L4409L8942j422m2170l2638J8284M3772J3852k9365l5106
1926c0563k047L4275L1025j0277l8727j9364K0788L5085R640k8093l6286P3L9671
1939E200L1459j4878m2512j9440K5806M3807P310m1891l8769J3396M7568K2572
1951C9628k7703m4303o811M2174L8300j4932m7880k1014K7646M2100P035l5632
1963a392l6062Q878M1603K2914j8909l6761j4854K4623L6570L232l4523k9743
1975c4424R816L7941K3282j8615m2053j2980L4668L8082o256m1759k7874J9705
1987b0467M5480J6209l5517m1303O450M3100K6346k0398m2702j4003L1717L7641
$$ plain form
1999 32553 29293 -7692 -30716 -15495 18188 33308 11360 -22555 -26336 2523 27662 21315
2011 21315 -8428 -29216 -15448 20441 34710 8565 -25622 -26945 3996 32139 22737 -15053
2023 -15053 -34651 -9716 27027 29526 -1922 -28295 -18331 16635 32975 8412 -25509 -26334 4047
2036 4047 27200 19312 -9229 -25563 -9208 19312 24385 3535 -17221 -17078 1846 19636 14441
2049 14441 -8297 -19513 -5165 16086 20624 3248 -18097 -17739 7207 24596 10784 -15436
2061 -15436 -22495 -3615 20269 21438 -3509 -22064 -10464 13564 18263 1034 -16949 -15330 3450
2074 3450 16724 7391 -10599 -13718 -1094 10337 9828 -1189 -12836 -10783 2138 8683 3767
2087 3767 -4759 -10423 -6031 6136 11092 675 -11326 -10491 33 8318 5419 -7187 -13414 -2487
$$ packed form
1999C2553l260l6985k3024J5221L3683J5120k1948l3915l781K8859K5139o347
2011B1315k9743k0788J3768L5889J4269k6145l4187j323L0941K8143r402l7790
2023a5053j9598K4935L6743K499l1448k6373R964L4966J6340k4563l3921q25L0381
2036D047K3153p888k8541j6334J6355K8520N073k0850k0756J43J8924J7790n195
2049A4441k2738j1216J4348K1251M538j7376k1345L58K4946J7389j3812k6220
2061a5436p059J8880K3884J169k4947j8555J1600K4028M699j7229j7983J619J8780
2074C450J3274r333j7990l119J2624J1431n09j1017j1647K053J2921O545m916
2087C767q526n664M392J2167M956j0417j2001Q35J0524Q285k899j2606o227J0927
$$ plain form
2101 -2487 9888 7930 -3295 -9203 -4766 4348 7162 -1365 -9704 -5523 3050 5191 1973 -1778
2115 -1778 -3110 -1373 1924 2139 679 86 -2264 -5906 -2435 4396 5778 297 -3964 -3565 1520 6475
2131 6475 2042 -6414 -6028 2069 5415 2148 -3432 -5455 -734 6472 6778 -569 -5871 -5087 -1390 3642
2147 3642 6252 815 -6312 -5447 1312 7045 7231 -1710 -9865 -4987 7341 9083 -2060 -11949 -7467
2162 -7467 6307 15256 5554 -12369 -14005 2839 14877 8953 -7671 -16213 -6598 11043 13984
2175 13984 -733 -12796 -8587 4461 12129 6138 -8735 -15434 -4434 10008 11330 -542 -13076
2188 -13076 -12262 3705 17323 9413 -11319 -19253 -4942 13530 16490 -3248 -21813 -13658 12990
2201 12990 23205 4921 -18491 -19676 2560 21903 13593 -13494 -23389 -4291 18584 18785 -1363
$$ packed form
2101b487J2375j958j1225n908M437R114K814q527q339M181Q573K141l218l751
2115a778j332J737L297K15j460n93k350l642L471O831J382n481m261L99N085M955
2131F475m433q456L86Q097L346l267n580k023M721P206L06p347n302P84L697N032
2147C642K610n437p127Q65O759N733J86q941q155M878J2328J742j1143r889M482
2162g467J3774Q949r702j7923j636J6844J2038n924j6624q542R615J7641K941
2175A3984j4717j2063M209J3048P668n991j4873o699J1000J4442J322j1872j2534
2188a3076Q14J5967J3618p910k0732p934J4311J8472K960j9738j8565Q155K6648
2201A2990J0215j8284k3412j185K2236J9343q310k7087r895J9098K2875K01k0148
$$ plain form
2214 -1363 -19466 -13204 10873 22421 6939 -15598 -19746 -2225 17935 19406 -2216 -21131 -12891
2227 -12891 11803 23482 9107 -15448 -22673 -1223 23813 18883 -10007 -25528 -8904 20029
2239 20029 27257 2222 -26244 -21439 10775 29286 12101 -17973 -25591 -2947 24249 22594 -5691
2252 -5691 -23840 -10854 14026 22137 4919 -18561 -20419 2994 23991 16210 -8856 -22340 -9588
2265 -9588 16417 26171 4916 -23329 -22692 4887 26176 16943 -12485 -26863 -6555 24404 25695
2278 25695 -4395 -27137 -16029 14315 27876 6814 -23286 -24104 5587 27423 16385 -11926
2290 -11926 -24578 -8635 17981 22819 -681 -22797 -17058 6902 22777 13149 -11387 -23132
2302 -23132 -6290 19156 20482 -1996 -22638 -18421 7479 25238 10751 -18338 -24481 170
$$ packed form
2214a363j8103O262K4077J1548j5482k2537m148J7521K0160J471k1622j8915Q240
2227a2891K4694J1679j4375k4555p225K1450K5036m930k8890j5521J6624K8933
2239B0029P228k5035k8466M805L2214J8511j7185l0074p618K2644K7196j655k8285
2252e691j8149J2986K4880Q111j7218k3480j858K3413K0997p781k5066j3484J2752
2265i588K6005R754k1255k8245O37K7579K1289r233k9428j4378K0308L0959J291
2278B5695l0090k2742J1108L0344J3561k1062l0100q18K9691K1836j1038k8311
2290a1926j2652J5943K6616M838k3500k2116N739K3960J5875r628k4536j1745
2302b3132J6842K5446J326k2478k0642M217K5900J7759j4487k9089o143K4651
$$ plain form
2314 170 23839 18802 -9895 -28320 -13263 17174 24478 -217 -23611 -19125 6323 23012 11505
2327 11505 -14579 -22637 -3907 15646 13594 -4814 -19128 -13025 7551 18111 5507 -14371
2339 -14371 -17720 -2393 14371 14110 -5309 -22067 -13913 9448 19185 4997 -15929 -18784 997
2352 997 19368 12290 -12430 -21832 -5994 14862 15803 -3097 -18949 -11749 9999 18648 3829
2365 3829 -13179 -14019 269 13341 10065 -5455 -14118 -5344 8677 12611 4385 -7694 -10998 124
2379 124 12266 9807 -3798 -11931 -6249 7777 15417 4756 -10161 -10532 4703 14627 7747 -6403
2393 -6403 -12442 -2271 12221 11951 -2325 -10343 -3094 7863 10248 2490 -7070 -6666 2496 7651
2407 7651 3651 -1714 -3984 -1260 3699 6615 3022 -2768 -4127 -1173 3080 5399 1132 -5803 -5307
$$ packed form
2314A70K3669n037k8697j8425J5057L0437P304k4695k3394M486K5448J6689j1507
2327A1505k6084q058J8730J9553k052j8408j4314O103K0576J0560j2604j9878
2339a4371l349J5327J6764k61j9419j6758Q154K3361R737j4188k0926k855J9781
2352I97J8371p078k4720r402J5838K0856R41j8900j5852P200K1748Q649j4819
2365C829j7008q40J4288J3072l276j5520q663Q774J4021L934q226j2079l304J1122
2379A24J2142k459j3605q133N682J4026P640j0661j4917l71J5235R924o880j4150
2393f403o039J0171J4492k70j4276q018P249J0957K385p758r560M04R162N155
2407G651m000n365k270K724M959K916l593n790j359K954M253K319m267o935M96
$$ plain form
2422 -5307 3050 7453 3366 -3261 -5599 -904 6017 5234 -3695 -6864 -1588 3904 4201 663 -3157
2437 -3157 -2884 1923 3666 364 -1682 -1031 -2179 -2115 1097 2837 1168 -1855 -3075 -1027 3997 4113
2453 4113 -2952 -7242 -2743 3939 4921 -144 -6225 -5174 3125 7535 1191 -6044 -5828 -831 3463
2468 3463 3287 -1908 -6594 -3510 2613 4202 2004 -2029 -6040 -3938 3270 5811 -449 -7566 -7873
2483 -7873 -149 8126 6846 -4862 -11312 -3434 7949 8347 -2856 -12090 -8520 5689 12010 1683
2497 1683 -11004 -9551 2637 11029 6605 -6113 -12836 -4104 8156 8483 -819 -8893 -7319 2494
2511 2494 10907 6881 -5960 -11145 -3119 7979 10534 920 -11634 -10367 5816 15838 7607 -8604
2525 -8604 -13210 -1240 14208 13753 -4089 -16760 -6669 11980 16662 3348 -12450 -11968 5805
$$ packed form
2422e307Q357M403m087o627k338M695O921p83q929l169N276N492K97l538l820
2437c157K73M807J743l302k046O51j148O4L212J740j669l023j220K048N024J16
2453D113p065m290M499O682R82n065o081J051Q299M410o344p235K16M997M294
2468C463j76n195m686L084O123J589k198m033m011K102P208K541o260p117l07
2483g873P724Q275j280j1708o450P878J1383L98j1203r234L570J4209O321j0327
2497A683j2687J453J2188Q392m424j2718o723Q732J2260L27r302q074J574R813
2511B494Q413m026j2841n185Q026J1098K555r614j2554J267J6183J0022q231j6211
2525h604m606J1970J5448m55j7842j2671J0091J8649M682j3314j5798M82J7773
$$ plain form
2538 5805 18462 9643 -8968 -14094 -2079 12172 14212 570 -12357 -8299 7682 15297 6850
2551 6850 -7711 -13158 -2587 13509 14438 -2538 -14980 -8760 8779 18424 7833 -12734 -17059
2564 -17059 631 17558 12105 -7752 -18205 -6762 13686 17494 -941 -17631 -11396 8654
2576 8654 17035 5617 -13129 -17334 -1236 15798 12429 -5402 -15540 -8041 8234 14760 4060
2589 4060 -13112 -15285 68 13586 9978 -5977 -16942 -8460 11318 17353 1473 -16558 -15095
2602 -15095 3408 17268 9564 -11515 -19517 -3058 16670 14612 -4559 -17639 -10177 9696 17353
2615 17353 2388 -15591 -14822 2753 14514 9911 -6429 -15321 -5830 10103 12898 -121 -12460
2628 -12460 -11582 1523 13287 9021 -7920 -15522 -4116 12057 14065 -368 -15514 -13434 5854
$$ packed form
2538E805J2657q819j8611n126J2015J4251K040j3642j2927M058J5981P615q447
2551F850j4561n447J0571J6096R29j6976j2442O220J7539R645j0591k0567m325
2564a7059J7690J6927n453j9857j0453J1443K0448L808j8435j6690O235K0050
2576H654Q381j1418j8746m205J6098J7034l369j7831j0138P499J6275O526j0700
2589D060j7172k173J5353J3518l608j5955j0965Q482J9778O035j5880j8031J463
2602a5095J8503J3860p704k1079q002J6459J9728k058j9171j3080P462J9873P657
2615A7353j4965j7979P69J7575J1761m603j6340q892R491J5933K795j3019j2339
2628a2460Q78J3105J1764m266j6941p602J1406J6173K008j4433j5146K080J9288
$$ plain form
2641 5854 16591 5693 -12333 -14895 -171 14264 11681 -6034 -16284 -4917 11347 12380 -1608
2654 -1608 -13667 -10180 4813 14493 6452 -8514 -11596 -1671 8894 9594 -102 -10495 -8539 3932
2668 3932 11193 4956 -5768 -9558 -1681 10450 11172 -2459 -13058 -7094 6902 13232 4383 -9554
2682 -9554 -11070 2452 13842 8364 -5907 -10377 -2143 8416 9311 -980 -9552 -4292 5972 9130
2696 9130 3373 -4482 -6315 -70 7212 6158 -969 -6067 -4431 2024 7245 5158 -3289 -6755 -637
2711 -637 6190 5897 -1011 -7704 -5826 3729 8698 1714 -6808 -6053 1696 7218 3972 -3553 -7273 -1553
2727 -1553 4892 3019 -2651 -4731 -2402 1638 4102 1286 -3240 -3482 -1054 641 1653 1161 -2776
2742 -2776 -4685 -1472 2697 3183 5 -3293 -3716 717 4245 217 -4790 -4082 544 4003 2676 -2124
$$ packed form
2641E854J0737j0898j8026k562J4724J4435k583j7715j0250J1367J6264J033j3988
2654a608j2059L487J4993R680q041j4966l082R925J0565P00r696j0393J956J2471
2668C932P261o237j0724l790P877J2131P22j3631j0599N964J3996O330q849j3937
2682i554j516J3522J1390n478j4271m470Q234J0559Q95j0291q572N260J0264L158
2696I130n757p855j833O245P282j054p127n098J636O455N221k087q447l466O118
2711f37O827k93o908o693J878R555M969o984q522P55P749N522l246p525l720N720
2727a553O445j873n670k080K329M040K464k816m526k42K428J695J012m92l937
2742b776j909L213M169M86l178l298m23M433L528m028n007P08M626L459j327m800
$$ plain form
2758 -2124 -4762 -816 3906 3200 -181 -2384 -2534 -783 1276 2178 694 -695 -987 -870 1215 3059
2774 3059 862 -3648 -2230 2069 4030 2187 -2823 -4607 857 7336 5133 -2631 -5783 -2094 3855
2789 3855 5694 724 -5307 -3487 2916 5267 1928 -2187 -3463 -1214 3698 3952 -702 -4379 -3043
2804 -3043 1103 4754 4534 -1299 -6063 -2474 4819 6169 512 -6059 -6452 1446 8554 4237 -6082
2819 -6082 -8045 226 7846 6842 -2832 -9761 -4914 6053 7851 28 -7216 -6121 1860 7979 4306
2834 4306 -4675 -7932 -1884 5587 5889 18 -7104 -7074 1602 9007 5330 -4130 -8675 -3608 5811 8936
2850 8936 -91 -10108 -7955 3850 9988 3991 -7358 -10392 -314 11237 7986 -5716 -12349
2863 -12349 -4604 7199 10092 716 -10268 -8407 3397 9815 3839 -5937 -9073 -2669 6425 7303
$$ packed form
2758b124k638L946M722p06l381k203j50J751K059R02j484j389k92J17K085J844
2774C059k197m510J418M299J961j843n010j784N464O479k203p764l152L689N949
2789C855J839m970o031J820O403K351l339m115j276K249M912K54m654l677J336
2804c043M146L651k20n833m764L589P293J350n657o571l93P898P108m317j0319
2819f082j963Q271P620j004r674o929M847J0967J798p823p244J095P981O119l673
2834D306q981l257O048P471L02n871p122L0Q676P405l677r460m545N067R419L125
2850H936r027j0017K153J1805O138n997j1349l034J0078J1551l251j3702o633
2863a2349P745J1803K893r376j0984J861J1804O418n976r776l136O404R094Q78
$$ plain form
2877 7303 -2227 -9897 -6160 3767 9617 4781 -6548 -11210 -1918 9348 8807 -2638 -11397 -7641
2891 -7641 5280 12014 3193 -9773 -9893 2543 11329 6043 -6406 -12637 -3154 10207 10382 -2238
2905 -2238 -10939 -6301 5278 10911 4381 -7357 -10133 -345 8640 7263 -1782 -8191 -5186 5288
2919 5288 10919 3809 -7472 -8438 381 9715 8669 -2785 -11744 -4704 8659 12199 1888 -9432
2933 -9432 -8347 3383 12579 6095 -7590 -10768 95 10439 8741 -1783 -9411 -4872 6820
2946 6820 10330 1623 -7009 -6973 1061 7784 6184 -3014 -8309 -2576 6318 8356 2008 -6810 -8050
2961 -8050 1220 9658 6163 -4839 -9433 -3267 7332 9502 528 -9250 -6661 4690 9361 2249
2975 2249 -7007 -8250 202 9083 6325 -4462 -8944 -2444 5687 7231 466 -7274 -6571 998 6445
$$ packed form
2877G303r530p670L737R927N850m836j1329m662R292J1266n41j1445q759L756
2891g641J2921O734q821j2966j20J2436Q786n286j2449o231R483J3361J75j2620
2905b238q701M638J1579N633o530j1738k776R788Q985j377r045o409L005J0474
2919E288N631p110j1281r66Q819R334j046j1454q959P040J3363L540j0311j1320
2933i432J085J1730R196o484j3685l178J0863J0344j698j0524p628M539J1692
2946F820L510q707q632L6Q034O723j600r198n295N733Q894K038o348q818j240
2961h050R270Q438l495j1002m594O166J0599K170q974r778K589J1351M671p112
2975B249r256j243Q452Q881k758j0787m482O500Q131J544o765p740P03P569N447
$$ plain form
2990 6445 3489 -2937 -5999 -2979 3258 5803 116 -6354 -5957 673 5724 3726 -3926 -8346 -2587
3005 -2587 6248 6595 -1640 -7756 -5434 2139 6416 1759 -6135 -6406 877 5728 2702 -3186 -5428
3020 -5428 -2166 3763 4094 -1324 -5046 -3283 282 3277 2614 -1505 -4038 -1526 2251 3034 659 -2687
3036 -2687 -4078 -810 4344 2788 -2150 -4434 -1088 3274 4651 313 -5244 -3766 2391 4555 681
3051 681 -2722 -2817 529 3867 3120 -967 -2480 -236 1517 1811 919 -653 -1891 -242 2055 2344 1498
3068 1498 -373 -2091 -813 2889 3060 -712 -2621 -1357 1605 3991 1626 -2543 -2772 1985 4098
3083 4098 1858 -1676 -3121 -975 2509 3135 -163 -1947 -951 1010 1674 1696 40 -1781 -1348 707
3099 707 1997 1206 -496 -2405 -955 3166 3906 -884 -3995 -2423 1776 4482 2035 -3897 -5209 735
$$ packed form
2990F445k956o426l062L020O237K545n687o470L97O630N051j998p652m420N759
3005b587Q835L47q235o116K322P573M277m657p894k71P283M851l026n888k242
3020e428L262N929L31n418l722J763L565K995o63m119k533K512L777P83k375l346
3036b687j391L268N154j556m938k284L346M362J377m338n557J478O157K164l874
3051F81l403r5L346L338p47m087j513K244J753K94q92j572j238J649K297K89q46
3068A498j871j718J278L702J71l772j909J264K962K386k365m169k29M757K113
3083D098k240l534j445K146L484O26l298j784R96J961O64K2j656j821M33K055
3099G07J290p91j702j909J450M121P40m790l111J572M199K706k447n932j312N944
$$ plain form
3115 735 4841 2741 -1720 -3827 -993 2991 3690 -878 -4197 -1883 1968 2805 1685 -1775 -3739 -766
3131 -766 3162 3486 -365 -2811 -3822 -394 4138 3428 -2478 -5325 -1788 3636 4955 314 -5727 -4938
3147 -4938 2245 6182 1475 -4962 -5541 -40 5907 4887 -2775 -6730 -2028 4152 4455 -529 -5104
3162 -5104 -4830 1246 5442 2738 -3094 -4716 -1984 2739 4634 792 -4977 -4976 795 5204 3263 -2308
3178 -2308 -6099 -2422 5451 6411 -1171 -7507 -4370 3011 6874 2742 -5798 -6808 1245 7600 4568
3193 4568 -3305 -6448 -2316 4686 6084 -140 -6019 -4032 2516 5552 2985 -2850 -5422 -1264 4780
3208 4780 5339 -654 -5294 -4469 1468 6789 4688 -3594 -6906 -739 6112 5703 -868 -7239 -4571 4478
3224 4478 7945 993 -6568 -5561 2157 7249 4718 -3955 -7587 -1633 5764 5176 -616 -5264 -4009
$$ packed form
3115G35M106k100m461k107K834L984O99m568l319K314L851Q37j120l460j964K973
3131g66L928L24l851k446j011L428M532p10n906k847L537N424J319m641o041P89
3147d938P183L937m707o437n79N501N947j020p662l955M702O180L03m984m575
3162e104K74O076M196k704n832j622K732M723J895l842n769JN771M409j941n571
3178b308l791L677P873R60p582o336L137P381L863m132q540j010Q053O355l032
3193D568p873l143M132P002J398o224n879J987O548L036k567n835k572M158O044
3208D780N59n993m640Q25N937N321k101q282l312O167O851m09o571o371K668R049
3224D478L467o952p561J007P718N092k531q673l632N954P397n88n792m648J255
$$ plain form
3239 -4009 1943 6121 2628 -3566 -4804 -891 4073 4251 -404 -5543 -4313 2510 6436 2378 -4032
3254 -4032 -6056 -869 6330 5812 -2180 -7343 -3017 4602 6629 1003 -5798 -5143 2546 7036 2698
3269 2698 -4579 -5620 -747 4503 4551 -1075 -5791 -2505 3099 4484 1729 -2987 -4651 -1186 4019
3284 4019 4025 -1468 -4699 -3101 2032 5402 2382 -4099 -5525 262 4836 3570 -1990 -5600 -2888 3934
3300 3934 5724 -204 -5278 -3285 2339 5107 1844 -3497 -5121 -548 4404 3151 -937 -3514 -2090
3315 -2090 1616 3872 1321 -2562 -3026 -76 2501 2400 177 -3397 -2619 1992 4138 1419 -2625 -3523
3331 -3523 -462 3933 4122 -1614 -5251 -1780 3181 4008 660 -2939 -2889 1225 4055 985 -2764 -2640
3347 -2640 -164 2216 2206 -366 -2847 -1506 1139 1754 794 -742 -2530 -1865 1161 2436 441 -2410
$$ packed form
3239d009N952M178l493o194j238L913M964J78m655n139J230O823L926m058o410
3254d032k024N187P199n18p992n163M326P619K027n626o801O55P689M490m338
3269B698p277j041M873N250M8n626m716L286N604J385k755m716j664L465N205
3284D019On493l231J598N133L370l020o481j426N787M574j266n560l610K712O822
3300C934J790n928n074J993N624K768l263n341j624M573M952j253m088k577J424
3315b090L706K256k551l883m64K950K577j01k223l574P78M611K146k719m044q98
3331c523L061M395J89n736l637L471M961Q27l348l599N0M114K830l070l749J24
3347b640K476K380j0k572k481J341K645O15r60j536j788O65L026J275j995k851
$$ plain form
3363 -2410 -2289 -157 2591 2244 -1642 -3816 -1273 2255 2102 -883 -2956 -2503 1141 3349 506 -2706
3379 -2706 -2307 406 1757 1186 -1543 -2655 -1378 1155 1726 161 -375 -1570 -1045 1142 2238 380
3395 380 -1854 -1710 -449 1963 2398 -878 -2747 -558 2645 2552 -78 -2455 -2053 1758 3440 1002
3411 1002 -2414 -2155 1089 2566 2144 -79 -1970 -854 1622 1882 516 -550 -719 -131 2034 2593
3427 2593 554 -1417 -1102 481 2552 2197 -1107 -3239 -266 3459 2925 -348 -2766 -1687 1899 3927
3443 3927 1017 -3258 -2386 1397 3102 1765 -1293 -2698 -548 2755 2460 -593 -2526 -1685 219 2125
3459 2125 1852 -1072 -2789 -933 1792 2450 890 -2593 -3391 294 3706 2066 -2084 -3990 -1072 2777
3475 2777 4058 -299 -4134 -2561 2277 3588 650 -3055 -3347 276 3666 2122 -2144 -3523 -1078
$$ packed form
3363b410J21K132K748l47l886k174K543L528j53k985k073M53L644K208k843l212
3379b706L99K713J351n71k729j112J277K533N71j565n36j195N25K187J096j858
3395C80k234J44J261K412M35l276j869K189L203r3k630k377M02L811J682k438
3411A002l416K59L244J477m22k223j891J116K476K60j366j066j69N88K165N59
3427B593k039j971L15J583K071l55l304k132K973L725n34l273k418J079L586K028
3443C927k910m275Q72L783J705j337l058j405K150L303k95l053j933Q41J904J906
3459B125k73k924j717J856K725O58j560l483p98L685L412j640m150j906K918L849
3475B777J281m357l835J573M838J311k938l705k92L623L390j544m266j379K445
$$ plain form
3490 -1078 2184 2820 346 -3188 -3063 247 2563 1564 -1091 -2965 -2150 1450 3500 341 -3325 -3237
3506 -3237 382 3230 2383 -2326 -4905 -1399 3604 3386 -1068 -4041 -3031 1475 4021 880 -4206
3521 -4206 -3571 911 3650 1836 -1737 -3867 -1823 2605 2792 -696 -3240 -2744 266 2525 2194 -1595
3537 -1595 -3521 -1590 1973 2649 657 -3157 -3704 613 4141 2018 -3107 -4034 -612 3576 4089 -459
3553 -459 -4414 -2503 2615 4050 532 -2786 -3020 628 3697 2762 -1891 -2776 -432 2554 2554 476 -2197
3570 -2197 -2417 973 3469 2266 -816 -2479 -1142 2083 3861 596 -2954 -2415 1402 3710 2539
3585 2539 -1436 -3553 -184 4216 3529 -680 -3395 -1582 2211 3960 967 -2771 -2257 1479 3257
3600 3257 1573 -856 -2405 -511 2198 2608 111 -2305 -1140 657 2424 2400 -1061 -2769 -763 2085
$$ packed form
3490a078L262O36k474l534J25L310K316r99k655j874Q15L600K050l159l666Q8
3506c237L619K848q47m709k579L506N003k18m454k973J010M506K546l141n086
3521d206O35M482K739j814l573k130K044M428J87l488k544M96L010K259l31l789
3537a595j926J931L563O76j992l814n47M317L528k123n125r27L422M188N13m548
3553d59l955J911N118J435l518l318k34L648L069r35m653q85K344K986%k078k673
3570b197k20L390K496j203l082j663J337L225J778l265l550N39L817K308j171
3585B539l975k117L369M400o87m209k715J813L793J749k993l738N14L736J778
3600C257j684k429j549J894K709M10k497k416J165J797J767k4l461j708K006K848
$$ plain form
3616 2085 2677 419 -2169 -2787 577 3607 2399 -1986 -3101 -209 2347 2856 -587 -3668 -2025 2009
3632 2009 2824 462 -2215 -2189 -136 2201 1539 -1221 -2167 -604 1177 1225 16 -1671 -2011 -119 2163
3649 2163 1498 -812 -2024 -1895 712 2667 524 -2457 -2659 426 2206 1355 -1217 -2886 -930 2304
3665 2304 2103 -991 -2641 -1496 859 2299 1074 -2147 -2132 249 1710 917 -255 -1682 -1125 151
3681 151 1404 540 -931 -1355 -510 816 1957 131 -1932 -1786 645 2122 1090 -1275 -2756 -375
3697 -375 2661 2250 -820 -2251 -816 1457 1771 298 -1798 -1890 808 2234 842 -838 -1370 -388 1048
3714 1048 1447 -85 -1388 -1248 -99 908 1505 -164 -1689 -1000 1120 1690 376 -1529 -2037 -296
3730 -296 2133 1826 -1402 -2429 -632 1885 1754 -42 -2419 -2009 1198 2035 -207 -1893 -1441 -119
$$ packed form
3616B085N92k258k588o18L364L030j208m385j115K892K556N09l443l081J643M034
3632B009Q15k362k677K6K053K337o62k760r46J563J781M8j209j687l40J892K282
3649B163o65k310j212J29K607J955k143k981k02L085J780q51k572j669J956L234
3665B304k01l094j650J145K355J440j225l221J5K381J461p93j172j427N57J276
3681A51J253q64j471m24Q45J326J141j826k063J46K431J477j032k365j481K381
3697c75L036m11l070j431J435K273L14j473k096r2K698J426j392j680n32R82J436
3714A048L99j532j303J40J149J007N97j669j525O89K120N70j314j905n08J741
3730b96K429l07l228j027J797K517j31j796k377M10L207Q37k242j686M52J322
$$ plain form
3746 -119 1253 1209 -537 -1820 -959 795 1066 688 -745 -1827 -798 1574 1672 -9 -1493 -1328 476
3763 476 2164 1148 -1897 -2095 321 2504 1778 -807 -2246 -973 2361 2892 -56 -2226 -1184 866
3779 866 2137 1472 -746 -1929 32 1756 1398 278 -900 -567 502 1765 1099 -642 -1662 -467
3795 -467 1232 2306 503 -1741 -1744 723 2265 833 -1481 -2423 -666 2431 2015 -757 -2012 -654
3811 -654 1565 1900 42 -2168 -1813 618 2082 717 -1060 -1515 -375 1094 1256 22 -1627 -1280
3827 -1280 346 1014 739 -559 -2114 -1114 1343 2182 13 -1706 -1626 16 2098 1488 -1481 -2638
3843 -2638 -152 2203 1356 -552 -1731 -1025 1742 2126 -108 -2122 -1546 391 1477 1279 -393 -1577
3859 -1577 -751 949 1142 587 -740 -1543 -658 1372 1136 -758 -1664 -818 599 1786 948 -1959 -2359
$$ packed form
3746a19J372m4j746j283Q61J754K71l78j433j082J029K372R8j681j484J65J804
3763D76J688j016l045j98K416K183p26k585j439J273L334N31k948k170J042K050
3779H66J271o65k218j183J961J724l58j120j178L33J069J263o66j741j020J195
3795d67J699J074j803k244lK467J542j432k314r42J757L097m16k772j255J358
3811f54K219L35j858k210L55K431J464j365j777m55J140J469J62j234j649L47
3827a280J626O68k75j298j555J000K457Q39k169j719Q0J642K082o10k969j157
3843b638K486K355q47j908j179P06K767L84k234k014N76J937J086j98j672j184
3859a577Q26J700J93n55j327q03Q85K030k36j894r06Q46J417J187q38k907m00
$$ plain form
3876 -2359 410 1953 1034 -1364 -2176 -1006 1853 2022 -789 -2279 -921 1075 1132 130 -1564 -1702
3892 -1702 10 1313 614 -870 -934 -851 123 1400 724 -1271 -1539 -380 934 1117 169 -1813 -1296 1158
3910 1158 2176 538 -1512 -1841 104 2138 1689 -578 -2063 -410 1969 1598 307 -1497 -955 400
$$ packed form
3876b359K769J543r19k398q12J170K859J69k811j490J358J996N7j002j694j38
3892a702J712J303o99j484o4Q3R74J277o76j995k68J159J314J83r48j982N17K454
3910A158J018j638k050l29J945K034m49k267j485J653K379l71j291j804N42J355
$$ [...]
8191c07
##END NTUPLES=NMR FID
##END=
