##TITLE=1H_CA-8719
 DMSO, 8 sc, 
 2.7.2020
##JCAMPDX= 6.0         $$ Bruker NMR JCAMP-DX V2.0
##DATA TYPE= NMR FID
##DATA CLASS= NTUPLES
##ORIGIN= UXNMR, Bruker Analytische Messtechnik GmbH
##OWNER= root
$$ XWIN-NMR		Version 3.5
$$ Thu Jul  2 09:59:34 2020 Russian Standard Time (UT+4h)  she@DPX200
##.OBSERVE FREQUENCY= 200.1315
##.OBSERVE NUCLEUS= ^1H
##.DELAY= (6, 6)
##.ACQUISITION MODE= SIMULTANEOUS
##.ACQUISITION SCHEME= undefined
##.AVERAGES= 8
##.DIGITISER RES= 18
##SPECTROMETER/DATA SYSTEM= spect
##.PULSE SEQUENCE= zg30
##.SOLVENT NAME= DMSO
##.SHIFT REFERENCE= (INTERNAL, DMSO, 0, 15.7039)
##AUDIT TRAIL= $$ (NUMBER, WHEN, WHO, WHERE, WHAT)
$$ ##TITLE= Audit trail, XWIN-NMR		Version 3.5
$$ ##JCAMPDX= 5.01
$$ ##ORIGIN= Bruker BioSpin GmbH
$$ ##OWNER= she
$$ F:/spectra/data/she/nmr/H-F/1/audita.txt
$$ ##AUDIT TRAIL=  $$ (NUMBER, WHEN, WHO, WHERE, WHAT)
(   1,<2020-07-02 09:58:37.70 +0400>,<she>,<DPX200>,
      <created by zg, POWCHK disabled, PULCHK disabled
       configuration hash MD5:
       00 E9 B6 7A A2 85 ED C7 34 08 36 98 17 FE 4E 26
       data hash MD5: 16K
       E7 DF 30 2A 38 87 9B 4B 1C B9 AD 34 21 9F A0 C6>)
$$ ##END=
$$ 
$$ hash MD5
$$ 3C ED D8 E9 31 4F 56 9F E5 74 D1 21 8C 84 BE 4C
##$RELAX= 
##$RELAX= 
##$RELAX= 
##$RELAX= 
##$RELAX= 
##$RELAX= 
$$ Bruker specific parameters
$$ --------------------------
##$DU= <F:/spectra>
##$EXPNO= 1
##$NAME= <H-F>
##$PROCNO= 1
##$TYPE= <nmr>
##$USER= <she>
##$AMP= (0..31)
100 100 100 100 100 100 100 100 100 100 100 100 100 100 100 100 100 100 
100 100 100 100 100 100 100 100 100 100 100 100 100 100 
##$AQSEQ= 0
##$AQ_mod= 1
##$AUNM= <au_zg>
##$AUTOPOS= <>
##$BF1= 200.13
##$BF2= 200.13
##$BF3= 200.13
##$BF4= 200.13
##$BF5= 200.13
##$BF6= 200.13
##$BF7= 200.13
##$BF8= 200.13
##$BYTORDA= 1
##$CFDGTYP= 0
##$CFRGTYP= 5
##$CHEMSTR= <none>
##$CNST= (0..31)
1 1 145 1 1 1 1 1 1 1 1 1 1 1 1 1 1 1 1 1 1 1 1 1 1 1 1 1 1 1 1 1 
##$CPDPRG= <>
##$CPDPRG1= <>
##$CPDPRG2= <>
##$CPDPRG3= <>
##$CPDPRG4= <mlev>
##$CPDPRG5= <mlev>
##$CPDPRG6= <mlev>
##$CPDPRG7= <mlev>
##$CPDPRG8= <mlev>
##$CPDPRGB= <>
##$CPDPRGT= <>
##$D= (0..31)
0 1.2 0 0 0 0 0 0 0 0.06 0 0.03 0 0 0 0 0.0002 0 0 0 0 0 0 0 0 0 0 0 0 
0 0 0 
##$DATE= 1593669517
##$DBL= (0..7)
120 120 120 120 120 120 120 120 
##$DBP= (0..7)
150 150 150 150 150 150 150 150 
##$DBP07= 0
##$DBPNAM0= <>
##$DBPNAM1= <>
##$DBPNAM2= <>
##$DBPNAM3= <>
##$DBPNAM4= <>
##$DBPNAM5= <>
##$DBPNAM6= <>
##$DBPNAM7= <>
##$DBPOAL= (0..7)
0.5 0.5 0.5 0.5 0.5 0.5 0.5 0.5 
##$DBPOFFS= (0..7)
0 0 0 0 0 0 0 0 
##$DE= 6
##$DECBNUC= <off>
##$DECIM= 24
##$DECNUC= <off>
##$DECSTAT= 4
##$DIGMOD= 1
##$DIGTYP= 9
##$DL= (0..7)
0 120 120 120 120 120 120 120 
##$DP= (0..7)
150 150 150 150 150 150 150 150 
##$DP07= 0
##$DPNAME0= <>
##$DPNAME1= <>
##$DPNAME2= <>
##$DPNAME3= <>
##$DPNAME4= <>
##$DPNAME5= <>
##$DPNAME6= <>
##$DPNAME7= <>
##$DPOAL= (0..7)
0.5 0.5 0.5 0.5 0.5 0.5 0.5 0.5 
##$DPOFFS= (0..7)
0 0 0 0 0 0 0 0 
##$DQDMODE= 0
##$DR= 18
##$DS= 0
##$DSLIST= <SSSSSSSSSSSSSSS>
##$DSPFIRM= 0
$$ [...]
##$SUBNAM2= <"">
##$SUBNAM3= <"">
##$SUBNAM4= <"">
##$SUBNAM5= <"">
##$SUBNAM6= <"">
##$SUBNAM7= <"">
##$SUBNAM8= <"">
##$SUBNAM9= <"">
##$SW= 24.9337058887773
##$SWIBOX= (0..15)
0 0 2 0 0 0 0 0 0 0 0 0 0 0 0 0 
##$SW_h= 4990.01996007984
##$TD= 16384
##$TD0= 1
##$TE= 0
##$TE2= 300
##$TE3= 300
##$TEG= 300
##$TL= (0..7)
0 120 120 120 120 120 120 120 
##$TP= (0..7)
150 150 150 150 150 150 150 150 
##$TP07= 0
##$TPNAME0= <>
##$TPNAME1= <>
##$TPNAME2= <>
##$TPNAME3= <>
##$TPNAME4= <>
##$TPNAME5= <>
##$TPNAME6= <>
##$TPNAME7= <>
##$TPOAL= (0..7)
0.5 0.5 0.5 0.5 0.5 0.5 0.5 0.5 
##$TPOFFS= (0..7)
0 0 0 0 0 0 0 0 
##$TUNHIN= 0
##$TUNHOUT= 0
##$TUNXOUT= 0
##$USERA1= <user>
##$USERA2= <user>
##$USERA3= <user>
##$USERA4= <user>
##$USERA5= <user>
##$V9= 5
##$VALIST= <valist>
##$VCLIST= <CCCCCCCCCCCCCCC>
##$VD= 0
##$VDLIST= <DDDDDDDDDDDDDDD>
##$VPLIST= <PPPPPPPPPPPPPPP>
##$VTLIST= <TTTTTTTTTTTTTTT>
##$WBST= 1024
##$WBSW= 4
##$XGAIN= (0..3)
0 0 0 0 
##$XL= 0
##$YL= 0
##$YMAX_a= 258994
##$YMIN_a= -176183
##$ZGOPTNS= <>
##$ZL1= 120
##$ZL2= 120
##$ZL3= 120
##$ZL4= 120
##$ABSF1= 10
##$ABSF2= 0
##$ABSG= 5
##$ABSL= 3
##$ALPHA= 0
##$AQORDER= 0
##$ASSFAC= 0
##$ASSFACI= 0
##$ASSFACX= 0
##$ASSWID= 0
##$AUNMP= <proc_1d>
##$AZFE= 0.1
##$AZFW= 0.1
##$BCFW= 1
##$BC_mod= 2
##$BYTORDP= 1
##$COROFFS= 0
##$CY= 11.3945322036743
##$DATMOD= 1
##$DC= 2
##$DFILT= <>
##$DTYPP= 0
##$F1P= 16.9975609425685
##$F2P= -3.02152046262296
##$FCOR= 0.5
##$FTSIZE= 0
##$FT_mod= 4
##$GAMMA= 1
##$GB= 0.15
##$INTBC= 1
##$INTSCL= 1
##$ISEN= 128
##$LB= 0.24
##$LEV0= 0
##$LPBIN= 0
##$MAXI= 10000
##$MC2= 0
##$MEAN= 0
##$ME_mod= 0
##$MI= 1.114404
##$NCOEF= 0
##$NC_proc= 0
##$NLEV= 6
##$NOISF1= 3.799351
##$NOISF2= 2.8
##$NSP= 1
##$NTH_PI= 0
##$NZP= 0
##$OFFSET= 15.70392
##$PC= 1
##$PHC0= -9801.076
##$PHC1= 25.20087
##$PH_mod= 1
##$PKNL= yes
##$PPARMOD= 0
##$PSCAL= 0
##$PSIGN= 0
##$REVERSE= no
##$SF= 200.130013532006
##$SI= 16384
##$SIGF1= 3
##$SIGF2= 2
##$SINO= 400
##$SIOLD= 16384
##$SREGLST= <1H.CDCl3>
##$SSB= 0
##$STSI= 0
##$STSR= 0
##$SW_p= 3612.71676300578
##$SYMM= 0
##$S_DEV= 0
##$TDeff= 0
##$TDoff= 0
##$TI= <>
##$TILT= no
##$TM1= 0
##$TM2= 0
##$TOPLEV= 0
##$USERP1= <user>
##$USERP2= <user>
##$USERP3= <user>
##$USERP4= <user>
##$USERP5= <user>
##$WDW= 1
##$XDIM= 8192
##$YMAX_p= 0
##$YMIN_p= 0
$$ End of Bruker specific parameters
$$ ---------------------------------
##NTUPLES= NMR FID
##VAR_NAME=  TIME,          FID/REAL,        FID/IMAG
##SYMBOL=    X,             R,               I
##VAR_TYPE=  INDEPENDENT,   DEPENDENT,       DEPENDENT
##VAR_FORM=  AFFN,          ASDF,            ASDF
##VAR_DIM=   8192,          8192,            8192
##UNITS=     SECONDS,       ARBITRARY UNITS, ARBITRARY UNITS
##FACTOR=    0.0002004,     1,               1
##FIRST=     0,             0,               0
##LAST=      1.6414764,     0,               0
##MIN=       0,             -176183,         0
##MAX=       1.6414764,     258994,          0
$$ Real data points
##PAGE= N=1
##DATA TABLE= (X++(R..R)), XYDATA
$$ [...]
2372C760j924l621k083J732L700K550j528l633k750R86M043L123j158m399k979
2387d181J139M501L065j894m123k440J783L486K332r60l697k138P19L014K310
2402B916J81k907l153l75K993L561M68k920l995o94L518L669O05l336l836p01
2418d006M016L630k75k846l273m86K651L375L44k433l054q20J846L095J939j836
2434A867l658j809J497L791J994j259m208k400J661M617J919j864l917k369K095
2449b043M059K036k044l731j643J405L413J942q87l111j991j49K860L036k3k916
2465B13l623K34K981L728J75l537l891L28L971K808k16l098l532O25L236K774
2481C176m76k722k432k51K280K692M38k009k827j170J776L526J261k008l243j909
$$ y = [3760, 1836, -1785, -3868, -2136, 1564, 4114, 2586, -1047, -3797, -2811, 1232, 4355, 3197, -1202, -4181, -3042, 1459, 4524, 2630, -1493, -3933, -2150, 1336, 3668, 2708, -989, -3127, -2408, 606, 2916, 3097, 190, -2963, -3338, -345, 3216, 3684, 764, -3231, -3925, -407, 3262, 3867, 531, -3305, -4006, 10, 3640, 3365, 519, -2754, -3240, -589, 2786, 3130, 697, -2357, -3177, -1331, 1764, 3703, 1867, -1791, -3600, -2103, 1688, 3682, 2423, -1785, -4185, -2524, 2093, 4012, 2148, -1769, -4138, -2043, 2016, 4052, 2008, -1723, -3366, -1961, 1452, 3394, 2507, -604, -2595, -2744, 116, 3152, 3129, 213, -3410, -3176, -195, 3533, 3708, 171, -3720, -3392, 579, 3387, 3171, 73, -3459, -2834, 402, 3176, 2700, -22, -2454, -2705, -425, 2267, 2705, 696, -2131, -3301, -1525, 2001, 3262, 1254, -1989, -3898]
2497c898J974L662K011k062m422j406K795L350J359k081l353j301K038K996J177
2512B839j282l075j492J294K751J374l91k623k581j11L707K975q03l306l108L05
2528c527M141K872p80l756k572Q85L494K316o59l295k212O23K702J930J77k007
2544C32k946k44K108K404J157j908l213j456K743L387J152k729l239j483K974
2559i61L442R80k778l491n01K528L200K95j956k862l97J578K043J573j315k546
2575a168j667R37K567K235m96l179k971J439L230K581j041l778k494J505L707
2590A407J846j342k896j884J056K623J715n45k403j753J5K185K189M84k545k477
2606b325k37K030K870R14k660l206r61L202L496J52l238l037K4L023K489J14k285
$$ y = [-3898, -1924, 1738, 3749, 1687, -2735, -4141, -1346, 2004, 3363, 1282, -2071, -3372, -1334, 1662, 2839, 1557, -1518, -3010, -1716, 1035, 2409, 2018, -605, -3186, -3297, 410, 3385, 2582, -724, -3832, -3527, 614, 3486, 2706, -1050, -3622, -2737, 757, 3073, 2414, -881, -3093, -2470, 232, 2162, 2339, 332, -2614, -2858, -750, 1654, 2811, 903, -2310, -3766, -1023, 2364, 3516, 787, -2452, -3935, -961, 2481, 3461, 683, -2808, -3309, -781, 2419, 2714, 758, -2104, -2501, -923, 1120, 2693, 1378, -1168, -2835, -1898, 669, 2904, 2408, -771, -3742, -2303, 927, 3508, 2467, -1311, -3805, -2300, 1407, 3253, 1911, -985, -2869, -1813, 810, 2525, 1980, -423, -2176, -2161, 24, 2213, 2697, 152, -2325, -2562, -532, 2338, 3252, 592, -2614, -3575, -373, 3123, 3275, 37, -3000, -2976, 47, 2536, 2650, 365]
2623C65k658k40K154K060N14j346k113j441J170K718J604r40k682k421J299L375
2639A418J859j463l421j592J152L660J638j555l214j597J627K622J169p52k710
2654a159j492J070K385J348n10j582k355j75K201K678R6k572k750l7K697K918
2670B761p1l200k485J87K851K684l3l254k338P09K232J997k0j632k505l47J703
2687g61K221Q11j184k720j351J703K618J717j545l311j390J592L644J019k118
2702I45l051r41J793L054P67j960k009r18J217K054J090o01k536j061L22J976
2718A41K063K27k681k507O97K603K377k73l315k360R68K927K209q85k620k217
2734b646P40K567K068j043j791j789L42J362J860P42j802k035q83J541K493J021
$$ y = [365, -2293, -2533, -379, 1681, 2195, 849, -1264, -2705, -1535, 1183, 2787, 1847, -835, -3256, -1957, 1418, 3277, 1814, -1607, -3199, -2047, 1613, 3251, 1696, -1518, -3115, -1488, 1134, 2303, 1551, -1159, -2651, -1581, 804, 2152, 1642, 60, -2295, -2470, -269, 2409, 2505, -67, -2817, -2854, -157, 2761, 2690, -510, -2995, -2808, 43, 2727, 2694, -560, -2898, -2189, 43, 2040, 2020, 388, -2117, -2464, -761, 1460, 2271, 1087, -1633, -2984, -1281, 1337, 3054, 1509, -1802, -3192, -1600, 2044, 3063, 945, -2106, -3047, -1254, 1800, 2567, 607, -1402, -2320, -1103, 951, 2041, 1440, -1096, -2157, -1835, 141, 2204, 2431, -250, -2757, -2060, 543, 2920, 2647, -668, -3028, -2060, 867, 3076, 2191, -429, -2646, -1906, 661, 2729, 1686, -105, -1894, -1552, -190, 1670, 2412, 610, -1425, -2308, -767, 1726, 2747]
2750B747j616l189o39J739K956R13k014l152n92K601K557M35k160k244p19J892
2766d85K073M12j280j721j224R90K019J523r02j946j840N89K308K287o04k846
2782f47k270R38K861K274j103l247j527J287L000J083q05k678j216O26K002J259
2798A837m10j413k136J90J699K381K99j782k444q89K091K745N28k115k876l67
2814b662K302K699L30k424k407J70J707K112J44j613k047j90J507J508J016j310
2830H42j556j658R40K498J405j019k464j837J070K798J968j677k721j099J125
2845a385K891J125j605k344q63J011J948J258q35j740j212K19K218J067K97j842
2861B08k150m76K352K126R8k050k374j10K607K236l25k193k232K78K566J590j21
$$ y = [2747, 1131, -2058, -2697, -958, 1998, 2911, 897, -2255, -2847, -246, 2311, 2746, 586, -1658, -2377, -485, 1588, 2000, 720, -1001, -2225, -1235, 784, 2307, 1405, -541, -2381, -1792, 516, 2803, 2199, -647, -2917, -1979, 882, 3156, 2053, -1194, -2721, -1434, 1566, 2649, 1844, -834, -2050, -1424, 578, 1837, 1427, 14, -2122, -1932, -233, 2148, 2447, 665, -1779, -2668, -577, 2168, 2696, 581, -2295, -2662, -360, 2339, 2669, 245, -2162, -1992, -285, 1827, 1971, 358, -1689, -1879, -372, 1136, 2152, 842, -714, -2372, -1432, 1066, 2471, 1452, -1012, -2849, -1779, 1019, 2987, 1310, -1411, -2510, -1385, 1506, 2631, 1026, -1318, -2181, -1170, 778, 2036, 1201, -539, -1751, -1532, 686, 1753, 2050, 208, -1942, -2418, -66, 2060, 2158, 108, -2266, -2376, 231, 2467, 2142, -51, -2283, -2005, 561, 2151, 2030]
2878B030j851j454j90J336J685N90j701j976m63J288K169R97j594k073q75J124
2894i58K280J361j366l000q32J729K531M25j172k373p01J272J845J212j358k040
2910a145k64N28J485J120m12j289j954j51K203K377l33k500j862M50J920K124
2926B297k28k803j962R89K551J258l31k036j776N05K087J308l10j531j488J8J275
2943a77J684L90j557j718r93J508K526N34j646k241n44J641K380N37k136j769
2959a581k74J315K250M85j739j980j67J014J631O82n95j591j305N23J820J214
2975A702j84k163j515N87K133J718o86k364j569R86K256J523j150k185j013Q78
2991a046J411J447o30j541j490O01J406J205M81j532j800j37J189J928M98j441
$$ y = [2030, 179, -1275, -1465, -129, 1556, 2146, 445, -1531, -1994, -706, 1463, 2460, 866, -1207, -2082, -958, 1322, 2683, 1317, -1683, -2515, -786, 1745, 2170, 998, -1375, -2076, -804, 1041, 2253, 895, -1145, -1409, -881, 604, 1724, 1312, 23, -1931, -2082, 121, 2498, 2165, -335, -2197, -1747, 173, 2297, 2069, -734, -2696, -1707, 844, 2102, 1771, -265, -2041, -1536, 551, 1859, 1549, 18, -1470, -1452, -177, 1507, 1897, 340, -1378, -2371, -863, 1663, 2197, 551, -1690, -2234, -593, 1787, 2324, 188, -1581, -1855, -540, 1710, 2195, 456, -1524, -1691, -677, 954, 1636, 1041, -550, -1855, -1332, 488, 1702, 1518, -645, -2160, -1573, 560, 2278, 1592, -772, -2341, -1355, 901, 2424, 1274, -911, -1924, -1046, 365, 1812, 1182, -359, -1849, -1248, 158, 1363, 1844, 312, -1488, -1625, -436, 1492, 1990, 549]
3007E49k245m06J834K170K43j862j898m00J839K095m40j254j479l62J340J405
3023A129L77r80j589n49R63J678P36p75j697j328Q15K172J243p97k510q75R88
3040i99K097O78n84k060j303J348K020O52q09j421j425O47J504J256l35j465j470
3057a669J17J741J672r2k008j200m07J677K110k76j716j971K06J966J474J54j739
3074C9j678K09J638J214r9j140j594j1J109J572L37r44j738m59P62J842J331j364
3092A026k203o87J054K113N28j021j998n94R61J707R08j275j715o84J231J412
3108G63P37m60j365j466P31J796P04k71j377j517L08J592J886l92k080j495L86
3125a520J771J803p55j462j525L35J640J187m0j769q95j8J474J221J61j222j818
$$ y = [549, -1696, -2102, -268, 1902, 2145, 283, -1615, -2015, -176, 1919, 1479, 225, -1254, -1616, -276, 1129, 1506, 526, -1063, -1612, -649, 1029, 1765, 990, -707, -2035, -1220, 952, 2195, 1398, -1112, -1987, -999, 1098, 1776, 1192, -868, -2171, -823, 1197, 1849, 1040, -381, -1806, -1159, 345, 1601, 1266, -199, -1669, -1552, 189, 1861, 1769, -239, -1439, -1846, -169, 1941, 1665, -51, -2022, -1816, 150, 1624, 1778, 39, -1639, -1430, 208, 1422, 1323, 183, -1411, -1422, -313, 1259, 1596, 652, -1086, -1545, -783, 1059, 2390, 1026, -1177, -1864, -810, 1303, 1831, 810, -1188, -1782, -821, 886, 1794, 519, -1196, -1880, -649, 763, 1500, 1040, -325, -1791, -1060, 736, 1440, 1169, -208, -1725, -1417, 175, 2061, 1669, -411, -1906, -1520, 251, 2054, 1299, -163, -1688, -1353, 287, 1474, 1434, -335, -1230, -1248, 226, 1447, 1608, 386, -1432]
3142a432P3J171J176P66o49k323o55J616J473P74j256j975p41J665J689J25j345
3159A52j132m18J151J396O58j110j428o75O08J592J087p16j884o52L38J495J258
3176A720l41j997r34O98J364J255m54j966j303R18J385J555r99j157j069J96J472
3193C43J140m57j168j177q1J336J362j96j349j106N6J065J651K71j407j980L56
3210a341J030J454K36j151j721l6J355J429j50q21j129q20J250J443K71n25j537
3227g63r28Q87J577R46j092j234j160P60J726R38o28k044n68L88J809Q30q76j364
3245g96q57N90J428Q20l67j374o65J04J091J178R8j332j334J21J438J219O5j281
3263A46j570K33J212J456k49j317j352P4J206J603l03j298j266L01P57J220M51
$$ y = [-1432, -1359, -188, 988, 1754, 1105, -1218, -1873, -257, 1216, 1990, 734, -1241, -1982, -317, 1372, 1497, 152, -980, -1398, -247, 1149, 1807, 697, -731, -1406, -798, 794, 1881, 1165, -719, -1371, -1033, 462, 1720, 1379, -618, -1552, -854, 510, 1765, 1311, -655, -1958, -1040, 345, 1900, 901, -256, -1325, -1129, 343, 1483, 1026, -142, -1319, -1400, -64, 1298, 1102, -247, -1353, -1297, -232, 1419, 1690, 283, -1697, -1341, -311, 1143, 1379, 228, -1493, -1529, -174, 1255, 1105, 284, -845, -1665, -415, 1028, 1299, 774, -763, -1691, -804, 773, 1719, 627, -607, -1767, -1007, 719, 1657, 1029, -1015, -1583, -1195, 614, 1444, 568, -796, -1653, -1063, 365, 1185, 818, -556, -1221, -1117, -26, 1152, 1250, -82, -1416, -1295, 143, 1362, 1427, 146, -1424, -1191, 21, 1477, 1228, -89, -1441, -1367, -161, 1442, 1139, -159, -1425, -1124, -367, 853, 1304]
3280A304j163r85n00R01J524K39p90j050j114R21J525N82p78j629n96J044J306
3297G41Q47q77j553n79Q75J389P61q46j579n29P71J161P11m55j216r29N13R89
3315A95R62J62j868r30M35J318J252k19j344j386J43J534P68J45j282j293k3J473
3333D2J348k79j161q13J44P85J146J50j082j526k33J071J630J87j238r07n49J155
3351a30J287K06r98j309n84J206J185M60q82j167p95P84J310N23n16j426o56R08
3369e94J324P27o74j596n98N51J360O98m65j621o55O18J047J432n28j678p91O46
3387g97R89Q60k93j075j096K00J223Q55J77j155j324M07J109R53l8r34j081k37
3405a257R05J436m2r45r74n20J296P49P02j203j202j29P97J052N86q29j369o21
$$ y = [1304, 141, -844, -1344, -443, 1081, 1320, 530, -520, -1634, -713, 812, 1394, 616, -1013, -1609, -565, 741, 1588, 711, -842, -1421, -546, 843, 1604, 758, -821, -1350, -579, 582, 1293, 838, -378, -1307, -794, 195, 1157, 1319, -549, -1479, -1044, 274, 1526, 1307, -37, -1423, -1280, 254, 1022, 1167, -115, -1408, -1431, 42, 1390, 1111, -50, -863, -719, 66, 1212, 1362, 280, -1246, -1479, -408, 1222, 1409, 171, -736, -1285, -130, 1157, 1363, 365, -944, -1528, -322, 863, 1323, 441, -726, -1521, -737, 573, 1096, 580, -846, -1502, -594, 730, 1457, 783, -813, -1411, -860, 500, 1198, 733, -888, -1543, -925, 122, 1554, 1026, -652, -1443, -797, 192, 1052, 759, -316, -1412, -1212, 11, 866, 1043, -112, -1436, -1029, 80, 1033, 995, 61, -1020, -1257, -352, 1084, 1042, 97, -877, -1397, -101, 648, 1350, 147, -1055, -1184, -387, 665, 1251, 422, -947, -1568]
3423a568J483R23O21j076j387m41J195J227o3l57j352l00J39J557M62l43j419
3440f99o85M92J097R25q7j237j407J095R18P15j83j332o02L33Q07P93K81j560
3458c36r09M49O27Q84Q7r79j025M2J163Q46m1n03j288k44J180J157p2r18r24m10
3478a214R85J069K63r02j050l21O48J283L18r76r66j48N33J100O42q81j155k74
3496a046O46Q60N59m75j057q18N23J443N33n32r11j118L05J544O35o07q32p39
3514a087K4J206J073n66r93r00K86J366P14k65j269q82M75R20J011l57q12j141
3532a197J19J117Q10J19p58j504L25R39O79K53q45j032o0Q10J030K58j031o13
3550e81n53P57J159N21o70j530j34O16J220L92m21j525j36L27J126P02n94j257
$$ y = [-1568, -85, 838, 1459, 383, -1004, -1445, -250, 977, 914, 557, -795, -1095, -956, 601, 1063, 720, -699, -1384, -892, 205, 1130, 1043, -194, -1601, -506, 412, 1127, 944, -388, -990, -657, 150, 943, 1224, -336, -1245, -796, -169, 715, 802, -177, -1202, -1160, 3, 849, 808, 305, -983, -1227, -47, 1110, 1038, 120, -804, -1214, -229, 840, 1103, 201, -849, -1170, -522, 761, 1079, 103, -863, -1011, -478, 622, 1264, 383, -772, -1046, -400, 460, 1019, 544, -513, -1331, -808, 635, 1168, 636, -275, -1393, -1088, 456, 1091, 484, -348, -1087, -1063, 143, 1216, 650, -343, -1243, -957, 409, 1123, 858, -411, -1293, -818, 102, 1113, 756, -56, -1197, -1078, 39, 849, 968, 210, -1294, -969, -30, 649, 902, 57, -975, -1035, -225, 805, 1063, 32, -581, -1134, -377, 782, 1303, 633, -897, -1031, -415, 805, 1197, 776, -749, -885, -558, 568, 1270, 676, -581]
3568e81r99J002J108L36n34m13j095O37J159L70n47r25n69L47J072N81J76j234
3586a09q67q1R29J050N0j273p38N7J087R64k29p65j538M39R38P78K32p98j154
3605a028j48J083J180o9j011o73q2M75P80M88o69j184n3O25J142J25p56p89n45
3624a109M97J151L02k86j030n67L85J267M11l53q08q55L83Q82P85m61q79p72O22
3643d35R73M16m35r06q42M30J179N09k67q73n86L58O05N77j29o14r63J87Q33P76
3663G93J59q81j129J42J105N70M3m35j138J13L91J188l2p07r73j37P07J042J93
3682A014p26j129r4O18J139L11j041o58l63Q17O10M01o60p71l4j28J047O95l45
3701G03j129m13M81M14J037l12j199p45N43R50N44l68p87o21j13J145O08j17o35
$$ y = [-581, -1580, -578, 530, 866, 332, -81, -1176, -539, 620, 990, 443, -482, -1051, -704, 368, 949, 1125, -109, -976, -1057, -128, 922, 972, -301, -1039, -982, 105, 1069, 840, 75, -1463, -1024, -86, 692, 924, 126, -1028, -1176, -93, 1087, 1018, 7, -666, -748, -273, 507, 995, 326, -858, -911, -286, 856, 981, 225, -564, -1109, -612, 539, 841, 555, -475, -1042, -657, 610, 1021, 668, -140, -995, -612, 270, 1055, 594, -285, -1057, -435, 538, 954, 519, -387, -1229, -799, 380, 889, 622, -251, -837, -479, 126, 703, 574, -40, -1003, -816, 17, 793, 952, 71, -1058, -916, 189, 759, 802, 367, -771, -658, -267, 921, 889, 182, -791, -928, -221, 821, 1014, 288, -841, -935, -317, 822, 1133, 92, -566, -929, -112, 498, 899, 239, -532, -566, -694, 353, 1048, 703, -426, -839, -358, 56, 1093, 781, -418, -1163, -620, 330, 874, 506, -281, -902, -1015, 130, 738, 621, -14]
3720a4r77K49J026O57k01o68q78R6Q33O33n9o57o91o5P34M59L59q82m65n20Q26
3741b05R61L6m97j248j25R29Q15J25o51q62o3K85J007N32n90r97k73M56P79L45
3761G59n34m42n02L29N86K19K55q04m24J88J031L75j72j404l92L30Q00Q64n47
3780E15q10m18m7J219R3P3j061l29K8P45Q20l11p83l55r0N78R87j77j005m23P1
3801f80O44Q21L05j028r14J46N38O59M01p36n77j14N72O61K37n65q71k25N62Q97
3821G33L53n25j032l35O38N61N27m84j081j71J57J054O89q11n38m99N5J212K64
3840G67l23p92l60K33P84K90J1n10q75J64Q06L04M49j078m39l8O57O85j22o40
3860b7m84J26Q1R58k78l33n40k09M65R69j4p90m42j19N94O54j98l19q01MO91N64
$$ y = [-14, -991, -742, 284, 941, 740, 72, -806, -710, 123, 756, 697, 40, -651, -716, 18, 477, 836, -46, -511, -1031, -205, 756, 792, 295, -953, -1078, -149, 666, 791, 140, -722, -785, -500, 507, 1039, 449, -548, -821, -365, 414, 759, 225, -217, -719, -390, 196, 415, 670, -134, -558, -370, 661, 1036, 864, -540, -932, -602, 198, 1062, 515, -295, -713, -760, 459, 552, 625, -436, -765, -737, 8, 828, 517, -266, -621, -711, -133, 854, 677, -328, -751, -680, -36, 785, 1090, 62, -852, -706, -168, 491, 892, 156, -421, -535, 37, 698, 935, 370, -501, -726, -164, 733, 1086, 561, -471, -806, -168, 393, 920, 436, -645, -816, -659, 395, 1084, 273, -265, -764, -709, 503, 767, 444, -348, -708, -475, 309, 599, 610, 100, -775, -611, 195, 499, 948, -130, -569, -607, 50, 735, 613, -27, -511, -385, -304, 654, 376, 43, -497, -706, -241, 728, 714, -76, -518, -637, -43, 611, 413, 94, -707, -703, -12, 552]
3882E52L66l74r76l17R02M35J12o01m06p76O25P11L94k85q66k63L48P74O30n70
3902D15n80l25n3Q56K96J22j170k32M37M68P42n47o80m20Q0O46O20J80q22p17
3922f84K75L46O96n2o17l93M7N64M99k8m48o60k08N82R24m07m6r91k29Q55N35
3943E60K51p25p92J11J72J093k4m26q49o3M37O63J24l29p71k06P17M93K98m40
3963B94n55k76M6R00L21o18l68n39L04M91N43m03m48m91L09Q63O03k56j117n44
3983i41L24O93Q09l69q98p6k78P83N10R2p50l71m19R51P65l44j06j148K64M47
4003f2N24K37l94o14l46Q27J07L69k62o54o48R57L82L05n56p71k62L45J348M3
4023H75n16n73o59N56Q88M08o98j67o86L27N65K14k11n12n31R7O55L68k3n40n12
$$ y = [552, 918, 544, -432, -749, 153, 588, 700, 99, -307, -1083, -458, 253, 647, 362, -504, -767, -419, 355, 985, 415, -165, -490, -543, 313, 609, 731, -439, -671, -234, 234, 976, 429, -251, -671, -591, 55, 675, 855, 33, -684, -409, -63, 633, 581, -36, -429, -382, 182, 681, 653, 205, -455, -663, -81, 843, 436, 390, -601, -830, 25, 560, 811, 86, -706, -595, -423, 670, 646, 220, -629, -692, -255, 408, 532, 203, -568, -774, -57, 436, 734, 294, -261, -537, -491, 409, 730, 112, -256, -795, -491, 0, 543, 140, -308, -799, -490, 373, 976, 720, -397, -941, -617, 76, 885, 516, -382, -458, -736, 47, 557, 649, -101, -472, -891, 60, 825, 481, 375, -773, -509, -62, 462, 699, 305, -309, -655, 172, 279, 648, 386, -268, -916, 41, 423, 728, 172, -599, -861, -516, 832, 875, 359, -214, -873, -317, 571, 979, 281, 114, -572, -245, 320, 534, 323, -189, -720, -623, 32, 400, 377, -163, -675]
4044f75K10O05N87n26l15k70l44R04N66m83m16m46RQ62M87Rn52p50L8M56Q86k26
4066F16o88k72k74O40M96Kl92m92N2K73N93J21n19l51m1pQ56j47n47k47l85M52
4088b61M10N07l32q86k23N22R34M1n7r10m43K60P72M05k49m06p52M36N14M15l09
4109C88n39o76M60P69P7lo67l38K75N27K52P6p34q1l49O84L33l7m03l89r6L64
4131a07N37k05l42m28J5L48N87k02j25m84j27N01K53N07o22n47n1L85M34Q4l08
4152A03l31l87M8Q43L35o53j30l40M25L61J72q3o72m62M13M47K75l9o09m91M13
4173c62P37M51n97o05q1L23J51M65j07n17n10J35P02L40o5o24k86j01O00Q03m15
4194D37k93o32J1K99O39j78m95MO9J96M40j13j16p89r1N35K88J53l95l69P3K11
$$ y = [-675, -465, 140, 727, 201, -114, -384, -728, 176, 742, 259, -157, -603, -594, 268, 755, 764, 212, -538, -500, -44, 842, 616, -72, -344, -618, 22, 518, 520, 128, -364, -312, -39, 554, 675, 156, -195, -236, -243, 613, 466, -81, -328, -713, -261, 149, 656, 324, -562, -785, -263, 671, 712, 655, -255, -698, -438, 334, 739, 490, 84, -668, -232, 282, 697, 388, -151, -827, -367, 402, 479, 476, -191, -529, -254, 273, 525, 601, -133, -214, -563, 121, 454, 417, 14, -375, -471, -107, 430, 225, -117, -545, -530, -182, 405, 203, 78, -406, -533, -32, 221, 728, 106, -441, -492, -107, 327, 411, 103, -228, -615, -567, 276, 611, -42, -172, -512, -87, 274, 446, 363, -309, -771, -358, 89, 364, 325, -284, -775, -362, 375, 826, 229, -376, -457, -134, 17, 482, 375, -142, -652, -517, 185, 525, 460, -164, -450, -551, 49, 852, 437, 144, -488, -477, -178, 461, 283, -212, -208, -139, 57, 497, 384, 268, -521, -612, -77, 211, 364, -31, -400, -327, -116]
4216a16N66j31k89j41m46L04J019l22kp97m42M93N30J40k16o40j87M24M40J51
4236C38M0n32o19L94P14J78k59k65l00j9M71L81P1o87n60K44N63K23k97j03m96
4257e20j46P19j03M83l76n32K19L22K70M29p74k58K4J51M05L2n69J31l66L48N34
4278D23J97j46p82m3L79J20J53m55j81j53N78M78k38l22l49k15J07P31K89n32
4298C9m64j43K52L06L57j41l83j51K13L82M3K87o74l54J10M95M45l36m54j74j38
4319d83L19O74k75m02k99j19P41J19K2j46p06J65J99O23k3m17m91M2L64N02r0
4340C19l47k84j61M70L09K2k0o05m36O23K98M75k50n26m37rP26R3Q2q08j02M05
4362a63M76N10o04o80r0M50J87N62k72o94j77K58M23J07j31l19j26l04N40L08
$$ y = [-116, 450, 319, 30, -111, -557, -253, 766, 444, 442, -355, -797, -304, 226, 366, 150, -490, -677, -253, 187, 338, 378, -154, -773, -379, 335, 513, 254, -11, -311, -330, 141, 522, 593, -94, -654, -410, 153, 376, 79, -24, -520, -666, 53, -50, 433, 57, -475, -256, 66, 336, 765, -9, -267, -243, -92, 313, 345, -224, -93, -459, -111, 423, 620, 474, -308, -351, 28, 148, 301, -154, -335, -488, 90, 568, 330, 8, -341, -556, -449, 282, 571, 39, -425, -568, -316, -10, 347, 206, -177, -328, -115, 267, 310, 597, -77, -431, -321, 174, 619, 283, -171, -345, -483, -164, 510, 235, -167, -466, -585, 156, 275, 297, 151, -555, -390, -191, 432, 409, -8, -499, -457, -93, 409, 319, -28, -312, -473, -3, 306, 328, 308, -297, -733, -110, 188, 663, 413, -113, -550, -559, 167, 260, 342, -466, -568, -163, 313, 823, 219, -461, -551, -101, 86, 648, 376, -318, -495, -237, 186, 293, 162, -157, -283, -587, -47, 261]
4382B61J04q02k22L81K39M56J03m81N1m30O45J80k1l11m91Q0J97M30j41k84l28
4403c84k27P11L45ol61n06J54K17L75L6l55l57m2L80L64O1o15j91p8N76J48L65
4425F10m12n40J23k23Q56J08n51no54N62N92M3j19p94R8j66M38M26j80l93o8L31
4447H2l6J87J19n05j42m9O17R4k28L7m66J41K38O58k2p91j86k58M50L97k16n0
4469G1n20K88m7O26j7j73l33K8L57l04L23j57l66l71P55M5M08n76k26k04K68L72
4491B47Q6k9p75j56M87Q0O25o8m17n38K59L96N9K95n84l39J72J39M79l6n68k61
4513d47J65M10L21j3l66l63K30J49J93k6p1o19K10L96L81N1o19m93j1K69K93L72
4535D12l98k08N4j09M89J55j26p62j03M48K08J92j55k25l24K61N61r9N9m62l17
$$ y = [261, 365, -437, -659, -278, -39, 417, 520, 39, 90, -340, 305, 485, 464, 153, -338, -258, -61, 369, 228, -56, -384, -611, 100, 445, 439, 78, -428, -274, -57, 318, 354, -1, -358, -400, -20, 344, 405, -210, -401, -479, 97, 245, 610, 198, -342, -219, -442, 414, 522, -29, -34, -688, -126, 466, 509, 390, -404, -306, -472, -34, 392, 212, -181, -249, 82, 46, 233, 352, -153, -295, -344, 273, 367, 139, 176, -290, -149, 89, 747, 725, -66, -252, -510, -60, 337, 121, 71, -449, -161, -208, 418, 401, 228, -105, -77, 280, -24, 299, 142, -224, -595, 160, 205, 613, 37, -189, -393, -125, 247, 333, 304, -471, -627, -140, -60, 565, 497, 80, -458, -199, 197, 256, 551, -33, -372, -200, -61, 418, 382, -186, -447, -282, 128, 449, 436, 70, -293, -63, 86, 279, 253, 182, -437, -227, 169, 550, 601, -18, -511, -522, -253, 40, 412, 14, -194, -140, -249, 240, 395, 269, -493, -596, -148, 60, 252, 97, -128, -452, -191, 370, 271, 330, -132, -449]
4556d49J36M03N08k30l62l15J13K34N67n45j28l43Q03k31kJ3j14m50K3O35n6j89
4578B1r2k21L53N0J86K50m01n03J1J61O03j84j73m33k63Q00K9J18l35l67j45O99
4600A64L12j43j76m38j16M36K44L21p33l16K01Q5N33j8k57l94j83N51J68o6o4
4621A11k75l62M59K17P0Lo53pK17O16P6m62k01l09J99N90q6m1j66o64N54k21M53
4644A18J35m85J9J01Q5L87M8n51j41l3J20K85K5r5n66L69L66J02m75J25l27J33
4666b55L20L2K07j72n23k5n7J004k64o7k67m26O17o2L65o69J1k47L94L88L20n41
4688H3k15m19M26P2K26m3l50K4k66O69L0K31m01k79j15M81M6R0k51l18O9N08J38
4711D36j56m43j98K08L03PJ39k85n47M18J78L33rm72k28J32K50L82j30m47r7j16
$$ y = [-449, -313, 90, 598, 368, 6, -309, -196, 38, 605, 60, -68, -411, 392, 161, 159, 172, 58, -392, -369, 266, 210, 21, -71, -292, 61, 111, 297, 547, 146, -357, -346, -185, 418, 234, 61, -372, -635, 165, 194, 312, -23, -390, -535, 164, 476, 333, 157, -281, -397, 39, 283, 604, -129, -445, -244, -159, 374, 356, 99, -295, -478, 73, 241, 175, 111, -164, -526, -67, 150, 220, 223, -430, -437, -220, 396, 472, 10, -191, -500, -301, 289, 203, 162, -4, -668, -114, -335, 118, 253, -232, -213, -112, -27, 360, 408, -143, -284, -317, -197, 88, 113, 18, -548, -179, 187, 289, -186, -61, -388, -255, 65, 97, 304, 132, -391, -416, -473, 531, 267, 200, -67, -493, 124, 62, 427, -242, -231, -478, -84, 304, 624, 83, -132, -551, -125, -53, 173, 130, -220, -196, -462, 207, 237, 468, 67, -212, -327, 154, 200, 290, 39, -279, -210, 298, 436, 280, -163, -361, -153, 150, 157, 296, 11, -536, -118, 60, 393, 384, -88, -316, -184, 66, 448, 318, -129, -226, -342]
4733c42J86L06N8j66m61j28N47K02J25k49j83m35N00L13L7q8l86k45J18N67q7
4754A89j47k58p1P0K55L21n13m3m2k3M07J19j80j56j22j25N48L4j00k18m68R1
4776d32P49O8k53j41j54n4J27L31m3j42n82J49M14L26Q7n65j8j45J8O10o5P8n41
4799a78o9J91J79J82m19k49r3M53J88K32j69o93l9O41J89J85m82p6k12K01N05
4820D67J30k09m41j73K47J84K74k35J6n77K6M15m6j81k50K57j45L46L38o17jR4
4842h1l86M58M2J85m75L7K31L4N22p23n1J12l02N25K34k13K71r04N8L95P0N8J48
4865B45o20L9K43L03K90l94M7j035P66M97l29M8k33j56K64K50J61m40k5o15O04
4886i0L98J40l93k79j46K85K58j75J61k76r1K38J77j97M17m45k37L35k31N08j86
$$ y = [-342, -156, 150, 208, 42, -419, -547, 0, 202, 327, 78, -105, -540, -40, 273, 310, 222, -164, -409, -291, 276, 189, 42, -216, -287, -217, 38, 359, -154, -197, -239, -262, 145, 264, 84, -72, -194, -319, 229, 263, 163, -55, -523, -432, 317, 385, 132, -9, -163, -217, -90, 241, 198, 56, -526, -377, 37, 363, 450, -115, -133, -278, -260, 350, 285, 363, -178, -247, -56, 123, 305, -114, -363, -456, -3, 185, 417, 248, -445, -484, 157, 346, 531, 49, -27, -239, -38, 467, 597, 388, -53, -226, 21, 205, 479, 244, 260, -317, -291, 124, 78, -103, -353, -96, -241, 105, 443, -174, -175, -81, -467, -9, 33, 218, -257, -220, 11, 45, 567, -156, -207, -95, -397, 128, 362, 149, 420, -484, -426, -31, 39, 97, 245, -375, -336, -93, 210, 500, 106, 153, -882, -116, 381, 52, 100, -133, -289, -25, 225, 386, -54, -79, -694, -90, 308, 448, 55, -224, -370, -85, 173, -2, 159, -117, -208, 30, 207, 10, 427, -18, -255, 80, -151, 357, 171]
4907A71k40k19P4L52k5r5j44M1r6K02K05l24p1k28K98K42n2M63p29j37j57K86
4929a83M59j09j21l62K2K06L14L8m5k42n01O01K18k22j25k03MJ78L55nj55l57
4951b35o3J32M76k46j89L07m33K38J09K4L18m44k13j0M04N2k05j45l60L20Q7M79
4973D03l16j22n03K58R0O42j96m55K35k50J72M18J45l98j74k20K24J4L41L0n39
4994b01k5L09P8J10l26k16Q5K77Q4K28m42q0k13L54K2J3j37R6k34J71K12k38r
5017h2K7l12L16L03n7L58o81L5j49K46J44j44J31m09k9N40j59j61m7k33J31J50
5039h2M05l88N4r2n9q5N45M4o02L87l84J55K02M1l40j93J12K19M15nk08n09J93
5062a75M2L48K9k21m22K49j0K29O5J17l51k31K80J31K10l55m15K99r6P89k22l18
$$ y = [171, -69, -288, -214, 138, 113, 18, -126, -85, -181, 21, 226, -98, -169, -397, -99, 143, 91, 554, -175, -312, -469, -183, 276, 167, 46, -316, -294, -88, 226, 264, 219, -23, -524, 77, 295, 73, -52, -255, -251, -73, 282, 277, 122, -235, -298, -166, 310, 64, -125, 182, -251, -13, 96, 120, 438, -6, -219, -229, 175, 227, 22, -123, -483, -163, -76, 403, 87, -35, -538, -280, -190, 452, 256, -199, 36, -214, -42, 376, 521, 123, -51, -271, -47, -33, 308, 338, -201, -226, 83, 161, 271, -55, -271, -186, 91, 175, 403, -39, -119, -332, 22, 44, 57, -80, 16, -218, -47, 165, -73, -82, -55, -367, -51, 252, 195, 553, -128, -93, -242, 4, 148, 4, 135, -274, -303, 237, 78, -83, -130, -363, -232, -82, 323, -65, -11, -103, -162, -247, 298, 342, -260, 127, -257, -102, 100, 141, -199, -392, -280, -61, 354, 349, 141, -368, -175, -133, 215, 244, 23, -399, -150, -160, 69, 134, 251, -100, -331, -51, 80, 290, -65, -480, -181, -277, 512, 290, -28]
5084b8n8k31K02j1K07O4j46j90o1M16N0lm31Q8p3J41J51K19l51Q5l5o7M91k69
5108A60l11j39L17l6L21m9j15m32M2K58L11j05j24k53P2r4O18j98k85n6p4R9O8
5131eL96n20Q8P2J18q3J52j66l91P5J00L00p7K5j43k00n8M32J78m3k19k20J43
5154d6O4K79k50J29l56OJ96L69m26j75l5J88M82o2j46n42Q2qM68J3l20K4r6J19
5178d3J07K34k75j62j35J98R7k5p0L8l96K39K3J65J53j93k86K10l8O70j78m04
5200g1o9o4L26P6J67k42n55K97k5L28r5K47k85m7j76K07R1L07m66K7p2R0K93l34
5224d5J89p47M91j20K60N9m9k17m9M40o2l77k43L81k16K37K15j91J5j36J08j97
5246b54L35K80o84K9P1L09n7K78o27L03j70N64j36k46k41J63j88J48N5M21j5n93
$$ y = [-28, -86, -317, -115, -126, 81, 145, -1, -191, -252, 164, 214, 211, -220, -132, -205, -64, 87, 306, -45, 40, 5, -62, 429, 160, -151, -290, 27, -9, 312, 263, 148, -284, -242, 16, 327, 222, 98, -155, -83, -177, 441, 243, -42, -98, -172, -73, -5, 391, -129, -41, 31, 149, 66, 218, 52, -339, -264, -164, 136, 59, 84, -59, -259, -317, 115, 293, 250, 31, -189, -46, 18, 297, 47, 176, -180, -174, 22, 391, -35, -210, -245, -57, 425, 363, 217, -325, -243, -251, 217, 230, -90, -66, -162, -43, 64, 298, 23, -139, -274, -76, 21, -4, -74, -36, -432, -193, -170, -5, 148, -45, -331, -121, -159, 511, 333, -71, -140, -204, 122, 198, 365, 123, -432, -135, -160, 168, 73, 320, 35, -12, -188, 19, 110, 417, -49, -22, -94, -4, 289, -45, 144, -603, -112, -232, 28, 87, 38, -179, -228, 212, 150, -227, -470, -89, -305, -68, 147, -44, -29, -165, -57, -254, 81, 361, -323, -294, -223, 86, 29, 307, -320, -17, -187, 377, 241, -5, -246, -83, -271, -123, -68, 353, 338, -255]
5268b55J79Q8J36j12J6J30o23N12K43l14K06n18L94k13J97J90j78j33m81L35L55
5289A54j49K58k07l10J41N16j36l08L78k22n08L68J34j43k01K04r2N5M03j21l93
5310a79l10L37k57P52lo17l5M67P0n4k31J42n09K19K35N2K09l60j39J08r7K79
5332G9L34j25l17k22J83R6Q0o6j62j62L24K20P8l51j91L84j65l2m7K72l08j77
5354b75K94l57O36K7k48j7k18K28K0P7l26l7P9L0K28m65L82l06J12K23J89k05
5376G1k12M8K50j46M92m56j15m00K38K25K82k3k06N1j89L31j03o9q6k45J54K41
5398A33J1j58R0j47J85q7K59j78oo27N01J08R3k7Q7j23l75k37O40J9l15j61J74
5421a41J33K76J0J07k46l48K47J36j9k82K13m75J12K92QJ91j55Nm01L62m9K09
$$ y = [-255, -76, 12, 148, 36, 52, 182, -441, 71, 314, 0, 206, -312, 82, -131, 66, 256, 78, -55, -536, -201, 154, 5, 263, 56, -254, -113, 403, 267, -41, 337, 115, -393, -25, 109, -34, -235, -31, -123, -68, 335, 214, -179, -489, -152, -409, 343, 340, -277, -312, 155, 225, 171, -60, 82, -427, -208, 27, 79, 288, -72, -211, -103, -200, 79, 413, 288, -29, -251, -68, 28, 108, 42, -120, -282, 42, 262, 340, -11, -202, 182, 17, -15, -62, 210, -98, -275, 19, -338, 298, 325, 77, 60, -158, 70, 90, 167, -159, -196, -117, -87, 141, -324, 58, -248, -136, 87, 276, 71, -141, -93, 157, 11, 503, 47, -68, -468, -230, -5, 277, 254, 48, 99, -90, 241, 138, 69, -17, -262, -108, 133, 144, -14, 76, -71, 114, 27, 286, 108, 102, -525, -24, 84, 177, 150, 237, 114, -261, -498, 142, 161, -154, -315, -141, -8, 268, 278, 385, 139, -209, 38, 174, 155, -127, 86, -389, -277, 15, 23, 214, 59, 64, -337, 25, -24, 185]
5443A85p8k78q5J15L63K54n30o2nJ33ML8k20J8k13K39L44N8m14N9j54L90n0M0
5467A51k6N9k16K28P7Ql18pj43K89p8K9P4q4j19l76N13J61l03o7M12m97N00J02
5491C69n22j25J83J3J85K0q4j01l92M15j63N13k28k69R6j19N12R3l16r7k34o5
5513c16N02J51j35j4n64L22j13M64j61r8l42k05N65%l4n6m24L40OM37M00q13k81
5536c69L82j1K23L8k5m07r1J37J84L08o28R5L%L30p4L8j74j66L03M6j6k9L0m74
5561c47J36M36j02m0j05o2K3L53j2j66l86R6L20j32j4l3J23k59j70N96j93k8l62
5584c28L9M6J88K72J22n09j97L61j26R7L37l93k8K09j45L30k50j10j97P3L00o4
5606B7n5J79k18J8j05L13k6k22j49K82j19O2R6q3k75k9L57j81M12k24j59m2Q1
$$ y = [185, 107, -171, -256, -141, 222, 476, -54, -116, -121, 12, 16, 54, -166, -148, -361, -122, 222, 280, -134, -75, -229, 161, 111, 151, 125, 184, -32, 196, 273, 281, -37, -44, -187, 102, 24, 53, 127, 43, -76, -452, 61, 222, -81, -148, 264, -233, 267, 369, -153, -278, -95, -82, 103, 123, 39, -62, -454, -39, -202, 311, 83, -186, -90, -209, 303, 396, 80, -17, -251, -316, 186, 337, 202, 188, -376, -54, -167, 297, 136, 38, -304, -509, 56, 56, 22, -34, -458, -118, -112, 325, 725, -88, -369, 13, 2, 225, 263, 238, -169, -260, -123, 61, 369, -259, -164, -161, -161, 169, 95, 133, -41, -207, 96, 142, 126, 97, 127, -347, -211, 225, 123, 83, -22, -84, -61, 292, 280, 114, -272, -176, 144, 12, -2, -35, 88, -171, -341, 255, 62, 34, -328, -289, -243, -55, 217, 339, -170, -367, -6, -132, -35, 302, -91, -119, 90, -55, 275, 25, -85, -282, -209, 91, 27, -28, 151, -67, -49, -154, 159, 133, -89, -238, 44, -75, -13, 83, 0, -275, -304, 53, -128, 284, 60, -99, -141, -60]
5629f0K75m5j61J34n84N82ok8J3l06K8j84J66M81l57jj1k69N16k97Pj29K52n90
5653e74N53K77k88J12k0l4J14j23J61r8m94L25j78N45k49Q9m09L6J99M15k44o5
5675E0j32l51Q32k72L9j42m07J32K46J48K17m10K63j49o6M19j50n8j17l15J03
5696a20L53J18l20q0k01L66j78J17K07m48J2q7N60k99J44l83J85m9K34j57N56
5717E30o16P8n84N65J19j85M8k45M17k82K36J29r4k66J76K30k42M52m20k59J39
5738g4m8M16K9k00j33P6p5K34J81k51l8l14K01k18L20k86M44m32J28M00n42L56
5760A74j89q5J50o3L9K51l66j45O4K36J37l50k5L24l72k4O4K74k25M5n2N56l51
5783F7K42l79R9l86L50Q4k2N1m72K07N9K17o6L3m43O0L51m1K61j45l15L70k82
$$ y = [-60, 215, 170, 9, 143, -441, 141, 135, 107, 120, -186, -158, -342, -176, 305, -52, -53, -64, -333, 183, -114, -107, -236, 16, -574, -21, 256, -32, 80, 60, 26, 140, 17, 178, 80, -414, -89, -267, 278, 29, 118, -291, -255, -56, 359, 115, 50, -82, -433, 399, 127, 166, 24, -383, -251, -5, 143, 360, -50, 213, 64, -2, 417, 267, 209, 92, -223, -120, 233, 351, 31, -49, -250, 116, -62, 55, 262, -186, -174, -261, 299, 0, 144, -239, -54, -103, 131, -26, 530, -86, -8, -592, -27, 92, -93, -45, -290, 127, -155, 81, 210, 116, -150, 26, 256, 14, 466, 46, -213, -74, -122, 294, 323, 123, -10, 66, -9, 225, 406, 155, 117, -197, 4, -214, 106, -180, 264, -168, -40, 360, -182, 174, -15, -100, 50, -13, 26, 277, -89, -234, -170, 66, 203, -147, -172, 152, -220, -244, -180, 94, -131, -86, -138, 418, 67, 309, -70, 29, -357, -7, 77, 55, 106, -366, -159, -100, 117, 51, 84, -359, -299, 52, 11, 272, 127, -188, 182, -100]
5806a00j88M09j26j32j84J81M37Rl09n7j05o3M78q0j01k65mn4M46k74j05mj0J22
5830g9L84j72j8M7r5m19J82J16J10Q6j74l52K79L99n58M81k87j27k24M30K30m06
5852a67L15m72M32j1j19K5J34k07J45J34j72k2r3l8j4Rj35J37L14l36J01L80k15
5875A25j91k3K83j48P5J53k38j63L1N24l12K32k87m2j8kk8N9L33l97Q5R9k01K48
5899A97P0J11m70oL96j32l69L91j10k52L03j54K8Q1m26M93O9k38K50m33k2M52
5921B29p5p1q0k53P6P2J87K28k25J86l39m7K4K41p2r3j87J07K13j6k36J04J09
5944H2l25J57L43l34K56o02J01M26l15L44J04l07j45K37n9J70j22M5k62k0R7J01
5966b8J50R6k93R2p7L74J1m04q0j23L53n8J51n28L08J56Kj97J82k63j6K50l65
$$ y = [-100, -288, 121, -5, -137, -321, -140, 297, 306, -3, -60, -165, -228, 250, 170, 69, -196, -200, -254, 192, -82, -187, -191, -201, -79, 305, 133, 115, 162, 67, -352, -170, -54, 56, 142, -32, -384, -105, 294, -264, 217, -70, -197, -421, 9, 239, -167, 148, -324, 108, 97, -22, 3, 137, -70, 75, 209, 37, 15, -78, -116, -130, -121, -256, -119, 195, -141, -40, 340, 125, -66, -89, 194, 46, 121, 274, 36, -127, -96, 428, 116, 348, 61, 19, 1, -1, -29, 30, 363, -34, 51, 150, -51, 197, 267, 378, -92, -98, 298, 166, -203, 188, 78, -174, 129, -25, 3, 84, -342, 151, 220, -18, 232, -201, -223, 229, 154, 83, 3, -250, -174, -102, 85, 313, 88, 274, -65, -112, -88, 153, 81, -12, -199, -92, 121, 105, -131, -27, 82, -243, -86, 257, -77, 179, -423, -322, 104, -211, 133, 237, -70, -215, 22, -37, 133, 11, 56, -206, -226, -129, -28, 122, 218, -75, 17, -60, 314, 325, -79, -159, -282, 71, 13, 164, -364, -56, 100, 102, -95, 87, -176, -192, 58, -307]
5989c07L79P4l61K22j22J76M8n8J23l67J75J41Km13M68j58j93q7K03j23M24j97
6011D9j16j0K52J02k83j25l4L19j80R2J17j0k11L6J73k47j02N0J84j99O3l9K15
6034I6j15l38K50L71L3k86l21P3J13rK98k56J14k69M02Nr8j86J85k31J10P1m4
6057c2K03j26l34K36M1J60n6n8J64K0o5l01M01k67j86j66M39lj9Q1Pk72K76j32
6081A1r8K62j46r3j43J35K09m9j52l3J84N6k48J54l68M16j50N3J33L8r3k13O6
6104f9k07N76l37J36l31o2L17m8M3j12k3j80K37K03K61m07k05L45l6J18k0K70
6126D69n02J38r4j22M61k99k06K54O7l8Jj52p8K15j51J69n7k18M5q2r4L00J19
6149A45n99M38k2O9O2Mj2j85k82K96J82p0O7k79P4j60L54k05M56l69j29O3j32
$$ y = [-307, 72, 146, -215, 7, -115, 61, 109, 51, 174, -193, -18, 123, 125, -288, 180, 22, -171, -258, -55, -178, 246, 49, -67, -77, 175, 277, -6, -131, -165, 154, -26, 66, 183, 173, -38, -2, 171, -76, -178, -128, 56, -143, -80, -119, 96, -19, -357, -107, 264, 297, 11, -310, -237, -124, -133, 165, -91, 23, -246, 156, 161, 63, -123, 62, -169, -59, 12, -32, 171, 45, -289, -53, -12, 148, 92, 34, 198, 218, 153, -148, 253, -14, -200, -366, 73, 70, 51, 132, 139, -133, 143, 11, -87, 175, 29, -64, -207, -72, 137, 88, -64, -97, 87, 143, -105, 49, -319, 97, -53, 0, 133, 171, 78, -135, -69, -276, 300, -37, 99, -232, -294, 23, -25, 18, -94, -117, -297, -60, 143, 404, -3, -208, 137, 101, 219, 199, 469, -33, 105, 11, -111, 350, 51, -155, 99, 166, 128, 129, -23, -101, 114, -37, 132, 75, -143, -98, -180, -274, 26, 145, -454, -16, -38, 31, 93, 97, 85, -100, -382, -86, 96, 26, 93, -186, -112, -272, 82, -123, 333, -36, -165, -102, -234]
6172b34K57K15M0l42JL45L2l08k54J8K33K34p6k06J62m46K64j30n7N76l71j11
6194a58K07M9k16J76j78j07M58p7q1l15N85n02j2J24M2J09j25l69L58rJ90J13
6216B62k57O4k33K36l13L66K67p05K46OL2k2J02l14K47J04j89J22l0k13L03q4
6238c%j5p2j4O5J64k8l10L84K73n34L7Q8q2N1lQJ31R7k54j5k43M07m31K83J49
6264A33L46n15j9o4j45J84J39O1j1l8j57j84L49J1l49O8j45L12Q4J80n54J40J54
6287b0J63J31l49J28l0l6j55L36j64j16J74k48J20N3Q9l39rK86j73K85p9r6J47
6310I8j6q5L67k92n58M60J08k98J47J99j56q6p4J47q2J53j91L34l81P0J91J9J65
6333B39m40M1O5J75M49o29lK82j62l92M13k7p0o9j31L48j18o4o8J26o6K82l33
$$ y = [-234, 23, 238, 278, -64, -63, 282, 314, 6, -248, -230, 3, 237, 161, -45, 117, -329, -65, -195, -252, 324, -47, -158, 49, 98, -118, 58, -120, -227, 231, 154, 73, -242, 343, -159, -171, -47, -5, 104, -21, -390, -32, -41, 149, 262, 5, 69, -164, 72, -241, 125, 392, -313, -67, -61, -29, -51, 51, -263, -16, 88, -101, 21, -9, -222, 81, -3, -3, -18, -90, -104, -39, 125, 97, -213, 171, 444, -90, -53, 35, -47, 4, 1, 9, 140, 237, -17, -32, -275, 132, -299, -16, 133, 479, -36, -55, -119, -264, -80, 59, 120, 109, 71, -86, -270, 79, 90, -259, -191, -336, -24, 60, 240, -314, -174, -20, 143, 274, -75, 53, 23, -13, -168, 168, 4, -112, 62, -186, -66, -13, 76, -263, -272, 14, -159, 126, 47, -49, 98, 82, -3, 364, 72, -486, -26, 82, -216, -69, 130, -26, -112, -186, -39, -121, 32, -159, 175, -206, -136, 55, 74, 239, -201, -160, -95, 80, 529, -100, -103, 179, 17, -375, 38, 11, -59, -128, -259, 89, -29, -93, -161, -35, -101, 181, -152]
6356a52L07j97j15L22p2k11K05j09j4n2L5L64r2n7m43L85j47n3L65l64p2K23Q3
6379A39j24O0k23K1J21R6p5N1k02L85l84k3K11J21j61q5j00L65J09k59p9q1l0
6402a47m6J41K14q5l4q4J05j65M4K6R4k04mL53J50j27Jk59l6N0J74p7j53k15L03
6427A9j70J16OJ06j67r0J26N8rJ6l10K27J82j35p9J60kn8O0K10j04j65J01l80
6451b82J61J59J09k07j38l26L01L73r2J25l34J8j41M33k50mk18M84k22r1L99l38
6473h1j48J15J16J56o2M9l30J41j73K12j04pj09M02m61J10K88l8k03K60J34k28
6495C9K31j30j90k27J28P5K21l75K30J19q1j19j19K43J70j32J54l13jm00L94j7
6517a00j64J73o7L15k32j41K23o1J82K9k86L6J3k22O15J93l48k07Rj22K1K70k53
$$ y = [-152, 155, -42, -157, 165, 93, -118, 87, -22, -36, -88, -53, 311, 219, 162, -281, 104, -43, -96, 269, -95, -167, 56, 139, 15, 75, -148, -127, -6, 90, 15, 66, -136, 249, -135, -158, 53, 174, 13, -72, -172, 193, 302, 43, -36, -117, -147, -193, -52, 162, 77, 43, -41, 64, -101, -57, -31, 63, -141, -145, 208, 358, 231, 232, -27, -63, -13, 161, 84, -69, -284, 19, -151, -35, -29, 77, -90, -180, -54, 4, -5, 11, -299, -72, 110, -25, -104, 56, 54, -4, 56, 266, 162, -3, 98, -282, -121, 38, 147, -60, -198, -524, -223, 150, 58, 183, -151, -133, -274, 159, -91, -95, -313, 171, -51, -142, 257, -81, -229, -114, 2, 158, 96, 145, -185, -44, -217, -5, -109, -116, -225, 177, -284, -174, 114, 76, -127, 133, 267, 39, 270, 140, -50, -277, -149, -74, 147, -228, 2, 121, 40, -79, -198, 45, 215, 83, 237, -76, -77, -477, -83, -100, -264, -91, -158, 157, -75, -216, 7, -54, 128, 157, -129, -93, -80, -302, 313, 506, 158, -49, -40, -162, -141, 129, -124]
6540a24R2K60k51o4K31n0k55R7R0m8L51n28n1P0p9N05n55M93j9n48N14j64O0j05
6564g8J29lj51L69M0n6J58o07L6K8j43N11j33l36l6L26j84o5l3N26k46r1r2K95
6588A64k8j47M2j06j9J06J65l17K57J21n07L97j69j77N46k19l31L70j21n7J36
6609A06ro4j58R0m7J18K48m14K74q8J92l67J18qJ72k40J55R6l33L8j51K05M1K6
6633@K34l60K89N2k06K21j52MO3kP3j57k48M08L6k52k73L85m20l5M15o9K24k53
6657b3L1K2q5K28j73l01L21j97K86mk03P0K23m05M42k14q9j0Ql5K9N4l6PJ5K32
6683A93j71K64l0l75mK0jJ25R4q0J33k90J38J55p6l16J93J13M3j10J55l87m8K47
6707a5J43Pj94k27L20Q6j58j44K26k37K36j4J5j37J70k7k87K80j58K45K0o7k07
$$ y = [-124, -32, 228, -23, -87, 144, 94, -161, -64, 26, -22, 329, -199, -250, -180, -259, 246, -309, 184, 165, -383, 131, -33, 27, -78, 51, 48, -103, 266, 306, 250, 408, -199, -163, -135, -278, 233, 100, -236, -272, 54, -130, -195, -228, 298, 52, -39, -131, 164, 136, -11, 31, -75, -94, 12, 177, -140, 117, 238, -269, 128, -41, -218, 328, 109, -222, 148, 27, -30, 106, 97, 33, -125, -35, -82, 36, 284, -130, 144, 56, 248, -119, -1, -9, 163, -77, 78, 174, -159, -121, -272, -67, -26, 0, 234, -126, 163, 215, 9, 230, 78, 82, 145, 143, 216, 59, -189, 219, 255, 3, -270, 115, -305, -340, 75, 6, 230, -23, 8, 30, -55, 173, 0, -301, 20, -177, 109, 105, -98, -28, 195, -210, 232, 18, -71, -81, -73, -108, -79, -25, -61, -54, -39, 193, 22, 286, 256, -119, -123, -103, -104, 21, 115, 35, 168, -122, 16, 171, 95, -221, -28, 85, 128, 18, 173, -214, -262, -15, 128, 135, -59, -286, 34, 120, -38, -182, 44, -193, 43, 29, 44, -93, 77, 50, -237, 43, -115, 130, 150, 83, -124]
6730a24M8J04l1K38k94J89k50o1K59M4m19L06m79N29J3J31n5l36L18k73k21M26
6752F2l1j59J51k1J65J38m40J78R8J28l18L8MJ86k34K35j63K74k03k77K0K90M5
6775A66k28K13m0Mk36K50J08l04M4J8j10N1K14J69j53l03p8N76l13j26L3J46j16
6798a5j53L26K02l47k79J55K40p3j22J13k8r7N9j90J51m5K64Q4n7k48P6K97m24
6821a11J76n1Q8m4r5K3Q7l8mj95k14L04k9J87j38k0K92k10r5K75k50J92j98J17
6845D9j83n9L31n1r4J17m8mk02K31J10l65J09J70k17K84j08J30m2k26J87O8m74
6868b87M68k89m4L77l85J56J0L46m71J53L1P8j27n7j28R2Q6K12k47l52K17J69
6890HJ86k14N9q6J21k25J1j06L30n0l16L82lJ35J5k43j38M70k88K13j53o3j3K45
$$ y = [-124, -76, 28, -3, 235, -59, 130, -120, -181, 78, 122, -297, 9, -470, 59, 72, 203, 148, -188, 130, -143, -364, 62, 31, -128, 23, 2, 167, 305, -135, 43, 141, 269, -49, -11, -7, 179, -55, 180, 17, 291, 88, -189, -169, 121, 166, -62, 151, 111, 115, -121, 129, 237, -67, -23, -5, -115, -64, 150, 319, 166, -137, -215, 361, 48, -78, -45, 101, -15, -168, 158, 360, 13, -266, -111, 129, 56, -66, 47, 19, -78, -19, -209, -58, -103, 161, 245, 188, -60, 16, 313, -111, 65, 14, 102, 58, -37, -14, 73, 35, 31, -164, -378, -74, -103, 84, -54, -74, 218, 8, -87, 188, -62, 130, -68, 49, -134, -193, 138, 87, -7, 110, 62, 58, -144, 87, 197, -168, -59, 111, -106, 178, 70, 200, 158, -68, 119, 187, -287, 181, -108, -152, 225, -160, -4, 6, 352, -119, 34, 65, 143, 16, -41, -169, -77, 9, 221, -26, -378, -161, 8, 194, -20, 39, -47, 74, -151, -140, -246, 84, 34, -282, 100, 97, 232, 247, 4, -134, 336, 48, 261, 108, 45, 32, 277]
6914B77k81o3J28O7j89N7l96M19J28N1N1m82J66J64k87M31l01J82j23k4R7J15
6936A87k14K54l26j07M38m10K87l8l63N26m23M1P1k88K99M9k34j44J30J92j56
6957b29M19p9k45l3N5m0J60J15J5k87o3J38j38L13q3l2j62j07N12k01j45j14M
6980b27K03R2O2j24P9p4j23j26M09p5k35J33ro0P7L02l70k94K86q8K51J59j63
7003H5K9k4k3J86o8j15k99L98R8k03k16K50l7r8j7J30k91k4J73l7L91o95P79j34
7027B38l66l90L93L0L58j15m2k74J64p6J22J66j27K79m38N9P4o7r4j76R5L28m5
7050I6N7k38K7L0J78oJ28m20K84Oj30N6l07K42M2L08l34P8k31K28K2n1j48P0%
7075a3J82j73l15K21M8J30N3j04j81k28L72j18K70K7k87P2L6J41l9j99L25r0k10
$$ y = [277, -4, -67, 61, 128, -61, -4, -400, 19, 147, 198, 249, -233, -67, 97, -190, 241, -60, 122, -1, -25, 72, 187, -27, 227, -99, -206, 232, -178, 109, 71, -292, 234, -189, -148, -77, -365, -66, -17, -251, -395, -265, -73, -229, 190, 111, -134, -167, -112, -152, 8, 123, 138, -149, -212, -74, -212, 101, 18, -14, -176, -283, 229, 28, -117, -231, -227, -24, 68, 130, 6, 85, 11, -112, -238, 171, 96, -139, -6, -15, -75, 2, 304, -66, -360, -74, -162, 89, 248, 85, 114, 90, 67, 253, 185, 70, -229, 169, 267, 64, -152, 98, 61, -37, -54, 76, -215, -239, -66, -103, 288, -407, 372, 238, -128, -518, -125, -95, 263, 148, 106, -168, -4, -80, 42, 208, 81, 360, -78, -19, 55, -12, -106, -282, -187, 141, 96, 153, -85, -58, -28, 150, 144, 272, -148, 136, 142, 12, 68, -239, 3, 45, 353, 19, 97, -134, 94, 116, 65, -83, -13, -13, 169, -4, -319, -98, -50, 80, 133, 29, -152, -380, -8, -126, 144, 171, -116, -44, -8, 133, 94, -105, 220, 130, -80]
7098h0q0K77J61l23k52M46N3l75K31L8j89L16l73J0K8m0K58j02J97k48j07p3K33
7121Fk15L24j45o0J35l07O7M07l3j25j89N4r2L95J69m09Q9J65l97M65k29k65M34
7144B44k40k1KK08j30j72j16L96k49j42L44r3l5M9j56m7J34j83P0K18j17M9L3
7167D6k24k9M1J26K08l24j26M16j83J9p8j78j97M95J48k17J04j00J00k15J05n8
7189a21K33r0k24P8K75p3K36k71m5J9P5k33K5J21J63j80n6j5J93j71L44m24K12
7212G1k26K40j53K92k43J62j05j34J91j04J64n33M11K49l81O0N7j1N0P7j0j09
7234A5J00l48L73l48M27ll64J69j56J37n4L20k78k59K25p0J68m2k18j3O17k92
7256A06r6K3Nj82M9K80m9q1j67J80r2J10r8r1K01k4k2j83O4P0J13j14j1pj1l1
$$ y = [-80, -160, 117, 278, -45, -297, 149, 202, -173, 58, 96, -93, 223, -150, -140, -112, -152, 106, 4, 201, -47, -154, -227, 6, -209, 115, -30, -90, 45, -262, -195, 212, 179, 54, -135, -81, -173, 222, 391, -18, 71, 236, -161, 304, 75, -190, 244, 4, -17, -15, 193, 63, -109, -225, 171, -78, -220, 124, 31, -4, 45, -111, -158, -24, -207, -137, 81, -36, 13, 46, -178, -207, -166, -40, 168, -156, -282, 134, -49, -30, -108, -286, -483, 12, 160, -57, 47, -53, 47, -168, -63, -121, 112, 22, -202, -124, 151, 78, 314, 43, -2, 17, 92, -141, -116, 5, 168, -12, -68, -83, 110, -61, 283, -141, 71, -155, 85, -68, 224, -19, 143, 38, -96, 95, -9, 155, -378, 33, 282, -99, -39, 18, 7, 57, 134, 124, 15, 115, -233, 140, -208, 219, 216, -148, 21, -135, 2, -52, 268, -10, -269, -44, -114, 54, 12, -206, -219, 398, 106, 10, 33, 38, -144, -95, 185, 136, 55, -112, 68, -24, 86, -12, -103, 98, 74, 52, -131, -67, 3, 116, 2, -9, -16, -27, -58]
7282e8l24L99j93j07L28m7J23k51J85j1J9k17M7L16l99J42K51k88P0J30P2l27
7304a40k0L70k38J92l04q8L61LO0j59k59KL45n6l75P15m44L83k07J29p9p3k59
7327a41L18K0k25J33j81J89N7k37n2M07k40q1K34j18Q7p2P0R6l68q5J73L18k61
7350D1j10J83K11j70j66r5J14o6k9K57m25L9K05q0K22q8J46p1K9j86L7p4j79M67
7374B12l18K40k3k42L56j17J17l13l4M66m01K49k25j37J73mJ6n%J22j17k95M93
7397B13k28M43l02K2l90M65l36j77M44l47J25J79K93l93N3k78J93l57O63k65m45
7418d25M23R5j9j77j53m8J19J13J31j81K04p5ll11L10k4K06l71MQ4M9K75n23M13
7442A16k01J02N8q0J08j84J13K66k70o2K7l33L80p8M5R5Lr5j62K73Jj73O7j93
$$ y = [-58, -382, 17, -176, -283, 45, -2, 121, -130, 55, 44, 63, -154, -107, 209, -190, -48, 203, -85, -15, 115, 187, -140, -160, 210, -28, 164, -140, -228, 133, 136, 196, 37, -222, -220, 125, 69, -306, 409, -35, 348, 141, 270, 191, 118, -141, 177, 197, -28, 105, -76, 113, 170, -67, -119, 288, 48, -33, 201, 83, 170, 98, 168, 264, -104, -189, -16, 302, 41, -69, 114, 325, 155, -11, -106, 8, -58, -87, 170, -255, -216, -11, -91, 131, 43, 189, 118, 147, -39, -2, -76, -255, 212, -106, 134, 111, -131, 225, 108, 225, -88, -122, 344, -57, 192, -33, -170, 3, -1, 15, 10, 10, 132, 15, -280, 213, -15, 428, 126, 148, -242, 223, -113, -290, 154, -193, -68, 111, 404, 11, 64, -214, -21, -378, 285, 20, -425, -2, 93, 74, -103, -256, -304, -185, -72, 59, -122, 82, 7, 4, -307, 3, -21, 185, -186, -182, -98, -49, 226, -297, 116, -85, 17, 75, -5, 103, -81, 32, 298, 28, -34, -7, -340, 40, -38, 7, 102, 105, 10, -152, 121, 122, -51, 16, -177]
7466a77K3K14P0p7PK4k05J39J20j50J12J56j85l23L67q3j15N3J53l5l16L45k19
7489a02K98l19q1N7M71M2j14k34Q2K0j08J69j36j75J09O2j17K51lk24n7Mj48J20
7513a33j71N56k76N6Q0K0j10lj71Q6J55j80m4J2r1q7K46R8j83K6M19l53kj06J96
7538D0m2j13M8P8k56P0J5P3K8J06M6k53L68j76j06L27l39K39k16l07K11J10J9
7561c0J19j03p9q5K83M3j93K5J32r1m7J9n1K69m25M89m31K25m4j17j14K35J43
7584A72rQk75q5K73n54M23J85j58J25k12N2P1K78k27j90NK45Oo7jL1j74j47K51
7609B6q6L4J86j25o3K50m03M42k84k8K3j13k4L7Q1M8m6J02J75m82J22Q8j02J3
7633a29J18J08n61M47J08k22K12m6N9j11j71P6O3K35k8L31l20l38L61nL10m87
$$ y = [-177, -154, 60, 130, 53, 60, 84, -121, 18, 138, -12, 100, 256, 71, -252, 115, 32, -83, -30, 123, 88, -228, 117, -102, 196, -123, -204, -147, 324, 366, 252, 18, 100, 120, 12, 181, 45, -130, -21, 41, -76, 175, 172, -52, -109, -105, -253, -133, -304, 252, -24, 32, 112, 132, 22, 19, -152, -66, 89, -91, -135, -123, -214, -301, -55, 43, -140, -114, 305, -48, -50, -156, 40, -2, -115, -67, 11, -245, -175, -160, -87, -59, 47, 93, -160, 208, 32, -74, 253, -86, 153, -63, -370, -159, -49, -30, 89, -14, -93, -178, 105, 148, -45, -20, 112, 21, -26, -7, -58, 211, -214, 275, -156, 69, 25, -92, -206, 29, 172, 163, 171, -104, -189, 84, -470, -47, 138, -20, 105, -107, -55, 16, 294, 67, -123, -118, 127, 133, 66, 65, 96, -78, -225, 26, -60, -26, 160, 35, -28, 222, -181, 261, -23, -51, -28, -141, -165, -128, -47, 1, -45, 57, 232, -250, -128, -40, -142, -129, -11, 97, -464, -17, 91, -131, 81, 35, 94, -17, -188, -112, -49, 186, 158, 489, 169, -169, 192, 187, 497, 10]
7655A0j69J16P9N1k15M7J07j53j9K62j01j57J0K9j20M6J11K70k29L86n41J65l16
7678c31J46K16k57L45J37k66J24Q9l0j06J91j39k49K29k58M4j4K84O1n1j03k24
7700a62N7O0j51L84l09K1M3L25m24J62nn5k58M08N2K5j04J3l64L22l3j14%J53
7724D6m06N43k89j77J80J27J90P7O9m71L6p5J53n9Mj10K60j86L82Lk36j03j1Q0
7748B7j8j12L52m26J43J28L1j45J71Q7l70K36J01l55K85MR4l40J1O1K65J0l06
7771f6M7k39J65K95k13R1j82p8J44K07j61j9k51L54K56l78J57r8l2K16k87K1l1
7794h2k6MMj07M86j27m07L31n5J02L3k27O8R1P5l20M6J63m3K78k86pl7k78N17
7819A96m79K43j1o7j16q4K57J56j92p6K22j61j35K66p9q8j16J50J99k11lj48J24
$$ y = [10, -159, -43, 36, 87, -128, -81, 26, -127, -146, 116, 15, -142, -132, -103, -223, -177, -66, 204, -25, 361, -180, -15, -331, -185, 31, -226, 119, 256, -10, 114, 203, 173, 67, 258, 119, -130, 99, -159, -115, -129, 155, 216, 165, 62, -162, -105, -45, -196, 188, -121, -100, -57, 268, -156, 6, 1, -54, -312, 96, 148, 173, 69, 82, -282, 40, 7, -107, -107, 46, -360, 183, -106, -283, -103, 24, 214, 291, 360, -111, -75, -150, 3, -56, -52, -162, 98, -88, 294, 297, 61, -42, -53, 27, 9, -103, 249, -177, -34, 94, 125, -20, 151, 238, -132, 104, 205, -150, 135, 139, 233, -107, -96, -35, 230, 240, -66, -19, -258, -93, 202, -11, 80, -102, -180, -36, 171, 10, -9, -260, 94, 350, -28, 129, 31, -1, 215, -72, -51, -82, -108, -104, -100, -207, 279, 152, -255, 76, 21, 123, 156, -71, -3, 88, 163, -157, -111, 52, 9, 287, 1, -6, -43, -321, 196, -283, -40, -51, -118, -234, -318, -61, 95, -97, -173, 49, -112, -247, 19, -60, -148, -264, -114, 85, -126, -129, -277, -153]
7842a53n0N7Q4J06P1o6k68J90K5J4N3J0r5%Qj40J02Kj93L84m53L6J88kL89m83
7868a84K81k80K39l23J94O7m6n9J15j66J19j7p2K04M4L52m31k7j76L24L2j90L53
7891C53l53l05L44o3J46qk03K50j2l09J15J9q3P5J90j45O5Q6j56q3p9L41l68L96
7915B13k21q0rJ5jn8K61j64L63n57L00J62k13L27l4n25N7N9J4K32p5k20J90J53
7939A89j56L88n58Q6J60J7k36M0K94m02K42k78J40M4J0r7L92l07k5j21J54J8q0
7962h6K76l28m8L09j42O0l7j09J04J22j96r3J77J00J04j24k42K25k05J59J09j87
7984e2qJ2N2k78M3K89J29K3l15K19j18J14r1j66L1J03K9k88K54PK34k66J10l88
8008c21M26k23K96j99k0K47j84l4K5K21k09J85n7J98l06q2K64j79l5j46m7j45
$$ y = [-153, -203, -146, -62, 44, 115, 49, -219, -29, -4, 10, 63, 73, -22, -22, -14, -154, -52, -50, -243, 141, -312, -276, -88, -90, 299, -184, 97, -183, 56, -267, -73, -6, -52, -111, 4, -162, -43, -60, -132, 72, 116, 468, 37, 10, -166, 158, 190, 0, 353, 0, -305, 39, -24, 122, 114, -89, 161, 149, -160, -45, -26, -109, -34, 156, 11, 76, 162, 6, -77, -156, 185, -183, 213, -8, -88, -97, -82, -83, -141, 120, -44, 319, -238, 62, 224, 11, 338, 304, -221, -164, -105, -91, 141, 66, -154, 36, 189, 33, 421, -137, -51, 109, 126, -110, -70, 224, -178, 64, -214, -74, -30, -20, -117, 275, -32, -57, -178, -24, -6, -86, 190, -138, -186, 123, -19, 41, 4, -105, -1, 121, -75, -168, 9, 109, 213, 89, -153, 72, -133, 26, 135, -52, -60, -48, 4, -274, -231, 58, 187, 210, -105, 114, -4, 110, 19, -147, -116, -13, 16, -272, -18, -11, 223, -43, 67, -321, 105, -118, 178, -21, -41, 206, 22, -12, 13, 234, 25, 210, 153, 351, 45, -37, 227, 48, 13, -133, -180, -325]
8030c25K48o5L10j38j8J23j6k80J58N8J68k95m3M46m03p3K20o0J75j37J66k19
8052@P5j25j07J49k21JJ17K19l45K07j26m7P4L4J23q0j7J52J08l92J46n5K10J60
8076B60l66N26n45j66M14m24K46p1N2J58j91jJ48r2Q7j5K41k12j53J31j77J23
8098b7J50j60k5j63L13rK9k22N6J65j53J69k96J16J39j26J05L00l66J0l73M50
8120H2l73M61j22J0j12j60K88j10L8K71p1m33Q37m57j46R7r5P2m69M69J30p5J36
8143B68m37J02J65k56K65J48k22J33n7J85j97m60K27o7J37L66m48j64N50r9j32
8164GR1k64J52R0k81J8J68J39J4m04K47J68j69n1J56p4j62K64j15l74K18P9k4
8187a07N9k07L20k23
$$ y = [-325, -77, -142, 168, 30, 12, 135, 119, -161, -3, 55, 223, -72, -115, 331, -72, -145, 75, 15, 190, 53, 219, 0, 75, -50, -157, -8, -229, -228, -111, 108, -237, -30, -156, -203, -129, -95, 28, -52, -69, 83, 191, -201, -55, -110, 100, 260, -106, 420, -125, -291, 123, -301, -55, -126, -74, 84, -107, -108, 40, -52, 35, 20, 261, 49, -104, 27, -150, -27, 123, -37, -62, -225, 88, 79, 108, -114, -58, 107, -46, 123, -173, -57, 82, -44, 61, 361, -5, 5, -368, 82, -291, 170, 48, 58, -54, -214, 74, -36, 2, 273, 202, -231, 606, 149, 3, 100, 5, 77, -392, 77, 207, 132, 268, -169, -67, 98, -158, 107, 255, 33, 166, 109, 294, 97, -363, -136, -203, -66, 300, -148, -312, 238, 139, 7, 98, -166, -14, 76, -205, -187, -19, 120, 134, -270, -23, 145, -24, -75, 81, 7, -155, 109, -6, -380, -162, -83, -107, -48, -255, 65, -158]
8191a58
$$ Imaginary data points
##PAGE= N=2
##DATA TABLE= (X++(I..I)), XYDATA
0@%%%%%%Qj6J6j6K4l2M0m8N6p2Q1r0J13j36J55j80K10k42K82l25L68m20M76n36
30b84O07o85P66q57R60j071J192j324J468j628J805j997K210k448K713l008L339
47A758l717M151m653N240n940O792p860R244j1110J3781j7961K5477m3192J61062
61A33072J25922l02170j33007Q5933J87362L5468n0233o5761l8190n0625K3956
72d8273J12370R8008p1634j55296n1542J12208J19810J3114q2448q5382l9064
83g8129L8841R4348P9887l4682j41332j01536P5094J76049P2384j12298j56022
94h7396l1527J06689J16995J5304q0804q7433k9946L4151P3653O6113n490q8454
106A855r2410k80J01463J07729K030j13670j12923K958J10840J04283o025j12893
$$ y = [0, 0, 0, 0, 0, 0, 0, 8, -8, 8, -8, 16, -16, 24, -24, 32, -40, 41, -49, 64, -72, 83, -97, 113, -129, 153, -172, 196, -224, 252, -284, 323, -362, 404, -453, 507, -564, 628, -696, 772, -856, 949, -1048, 1162, -1286, 1427, -1581, 1758, -1959, 2192, -2461, 2779, -3161, 3631, -4229, 5015, -6095, 7686, -10275, 15202, -27990, 133072, 258994, -43176, -176183, -90250, 97112, 132580, 82347, 16586, -21604, -72229, -48273, 64097, 162105, 90471, -64825, -116367, -4159, 115651, 128765, 46317, -39065, -78129, -39288, 55060, 134947, 100265, -41067, -142603, -67509, 108540, 180924, 68626, -87396, -118923, -12234, 104761, 120065, 39261, -48172, -78118, -43967, 29686, 95799, 90309, 1855, -90555, -90835, 10628, 118357, 120387, 6717, -106206, -103248, 7592, 111875, 105850, -7043]
118g043j05718J6769J19472Q6306l5742j02125n5675L2855P2893M3343j1313n1122
130B900o0162k3510N3248R0790K5577p8146r3572r647P4123Q3105K2825n6497
142C1034r2748m6983N6138J17269N4347q4660j34824k6773J04986J03774m142
153G7418p7610o1117m230L9662N1621L1416j7047o2572n5434J5069P7745N5943
165G0864k5503p9177n3955K4988Q5172O3280k9621r6210n7732M3502R6812M8013
177I0433m9086r2519m1170M3408P8091M3349k6115p5088n4683K4666P9892N3713
189G4891k0390o5947n1781K976N2367O0188J6415m9944q1568l1090O7572J01686
201G5375J8523q7512r0733N284Q8074P1331j4917p5836n4163J1355N3801M6396
$$ y = [-7043, -112761, -95992, 23480, 109786, 74044, -28081, -83756, -50901, 21992, 65335, 54022, 2900, -57262, -80772, -27524, 63266, 88843, 10697, -82875, -92522, -18399, 64706, 87531, 31034, -61714, -108697, -52559, 64710, 119057, 34397, -100427, -127200, -22214, 81560, 77418, -192, -61309, -65539, -25877, 25744, 57160, 40113, -22459, -77893, -62824, 14921, 70864, 45361, -33816, -87771, -62783, 22389, 85669, 56048, -40162, -97894, -54392, 42420, 90433, 41347, -51172, -92342, -48934, 29157, 72506, 46391, -28697, -83380, -58714, 21178, 74891, 54501, -11446, -63227, -60251, -7884, 52304, 68719, 18775, -62793, -93883, -26311, 75375, 93898, 6386, -84347, -79063, 9011, 80342, 65425, -10411, -64574, -53219, 582, 46978]
213D6978P363m2281o0701j8998M8178P1472K2640n0502p4731k2338N0943O9246
225D7269K5267l7712p1188m7804K9907R0660O0157m1886j03641n2149N7655J00723
237E7258L3111o1064p6198j8185L6576M9536K9463j1108n0287m9223K737N9730
249B346O0516m239o8457n9780J2192O6698N3227o120o2393o5151j679P0849P2518
262G0527m527p9884p0658J4449Q2294O0562k0150o8127m6903O769M7362M9291
274D1005J0872m0036n9137k4915L5895O8080L5057l7308p3789l4568L8222P4299
286C3677L8155l8361q0171l9312M6363P8717K7478m9991p0439j7476M7598N7224
298C3462J2285l1820m2291k2836J3639M6693L9474j2106n7139m6447J1750O1579
$$ y = [46978, 54341, 12060, -48641, -67639, -19461, 52011, 74651, 24149, -50582, -72920, -21977, 47269, 72536, 34824, -36364, -84168, -54261, 36399, 96556, 54670, -48971, -101120, -43465, 57258, 90369, 29305, -46893, -65078, -28502, 21034, 50497, 39389, -10898, -60121, -57384, 2346, 62862, 58623, -9834, -69614, -57422, 9276, 62503, 56383, -6010, -71161, -72840, -1991, 70527, 66000, -13884, -84542, -70093, 12201, 72763, 52613, -15514, -62417, -55648, -8286, 41005, 51877, 11841, -47296, -72211, -36316, 31764, 66821, 29513, -44276, -78844, -40622, 33677, 71832, 33471, -46700, -86012, -39649, 39068, 66546, 16555, -53884, -71360, -23762, 33462, 45747, 13927, -28364, -51200, -37561, 9132, 48606, 36500, -20639, -67086, -55336, 6243]
310F243N0507j2655o2133n0236Q686O1537N9396m129o9310o3194J2357P1625N2770
323F1464j8836o4228m1270J8585M9958K9737n875k8421l2292j3626K3874M6124
335B5194K3825k8514n8424k7578L9139O6286J8323m9495o0472q839M7560N5923
347D2928J0476m4605n4059j0347M2015N1726J2083m0282n1189j0301L5409M1823
359B5677J3140j9742l7328k6008J0411M3391L8028o849n1826m7789J1853O1786
371A4744M3170k1062n9814l6820K2783N7813L2969k5719n2696k3752K4667M2905
383A9188J9560j7587l4568k1466N161K8073L2585P583l5165m6655n208M6368M8945
396D6814P02m7505m7622n42M5295M6800K788m3127n0721o822M8276N1906k78m7487
$$ y = [6243, 56750, 44095, -18038, -68274, -59588, 1949, 61345, 57216, -12094, -75288, -62931, 8694, 61464, 42628, -21600, -62870, -44285, 5673, 35410, 29535, 1114, -31178, -44804, -20930, 25194, 49019, 20505, -37919, -65497, -26358, 39928, 58251, 8756, -51716, -60555, -12995, 42928, 53404, 8799, -45260, -55607, -13592, 38134, 50217, 9935, -41254, -51555, -16146, 25677, 38817, 19075, -18253, -44261, -33850, 9541, 47569, 40720, -11106, -58895, -47042, 14744, 57914, 36852, -22962, -59782, -36999, 20814, 53783, 28064, -24632, -48384, -23717, 19188, 38748, 21161, -13407, -34873, -29712, -1639, 30946, 38529, 3364, -43291, -48499, -2131, 46814, 47516, 11, -47611, -48153, -2858, 43942, 46730, 3603, -47118, -53940, -5664, 46242, 45964, -1523]
410a523m0548L653L6515L2118L398k4677l1230j5054J5125L8077K6907j8243m9107
423b4589k7773K5698N2517K6338k7924n4794k3433L2167N2593J8487l0023m9414
435c0150k0134K8153M7264J9200k4396m1860k1150J6911M1016K5994j1654l7457
447h263l1287J834L7934M1496M74m4843m5112K481M7489M3739m502m6919l9258
460d4737O276M1684L6334j407l8402m0615K94M0783L7210l488l5461l1538j138
473c4205K8361L1753R137j9850l8185k2304K1986N1325K3949l3383n3912j7141
485e2469L4943M8756J4989l1229m2644j5538K3057M0770K2347j8997m4840k3731
497d4586K1259M0678K0673j6171l6347k2916J0748L3799K6370l498l3810l4005
$$ y = [-1523, -42071, -38418, -1903, 30215, 33613, 8936, -22294, -37348, -22223, 15854, 42761, 24518, -24589, -52362, -26664, 25853, 52191, 24267, -30527, -53960, -21793, 30800, 49287, 19264, -30150, -50284, -22131, 25133, 44333, 19937, -21923, -43073, -26162, 14854, 40848, 29194, -8263, -39550, -37716, 218, 41714, 42188, -2655, -47767, -45286, 2203, 45942, 41440, -5479, -44737, -38461, 3223, 39557, 38150, -252, -40867, -40573, 210, 37420, 33932, -1529, -33067, -34205, -5844, 25909, 35046, 15196, -22989, -45293, -23307, 28018, 51967, 18584, -35328, -52469, -17526, 31230, 46219, 14990, -27654, -43192, -20135, 20635, 42982, 23985, -20855, -44586, -23327, 17351, 38024, 21853, -14494, -37410, -26662, 7137, 33507, 30009, -3801, -37806]
509c7806J599L9864L6675o004m1793l5505O520M2312L4547r123m0992k9304Q297
522c0713L4769K9482k767l2014l0634j090K8055L2430O824k7945l6327q311K7378
535a0863L5590J2120k3407l8772j5626K5472M0450J5178k5570m0655j4964K6097
547a4950L9200J1775k4804l4273j1442K0000L3631J3896j8481l1628j4504J4637
559a6943K9872J8804j1167l1636k2425R105L2762K7038p967l7134k8388J1083
571b6996L9106K5757j0941l6320k5704R664L4801K4305q119l0805k4993M394L0520
584D669K5491m176k6272k3537j221K2284K8116N359k3918l0729p185K5224L3617
597B7722O973k8505l3091l926K7389L1106N982k5867l2630o067K6094L1008N568
$$ y = [-37806, -36207, 3657, 40332, 34328, -7465, -42970, -36450, 5862, 40409, 31286, -9706, -39010, -30713, 4056, 33538, 30771, -1243, -31877, -32967, -4912, 27518, 34342, 6397, -29930, -38241, -10863, 24727, 36847, 13440, -25332, -40958, -15486, 24964, 40142, 14572, -26083, -41047, -14950, 24250, 36025, 11221, -23052, -34494, -14494, 19137, 33033, 14552, -17076, -31580, -16943, 12929, 31733, 20566, -11070, -33495, -24390, 8372, 35410, 27443, -9691, -38079, -26996, 12110, 37867, 26926, -9394, -35098, -25434, 9367, 33672, 25553, -5252, -30245, -25851, 4669, 30160, 25984, -288, -23825, -25046, -2762, 25354, 30713, 6795, -23934, -31119, -5895, 27722, 34695, 6190, -26901, -30827, -3438, 27668, 33650, 7783, -24847, -30914, -4820, 26188, 31756]
610C1756k3308k9490q203K0539K8802J0719j6477k8309j5645J3332L2089J9220
622C5025j4351l3301k0795J2782L5487K1999j5254l6057j8987J4871L2519J9511
634C3449j2382l2169j9140J1500K9466J9293p721k8617k2474O644K8097K1938
646B7884l276k6037k5273l38K7732K8828N30k8533l0486k572L0690L2106L63l1332
660B86k9608J56K7361K8188K955k4841k7846n245K1490K8243R248k0226l0962
673b0801r792J9143K9410J2278j6211l0892j5646J6769L3133J5397j6324l2968
685a6504j7179J7102L4063J5325j6944l1442j5651J3643L0970J7723j2859k8737
697a0490j7748Q168K7508K2264o055k8889k3818N362K8102K5135k693k8709k7336
$$ y = [31756, 8448, -21042, -29245, -8706, 20096, 30815, 14338, -13971, -29616, -16284, 15805, 35025, 20674, -12627, -33422, -20640, 14847, 36846, 21592, -14465, -33452, -18581, 13938, 33449, 21067, -11102, -30242, -18742, 10724, 30017, 22296, -6321, -28795, -22151, 5946, 27884, 24608, -1429, -26702, -27040, 692, 29520, 30050, 1517, -28969, -31541, -851, 31255, 31618, 286, -29322, -29166, -1805, 26383, 29338, 4497, -23349, -28594, -7104, 21139, 30387, 10161, -20801, -30593, -11450, 17960, 30238, 14027, -16865, -32511, -15742, 17391, 32788, 16464, -16504, -33683, -16581, 17482, 32807, 15863, -15579, -31230, -17587, 13383, 31106, 18247, -10490, -28238, -20070, 7438, 29702, 23647, -5242, -29060, -23698, 4404, 29539, 26846, -1863, -29199]
710b9199K817K9042K6532j283k7709k7134L98K7943K6295o82k4128k6020l058
723b6186K3937K6780L198k1964k5492o105J9248K8133Q854j9928k8473r843J8616
736i225K9676J1916j9283l0310j1524J8226K9340J2936j6548l0119j3248J6860
748a1303K8282J2735j2971k7067j5805J1303K7395J6381r152k6542j8830P772
760a7802K7223J9853p465k6413k0222N101K6633K2210n623k7075k1388N188K4874
773E094K1775k288k5605k2811K848K4023K2021J8k3210k3317j052K2384K3020
786B2900K345k0258k5049m693K1277K5803M750j9839k5719p205J9234K6738P746
799B8030j9685k5918p425J6957K5540R413j6766k5587r534J4685K5146J2290j4094
$$ y = [-29199, -26382, 2660, 29192, 27909, 200, -26934, -26536, 1407, 27702, 27020, 2892, -23128, -26186, -2249, 24531, 27729, 5765, -19727, -25832, -6584, 21549, 30403, 10475, -17998, -27841, -9225, 20451, 32367, 13084, -17226, -28750, -10524, 18816, 31752, 15204, -14915, -28163, -11303, 16979, 29714, 16743, -10324, -26129, -14826, 12569, 28950, 19798, -6744, -25574, -17802, 9421, 29274, 21809, -4604, -24826, -19725, 6908, 29118, 23495, -3580, -24968, -19780, 5094, 26869, 24581, -1024, -23835, -20987, 3036, 25057, 25075, 1865, -21452, -22504, -120, 22900, 25245, 4987, -20062, -24755, -3478, 22325, 27075, 7236, -18483, -25688, -6454, 20284, 28030, 8345, -17573, -24998, -8041, 17499, 26912, 10146, -15441, -24975, -10290, 14856, 27146, 13052]
812A3052k6510j2314J3716K4831J3403j1234k5968j5467J1270K6749J4615r853
824A6290k5458j6780Q571K6474J7880r075k4983j8393O468K5458J9145o614k4341
837e358j8739M075K3166K0985k443k4295k1012K212K2547K1518J48k2273k3162
850b2631n13K1782K2849K047k0657k3863l279K0968K3733L566j8771k4055o554
863b5378J9371K5356N644j8433k4377p377J6540K5130R766j6230k6061r469J4737
876a0781K5404J2027j3938k6585j2228J3156K4918J3991j1400k6075j4892J1505
888a4898K5237J4714q344k5103j7296Q187K5309J7226p721k3956j7706N287K3857
901D793J9377n069k3231j9139K347K3143K1474k510k3417k0684J307K1148K1566
$$ y = [13052, -13458, -25772, -12056, 12775, 26178, 14944, -11024, -26491, -15221, 11528, 26143, 16290, -9168, -25948, -17377, 9097, 26977, 17902, -7081, -25474, -19006, 6452, 25597, 18983, -5358, -24097, -20022, 3144, 24129, 21686, -2609, -23621, -21409, 1138, 22656, 22804, 531, -22631, -23144, -1362, 21487, 23534, 2877, -20986, -24265, -3297, 20436, 24002, 5231, -18824, -25378, -6007, 19349, 24993, 6560, -17817, -25194, -8654, 16476, 26242, 10012, -16049, -25518, -10781, 14623, 26650, 12712, -13873, -26101, -12945, 11973, 25964, 14564, -11511, -26403, -14898, 10339, 25053, 16709, -8394, -25690, -17503, 7806, 25032, 17311, -6645, -24351, -19064, 4793, 24170, 19101, -4130, -23269, -20922, 2221, 23695, 21185, -2232, -22916, -21609, -461, 21105]
914B1105J537k1841k2742p24K0345K2362K989j9617k3911l548J9260K3379M529
927B3123j7269k3915o871J7441K4019O975j5968k3599q855J4464K5088R794j4973
940I454k4000j0158J2674K3800J2286j2353k4238j2493J1387K2943J3939r340
952A3901k4470j4371R661K3109J4574p462k2958j6412P163K3275J5855n902k1678
965e715j7564M363K2250J8085l698k1393j8513J977K1076J9466j651k0499j8777
978b0593r6J9022K0276J539j9933k0096j219J7989K0309L308j7507k1569l531
991b2101J7432K0403M786j5455k1732o165J5910K1651N815j3913k1464p991J3850
1004h974K2464P955j3354k1232r490J2085K1726J0801j2448k1332j0760J0235
$$ y = [21105, 22642, 801, -21941, -22665, -2320, 20042, 23031, 3414, -20497, -24045, -4785, 18594, 23123, 5854, -18061, -24932, -7491, 16528, 23503, 7535, -16064, -24919, -10455, 14633, 24427, 9454, -14546, -24704, -12030, 11770, 24056, 11703, -12535, -25028, -13641, 9302, 23241, 13901, -10569, -24940, -15279, 7830, 22404, 14942, -8016, -24428, -17265, 6010, 21865, 15963, -5715, -23279, -18916, 3334, 21419, 17721, -3672, -22185, -20208, 868, 20334, 18683, -1816, -20593, -20689, -1667, 18609, 20148, 215, -19881, -21100, -3111, 17198, 20506, 2999, -18570, -22101, -4669, 15734, 20520, 5065, -16667, -22832, -6922, 14729, 20544, 6631, -14833, -22824, -8974, 13490, 21445, 8091, -13141, -22631, -10546, 11180, 21981, 9533, -11799, -22559, -12324]
1016a2324K1690J2352r839k1777j2583Q812K1033J3341p209k1226j4840P306K1212
1029E948J3944n419k0076j5882M745K0770J5737m134j9651j6331K441J9574J7147
1042A8813k247j9151j6976O59J8432J8747m43j8138j8467o83J7102J9185J830
1055A8663j7238j9326k403J6571J8993M020j5368k0226n129J5851J9857N582j4276
1068E571k0287o782J3328K0678O921j2134j9850r144J1876K0848R218j1600k0060
1081a1417r636R562K0197J1431r471k0490j1182Q469J9491J2559o918k0443j2799
1094b0647P102J8960J3695m867j9750j4863M974J9616J4666l679j8434j6162K417
1107a6972J8948J6189j897j7970j6174L31J7635J7954o62j7047j6988j390J5827
$$ y = [-12324, 9366, 21718, 11879, -9898, -22481, -13669, 7364, 20705, 13496, -7730, -22570, -15264, 5948, 19892, 14473, -5603, -21485, -16740, 4030, 19767, 15633, -4018, -20349, -17908, 1666, 18813, 16566, -2585, -19561, -18902, -470, 18277, 17834, -304, -18771, -19454, -2352, 16833, 18663, 1425, -17901, -20304, -3733, 15260, 19280, 3912, -16314, -21443, -5592, 14265, 19847, 5571, -14716, -21498, -8170, 12508, 19429, 7295, -12555, -21699, -9823, 11025, 20243, 8643, -11417, -21053, -11491, 8706, 20137, 10666, -9824, -21006, -12537, 6954, 19513, 12595, -7848, -20647, -13545, 5415, 19110, 14243, -5507, -20370, -15396, 4220, 18886, 15207, -3227, -19389, -16972, 1976, 18165, 16268, -1702, -17876, -17545, 90, 18044, 17382, 335, -16653, -18043, -2216]
1120b216J8426K104j6164j7847k494J4426J8407M294j4497j9030m121J3999J8198
1133A3485N340j2260j9343o846J2879J9284O892j1643j8846q444J0870J9483Q394
1146A9245r964j8611r096Q564J8768J0643q661j8711j0457P187J8072J2099o395
1159A2683j8984j1998N909J7733J2863m223j8164j3652M788J7250J3100l263j6298
1172b256j4837K457J7196J4241k223j5243j4827N09J5355J5358J18j5447j5077
1185a4676j470J4223J6457J739j4136j6036k433J2921J6604L951j3083j7066m064
1198a7069J2624J6242N076j1553j6831n803J1382J6825N033r376j6213p518R913
1211g268J6581P420r243j6192q321P489J7419Q570p793j6531q797O267J6289J0746
$$ y = [-2216, 16210, 18314, 2150, -15697, -18191, -3765, 14642, 18936, 4439, -14591, -18712, -4713, 13485, 18825, 6565, -12778, -19624, -6745, 12539, 19431, 7788, -11058, -19502, -8632, 10851, 19245, 9281, -9330, -18426, -9862, 8906, 19549, 10888, -7823, -18280, -11093, 6979, 19078, 12683, -6301, -18299, -12390, 5343, 18206, 13983, -4181, -17833, -13045, 4205, 17305, 14042, -2256, -17093, -14636, 2560, 16801, 14578, -665, -15492, -14983, 372, 15730, 15848, 401, -14676, -16146, -1923, 14534, 16273, 2137, -13899, -16332, -3411, 13193, 17144, 4061, -13005, -17069, -4445, 11797, 16873, 5320, -11511, -17314, -5932, 10893, 15926, 6550, -9663, -17181, -7268, 9313, 16733, 7490, -8702, -17023, -9534, 7885, 16455, 8662, -7869, -16666, -10399, 5890, 16636]
1225A6636o359j7090r729N568J5477J1176m571j6296j1500M869J5499J0935k468
1238A2147j4737j3108K312J5139J2550j549j4000j3487L49J4522J3726p71j3697
1251f04j3221r60J3433J4803P32j2920j4426j632J2366J4505K585j2133j4513
1264a1985k746J0985J4442M395j0843j5287m508J0563J4672N422r009j5558o431
1277a5888R360J5839O156q277j5301p901Q050J5374P874p337j4831p985O081J5088
1291F302R040o115j5079q607N139J3683J0258m157j4896r687L646J3596J0914
1304A4037k226j4289j1700K805J3845J0995j151j3235j2823J516J3282J2556j213
1317A2399j2123j2229j036J2111J2992J195j1796j2825j924J0527J4018K589j1168
$$ y = [16636, 10277, -6813, -16542, -10974, 4503, 15679, 11108, -5188, -16688, -11819, 3680, 14615, 12147, -2590, -15698, -13386, 1753, 14303, 12754, -1246, -14733, -14384, 138, 13864, 13093, -604, -13825, -14785, -1352, 13451, 14183, 1263, -13163, -14795, -2429, 12076, 14661, 2528, -11985, -14731, -3746, 10696, 15091, 4248, -11039, -15547, -4984, 9688, 15110, 6101, -9457, -15888, -6528, 9311, 15467, 7190, -8111, -16012, -7962, 7412, 15286, 7949, -6882, -14867, -8786, 6302, 15342, 9227, -5852, -14459, -9320, 4363, 14621, 10464, -4432, -14119, -10473, 3123, 14037, 11811, -2478, -14178, -11373, 2472, 13467, 12316, -919, -13742, -12226, 1056, 13612, 12399, 276, -11953, -12989, -878, 12114, 13309, 1513, -11312, -13236, -2709, 11309, 13898, 2730]
1330B730j3095l148R715J3801M643j0135j4096m138R307J3923M802q754j3874
1343h319n749Q673J3772N480p339j3622o406O721J3579O845o049j3166q095M891
1357h784J4307Q418n307j3311q479L817J3174R894m035j3250r792L677J2610R971
1371A2910k490j2429j0536K216J2095R996r81j1444j1326R06J1738J0250r7r817
1385I91j1897q21J0689J1767J081j0399j1444k425R896J2560K114r648j2066k702
1399a2304Q896J2495L459q944j1937l774P907J1701M955p251j2598m966P256J1763
1413F658N247n619j1899o865N889J2354O239m768j2022p582N122J2109P322m757
1427G428j1675p330L420J1954Q588m477j1213p811K761J0533Q998j777j1067r147
$$ y = [2730, -10365, -13513, -3798, 10003, 14646, 4511, -9585, -13723, -4416, 9507, 14309, 5555, -8319, -14068, -5395, 8377, 13857, 6518, -7104, -13510, -6789, 6790, 13635, 7586, -5580, -13675, -8784, 5523, 13941, 8634, -4677, -13156, -9339, 3835, 13729, 9694, -3556, -13348, -9671, 2939, 12910, 10420, -2009, -12545, -10329, 1766, 11762, 10781, -663, -11989, -11083, 655, 10905, 10808, 991, -10906, -11727, -1038, 10729, 11810, 1411, -10033, -12458, -2562, 9998, 12112, 2464, -9602, -12304, -3408, 9087, 12546, 3602, -8335, -12109, -4202, 7499, 12454, 5203, -7395, -12361, -5105, 6658, 11905, 6286, -5613, -12478, -6589, 5765, 12004, 7236, -4786, -12368, -7246, 4863, 12185, 7428, -4247, -11577, -8157, 3797, 12385, 7908, -3305, -11116, -8355, 2178, 11176, 9399, -1668, -10815]
1441a0815J509J0503R433n50j0408j0782J075J0277R982L99j0056j0648o10J0069
1455f22J0464J086r342j0291j901Q779J0874K252q683j0442k659P661J0867L173
1469A1216p388j0770l439O197J1140M717o743j1330m828O971J0670N332n694j1583
1483e532o285O524J1280N349m945j0745o375M230J1208O282l723j0137p398K802
1497g465J1077P551l008j0196q061K036R960Q747j584j0559q511J396R765Q991
1511A0139l18j0170q776N45Q983Q935K75q671r688o57Q807R395P75p681r615k211
1527i933Q063J0501J717p547r652k914O494J0618L433p216r999l810O575J0035
1541F365M588o180j0615m069N346R768N575m820j0930n147M904R418N680l685
$$ y = [-10815, -9306, 1197, 10630, 10080, -328, -11110, -10035, 242, 10224, 10623, 567, -10081, -10691, -622, 9842, 10928, 1586, -8705, -10606, -1827, 9047, 11299, 2616, -7826, -10485, -2824, 8043, 11216, 3828, -6942, -10381, -4184, 6956, 11673, 4930, -6400, -11228, -4257, 6413, 11745, 6051, -5532, -11817, -5293, 5987, 11336, 6391, -4354, -10729, -6499, 4709, 10991, 7268, -2869, -10267, -7465, 3612, 11163, 8155, -2041, -10102, -8066, 1894, 10641, 9057, -1502, -10013, -8617, 1148, 10139, 9821, -349, -9125, -8580, 403, 9338, 9613, 942, -8746, -9403, -596, 8799, 9574, 1893, -7722, -9933, -1870, 8631, 10348, 2801, -6851, -9765, -3271, 7347, 10780, 3564, -6435, -10245, -3670, 6365, 10953, 4773, -5842, -9911, -4565, 5203, 10778, 5958, -4972, -10119, -5215, 4203, 9883, 6198]
1555F198r690o876L855J0212O343l326r512p227K586J0166P323k794q849p814
1569i405J268R434Q223j732r423p289J100P899Q310L21r155q108n6Q038Q499R81
1585H905p749r085j439P723Q836J988p091r416j864P121R153K037o639q650l177
1600i347O070R613L113o307q694l588N011R265M018m560r550m196M336R103N351
1615I638m510r520n142L878Q986N889l163r274o071L369Q982N996k560q432p058
1630h992K335Q493O522j544q035p035R16Q530O951r97p615p283j18Q180P605Q0
1646G993p678p913K4O693P950J314p139q244j082P001Q071J542o560q221k301
1661h550O492Q322J836n339q338k922N604Q475L178n178q150l820M556Q687M198
$$ y = [6198, -3492, -10368, -6513, 3699, 10042, 6716, -2796, -10023, -7437, 2729, 10052, 7258, -1591, -9405, -8137, 1297, 9520, 7788, -1635, -8924, -7824, 75, 8385, 8706, -449, -8557, -8613, -575, 7924, 8905, 1156, -7929, -9368, -1645, 7191, 9179, 2088, -7328, -9192, -2071, 7082, 9119, 2480, -6170, -9347, -3277, 6336, 9449, 3142, -5552, -9140, -4129, 5136, 9154, 4594, -4956, -9152, -4816, 4287, 9638, 5128, -4392, -9534, -5656, 3330, 9219, 6056, -3218, -9289, -5920, 3062, 9058, 6498, -1934, -8992, -6657, 1836, 8358, 6814, -1221, -8256, -7340, 1190, 8141, 7144, -471, -7754, -7872, 308, 7913, 7993, 315, -7598, -7574, -881, 7069, 8383, 1244, -7000, -8082, -1081, 6990, 8532, 1972, -6249, -8550, -2058, 6264, 8100, 2761, -5577, -8499, -2895, 5580, 8758, 3580, -4570, -8390, -3834, 4853, 9051]
1676I051n121p992m354L915Q533M993l557r118m615L497P896N466k847q390n414
1691h057K696P791N698k007q006o096J649Q294N986j236p590o602P07P760O723
1706G710l64p347o992j20P279P035J40p016p165m15O325P434J387o632p693q47
1722g281N771P778J761n758q395j728N678P450K649n074p954l017N115Q433K412
1737G840m422p676l849M165Q575L544m460p642l981L589P757M763l507p940m984
1752h228L273P594N281k357q176n335K622P246N537j389p575o252J931P214N777
1767G163j008o820o591O57O999O552o80o431o530o25O972P385j70o293o951p99
1783g170O032P311J211o075p112j317N007P547K363n502p884j740N142O566L163
$$ y = [9051, 3930, -4062, -8416, -4501, 4032, 9025, 5468, -3650, -8265, -4768, 3128, 8594, 5747, -2643, -8057, -5361, 2430, 8128, 6121, -1885, -7981, -6332, 1962, 7948, 6712, -878, -7480, -6773, 987, 7710, 7346, -1, -6993, -7113, 166, 7201, 7341, 325, -6840, -7255, -930, 6504, 7891, 1259, -6434, -7281, -1510, 6268, 8029, 2271, -6124, -7852, -2174, 5276, 7925, 2851, -5103, -8120, -3005, 5428, 7840, 3418, -4258, -8107, -3942, 4633, 8177, 3717, -3925, -7906, -4317, 3440, 8203, 4696, -3244, -8228, -4955, 2639, 7920, 5563, -2613, -7948, -5326, 1920, 7457, 6068, -1507, -7759, -5828, 1386, 7163, 6155, -665, -7256, -6599, 400, 6952, 6272, -159, -6689, -7314, -342, 7043, 6873, 580, -6371, -7170, -1138, 6173, 7384, 1309, -5803, -7120, -2113, 5434, 7797, 2295, -5589, -7329, -2187, 4379, 7542]
1798G542m590p577l020M653P278L255m111p248l654L503P591L696l682o757m408
1813g529L070P637M112k658o931m781K064P164N452k437p059m965J579O809N362
1828F889j170o775n857J692O282N560k45o427o697N80O436O122n7o106o378m6
1844f197N978O518J40n723n771j589N617O945J029n324o479j645M685O803K105
1859G092n087o665j744M216O688K574m057p069k609L849O991L050l569p202l600
1874g142L622P322L362l286o646l947K847O673M448l062o275m268J783O623M953
1889G007j935o938m310J184O452N361j361o647m941P99O079N488l48o085n903
1904f098L80O045N170N02n690o284j85N875N702N11n166o046j070N337O107R83
$$ y = [7542, 2952, -4625, -7645, -2992, 4286, 7541, 3430, -3818, -7472, -3969, 3622, 7318, 3636, -3121, -7529, -4459, 3178, 7290, 4632, -2299, -7080, -5016, 2148, 7600, 5163, -1896, -6861, -5282, 1527, 6889, 5719, -1056, -6913, -5221, 1061, 6621, 6376, -51, -6748, -6168, 268, 6390, 6333, 227, -6151, -6197, -219, 6299, 6439, 716, -5055, -6644, -1027, 5918, 6947, 1623, -4856, -6501, -1816, 4987, 7092, 2005, -4660, -6404, -2188, 4500, 7074, 3017, -4052, -6661, -2812, 4179, 7229, 3660, -3542, -7142, -3520, 3802, 7164, 3878, -2768, -6715, -3868, 2805, 7253, 4191, -2084, -6352, -4569, 2054, 7007, 5072, -1866, -6176, -4992, 1460, 6821, 5460, -1187, -6128, -5329, 750, 6238, 5890, -195, -6098, -5718, 327, 5497, 5999, 309, -5975, -6160, -285, 5417, 5928, 762, -5284, -6354, -1017, 5090, 6073]
1920F073m835o394j380M271O659J840m341o492k079L774O912K568m060o728k562
1935f774L551O357K898l166o583l288L793N892L419k832o360l993K489O851L634
1950E888k338o149l898J719O467M795k209o387m117J130O012M688r83o088m719
1965f189P88N444N631l59n868n502L50N611M920N04n011n933l28M914N574N66
1981E112m536n673r45M796N690J113m193n905j659M268O140J902m509n872j778
1996f049L627O007K643m079o198j896L298N689K974k932o105l264L404N422L252
2011E793k255n855l831K367O030L522j776n633m665J991O009M176j790n641m213
2026e771R16O255M421r41o039m174Q34N001M850l44n340m847K10M729N275K50
$$ y = [6073, 1238, -5156, -6536, -2265, 4394, 6234, 1893, -4599, -6678, -2904, 4008, 6576, 2516, -4212, -6774, -3223, 3134, 6032, 2866, -3717, -7005, -3212, 2680, 6099, 3267, -3093, -7086, -4597, 2254, 5888, 3550, -2599, -6497, -4778, 1689, 6484, 4275, -2112, -6229, -5099, 913, 5601, 4618, -1470, -6189, -5401, 43, 5674, 5315, -553, -6055, -5705, -94, 4826, 5330, 319, -5614, -5942, -1028, 4546, 5112, 576, -5097, -6042, -1246, 4444, 5557, 1364, -4541, -6200, -1932, 4208, 6110, 1601, -4271, -6049, -2422, 3585, 6228, 2149, -4049, -5945, -2647, 3042, 6016, 3084, -3021, -6285, -2881, 2541, 5793, 3538, -2317, -6148, -3781, 2249, 5771, 3995, -1638, -6303, -4312, 1697, 5873, 4083, -1558, -5771, -4855, 1400, 5821, 4880, -1159, -5333, -4499, 502, 5352, 5008, -332, -5179, -4969, -240, 5035, 5285]
2042E285m593n917j79M876N053R56m878n390q65M488N721O42l613n775j302M231
2058a260N118J393l620n369j779L121N511K453l582n329k467K922N429L250k807
2073B984o033l066L062N408K937k277n615l468K530N272L249j830n363l786J966
2088d030N422L202j014m842m161N49N489M425r37n342m159M94M850M893k99n085
2104e45m831R8M983M616J48n052m437J17M119M905N01l953n307l98L936M734R71
2121D605l718m964j620L888N237J527l529n336j920L252N750J962l334n122k241
2136e563K922N534K567l328n056k350K520M857K673j740n102l383K164M961L264
2151D940j206n221l862J525M858L613n83n106l953R08N452L800j143m699l958
$$ y = [5285, 692, -5225, -5404, -528, 4525, 5481, 603, -4787, -5652, -1164, 4557, 5199, 1586, -4189, -5491, -1260, 3858, 5251, 1631, -3738, -5517, -2396, 3115, 5568, 1986, -3343, -5810, -2888, 2541, 5791, 2984, -3049, -6115, -3053, 2355, 5292, 3015, -2600, -6068, -3538, 1734, 4983, 3153, -2210, -5996, -4030, 1392, 4594, 3580, -1262, -5423, -4874, 615, 5040, 4103, -1239, -5398, -4904, -54, 4839, 4540, -545, -5376, -5278, -295, 4321, 4469, -583, -5020, -4903, -784, 4121, 4622, 669, -4638, -5036, -1100, 3634, 4605, 887, -4077, -5697, -1809, 3428, 4955, 1426, -3910, -5830, -2578, 3172, 5134, 1800, -3322, -5563, -2641, 2893, 5460, 2132, -2924, -5274, -2754, 2103, 4776, 3036, -2066, -5449, -3285, 1676, 4940, 3734, -1487, -5349, -3824, 1034, 4647, 4064, -1042, -4995, -4087, 1365, 5165, 4022, -677, -4635]
2166d635M21M766M110n39m145m008j22L961M526J12l950m612j83L570M715J028
2182E015l873m913j010L717M821J208l549n069j594M226M916R09l148m812j629
2197d785K964N153J486k840m500k091K420M737K348k312m711k325J594M798L267
2212E203j679n462l097J900M836L377j559n374l195J821M874L324j700m532l177
2227d440J039M311L238p33l728l781J84M130M024l43l912l945n09L878M893J52
2243D458m207m336m68L937M820K28m105m448J04L174M005N46k621m322j235L313
2259a157L949J301k543l894k259K462M715K019k370m777k259K246N030K334k380
2274B417m748k245K271M859K253k479m741k050K276M024K509j590m200k750J511
$$ y = [-4635, -4214, 552, 4662, 4123, -22, -4030, -4152, -191, 4335, 4447, 497, -4115, -4298, -728, 3987, 5015, 1142, -3771, -4781, -1064, 3757, 4965, 1416, -3653, -5247, -1021, 3895, 4804, 1656, -3156, -4785, -1821, 3332, 4818, 1978, -2522, -4613, -2193, 2544, 4892, 2580, -2131, -4456, -2862, 1936, 5203, 3524, -1938, -5035, -3135, 1701, 5078, 3519, -1855, -5050, -3229, 1645, 4969, 3269, -1263, -4440, -3401, 910, 4148, 3415, -313, -4094, -3910, 220, 4244, 3901, -11, -3956, -4465, -587, 4306, 4458, 251, -4085, -4553, -616, 4204, 4432, 327, -4121, -4017, -843, 3162, 3708, 1087, -3235, -4470, -1157, 2792, 4093, 1550, -2344, -4603, -2141, 2574, 4593, 2223, -2554, -4813, -2567, 2463, 4797, 2417, -2331, -4576, -2305, 2554, 4807, 2328, -2413, -4463, -2187, 1837, 4346, 2756, -1444, -4194, -2683]
2289b683L392L194o61l476l839P50L665L998l23m237l850J48M517L906o35m039
2305a73l679N5L910L839l83l917k983l55L232L893N28l272l471j013L073L638
2321B922J188k678m160j353K595M187J710k609m997j510L067M731J462k883m118
2336b446j798K615M182J435k320l439j836J425L826K362j583l854k456J230L519
2351H62L213j061m163l088P84M600L304r09m557l250J246M536K653j053l866l326
2367d075J283L897K325m14l225k787k64L187L257J54k840l193j009K749M146R65
2383D156l232m214n55L050M399P86l355l953r97L223L671Q34k878l538q54K480
2399i77L325J215k038k981j878J427L715J980j552l545k368J216M321K701j807
$$ y = [-2683, 709, 3903, 3242, -234, -4073, -3323, 342, 4340, 4017, -220, -4070, -3922, 595, 4501, 3866, -173, -3852, -3797, 113, 3952, 3569, -348, -3331, -3686, -454, 3439, 3967, 695, -2776, -3789, -716, 2922, 4110, 1432, -2728, -4081, -1486, 2701, 4411, 1802, -3195, -4705, -1638, 3093, 4555, 1672, -2446, -4244, -1629, 2553, 3988, 1668, -1771, -3607, -2182, 1644, 4006, 2423, -1431, -3887, -2657, 862, 4075, 3014, -1149, -4237, -3453, 1147, 4451, 3542, -1015, -4265, -3019, 1517, 4170, 3117, -749, -4075, -2792, 1105, 3430, 3016, -209, -2996, -3260, -73, 3184, 3338, 498, -2695, -3704, -955, 3191, 4156, 924, -3290, -3845, -795, 3604, 4390, 1035, -2918, -3915, -692, 2979, 3813, 935, -2603, -3457, -977, 2348, 3563, 1525, -1456, -3334, -1907, 1808, 3788, 2236, -1309, -3677, -2461, 1860, 4561, 2754]
2414B754m237k748J915L776K762j996l779j914J258M001J998j726k819k376J007
2429b124L168K270m70k510k974l25L216L132p7k649l746p95L635L788M9l333l570
2446c315l54L811L473k89l149k998q3K647K988N25k571k686j037K224K678J659
2462C523j749l669j431J813L505J855j686m090k285K398M293J854k199l999k010
2477c877K162L902J412k066l360j472J910K840J596j134k569k020J97K753L087
2492C361k67l323k916K78L142L051j05l414l461M45M080K705m90l567k549L22
2508b708L009K449k63k169k714m61K571K475O89k458k452j028J771L192J641k288
2524A256l351j386K091L834J591k787l844j303L125L404P78k545l162p65K198
$$ y = [2754, -1483, -4231, -2316, 1460, 4222, 2226, -1553, -3467, -2209, 1792, 3790, 2064, -755, -3131, -2124, 1044, 3314, 2844, 334, -2640, -2965, 251, 3383, 3306, 657, -3089, -3884, -249, 3539, 3588, 255, -3315, -3669, 142, 3615, 3326, 177, -2821, -2904, -257, 2731, 3256, 685, -2001, -3038, -814, 1864, 3523, 1774, -1895, -3326, -1513, 1992, 3847, 2161, -1929, -4214, -1816, 2477, 4331, 2132, -1867, -3877, -1715, 2187, 3599, 1533, -1827, -3299, -1389, 1451, 3047, 1913, -656, -2676, -2479, 274, 3361, 3094, -229, -3145, -2867, 275, 3326, 3221, -193, -3654, -3209, 871, 3576, 3086, -481, -3030, -2708, 301, 2750, 2487, 318, -2396, -2857, -286, 2189, 2878, 420, -2032, -3060, -1289, 1903, 3544, 1256, -2095, -3481, -1390, 2444, 4035, 1248, -2596, -3899, -774, 2630, 3408, 863, -2299, -3064, -866]
2539h66K753R03j408k713j258R09K806J738o62k718k398K91L322K944n92l841
2555g90k676O80L850K589r95l871k019J039L161K084q77k837j872Q52J960J819
2571B097L85k017k729m17K418K614R66k637l047j414K976L669M91k527l236r21
2587c329K774L298P36k929k851j96K014K879Q2j858k450p77J567K404J444j132
2603A676k766j954J415K544K142r85l081k834J412L766K037j392l390k281J831
2618a860L631J502k028k509j658J063K827J665r55k466j235o1J900K352L62k538
2634hk342m65J834L361N64k580l324j97L108K601L4k688k615k26K781K802o38
2651B002k210j902n41K294K027M72j705k026j115J134K970J440j391l042j607
$$ y = [-866, 1887, 2790, 1382, -1331, -2589, -1680, 1126, 2864, 2202, -516, -2914, -2623, 699, 3643, 3051, -790, -3466, -2786, 1064, 3653, 2658, -1213, -3232, -2193, 968, 3052, 2175, -662, -2534, -1682, 278, 2097, 2482, 465, -2264, -2681, -263, 2351, 3317, 680, -2367, -3781, -805, 2864, 3355, 828, -2408, -3329, -555, 2743, 3479, 550, -2301, -2497, -483, 2396, 2478, 620, -1830, -2607, -1040, 1364, 2808, 1676, -1090, -3044, -1629, 915, 3057, 2072, -1009, -3843, -2431, 1335, 3372, 1980, -1410, -3691, -1860, 1771, 3273, 1245, -1264, -2922, -1859, 968, 2633, 1678, -788, -2023, -2084, -184, 2168, 2530, -8, -2350, -2815, -981, 2380, 2944, 364, -2960, -3157, -49, 2552, 2586, -102, -2717, -2943, -162, 2640, 2002, -208, -2110, -2651, -357, 1670, 2142, 437, -1589, -2704, -1570, 1400, 2840, 1449, -1593, -3200]
2666c200J326L241J881j719l060j594J741L066J276j485l385j125J958K482J056
2681B459j066k505j212R89J827J579l67j974k013k99K545K489J13k678k751J04
2697b760K975K957q28k953k437O90K706K517n59k828j794J47K609J342K53j719
2713C18k131l61J483K590M82j379k632j022J725K588J072j832k951j219J869L663
2729B263P26j897k878r01J667K734Q69j745k489p14J242K133J228j028j906j452
2745b148N30J962K118n45k204k310L32K725K265n65k934k578J226K866K262j303
2761A699k692j667Q12K373J716o42k261j633L01J895J714N17k158j856o31J712
2777h01K621Q08j753l467o10K324K769P77k351k465o35K563K056K43j895j976
$$ y = [-3200, -1874, 1367, 3248, 1529, -1531, -3125, -1384, 1682, 2958, 1473, -1912, -3037, -1079, 1403, 2459, 1393, -1112, -2324, -1335, 492, 2071, 1704, -270, -2283, -2582, -37, 2452, 2565, -113, -2864, -2760, 215, 3172, 2344, -609, -3046, -2356, 350, 2867, 2308, -520, -2314, -2167, 442, 1784, 2037, 318, -1813, -2174, -691, 1899, 2381, 1002, -1630, -2652, -927, 1661, 2733, 901, -2050, -3269, -1400, 2263, 2989, 1092, -1786, -2687, -1020, 1714, 2583, 838, -1651, -2365, -1123, 1010, 2238, 1210, -696, -2148, -1618, 344, 2462, 1917, -287, -2597, -2265, 460, 2725, 2160, -774, -3352, -2126, 740, 3002, 1699, -993, -2660, -1848, 525, 2241, 1599, -662, -2295, -1994, -99, 1615, 2132, -26, -1882, -2513, -801, 1820, 2628, 875, -2592, -3202, -878, 1891, 2668, 317, -2148, -2783, -220, 1836, 2079, 184, -1792]
2793a792o01J836K217K8j262j830r93J037K209J542j067k245j597O96K536J984
2809B698r73l009j849J225L260J104r50k692j390J324K145J214p42k075j362M84
2825a588K110J351m93j167k067j06J512K337L29j881k369o43K131K876p0k113
2841A49k573j49K645K282j60k456k023M25K060J453K86j552j789m69J561J753
2857A443K40r90j558j186P13K437J250j107k637j248J128L141J207j702k573j261
2873b703J517K545J409j979k085n28R36J864P14m54j986j108N59J578J662m70
2889A471j412j910q9K300J788o2k275k321L61K399K084o50k292j809M19K443J415
2906A860k34j686j555J5J440J493N72j588j725r04J402K309P47j036k594r85J672
$$ y = [-1792, -2393, -557, 1660, 1688, 426, -1404, -2397, -1360, 849, 2391, 1324, -921, -2518, -1822, 714, 2698, 1725, -1284, -3133, -1908, 1352, 2456, 1506, -1186, -2576, -1252, 893, 2107, 1365, -710, -2072, -1588, 522, 1873, 1380, 213, -1854, -1960, -448, 1889, 2218, 337, -2032, -2675, -544, 2332, 2262, 149, -2424, -2573, 72, 2354, 2194, -262, -2285, -1860, 200, 1653, 1939, 387, -1402, -1871, -310, 1443, 1683, 693, -865, -2051, -1338, 1099, 2349, 1242, -1395, -2643, -1515, 1626, 2833, 1131, -1442, -2703, -1186, 1359, 2768, 789, -1296, -1824, -888, 976, 1690, 1236, -750, -1858, -1299, 279, 1941, 1471, 59, -1851, -1940, 360, 2148, 2086, -189, -2510, -2149, 250, 2334, 1684, -608, -2417, -1998, 445, 1860, 1626, -60, -1615, -1600, -160, 1333, 1905, 317, -1408, -2312, -910, 1399, 2146, 1110, -1484, -2469, -797]
2923g97K170J036j262k715j129J911K648P7j422j814p50J499J737R45j445j591
2939i02p36O11J740J399p30j886j353K80J902J874n78k444j287K78K549J428l10
2956A835k343j811Q63K254J508o29k188j380M75J937J111l16j218j357m43J673
2972b9J785j97j139j466q77J328K411J86j551k093o43J760K197O44j908k107j71
2989a870J317K115L99j340j760o62J428J527O76r78j673q38O66J889Q63o10j727
3006e78j640Q22K367J572j514k238j229J204K082J120n84k178r57R84J516J069
3022A818o49j796j350O82J380J321Jj573j471J4J411J725L73j596k193j97J973
3039a27J929O5j950j532l74J759J744j67j495j532j15J588J539K28j311j406l53
$$ y = [-797, 1373, 2409, 1147, -1568, -2697, -786, 1862, 1939, 517, -1297, -2047, -548, 1189, 2134, 689, -902, -1638, -1027, 713, 2112, 1382, -504, -1857, -1577, 325, 2199, 1621, -823, -2110, -1832, 717, 2145, 1835, -508, -2319, -1456, 798, 2306, 1677, -511, -1891, -1416, 521, 1632, 1316, 98, -1259, -1702, -29, 1756, 1559, 420, -1046, -1923, -595, 1816, 2002, 451, -1642, -2285, -525, 1672, 2316, 408, -1699, -1870, -553, 1562, 1961, 621, -1139, -1801, -373, 1154, 1830, 852, -821, -1659, -993, 896, 1759, 1149, -578, -2218, -1396, 971, 2543, 1029, -1209, -2438, -1234, 848, 1968, 1384, -794, -1751, -767, 749, 1818, 1169, -627, -1977, -1295, 85, 1406, 1407, -166, -1637, -1623, -212, 1513, 1886, 290, -1903, -2100, -127, 1802, 1867, -83, -1615, -1989, -230, 1514, 1347, -148, -1680, -1795, -207, 1332, 1560, 249, -1157, -1510]
3056a510Q88J375Q69o67k000j168J217K281P09r47k249j023J375J796J029q84
3072A091k423l65O67K369N38r53j928l77K17J718J413q54j329j124K12J325J491
3089A688M2k098j340K35J599J733L7k181j477K20K070J732p29j577j817M73K079
3106F89P82K25j087j558m60J417J295K41j154j403n00Q89K030K80p82j884q71
3123a851J209J697J051j377k202l10J254J544R54j143j881m57J073J531M47o96
3139H43j505q10O14J549O37l38j175j464M26J795J094o72j445j235K40J918J254
3156A726m78j775r46M22J603J369o83j270j334J04J086J414K49j209j505n16J759
3173A6J147L07j110j643j13J017J845K48j537j347n24J467J373N78j587j378k23
$$ y = [-1510, -622, 753, 1622, 955, -1045, -2213, -996, 1285, 1994, 1047, -1202, -2225, -850, 946, 1975, 1091, -1332, -1697, -1030, 1339, 1877, 924, -1004, -1381, -1164, 554, 1967, 1113, -216, -1340, -1128, 197, 1688, 1730, -368, -1708, -1473, 126, 1859, 1896, -285, -1762, -1542, 528, 2260, 1531, -46, -1863, -1390, 689, 1471, 1696, 609, -949, -1409, 8, 1303, 1544, 390, -1013, -1513, -624, 1406, 1686, 904, -980, -1851, -642, 1055, 2106, 729, -1473, -1783, -529, 1015, 1969, 826, -1055, -1512, -439, 1092, 1539, 843, -662, -1472, -858, 691, 1328, 990, -185, -1649, -1223, 572, 1666, 994, -451, -1686, -1446, 472, 1726, 1248, -527, -1473, -1051, 552, 1921, 1238, -32, -1366, -1262, -176, 1238, 1487, 278, -1227, -1743, 16, 1163, 1470, 360, -1283, -1396, -379, 1466, 1714, 177, -1170, -1694, -227, 1146, 1724, 137, -1241, -1464]
3190a464R19J301J070j564j054q18J145J189O15l15j871p16P56J368R69l72j857
3207f99q60O93J598R93p39j604r81N78J669O35k37j635p85j15K039Q38o46j100
3225c58j296M31J088J207M20j549j385L16O61J901%j258j639J39J242J321K53
3242A494j491j263j53J265J446L2r49j371k67R77J500K29q44j394n20R10J608
3259A209M65j033j473p37P39J915N67p06j882o09Q35J533Q92p96j621p63N76J409
3277E20R90o25j222r01L86J454Q51l51j269j229K26J585J338m40j312j183K26
3294i56J259J472k90j933q05K37J139J231Q2j062j478j91J342J051R0r91j382
3311a185j98J297J019L68p49j530l14J010J360N60j098j466p12J125J476K88o86
$$ y = [-1464, -545, 756, 1826, 262, -792, -1610, -465, 724, 1339, 1024, -847, -1563, -807, 561, 1530, 1158, -699, -1559, -866, 732, 1725, 986, -618, -1599, -1021, 648, 1283, 1046, -589, -1374, -1489, 550, 1388, 742, -358, -1654, -1223, -135, 1072, 1492, -57, -1442, -1126, -465, 1436, 1436, 178, -1461, -1322, -80, 1241, 1494, 3, -1260, -1413, -148, 1298, 1330, 381, -990, -1257, -280, 1220, 1449, 605, -789, -1309, -399, 1209, 1674, 641, -832, -1569, -830, 1085, 1652, 946, -936, -1545, -710, 823, 1715, 919, -702, -1465, -889, 520, 1510, 885, -337, -1238, -852, 602, 1453, 1102, -167, -1396, -1170, 415, 1753, 1313, 1, -1182, -956, 303, 1775, 1485, -448, -1253, -1016, 123, 1354, 1436, 374, -1104, -1295, 47, 1098, 1188, 197, -1185, -1383, -86, 933, 1301, 552, -978, -1292, -282, 1078, 1638, 540, -926, -1638, -513, 963, 1251, 565]
3328E65j287p93R29J402Q72r17j651l73M54J119Q21l20j186j409Q00J364Q62j75
3346A077j293j306M52J498P74m08j129j419O10J383R43r3j399p77r3J412J076
3363A308k75j008j286M63P61R88M73j250j406j58J320J148J21r09j550J9R52J187
3381H98L86j245j128k23Q84J350K38j056j029m77R46J285K67p16r82m30M72J433
3399H73L71n59j222p46N95J512N76n14j496o43M80J244N72k21j419r70P48J501
3417F82M20Qj179j308N67J245O29J50j405j308K41J253J156l21q91j149m1J151
3435a00J423k37j155j163K12R01R28M90j298j126J13J074O48O34r08j390m1M73
3453e22J570J12n99j139o09O52J409K43p03j073n70N29J520L61p29j151m65L59
$$ y = [565, -722, -1515, -586, 816, 1688, 771, -880, -1253, -799, 320, 1141, 821, -365, -1774, -974, 390, 1252, 1077, -216, -1522, -1070, 428, 1202, 794, -335, -1754, -1144, 239, 1182, 1089, -310, -1087, -1180, 232, 1308, 1033, 25, -1261, -798, -37, 951, 1424, 174, -1232, -1390, -70, 1078, 1199, 290, -1260, -1241, -289, 898, 1284, 39, -1089, -1312, -428, 922, 1160, 104, -925, -1402, -456, 829, 1096, 380, -602, -1032, -560, 873, 1244, 685, -537, -1283, -688, 824, 1400, 886, -610, -1253, -773, 471, 1043, 822, -597, -1567, -819, 682, 1102, 1110, -69, -1377, -810, 435, 1064, 1214, -191, -1499, -1258, -5, 1151, 830, -61, -1210, -1251, -100, 1323, 1086, -69, -1232, -1020, -119, 809, 1299, 1, -1125, -1012, 62, 710, 1344, 436, -954, -995, -522, 1048, 1160, 561, -578, -1187, -535, 874, 1117, 414, -659, -1229, -700, 820, 1181, 452, -699, -1164, -805]
3471h05J013R18o87j207m25N61R92O74l18j162n16L10R78P32l32q47j204L95J162
3490B32R85m88p80j208M96J190P98m20r82p16j89J032Q24j31m86j043k09R54R80
3509H39M99j365j107J8R41R71L55p10j249n75J081P76O49p12j307l20O57J389
3527H30L23n58j085l63M66J169N53m52j319p66N51J345L19n54q87r11O66J222
3545E49L15j37r62j030N72R16Q83m96j092o43J48J169Q71l57o32j275l1J479N33
3564G80K10p68q68n05J022R93n1j008o17j74L84J545p2q04p01n15R11Q30J60l94
3584C58j325j24O30J234o4l13j100n08O73J364L14o70r09o68M90J271M04o04m75
3603b2j149L73J341O32o95j135m60N77P09Q54m49q02n36j33J240N91l42p12r75
$$ y = [-805, 208, 1126, 439, -768, -1193, -632, 360, 1034, 716, -446, -962, -652, 326, 1058, 726, -121, -1325, -930, 232, 1217, 729, -51, -1259, -763, 427, 1225, 805, -177, -893, -1082, -50, 774, 643, 157, -886, -1095, -141, 839, 1338, -27, -1134, -1116, -175, 796, 1151, 441, -808, -1383, -302, 474, 1123, 411, -896, -1216, -559, 830, 1153, 595, -490, -853, -387, 782, 1335, 883, -436, -1202, -651, 694, 1013, 459, -428, -1339, -673, 549, 864, 727, -235, -1265, -693, 223, 1106, 610, -482, -1125, -977, 192, 1063, 706, 74, -1201, -1232, 247, 780, 990, 222, -646, -1151, -129, 864, 813, -195, -812, -986, -602, 943, 871, 67, -634, -1149, -238, 592, 752, 358, -967, -1091, -461, 773, 709, 396, -704, -1212, -539, 825, 1139, 469, -440, -1108, -618, 653, 1057, 453, -22, -1171, -798, 543, 1175, 480, -655, -1115, -538, 171, 1025, 576, -226, -762, -895, 345, 936, 594, -118, -1093]
3622a093M85O08O20L61o88j523L41O95R97R1p65j116Q8P95J091j35p49j053R3
3641h57O64J039J70r07n55n27P90Q93N73j127p15k95M30R56N97p51r99o09Q34
3660c96R63M89n35p66m07O6J106J79j18j140n40Q42P38O33m93o42j276M39J470
3679F12N25m82q94o10J75P35R45j05j116o46M5J014N26L2o90o55j30P20O05P0
3699F76k79j344J86P75Q38k46m51q57p5O40J218k84o58r34j84M06J185M05q88
3718A29n26n62O78P34P88q38r27o01O61R37K37k44j204o3M46Q64J67j77r13n08
3738i22M39P56N96Q6j267p73L25R31P65k43j090k74o6P33Q92l46p66o51J88N87
3758a00R44n9p15j023M26O10R04m40p72m20K9N86N60M7m20p07K06K03J080l07
$$ y = [-1093, -608, 0, 620, 981, 293, -1230, -889, -194, 803, 894, 129, -987, -899, -104, 987, 852, 103, -950, -857, -193, 846, 1016, 109, -446, -973, -183, 710, 1283, 156, -559, -854, -424, 532, 1129, 378, -621, -1230, -396, 567, 1056, 521, -245, -652, -586, 520, 699, 581, -559, -1099, -257, 481, 1114, 621, -21, -1297, -858, 612, 1137, 655, -239, -849, -674, 61, 1006, 901, -215, -861, -816, 198, 724, 756, 66, -589, -719, 1, 606, 676, 397, -947, -761, 14, 852, 606, 155, -702, -777, -137, 1081, 797, 139, -795, -979, -573, 612, 1017, 129, -397, -959, -281, 453, 1241, 403, -524, -1125, -464, 473, 710, 466, -738, -801, -355, 509, 676, 499, -414, -922, -483, 273, 869, 955, -312, -1085, -760, 171, 936, 693, -397, -671, -737, -4, 888, 542, -224, -875, -687, -100, 844, 785, 70, -953, -527, 83, 987, 547, -225, -645, -616, -30, 530, 577, 157, -550, -344, -141, 939, 632]
3778F32l82o51l82P73O14M01q49n88o47Q26M53L53k56r25j84L13R14N94l78j036
3798d05l89L17Q83M91j18j001n24L36N83P92l62q66k25pQ19O99k47j126n31J83
3818f98R78P35l27q89n46M13M05P92j62p84q42j36J005Q08k47k69q51R5N25P32
3838G37J52p03j113J97N58Q31l3m26n97p1M25P21P5m96q10k87M80P32N89o73q87
3859e99M8P1P04O95k65j156K0K37N89N67l55j247J03L25N53O88n01p70k79K07
3879c65J72J012k64q40o49Q3O55Q82k31l10o26J12L42R56k64p03q78K22R18M38
3899F62L5o50m72j81P08L90L20o49o58k01O47N28L00o68o18m75Q98N25J56k54
3919C43o11l58L63O30L01j94j019m3K98L97N11j94o89j04j59J098k0j59p81l84
$$ y = [632, 250, -401, -783, -10, 604, 1005, 156, -432, -1079, -253, 200, 553, 297, -628, -812, -499, 415, 1009, 631, -405, -794, -477, 406, 897, 779, -222, -746, -410, 173, 965, 603, -263, -488, -495, 324, 1023, 776, -350, -881, -698, 280, 1015, 688, -201, -747, -334, 71, 863, 701, -83, -925, -1061, -56, 752, 505, 236, -615, -520, 5, 737, 889, 186, -927, -730, -172, 659, 626, 200, -397, -468, -43, 678, 753, 257, -553, -840, -360, 372, 961, 288, -599, -551, -480, 224, 919, 654, -502, -482, -245, 344, 911, 556, -691, -588, -263, 290, 978, 477, -293, -572, -365, -193, 819, 555, -285, -934, -851, -196, 686, 455, 145, -481, -369, -27, 929, 665, -38, -916, -694, 224, 662, 697, 47, -425, -606, 102, 492, 812, 163, -495, -696, -49, 479, 779, 111, -507, -982, -84, 441, 597, 343, -268, -626, -263, 367, 668, 474, -545, -588, -290, 107, 618, 424, -265, -369, -528, 570, 550, 391, -390, -774]
3939g74K60O66N45J1p40p16J57R06L02l98k19q84J56Q63N75J39r85o18L90M51
3959H7M86j29p10m08j59N54J014k60n23q57M91K93O20K21n41p09j0L92P60L7k56
3980C93l88q88O97Q53J25n48p36j08K87P35K26k93p46m0K21N41M36m11o48l55
4000f47K41R23J53J05j003m15L18M95N03k49m69m64L2O84N12j24o03p18J38N62
4020b6P52j20r56k45M7R37L50l17l15p82m3N14R65K6p37m80R7L92M02k5l55p96
4042g15L13O04J98K77j47r01j0K3N13Q96p60q37k14N54O30K98m01o23j67J15Q28
4063D74R6j06m63n55j35P31M67l31n39l9j7N68L45J15j163p3K97N08J87L18n54
4084A31o89K46K26L22K19n71n42L83L75K43K4k14o92l61R45O05j90l90p56M6P19
$$ y = [-774, -514, 152, 697, 708, -32, -748, -591, 315, 617, 219, 0, -884, -728, 135, 710, 849, -136, -754, -364, 87, 573, 444, -266, -674, -833, -279, 735, 475, -48, -905, -414, -121, 499, 720, 179, -530, -540, -148, 612, 649, 393, 5, -883, -186, 667, 792, 244, -492, -600, -313, 422, 648, 355, -391, -431, -210, 331, 767, 356, -292, -647, -406, 517, 670, 775, -228, -643, -325, 170, 673, 424, -45, -509, -477, 207, 719, 595, -8, -726, -588, -26, 726, 606, -350, -595, -548, 389, 739, 422, 107, -675, -718, -204, 761, 787, 50, -430, -333, 59, 461, 436, 81, -715, -402, 202, 400, 677, 530, -371, -381, -358, 155, 1051, 291, -546, -760, -206, 424, 722, 321, -302, -469, -354, 474, 570, 464, 1, -554, -689, 42, 509, 178, -361, -400, -417, 151, 496, 611, -552, -625, -328, 180, 367, 685, 131, -558, -312, -86, 236, 455, -116, -658, -275, 100, 343, 367, 153, -539, -900, 45, 650, 460, 70, -686, -640, 79]
4105G9M64o7l35n61j55L35O08K08j84o55l03K27O57K16r8p58j60M40L42L90l94
4126B96m52o34O71N76J41k65o53j85J21N49N55m53o20k04Q1O11M77k19k92o65
4146e64j02Q31M12Q0q03m25O0M26O12n1o17n11K97L04O76j88p27m1J2M61qO51
4168G85o48n60j37L79M21L35l69m83k86K87R50J09n64m30n1M30L04Q9k45p24k40
4189f48J62Q51K80l67n45m04K52O27L44j81m46k98p3O59J14k06k68m93L83L92
4209A35M08k74l29o40N08M59K41k34n72j77K03N25P5J88q83j00j45O53M57N5l50
4230B03r32J33M24O06o3m10k64k38K94N61L41n35p28k38P56J70L16k59r07M32
4250c38J05L11J08r9m13q19R17L98M00j89l50o49M86L85J26o4n88m00J35Q51K93
$$ y = [79, 543, 476, 141, -420, -575, -240, 368, 576, 392, -263, -566, -339, 318, 534, 436, -322, -482, -42, 300, 690, 296, -156, -790, -119, 457, 598, 333, -320, -505, -384, 165, 720, 267, -353, -557, -476, 135, 612, 393, 101, -564, -666, 165, 577, 657, -146, -571, -511, -85, 527, 476, -141, -652, -355, -51, 625, 437, -290, -331, -319, 142, 134, 785, 137, -423, -560, -181, 240, 575, 206, -277, -563, -276, 674, 783, 219, -211, -262, 168, 472, 561, 316, -408, -648, -486, 365, 645, 278, -267, -671, -419, 208, 552, 371, -75, -373, -446, 213, 327, 121, -147, -640, -257, 135, 543, 269, -60, -700, -192, 267, 508, 274, -298, -475, -272, 253, 328, 516, -367, -467, -612, 41, 498, 553, 203, -729, -596, -172, 434, 371, -39, -303, -541, -247, 314, 655, 120, -608, -846, -90, 80, 396, 137, -770, -338, -233, 78, 186, 87, -326, -1145, -228, 170, 570, 381, 31, -618, -132, 253, 379, 315, -273, -673, -538, 313, 606]
4271F06m10m57l48M43L20M17qq60r0K3M62N62m10k24m51K87K30K67L33j088%j10
4293e06M66L59K40n02l19j31J20N48R0l00n31k25Q47J94K35m92l91q6L00K20K68
4314D04m5o90j38L63L53K98k07p49k20M19O22J27l69n02r8J5O35K92m74j52l95
4335e11L18L55M47l47k01o57Q6N39L12J0o69j28J50M96J55p8k71m88K35K37L37
4356C27J03n63J5k64O21j23M11n07n58J50K08M46j08k23l59j16N86L33J70p67
4376b18j66L2J44P20m2k95n37l03L80O33L92m87n14m84P57N17M1m42o20j95L30
4397c57P17j15j49j10o46J60N93M65k65l68o56L15L33J91N07o84l34j27Q18L20
4417F08k63m63j89j72O67J48J07m60n87M58J0N13om62k51J25q9P07K28m38l66
$$ y = [606, 196, -261, -609, -166, 154, 571, 563, -297, -387, -364, 98, 660, 250, 26, -425, -138, 92, 359, 692, -396, -396, -506, -40, 319, 559, 57, -262, -393, -273, 275, 365, 65, -466, -691, 156, 350, 585, 93, -298, -384, -84, 136, 404, 359, -331, -469, -106, 247, 545, 338, -411, -631, -212, 410, 537, 168, -334, -432, -417, 218, 510, 36, -116, -511, -193, 162, 609, 262, 61, -596, -510, 29, 341, 351, -318, -446, -296, 200, 355, 277, 6, -482, -247, -10, 327, 430, -133, -118, -382, 239, 116, 527, 20, -538, -388, -180, 266, 158, -65, -424, -540, 46, 379, 549, -218, -384, -352, -208, 512, 470, 175, -362, -665, -285, 348, 740, 253, -261, -745, 12, 529, 570, 128, -492, -687, -357, 360, 245, 96, -14, -660, -500, 93, 558, 293, -75, -731, -416, -83, 108, 615, -69, -403, -530, 288, 608, 345, -118, -307, -479, 188, 336, 443, -17, -604, -146, -136, 377, 371, -91, -342, -217, -306, 401, 629, 191, -175]
4438a75k33J99M91L26m39o38J08M1N30K48k33o52q2N39L45K85m17n92J6M23M32
4459E22k84j95l69q6M35M8K06j66l25j35J58M59p1J29l85l96K30L02M4k9l81J33
4481a56n5L89L99j73o58l59L53J79N02r1k37o31J61L16N63K03q59j33J44R9M82
$$ y = [-175, -408, -209, 282, 608, 169, -469, -361, -320, 210, 458, 225, -427, -509, 30, 375, 660, 243, -349, -333, 90, 522, 238, 43, -326, -412, 23, 71, 277, 111, -214, -349, -191, 268, 197, 326, -59, -455, -225, 77, 121, 92, -289, -156, -211, 178, 577, 404, -254, -613, -260, -81, 421, 330, 93, -538, -377, -61, 502, 705, -154, -287, -143, -44, 438]
$$ [...]
8191a58
##END NTUPLES=NMR FID
##END=
