##TITLE=1H_CA-8718
 DMSO, 8 sc, 
 2.7.2020
##JCAMPDX= 6.0         $$ Bruker NMR JCAMP-DX V2.0
##DATA TYPE= NMR FID
##DATA CLASS= NTUPLES
##ORIGIN= UXNMR, Bruker Analytische Messtechnik GmbH
##OWNER= root
$$ XWIN-NMR		Version 3.5
$$ Thu Jul  2 09:54:12 2020 Russian Standard Time (UT+4h)  she@DPX200
##.OBSERVE FREQUENCY= 200.1315
##.OBSERVE NUCLEUS= ^1H
##.DELAY= (6, 6)
##.ACQUISITION MODE= SIMULTANEOUS
##.ACQUISITION SCHEME= undefined
##.AVERAGES= 8
##.DIGITISER RES= 18
##SPECTROMETER/DATA SYSTEM= spect
##.PULSE SEQUENCE= zg30
##.SOLVENT NAME= DMSO
##.SHIFT REFERENCE= (INTERNAL, DMSO, 0, 15.7039)
##AUDIT TRAIL= $$ (NUMBER, WHEN, WHO, WHERE, WHAT)
$$ ##TITLE= Audit trail, XWIN-NMR		Version 3.5
$$ ##JCAMPDX= 5.01
$$ ##ORIGIN= Bruker BioSpin GmbH
$$ ##OWNER= she
$$ F:/spectra/data/she/nmr/H-F/1/audita.txt
$$ ##AUDIT TRAIL=  $$ (NUMBER, WHEN, WHO, WHERE, WHAT)
(   1,<2020-07-02 09:53:17.20 +0400>,<she>,<DPX200>,
      <created by zg, POWCHK disabled, PULCHK disabled
       configuration hash MD5:
       00 E9 B6 7A A2 85 ED C7 34 08 36 98 17 FE 4E 26
       data hash MD5: 16K
       D4 9A 0A 15 C7 70 9C B9 CE BA E8 89 26 E4 01 82>)
$$ ##END=
$$ 
$$ hash MD5
$$ 5D A5 33 E5 24 EC 52 A3 C2 78 C8 9B A0 92 35 80
##$RELAX= 
##$RELAX= 
##$RELAX= 
##$RELAX= 
##$RELAX= 
##$RELAX= 
$$ Bruker specific parameters
$$ --------------------------
##$DU= <F:/spectra>
##$EXPNO= 1
##$NAME= <H-F>
##$PROCNO= 1
##$TYPE= <nmr>
##$USER= <she>
##$AMP= (0..31)
100 100 100 100 100 100 100 100 100 100 100 100 100 100 100 100 100 100 
100 100 100 100 100 100 100 100 100 100 100 100 100 100 
##$AQSEQ= 0
##$AQ_mod= 1
##$AUNM= <au_zg>
##$AUTOPOS= <>
##$BF1= 200.13
##$BF2= 200.13
##$BF3= 200.13
##$BF4= 200.13
##$BF5= 200.13
##$BF6= 200.13
##$BF7= 200.13
##$BF8= 200.13
##$BYTORDA= 1
##$CFDGTYP= 0
##$CFRGTYP= 5
##$CHEMSTR= <none>
##$CNST= (0..31)
1 1 145 1 1 1 1 1 1 1 1 1 1 1 1 1 1 1 1 1 1 1 1 1 1 1 1 1 1 1 1 1 
##$CPDPRG= <>
##$CPDPRG1= <>
##$CPDPRG2= <>
##$CPDPRG3= <>
##$CPDPRG4= <mlev>
##$CPDPRG5= <mlev>
##$CPDPRG6= <mlev>
##$CPDPRG7= <mlev>
##$CPDPRG8= <mlev>
##$CPDPRGB= <>
##$CPDPRGT= <>
##$D= (0..31)
0 1.2 0 0 0 0 0 0 0 0.06 0 0.03 0 0 0 0 0.0002 0 0 0 0 0 0 0 0 0 0 0 0 
0 0 0 
##$DATE= 1593669196
##$DBL= (0..7)
120 120 120 120 120 120 120 120 
##$DBP= (0..7)
150 150 150 150 150 150 150 150 
##$DBP07= 0
##$DBPNAM0= <>
##$DBPNAM1= <>
##$DBPNAM2= <>
##$DBPNAM3= <>
##$DBPNAM4= <>
##$DBPNAM5= <>
##$DBPNAM6= <>
##$DBPNAM7= <>
##$DBPOAL= (0..7)
0.5 0.5 0.5 0.5 0.5 0.5 0.5 0.5 
##$DBPOFFS= (0..7)
0 0 0 0 0 0 0 0 
##$DE= 6
##$DECBNUC= <off>
##$DECIM= 24
##$DECNUC= <off>
##$DECSTAT= 4
##$DIGMOD= 1
##$DIGTYP= 9
##$DL= (0..7)
0 120 120 120 120 120 120 120 
##$DP= (0..7)
150 150 150 150 150 150 150 150 
##$DP07= 0
##$DPNAME0= <>
##$DPNAME1= <>
##$DPNAME2= <>
##$DPNAME3= <>
##$DPNAME4= <>
##$DPNAME5= <>
##$DPNAME6= <>
##$DPNAME7= <>
##$DPOAL= (0..7)
0.5 0.5 0.5 0.5 0.5 0.5 0.5 0.5 
##$DPOFFS= (0..7)
0 0 0 0 0 0 0 0 
##$DQDMODE= 0
##$DR= 18
##$DS= 0
##$DSLIST= <SSSSSSSSSSSSSSS>
##$DSPFIRM= 0
$$ [...]
##$SUBNAM2= <"">
##$SUBNAM3= <"">
##$SUBNAM4= <"">
##$SUBNAM5= <"">
##$SUBNAM6= <"">
##$SUBNAM7= <"">
##$SUBNAM8= <"">
##$SUBNAM9= <"">
##$SW= 24.9337058887773
##$SWIBOX= (0..15)
0 0 2 0 0 0 0 0 0 0 0 0 0 0 0 0 
##$SW_h= 4990.01996007984
##$TD= 16384
##$TD0= 1
##$TE= 0
##$TE2= 300
##$TE3= 300
##$TEG= 300
##$TL= (0..7)
0 120 120 120 120 120 120 120 
##$TP= (0..7)
150 150 150 150 150 150 150 150 
##$TP07= 0
##$TPNAME0= <>
##$TPNAME1= <>
##$TPNAME2= <>
##$TPNAME3= <>
##$TPNAME4= <>
##$TPNAME5= <>
##$TPNAME6= <>
##$TPNAME7= <>
##$TPOAL= (0..7)
0.5 0.5 0.5 0.5 0.5 0.5 0.5 0.5 
##$TPOFFS= (0..7)
0 0 0 0 0 0 0 0 
##$TUNHIN= 0
##$TUNHOUT= 0
##$TUNXOUT= 0
##$USERA1= <user>
##$USERA2= <user>
##$USERA3= <user>
##$USERA4= <user>
##$USERA5= <user>
##$V9= 5
##$VALIST= <valist>
##$VCLIST= <CCCCCCCCCCCCCCC>
##$VD= 0
##$VDLIST= <DDDDDDDDDDDDDDD>
##$VPLIST= <PPPPPPPPPPPPPPP>
##$VTLIST= <TTTTTTTTTTTTTTT>
##$WBST= 1024
##$WBSW= 4
##$XGAIN= (0..3)
0 0 0 0 
##$XL= 0
##$YL= 0
##$YMAX_a= 557133
##$YMIN_a= -365779
##$ZGOPTNS= <>
##$ZL1= 120
##$ZL2= 120
##$ZL3= 120
##$ZL4= 120
##$ABSF1= 10
##$ABSF2= 0
##$ABSG= 5
##$ABSL= 3
##$ALPHA= 0
##$AQORDER= 0
##$ASSFAC= 0
##$ASSFACI= 0
##$ASSFACX= 0
##$ASSWID= 0
##$AUNMP= <proc_1d>
##$AZFE= 0.1
##$AZFW= 0.1
##$BCFW= 1
##$BC_mod= 2
##$BYTORDP= 1
##$COROFFS= 0
##$CY= 11.3945322036743
##$DATMOD= 1
##$DC= 2
##$DFILT= <>
##$DTYPP= 0
##$F1P= 16.9975609425685
##$F2P= -3.02152046262296
##$FCOR= 0.5
##$FTSIZE= 0
##$FT_mod= 4
##$GAMMA= 1
##$GB= 0.15
##$INTBC= 1
##$INTSCL= 1
##$ISEN= 128
##$LB= 0.24
##$LEV0= 0
##$LPBIN= 0
##$MAXI= 10000
##$MC2= 0
##$MEAN= 0
##$ME_mod= 0
##$MI= 1.114404
##$NCOEF= 0
##$NC_proc= 0
##$NLEV= 6
##$NOISF1= 3.799351
##$NOISF2= 2.8
##$NSP= 1
##$NTH_PI= 0
##$NZP= 0
##$OFFSET= 15.70392
##$PC= 1
##$PHC0= -9800.273
##$PHC1= 23.00087
##$PH_mod= 1
##$PKNL= yes
##$PPARMOD= 0
##$PSCAL= 0
##$PSIGN= 0
##$REVERSE= no
##$SF= 200.130013532006
##$SI= 16384
##$SIGF1= 3
##$SIGF2= 2
##$SINO= 400
##$SIOLD= 16384
##$SREGLST= <1H.CDCl3>
##$SSB= 0
##$STSI= 0
##$STSR= 0
##$SW_p= 3612.71676300578
##$SYMM= 0
##$S_DEV= 0
##$TDeff= 0
##$TDoff= 0
##$TI= <>
##$TILT= no
##$TM1= 0
##$TM2= 0
##$TOPLEV= 0
##$USERP1= <user>
##$USERP2= <user>
##$USERP3= <user>
##$USERP4= <user>
##$USERP5= <user>
##$WDW= 1
##$XDIM= 8192
##$YMAX_p= 0
##$YMIN_p= 0
$$ End of Bruker specific parameters
$$ ---------------------------------
##NTUPLES= NMR FID
##VAR_NAME=  TIME,          FID/REAL,        FID/IMAG
##SYMBOL=    X,             R,               I
##VAR_TYPE=  INDEPENDENT,   DEPENDENT,       DEPENDENT
##VAR_FORM=  AFFN,          ASDF,            ASDF
##VAR_DIM=   8192,          8192,            8192
##UNITS=     SECONDS,       ARBITRARY UNITS, ARBITRARY UNITS
##FACTOR=    0.0002004,     1,               1
##FIRST=     0,             0,               0
##LAST=      1.6414764,     0,               0
##MIN=       0,             -365779,         0
##MAX=       1.6414764,     557133,          0
$$ Real data points
##PAGE= N=1
##DATA TABLE= (X++(R..R)), XYDATA
$$ plain form
0 0 0 0 0 0 0 8 0 8 -8 8 -16 16 -24 29 -32 40 -51 56 -68 84 -96 111 -132 150 -173 201 -228 259 -297 331
30 331 -376 425 -476 530 -595 664 -737 822 -910 1010 -1120 1237 -1372 1521 -1679 1864
46 1864 -2073 2303 -2570 2877 -3237 3665 -4187 4832 -5664 6773 -8338 10731 -14856 23871
60 23871 -84457 236429 419692 -66996 -325497 -136993 99178 -31 -68556 84353 153846
71 153846 -140553 -365779 -125317 274747 229233 -147934 -293820 -70228 101906 48762
81 48762 2112 73461 31178 -154746 -170980 96775 254376 26900 -268730 -199182 94104
92 94104 178977 16193 -86841 -52698 -53294 -80724 42612 222649 149757 -156537 -280398
103 -280398 -43977 201781 137320 -56448 -86626 -36615 -95591 -124292 62972 244422 86973
$$ packed form
0@%%%%%QqQj6J6k4L2m0N3o1P2r1J07j24J52j80K07k43K82l23L74m29M87n56O28
30C31p07Q01r01J006j125J259j401J559j732J920k130K357k609K893l200L543
46A864l937M376m873N447o114O902p852R019j0496J2437j5111J9069k5587L8727
60B3871j08328L20886J83263m86688k58501J88504K36171r9209o8525J52909O9493
71A53846k94399k25226K40462M00064m5514l77167j45886K23592J72134n3144
81D8762m6650P1349m2283j85924j6234K67755J57601k27476k95630O9548K93286
92I4104Q4873j62784j03034L4143n96k7430J23336J80037p2892l06294j23861
103b80398K36421K45758o4461j93768l0178N0011n8976k8701J87264J81450j57449
$$ plain form
114 86973 -240411 -255622 79120 271451 63947 -193233 -141293 45054 40615 -75509 -45259
125 -45259 58811 -9556 -172689 -133481 93270 165161 -35117 -205462 -109022 73774 76234
136 76234 -43519 -81544 -51838 -79744 -111089 -22787 88013 22139 -166415 -211433 -37086
147 -37086 123896 77336 -75622 -140950 -103251 -55180 -10916 35037 15976 -95570 -178196
158 -178196 -120530 3352 41209 -21560 -79201 -81941 -72277 -59926 -8286 40202 -12859 -132911
170 -132911 -147969 -14835 79978 -6193 -154010 -159238 -28797 54176 7228 -65750 -71333 -52706
182 -52706 -59284 -38821 33260 56810 -39839 -151029 -126961 6821 83042 21740 -85119 -116670
194 -116670 -68661 -7897 34629 50574 12948 -72157 -116656 -49624 67848 98830 -299 -117352
$$ packed form
114H6973l27384j5211L34742J92331k07504k57180N1940J86347m439j16124L0250
125d5259J04070o8367j63133L9208K26751P1891k00278j70345R6440J82796K460
136G6234j19753l8025K9706k7906l1345Q8302J10800o5874j88554m5018J74347
147c7086J60982m6560j52958o5328L7699M8071M4264M5953j9061j11546q2626
158a78196N7666J23882L7857o2769n7641k740R664J2351N1640M8488n3061j20052
170a32911j5058J33134R4813q6171j47817n228J30441Q2973m6948p2978n583J8627
182e2706o578K0463P2081K3550r6649j11190K4068J33782P6221o1302j06859l1551
194a16670M8009O0764M2526J5945l7626q5105m4499O7032J17472L0982r9129j17053
$$ plain form
206 -117352 -119618 -13562 69965 45742 -31471 -66255 -40664 -171 24548 32639 22294 -16758
218 -16758 -58533 -46262 28746 81571 30696 -76447 -112431 -32721 73080 95770 20401 -71931
230 -71931 -93292 -28134 64088 103574 52600 -48646 -104369 -58492 36700 83242 47444 -28267
242 -28267 -82249 -75077 -7283 72597 87979 12041 -82762 -90357 1474 85172 69253 -13000
254 -13000 -70249 -68533 -28370 28700 64740 27604 -67120 -112495 -33162 87378 94714 -19397
266 -19397 -103707 -60254 26675 44408 10621 -6133 -22051 -69606 -86545 -4434 99448 75515
278 75515 -69931 -152911 -63743 77855 102321 15049 -60205 -74385 -57551 -16531 48099 71672
290 71672 -4138 -110618 -112140 1290 86742 48077 -38608 -63854 -35089 -11055 10977 43813
$$ packed form
206a17352k266J06056Q3527k4223p7213l4784K5591M0493K4719Q091j0345l9052
218a6758m1775J2271P5008N2825n0875j07143l5984P9710J05801K2690p5369r2332
230g1931k1361O5158R2222L9486n0974j01246n5723M5877R5192M6542l5798p5711
242b8267n3982P172O7794P9880J5382p5938r4803p595R1831Q3698j5919q2253
254a3000n7249J716M0163N7070L6040l7136r4724m5375P9333J20540P336j14111
266a9397q4310M3453Q6929J7733l3787j6754j5918m7555j6939Q2111J03882k3933
278G5515j45446q2980Q9168J41598K4466q7272p5254j4180J6834M1020O4630K3573
290G1672p5810j06480j522J13430Q5452l8665q6685k5246K8765K4034K2032L2836
$$ plain form
302 43813 35273 -42133 -101047 -49093 56484 76946 -11484 -87394 -63873 5149 38605 35665
314 35665 19175 -23269 -72764 -50313 46971 99268 23277 -87615 -90639 2578 60325 31416
326 31416 -6571 -8391 -22301 -55449 -26267 72128 106012 3395 -108928 -78602 46855 97128
338 97128 27631 -44478 -40724 -12344 -7240 11485 52483 42662 -35083 -73286 -2510 82203 61893
351 61893 -26052 -55809 -6721 30676 17186 5855 17844 620 -46841 -39646 42473 88992
363 88992 24470 -65042 -59306 21071 67371 40786 -2183 -21864 -32320 -29254 15800 67376
375 67376 44466 -40864 -74858 -10884 60197 51064 -203 -17706 -6309 -10431 -13876 22970 58485
388 58485 19316 -60874 -65524 21450 77743 28625 -44880 -44603 7679 32333 20640 13160 8297
$$ packed form
302D3813q540p7406n8914N1954J05577K0462q8430p5910K3521O9022L3456k940
314C5665j6490m2444m9495K2451R7284N2297p5991j10892l024R3217N7747k8909
326C1416l7987j820j3910l3148K9182R8395L3884j02617j12323L0326J25457N0273
338I7128o9497p2109L754K8380N104J8725M0998r821p7745l8203P0776Q4713k0310
351F1893q7945k9757M9088L7397j3490j1331J1989j7224m7461P195Q2119M6519
363H8992o4522q9512N736Q0377M6300k6585m2969j9681j0456L066M5054N1576
375F7376k2910q5330l3994O3974P1081r133n1267j7503J1397m122l445L6846L5515
388E8485l9169q0190m650Q6974N6293m9118p3505K77N2282K4654j1693p480m863
$$ plain form
401 8297 -19088 -40487 -3956 58144 52197 -26740 -71943 -25894 40164 46529 10301 -11564 -15060
414 -15060 -23196 -16500 27748 65582 30156 -50481 -71946 -3797 63335 50389 -9300 -43017
426 -43017 -32130 -3523 24391 41762 27310 -19512 -50105 -18401 42181 54617 6279 -37428
438 -37428 -31338 -1608 17071 24306 21940 -3356 -39219 -37535 18194 67047 41775 -31959 -62530
451 -62530 -16859 41223 49995 16865 -20036 -39831 -32251 5263 49127 50269 -4004 -57203 -45219
464 -45219 18742 59780 38467 -8013 -33888 -30704 -7994 25807 46141 23541 -30404 -58809
476 -58809 -21299 43886 61519 12159 -42224 -42785 -329 36921 40581 13367 -23289 -39321 -18109
489 -18109 24727 47004 22814 -25747 -46635 -17205 29214 46527 25661 -12888 -38436 -28757
$$ packed form
401H297k7385k1399L6531O2100n947p8937m5203M6049O6058O365l6228k1865l496
414a5060q136O696M4248L7834l5426q0637k1465O8149O7132j2946n9689l3717
426d3017J0887K8607K7914J7371j4452m6822l0593L1704O0582J2436m8338m3707
438c7428O090K9730J8679P235k366k5296l5863J684N5729M8853k5272p3734l0571
451f2530M5671N8082Q772l3130l6901j9795P580L7514M3864J142n4273n3199J1984
464d5219O3961M1038k1313m6480k5875L184K2710L3801K0334k2600n3945k8405
476e8809L7510O5185J7633m9360n4383n61M2456L7250L660k7214l6656j6032K1212
489a8109M2836K2277k4190m8561k0888K9430M6419J7313k0866l8549k5548R679
$$ plain form
501 -28757 13141 50969 43898 -7407 -52465 -42062 14909 57264 41391 -9532 -41568 -30233
513 -30233 8222 41920 43675 10612 -29182 -37766 -5109 37843 47018 11575 -29345 -34259 -3904
526 -3904 29329 39151 20020 -13466 -32521 -14958 27376 51073 27501 -21985 -43131 -10785
538 -10785 36421 46427 13827 -21339 -28752 -9224 20846 39186 29362 -3606 -32013 -24518 16151
551 16151 47999 34538 -7839 -34233 -22817 9716 35104 33502 5546 -27260 -31551 393
563 393 38772 42493 5419 -32111 -28239 7709 33236 26716 1657 -18654 -21983 -4923 19799
576 19799 30246 12829 -18619 -30179 -5987 27872 33089 6763 -20239 -25101 -7999 16833
588 16833 30449 16561 -16871 -36615 -17793 22555 39925 14343 -23588 -31874 -7651 18580
$$ packed form
501b8757M1898L7828p071n1305m5058J0403N6971M2355j5873n0923l2036J1335
513c0233L8455L3698J755l3063l9794q584L2657M2952R175l5443m0920m914L0355
526c904L3233R822j9131l3486j9055J7563M2334K3697k3572m9486k1146L2346
538a0785M7206J0006l2600l5166p413J9528L0070J8340r824l2968k8407P495M0669
551A6151L1848j3461m2377k6394J1416L2533K5388j602k7956l2806m291L1944
563C93L8379L721l7074l7530L872L5948K5527o520k5059k0311l329J7060K4722
576A9799J0447j7417l1448j1560K4192L3859N217k6326k7002m862J7102K4832
588A6833J3616j3888l3432j9744J8822M0348J7370k5582l7931q286K4223K6231
$$ plain form
600 18580 25553 14246 -7104 -25143 -22297 4562 29303 25395 -6962 -32204 -21741 11019 30132
613 30132 19051 -5507 -21570 -18816 2105 25129 27218 724 -27843 -26006 5778 33521 24400
626 24400 -7360 -25648 -14830 7793 23080 23808 7371 -16546 -24894 -3859 27615 35238 8727
639 8727 -23427 -26876 -259 27142 31001 13008 -12438 -25306 -9428 22894 39665 20334 -14886
652 -14886 -28769 -6918 25242 34783 15070 -10286 -19268 -8116 13611 31682 26448 -1028 -24373
665 -24373 -16505 15738 38514 26694 -5997 -24512 -12718 13283 31367 27536 3101 -22693
677 -22693 -22935 7216 37155 34199 1060 -26548 -21304 8171 31311 28405 6300 -17369 -24036
690 -24036 -5878 24302 35606 13966 -19373 -30217 -7053 25246 34828 12918 -16460 -26331
$$ packed form
600A8580O973j1307k1350j8039K846K6859K4741l908l2357k5242J0463L2760J9113
613C0132j1081k4558j6063K754K0921K3024K089k6494k8567J837L1784K7743r121
626B4400l1760j8288J0818K2623J5287P28j6437k3917q348K1035L1474P623k6511
639H727l2154l449K6617K7401L859j7993k5446j2868J5878L2322J6771j9331l5220
652a4886j3883K1851L2160R541j9713k5356q982J1152K1727J8071n234k7476k3345
665b4373P868L2243K2776j1820l2691j8515J1794K6001J8084l831k4435k5794
677b2693k42L0151K9939k956l3139k7608N244K9475K3140k906k2105k3669o667
690b4036J8158L0180J1304k1640l3339j0844K3164L2299R582k1910k9378r871
$$ plain form
702 -26331 -10490 15754 31098 18957 -12475 -31586 -16478 17010 33145 16717 -13411 -27871
714 -27871 -14333 10807 26153 19699 -4297 -27058 -24724 4142 30236 24982 -5781 -30045 -25083
727 -25083 3428 26977 24297 -425 -24638 -26516 -3793 23691 28747 4069 -25474 -29116 -5303
740 -5303 21996 26289 5695 -19240 -25221 -8645 15116 26511 14163 -13637 -29211 -14208 15967
753 15967 29596 13399 -13997 -26292 -12759 12431 25535 16028 -7380 -24815 -17249 9694
765 9694 28491 19191 -7337 -24332 -15988 7645 24653 19816 -2533 -20823 -18529 2374 23743
778 23743 24310 2547 -21118 -21505 1724 23644 23957 2966 -18476 -19932 -1310 19093 23276 7456
792 7456 -15251 -22106 -5067 19302 24622 7007 -14501 -19827 -5605 14690 21947 9877 -10821
$$ packed form
702b6331J5841K6244J5344j2141l1432j9111J5108L3488J6135j6428l0128j4460
714b7871J3538K5140J5346o454k3996k2761K334K8866K6094n254l0763k4264M962
727b5083K8511K3549k680k4722k4213j878K2723K7484N056k4678k9543l642K3813
740e303K7299M293k0594k4935n981J6576K3761J1395j2348k7800j5574J5003L0175
753A5967J3629j6197k7396j2295J3533K5190J3104r507k3408j7435P566K6943
765I694J8797r300k6528j6995Q344K3633J7008m837k2349j8290K294K0903K1369
778B3743N67k1763k3665l87K3229K1920L13k0991k1442j456J8622K0403M183j5820
792G456k2707o855J7039K4369N320j7615k1508n326J4222K0295P257j2070k0698
$$ plain form
805 -10821 -21432 -10854 12099 23984 11703 -11894 -22739 -10825 10827 22007 11893 -9696
817 -9696 -22180 -13303 7679 20409 13585 -7284 -23337 -16954 5289 20286 13879 -6576 -21216
830 -21216 -16976 1929 17704 15131 -3064 -20848 -20835 -1745 17938 16779 -3596 -21112 -20349 -2735
844 -2735 15320 16303 -517 -19616 -21864 -5360 13858 17933 1394 -19239 -23173 -7580 12009
857 12009 17203 3218 -17059 -23966 -9995 10858 18323 6228 -14614 -24679 -13084 9696 19632
870 19632 7696 -14186 -24523 -14413 6779 19002 10162 -10791 -23859 -16657 4454 19602
882 19602 12966 -9213 -23787 -17509 2259 17641 14664 -5448 -22846 -20253 -233 17539 16515
895 16515 -2304 -21640 -21887 -2726 17024 17426 -129 -20214 -22860 -5335 15194 17904 1792
$$ packed form
805a0821j0611J0578K2953J1885j2281k3597j0845J1914K1652J1180j0114k1589
817i696j2484Q877K0982J2730o824k0869j6053O383K2243J4997o407k0455j4640
830b1216M240J8905J5775k573j8195j7784J3J9090J9683j159k0375j7516P63J7614
844b735J8055R83j6820j9099k248J6504J9218M075j6539k0633l934J5593J9589
857A2009N194j3985k0277o907J3971K0853P465j2095k0842j0065J1595K2780R936
870A9632j1936k1882j0337J0110K1192J2223q840k0953j3068P202K1111J5148
882A9602o636k2179j4574O278J9768J5382k977k0112j7398K593K0020J7772j024
895A6515j8819j9336k47J9161J9750M02j7555k0085k646J7525K0529K710j6112
$$ plain form
908 1792 -17972 -23451 -8907 13021 19802 4669 -16829 -23900 -10448 10584 19484 7602 -14439
921 -14439 -24480 -13875 8317 19687 9852 -12121 -24635 -15702 5560 18893 11912 -8899 -24103
934 -24103 -18227 3015 18277 12973 -6485 -23022 -20213 -701 17138 15203 -3948 -21204 -21027
947 -21027 -2705 15724 16201 -1331 -19834 -21544 -5736 13723 17098 866 -18862 -22491 -7696
960 -7696 11770 17319 3964 -16357 -22792 -9350 10154 17264 6002 -13629 -23108 -12035 7813
973 7813 17724 8069 -11078 -22405 -13979 6288 17815 10092 -8351 -20767 -15291 2875 16717
986 16717 11966 -6319 -20246 -16232 1336 15561 12839 -4017 -18824 -16569 -723 14223 14359
999 14359 -969 -17452 -17691 -1960 13162 14812 149 -16197 -18421 -3811 12380 14776 2310
$$ packed form
908A792j9764n479J4544K1928O781j5133k1498p071J3452K1032Q900j1882k2041
921a4439j0041J0605K2192J1370r835k1973j2514Q933K1262J3333o981k0811j5204
934b4103N876K1242J5262n304j9458j6537K809J9512J7839j935j9151j7256J77
947b1027J8322J8429M77j7532j8503j710J5808J9459L375j6232j9728l629J4795
960g696J9466N549j3355k0321o435J3442J9504P110j1262j9631r479J1073J9848
973G813R911r655j9147j1327Q426K0267J1527p723j8443j2416N476J8166J3842
986A6717m751j8285j3927M014J7568J4225k722j6856j4807K255J5846J4946J36
999A4359j5328j6483k39J5731J5122J650j4663j6346k224J4610J6191K396j2466
$$ plain form
1012 2310 -13885 -18322 -6166 11138 16290 4486 -12845 -18894 -7921 9435 15707 5449 -11260
1025 -11260 -18157 -9598 6932 15931 8176 -9187 -18390 -10815 5661 15281 8900 -7746 -17644 -11741
1039 -11741 4161 14104 9665 -5123 -17205 -13291 2402 14475 11139 -4044 -16882 -14190 1009
1052 1009 13648 11598 -2753 -15307 -15211 -1417 13060 13550 -854 -15201 -15732 -2155 12693 14369
1066 14369 937 -13533 -16079 -3767 10523 14696 3860 -11823 -17147 -5497 10109 15916 5685
1079 5685 -10778 -16303 -6193 9044 15202 6659 -7778 -16195 -8834 7419 16366 8301 -7096
1092 -7096 -15890 -9172 6316 16115 10114 -5335 -14841 -10393 4363 15933 12811 -3162 -15755
1105 -15755 -11806 3397 15772 13461 -1538 -14140 -12394 1614 14479 14844 2251 -12697 -14479
$$ packed form
1012B310j6195m437J2156J7304N152j1804j7331o049J0973J7356O272j0258j6709
1025a1260o897Q559J6530Q999p755j7363r203P575J6476R620o381j6646r898N903
1039a1741J5902R943m439j4788j2082L914J5693J2073l336j5183j2838K692J5199
1052A009J2639k050j4351j2554R6J3794J4477M90j4404j4347n31J3577J4848J676
1066A4369j3432j4470k546J2312J4290M173j0836j5683n324J1650J5606N807j0231
1079E685j6463n525J0110J5237O158q543j4437q417P361J6253Q947q065j5397
1092g096q794O718J5488R799o001j5449r506M448J4756J1570l122j5973j2593
1105a5755L949J5203J2375k311j4999j2602J746J4008J2865L65j2593j4948j782
$$ plain form
1118 -14479 -870 14201 15778 2649 -11907 -14509 -2588 12162 15512 5001 -9630 -14149 -4673
1131 -4673 10754 16903 6268 -9294 -15337 -5917 9139 15958 7605 -7675 -15283 -7719 7112
1144 7112 16294 10130 -5592 -16072 -9856 6188 15618 10456 -4689 -15543 -11339 2824 14139
1157 14139 11247 -2324 -14504 -13160 955 14161 12694 -1195 -13647 -13397 -890 11979 13021
1170 13021 775 -12314 -14915 -3642 10437 13958 2770 -11521 -14838 -3864 9837 13213 3637
1183 3637 -9804 -14593 -5590 7607 13418 5748 -8452 -15858 -7428 7260 14161 6778 -6829 -14390
1197 -14390 -8413 5219 13594 8517 -4805 -14147 -10559 2951 13408 9767 -4059 -13422 -10285
1210 -10285 2159 12424 10525 -1024 -11979 -10784 175 11388 11508 463 -11687 -11881 -688
$$ packed form
1118a4479J3609J5071J577j3129j4556k602J1921J4750L350j0511j4631m519R476
1131d673J5427O149j0635j5562o043R420J5056O819q353j5280p608P564J4831
1144G112R182o164j5722j0480O216J6044R430n162j5145j0854M204J4163J1315
1157A4139k892j3571j2180J344J4115J3206j467j3889j2452K50J2507J2869J042
1170A3021j2246j3089k601J1273J4079L521j1188j4291l317J0974J3701L376r576
1183C637j3441m789R003J3197N811p670j4200p406Q430J4688O901p383j3607p561
1197a4390N977J3632Q375n077j3322r342L588J3510J0457l641j3826r363L137
1210a0285J2444J0265j899j1549j0955J195J0959J1213J20j1045j2150j94J1193
$$ plain form
1223 -688 10359 11564 1544 -9535 -11175 -1577 9913 12370 3321 -8696 -12656 -3414 9206 13159
1237 13159 3450 -8367 -11944 -4294 8039 12682 5838 -6336 -11752 -5580 6024 13550 7873 -5371
1251 -5371 -12284 -6566 5092 12173 7630 -4051 -11297 -7686 3622 11686 9201 -2180 -11454 -9003
1265 -9003 3359 11646 8587 -1996 -10451 -9174 951 10191 9439 -562 -10438 -10250 -388 10559
1279 10559 10806 119 -10288 -10624 -1244 8960 10723 1935 -9569 -11771 -3124 7649 11358 3454
1293 3454 -8590 -12403 -3779 7709 11194 4009 -7251 -11594 -5894 5259 10786 5468 -5859 -12466
1307 -12466 -7055 4741 11462 5805 -5266 -11340 -7325 3442 10923 7544 -3719 -11629 -8913 2021
1321 2021 11090 8490 -3200 -11588 -8698 1617 9933 8898 -644 -10340 -10033 17 9873 10452 905
$$ packed form
1223f88J1047J205j0020j1079j640R598J1490K457r049j2017l960R242J2620L953
1237A3159r709j1817l577P650J2333M643o844j2174n416O172J1604P526n677j3244
1251e371o913N718J1658P081m543j1681p246L611J1308Q064k485j1381r274K451
1265i003J2362Q287l059j0583q455J277J0125R240p52j0001r876J88R862J0947
1279A0559K47j0687j0407l36R380J0204J763q788j1504k202Q647J0773L709p904
1293C454j2044l813Q624J1488L485p185j1260m343N700J1153N527n318j1327o607
1307a2466N411J1796O721n657j1071o074M015J0767P481l379j1263p910K716J0934
1321B021R069k600j1690q388K890J0315Q316j035r542r696L07J0050R856N79r547
$$ plain form
1336 905 -9824 -11695 -1435 9423 10580 1935 -8124 -10428 -3190 7891 11705 4288 -7284 -11484
1350 -11484 -3813 7470 11727 4537 -6206 -10345 -4438 5719 10895 6637 -4017 -10361 -5720 5243
1364 5243 11885 7705 -3335 -10838 -6610 4172 11351 7865 -1976 -9821 -7898 2715 11205 9745
1378 9745 -71 -9654 -8569 1490 10916 9847 418 -8085 -8638 -598 8994 10802 2737 -7341 -9407
1393 -9407 -1515 8760 11539 3799 -6636 -9086 -2484 7348 10722 4725 -5689 -10146 -3430 6947
1407 6947 10790 5290 -4535 -9323 -4311 5973 10872 6206 -3243 -8867 -5979 3466 10527 7618 -2593
1422 -2593 -9552 -7206 2978 10508 8040 -1401 -8120 -6662 1365 9298 8980 97 -8671 -8141 697
1437 697 8641 8442 710 -7222 -8058 -533 7494 8934 2380 -6366 -8600 -2142 7440 9170 2765 -5878
$$ packed form
1336I05j0729j871J0260J0858J157q645j0059k304P238J1081L814p417j1572m200
1350a1484P671J1283M257p190j0743m139N907J0157N176m258j0654o344M641J0963
1364E243O642m180j1040p503M228J0782P179l486r841p845J923J0613Q490j460
1378I745r816r583J085J0059R426j069r429q503n53Q040R592J808q065j0078k066
1393i407P892J0275K779p740j0435k450O602R832L374n997j0414m457O716J0377
1407F947L843n500r825m788N012J0284M899m666r449n624K888R445P061k909j0211
1422b593o959K346J0184P530k468r441o719J458Q027P933l18q883q768N30Q838
1437F97P944j99p732p932q36P525Q027J440o554q746k234O458R582J730o405q643
$$ plain form
1453 -5878 -8942 -2727 6354 9370 3105 -5644 -8413 -3658 4959 9638 4805 -4764 -9030 -4358 4695
1468 4695 9365 5247 -3625 -8689 -5220 2985 8373 6439 -1543 -8708 -6542 2498 9320 6767 -1173
1483 -1173 -7919 -6804 1530 8357 6950 -348 -7132 -6880 236 8246 7843 634 -6659 -7049 148 7501
1499 7501 8699 1501 -5961 -7078 -1087 6180 8878 3092 -5581 -7794 -2077 6870 9213 3553 -4559
1514 -4559 -7892 -2497 5436 8842 5024 -3380 -7834 -4009 4895 9400 5462 -2661 -7059 -4581 3605
1529 3605 9097 6410 -1736 -7213 -5160 2344 8767 7265 -651 -7380 -5948 1868 8613 7226 -212
1544 -212 -6704 -5815 1221 7671 8001 1169 -6407 -7464 4 7760 7967 1581 -5566 -7176 -1461 6326
1560 6326 8596 3300 -4856 -7841 -2901 5859 8890 3483 -4591 -8092 -3510 4455 8158 4210 -3778
$$ packed form
1453e878l064O215R081L016o265q749k769M755Q617M679m833r569m266M672R053
1468D695M670m118q872n064L469Q205N388j934p982p165K166R040O822k553p940
1483a173o746J115Q334O827j407p298o784K52P116Q010m03p209p293l90P197P353
1499G501J198p198p462j117N991P267K698n786q673k213N717Q947K343n660q112
1514d559l333N395P933L406l818q404m454L825Q904M505l938q123m398K478Q186
1529C605N492k687q146n477K053P504O423j502p916o729J432P816O745j387p438
1544b12o492Q89P036O450L30o832p576j057P468P756K07o386p147j610N715P787
1560F326K270n296q156k985M940Q760L031n407q074l501M582P965L703l948p988
$$ plain form
1575 -3778 -8084 -4107 3232 8168 5357 -3104 -7933 -5140 2812 7853 5137 -2343 -7643 -5770 1615
1590 1615 6972 6133 -921 -7350 -7011 1033 7687 6556 -326 -6839 -7006 -534 6710 7111 774 -6142
1606 -6142 -7547 -1577 5972 7441 1667 -5605 -7216 -2433 4872 7784 2962 -4659 -7976 -3247 3956
1621 3956 7490 3601 -3875 -7824 -3663 3676 7486 4058 -3208 -7107 -4070 2789 7317 4821 -2144
1636 -2144 -7135 -5160 2035 7469 5264 -1656 -6223 -5174 1087 6655 6457 -248 -6366 -5879 318
1651 318 6547 6594 560 -6272 -5951 -286 5811 6672 1401 -4879 -6131 -884 5263 6946 2723 -3867
1667 -3867 -6625 -1767 4841 7038 2694 -3436 -6062 -2583 4126 7101 3507 -2990 -6284 -3305 3826
1682 3826 7466 4162 -2384 -6200 -3655 2501 6673 4884 -1995 -6155 -4421 2229 6926 5403 -567
$$ packed form
1575c778m306L977P339M936k811q461m829K793P952N041k716p480n300J873P385
1590A615N357q39p054o429L39Q044O654j131o882o513j67O472P244M01o337o916
1606f142j405N970P549J469n774p272j611M783P305K912m822p621l317M729P203
1621C956L534l889p476l949M161P339L810l428p266l899L037O859M528k496o965
1636b144m991J975P195N434k205o920m567J049O261N568j98o705o118M87O197
1651C18O229M7o034o832L21N665O097Q61n271o280j252N247O147J683m223o590
1667c867k758M858O608K197m344o130k626L479O709K975l594o497l294K979P131
1682C826L640l304o546l816K545O156M172j789o879m160J734O650M697j523n970
$$ plain form
1697 -567 -5994 -4913 1435 6095 5113 -98 -5737 -5499 495 5936 5891 286 -5133 -5885 -374 5320
1713 5320 6066 747 -4760 -5656 -1054 4668 6150 1924 -4620 -6135 -1724 4505 6297 2483 -4090
1728 -4090 -6124 -2347 4029 6105 3029 -3307 -6543 -3504 3059 6067 3664 -2880 -6758 -3858 2399
1743 2399 6189 3803 -2146 -6277 -4544 1266 5808 4536 -1046 -5855 -4871 347 5874 4897 -601
1758 -601 -5767 -5419 127 5125 5777 550 -5309 -5720 -371 4638 5588 847 -4783 -5728 -1194 4671
1774 4671 5869 1729 -3629 -6073 -1983 4127 6359 2171 -3681 -5852 -3013 3507 6487 3344 -2789
1789 -2789 -5648 -2873 2573 6459 4308 -2154 -5790 -3408 2408 6181 4696 -1443 -5515 -4027 1968
1804 1968 5956 4840 -390 -5207 -4378 1245 6019 5629 245 -4956 -4683 383 5528 5644 788 -4225
$$ packed form
1697e67n427J081O348M660r82n211n639K38N994N441m5n605n419p52N511N694
1713E320P46n319n507q96M602N722J482m226o544j515M411O229J792l814o573
1728d090k034L777O376K076l076o336l236L039O563L008k403o544l878K900O257
1743B399L790k386n949m131J733N810M542j272n582m809R84N218N527r77n498
1758f01n166L48N546M998O52n227n859m11N349N009R50m741n630r45M534N865
1774D671J198m140n358k444M090O110K232m188n852k171K839O520K980l143o133
1789b789k859K775N446L886k151o462l636K382N816L773j485o139m072J488N995
1804A968L988j116n230m817Q29N623M774l90n384n201K73N066N145J16m856n013
$$ plain form
1820 -4225 -4838 -654 5211 6074 1653 -3653 -5022 -787 4847 6456 2575 -3495 -5040 -1464 3877
1835 3877 6279 3361 -2731 -5403 -2465 3189 6107 3622 -1936 -5205 -2639 2951 5716 4389 -1138
1850 -1138 -5347 -3608 2094 5704 4355 -1116 -5204 -4314 910 5585 4441 -421 -4810 -4498 208
1865 208 4877 5073 -305 -4789 -4817 -140 4540 5183 525 -4523 -5242 -861 3676 5091 1065 -4281
1881 -4281 -5656 -1604 3470 4924 1412 -3739 -5684 -2530 2648 4842 1685 -3137 -5487 -2846 2304
1896 2304 4994 2389 -2752 -5607 -3574 1654 4759 2928 -2079 -5453 -3652 1048 4439 3394 -1616
1911 -1616 -5444 -4172 589 4507 3782 -962 -4883 -4745 223 4033 3913 -80 -4386 -5082 -803 4211
1927 4211 4460 276 -4028 -4711 -870 3818 4759 850 -3373 -4935 -1549 3188 5079 1862 -3218 -4726
$$ packed form
1820d225o13M184N865Q63m421n306j369M235N634J609l881o070j545L576N341
1835C877K402k918o092k672K938N654K918k485n558l269K566N590K765j327n527
1850a138m209J739N702L610j349n471m088Q90N224M675j144m862m389L12M706
1865B08M669J96n378m484k8M677M680O43m658n048p19M381M537J415m026n346
1881d281j375M052N074J454l512n151j945L154N178K194l157m822k350K641N150
1896B304K690k605n141k855K033N228L105j831n007l374J801M700L391j045n010
1911a616l828J272M761L918p25m744l921J38M968L810j20l993m306o96M279N014
1927D211K49m184m304o83L841M688R41l909m223j562L386M737J891l217n080j508
$$ plain form
1943 -4726 -1833 3177 4971 2011 -2563 -4678 -2157 2559 5225 2884 -1709 -5047 -2620 2302 5074
1958 5074 3352 -1533 -4340 -3309 1724 4903 3794 -917 -4586 -3537 880 4917 4068 -511 -4110
1973 -4110 -3567 137 4344 4234 -68 -4073 -4340 -487 3557 4245 569 -4434 -4724 -1263 3299 4120
1989 4120 775 -3850 -5304 -1743 3056 4158 1375 -3421 -5123 -2598 2261 4053 1432 -3207 -5493
2004 -5493 -3411 1429 4184 1816 -2828 -5582 -3647 890 3793 2348 -2190 -5288 -4078 27 3383
2019 3383 2660 -2111 -5408 -4342 -251 3567 2783 -1241 -5098 -5013 -869 3170 2813 -557 -4872 -5097
2035 -5097 -1249 2699 3298 221 -4051 -5378 -2012 2582 3761 470 -4163 -4743 -2489 2394 4075
2050 4075 1175 -3447 -5053 -2396 2017 4118 1268 -2603 -4774 -2834 1669 3890 2380 -2224 -4678
$$ packed form
1943d726K893N010J794k960m574k115K521M716K666k341m593l338K427M922K772
1958E074j722m885k807J031N033L179j109m711l669J049M417M037q49m579l599
1973d110N43L704M207j10m302m005k67L853M044O88l676n003k90L461M562Q21
1989D120l345m625j454L561M799J102k783m796j702K525M859J792k621m639k286
2004e493K082M840K755k368m644k754J935M537K903j445m538l098J210M105L356
2019C383p23m771l297J066M091L818p84m024l857Q5M144M039l57l370m315k25
2035e097L848L948N99l077m272j327L366M594J179l291m633n80K254M883J681
2050D075k900m622j606K657M413K101k850l871k171J940M503K221j510m604k454
$$ plain form
2065 -4678 -3274 1122 4026 2928 -1345 -4388 -3423 576 4304 3105 -1073 -4081 -3340 548 3671
2080 3671 3457 -387 -3539 -3604 -95 3576 3758 351 -3568 -3567 -406 3238 4074 830 -3264 -4265 -790
2097 -790 2861 3734 1255 -2639 -3947 -1638 2391 3919 1312 -2633 -4107 -1719 1982 3759 1771
2112 1771 -2095 -4195 -2805 1310 3735 1694 -1925 -4279 -2915 659 3382 2480 -1928 -4618 -3076
2127 -3076 328 3427 2637 -1406 -4090 -3411 162 3141 2604 -765 -4133 -3903 -431 3026 2586 -170
2143 -170 -3502 -4466 -1731 2288 2894 157 -3518 -4303 -1759 2208 3418 581 -3145 -4335 -2060 1769
2159 1769 3367 678 -3046 -4104 -2042 1572 2876 1579 -2333 -4054 -2814 959 2937 1868 -1884
2174 -1884 -4172 -2968 940 3397 2326 -1075 -4115 -3349 809 3578 2468 -652 -3681 -3228 171
$$ packed form
2065d678J404M396K904j098m273l043R65L999L728j199m178l008P41L888L123
2080C671k14l844l152o5L509L671J82l407l919JL161L644Q36l244m094j001L475
2097g90L651Q73k479l894j308K309M029J528k607l945j474K388L701J777j988
2112A771l866k100J390M115K425k041l619k354J364L574K723r02m408k690J542
2127c076L404L099p90m043k684O79L573K979n37l369l368K30L472L457m40k756
2143a70l332r64K735M019O06k737l675p85K544L967J210k837l726j190K275L829
2159A769J598k689l724j058K062L614J304j297l912j721J240L773J978j069l752
2174a884k288J204L908K457j071l401l040P66M158K769j110l120l029M53L399
$$ plain form
2189 171 3264 3011 -400 -3122 -2849 246 3188 3179 679 -3116 -3094 -689 2544 3664 989 -2702 -3597
2206 -3597 -858 2736 3987 1309 -2356 -3798 -985 2611 3861 1221 -2088 -3359 -1550 2120 3565
2221 3565 2039 -1473 -3315 -2044 1585 3688 2217 -1362 -3023 -2091 1295 3667 2616 -831 -3750
2236 -3750 -2689 863 3527 2826 -644 -3634 -2559 616 3051 2680 -412 -3220 -2844 -299 2587 2964
2252 2964 139 -2718 -3138 -895 2566 3149 740 -2631 -3561 -1195 2143 3572 1210 -2439 -3677 -1473
2268 -1473 1832 3559 901 -2060 -3746 -1709 1333 2921 1443 -1881 -3333 -2019 662 2529 1512
2283 1512 -1061 -3348 -2694 517 3077 2186 -1051 -3265 -2724 658 3005 2333 -692 -3322 -2846 87
2299 87 3021 2343 -692 -2960 -2754 -117 2191 2516 376 -2729 -2911 -591 2014 3111 1167 -2370
$$ packed form
2189A71L093k53l411k722K73L095K942rk500l795K2K405L233J120k675l691q95
2206c597K739L594J251k678l665j442K813L596J250k640l309j271J809L670J445
2221C565j526l512j842J271L629K103j471l579j661R32L386K372j051l447k919
2236c750J061L552K664p01l470k990J075L175K435l71l092k808L76K545K886L77
2252B964k825k857m20K243L461N83k409l371r30K366L338J429k362l649j238K204
2268a473L305J727k658k961j686K037L042J588j478l324j452J314K681J867j017
2283A512k573k287O54L211K560q91l237k214N41L382K347o72l025k630M76K933
2299H7K934o78l035k268K06K637K308L25k140l105j82K320K605J097j944l537
$$ plain form
2315 -2370 -3514 -1182 1980 3812 1238 -2304 -3689 -940 1981 3086 1212 -1800 -3252 -1540 1471
2330 1471 3153 1038 -1424 -2839 -1701 620 2724 2136 -815 -2739 -2184 300 2787 2461 -558 -3075
2346 -3075 -2614 325 2662 2723 -556 -3304 -2700 572 3016 2501 -282 -2563 -2418 30 2426 2332 265
2363 265 -1981 -2323 -631 1843 3048 773 -1758 -3325 -1350 2176 3163 1447 -1862 -2977 -1480 1470
2379 1470 3433 1223 -1861 -3036 -1073 1457 2937 1256 -1102 -2559 -1459 912 2479 1883 -411
2394 -411 -2294 -2053 669 2740 2159 -145 -2573 -2355 227 2981 2312 -163 -2758 -2021 481 2872
2410 2872 2273 -308 -2335 -1869 -176 2243 2608 483 -1709 -2281 -69 1937 3019 1209 -1589 -2885
2426 -2885 -697 1869 3117 1427 -1788 -2948 -773 2020 3414 1537 -1391 -2859 -822 1476 2802
$$ packed form
2315b370j144K332L162J832k574l542j385K749K921J105j874l012j452J712L011
2330A471J682k115k462j415J138K321K104n88k951j924N55K484K487l26l019k517
2346c075M61K939K337O1l279k748O04L272K444n15k783k281J45K448K396r4k067
2363B65k246l42J692K474J205k275k531j567J975L526R87j716l309j115J497K950
2379A470J963k210l084j175J963K530J480j681k358j457J100K371J567n96k294
2394d11j883K41K722K071n81k304k428K18K582K754o69k475k595P37K502K391
2410B872n99k581k027M66J693K419L65k125k192n72K212K006J082j810k798j296
2426b885K188K566J248j690l215j160K175K793J394j877k928j468K037K298J326
$$ plain form
2441 2802 978 -1144 -2432 -1278 963 2565 1535 -673 -2363 -1570 576 2552 2285 -254 -2661
2456 -2661 -2501 295 2691 2240 -161 -2828 -2412 500 2534 2218 -376 -2052 -2223 44 2067 2172
2472 2172 -43 -1509 -2116 -667 1846 2301 1302 -1499 -2165 -1355 1251 3012 888 -1593 -2842 -1379
2488 -1379 1564 3072 1533 -1343 -2530 -1018 1453 2551 1419 -1131 -2400 -1327 1127 1967 1605
2503 1605 -225 -1742 -1619 445 2508 2276 145 -2260 -2152 600 2728 2568 68 -2151 -1847 281
2519 281 2842 2275 293 -1672 -2134 218 2165 2394 423 -1433 -1775 -306 1609 2490 1209 -923
2535 -923 -1783 -813 1481 2814 1725 -1051 -2418 -805 1821 3021 1495 -1146 -2481 -1030 1720 2557
2551 2557 1219 -794 -1635 -993 1146 2338 1546 -483 -1644 -1270 364 2044 2252 -456 -2209 -2334
$$ packed form
2441B802j824k122j288J154K241J602j030k208j690P93K146J976k67k539k407
2456b661J60K796K396m51k401k667M16K912K034l16k594j676j71K267K023J05
2472B172k215j466o07J449K513M55r99k801o66Q10K606J761k124k481j249J463
2488a379K943J508j539k876j187J512K471J098j132k550j269J073K454Q40l62
2503A605j830j517J23K064K063k32k131k405J08K752K128j60k500k219L04K128
2519B81K561n67j982j965m62K352J947K29j971j856l42J469J915Q81j281k132
2535i23q60R70K294J333j089k776j367J613K626J200j526k641j335J451K750Q37
2551B557j338k013q41O42K139J192p92k029j161L74J634J680K08k708j753j25
$$ plain form
2567 -2334 -18 2189 2269 -8 -2354 -2301 303 2413 2246 -40 -2268 -2094 -53 1807 1435 371 -1831
2584 -1831 -1788 -781 1102 1681 500 -918 -2053 -1353 860 1991 1146 -1239 -2781 -1665 783 2233
2600 2233 1242 -1791 -2619 -1010 1224 2134 1148 -1261 -2298 -1317 795 1692 1358 -441 -1911 -1633 227
2617 227 1475 1499 137 -1676 -1981 -204 2173 2009 106 -2224 -1713 -48 2184 2108 29 -2029 -1501
2634 -1501 407 1702 2195 251 -1164 -1670 -68 1479 1945 1190 -863 -1755 -672 1121 2562 1605
2650 1605 -570 -2094 -1024 1333 2819 1379 -995 -2136 -984 1467 2606 1619 -590 -1828 -1020
2665 -1020 1197 1956 1233 -262 -1194 -1005 294 1759 1674 285 -1783 -1764 169 1558 2346 107 -1599
2682 -1599 -2141 53 2114 2212 248 -2160 -1894 239 1616 1884 -32 -1617 -1580 -815 1530 1534 584 -1090
$$ packed form
2567b334K316K207Q0k277k346N3K604K110j67k286k228J74K041J860l72j064k202
2584a831M3J007J883N79j181j418j135P00K213J131q45k385j542J116K448J450
2600B233r91l033q28J609K234R10r86k409j037R81K112Q97l34j799j470K78J860
2617B27J248K4j362j813l05J777K377j64j903k330N11J665K232p6k079k058N28
2634a501J908J295M93j944j415n06J602J547M66p55k053q92J083J793J441r57
2650A605k175j524J070K357J486j440k374j141J152K451J139r87k209j238Q08
2665a020K217P59p23j495r32J89J299J465q5j389k068J9J933J389P88k239j706
2682a599n42K194K061R8j964k408K66K133J377K68j916j585L7P65K345Mr50j674
$$ plain form
2700 -1090 -1807 -1233 398 1571 1099 -1135 -2190 -1318 732 1941 807 -1271 -2369 -949 1027 1855
2716 1855 964 -945 -2049 -1457 517 1255 979 -536 -1988 -1624 78 1216 946 61 -1335 -2211 -637
2733 -637 1450 1735 -128 -1968 -1943 -614 1670 1820 -93 -2016 -1727 -488 1105 1729 8 -1372 -1661
2750 -1661 -506 703 1587 544 -964 -1741 -930 652 1853 1283 -689 -1789 -1317 1021 1853 1409 -497
2767 -497 -2126 -1052 1122 2014 957 -475 -1486 -1287 764 1501 1196 -278 -1422 -1306 -8 1534
2783 1534 1305 64 -1359 -1373 -179 1423 1782 816 -1457 -2079 -173 1807 2113 306 -1592 -1705 -281
2800 -281 1574 1293 192 -1164 -1276 -447 889 907 396 -582 -1692 -1131 729 1427 1043 -915 -1676 -1321
2818 -1321 281 1348 1170 -809 -2270 -1542 403 1324 912 -918 -1868 -1310 348 1229 863 -226 -1537
$$ packed form
2700a090p17N74J631J173m72k234j055Q72K050J209j134k078j098J420J976Q28
2716A855q91j909j104N92J974P38k76j515j452L64J702J138k70q85j396q76J574
2733f37K087K85j863j840K5J329K284J50j913j923K89J239J593O24j721j380k89
2750a661J155J209Q84j043j508p77Q11J582J201n70j972j100M72K338Q32m44j906
2767d97j629J074K174Q92j057j432j011J99K051P37l05j474j144J16J298J542
2783A534k29j241j423j4J194J602L59r66k273o22J906J980L06j807j898j13J424
2800b81J855k81j101j356j12Q29J336J8n11r78j110N61J860O98l84j958p61L55
2818a321J602J067j78j979j461P28J945R21m12j830r50N58J658Q81l66j089j311
$$ plain form
2835 -1537 -965 -333 988 1078 -229 -1515 -2071 -646 1152 1272 215 -1531 -1801 -982 1335 1749 162
2852 162 -1525 -1696 -463 1338 1704 256 -1318 -1616 -508 784 1337 550 -1115 -1663 -349 434 1392
2869 1392 636 -382 -1552 -1064 386 1802 731 -535 -1928 -1390 596 1741 1098 -530 -1697 -1184
2885 -1184 748 1572 973 -485 -1272 -963 -89 1247 1109 224 -952 -1470 -139 871 1335 466 -1134
2902 -1134 -1845 -371 1388 1597 509 -1399 -1914 -251 1225 1394 247 -1261 -1463 -479 1176 1219 420
2919 420 -876 -1110 -840 528 1396 1041 -312 -1371 -937 228 1494 794 -590 -2000 -1134 519 1419
2936 1419 1112 -773 -1359 -952 428 1123 741 -535 -1410 -965 23 1351 878 88 -1019 -1137 -372 784
2954 784 1257 472 -1063 -1395 -391 1007 1603 266 -1505 -1309 -377 1239 1349 413 -1161 -1842 -275
$$ packed form
2835a537N72O32J321R0j307j286n56J425J798J20j057j746k70Q19K317M14j587
2852A62j687j71J233J801L66j448j574k98J108J292N53p87j665n48J314P83R58
2869A392p56j018j170M88J450J416j071j266j393N38J986J145o43j628j167N13
2885a184J932Q24n99j458p87L09Q74J336j38q85j176n18J331J010M64q69j600
2902a134p11J474J759K09j088j908n15J663J476J69j147j508k02R84J655M3p99
2919D20j296k34K70J368Q68l55j353j059M34J165J266p00j384j410Q66J653R00
2936A419l07j885n86M07J380O95l82j276q75M45R88J328m73p90j107j18P65J156
2954G84M73p85j535l32J004J398N96j337j771J96R32J616J10r36j574o81J567
$$ plain form
2971 -275 869 965 811 -660 -1129 -772 331 1308 928 -613 -1537 -839 473 1457 1154 -252 -1246 -1676
2989 -1676 480 1575 999 -457 -1256 -801 290 1374 1074 -797 -1112 -714 21 1203 1312 -77 -1105
3006 -1105 -867 -522 790 1058 531 -1145 -1476 -268 1272 1466 461 -1180 -1315 -342 860 1345 -120
3023 -120 -1309 -1566 -679 776 1431 460 -601 -1259 -860 96 1154 574 -387 -1299 -927 146 1129 1029
3041 1029 -659 -1532 -1125 244 942 371 -703 -1767 -1296 255 1032 652 -170 -1018 -918 180 1008 843
3059 843 -176 -922 -984 -453 798 883 37 -777 -1277 -749 781 1161 448 -939 -1431 -546 1015 1343 414
3078 414 -999 -1365 -481 691 1220 732 -859 -1104 -658 329 952 687 -314 -1188 -982 71 1195 837
3096 837 -237 -850 -1124 574 1231 1067 -255 -1024 -761 70 1259 1304 -235 -851 -632 119 1038 952 256
$$ packed form
2971b75J144R6j54j471m69L57J103R77l80j541r24O98J312R84l03j406r94m30
2989a676K156J095n76j456p99M55J091J084l00j871l15L98P35J182J09j389j028
3006a105K38L45J312K68n27j676l31J208J540J94j005j641j35R73J202M85j465
3023a20j189k57Q87J455O55r71j061o58L99R56J058n80r61r12L72J073R83j00
3041A029j688q73M07J369O98n71j074j064M71J551P77l80q22q48J00J098Q28j65
3059H43j019p46o2N31J251Q5q46q14n00N28J530L80p13j387m92Q85J561L28r29
3078D14j413l66Q84J172N29m88j591k45M46R87O23k65j001q74K06J053J124l58
3096H37j074o13k74J698O57j64j322p69K63Q31J189M5j539o16K19P51R19q6o96
$$ plain form
3115 256 -861 -843 175 925 994 337 -601 -1107 -206 526 1389 674 -784 -1347 -431 955 1469 32 -1025
3134 -1025 -680 -336 583 1267 377 -765 -1193 -758 467 948 656 -412 -800 -906 64 830 729 -280
3152 -280 -1402 -1175 106 1091 667 -436 -1315 -1126 29 899 507 -252 -1277 -1007 -103 1125 773 -64
3170 -64 -815 -1004 -177 660 860 -87 -869 -1089 -358 369 968 72 -969 -1562 -751 643 1112 592 -1024
3189 -1024 -1108 -408 491 949 405 -760 -1057 -521 401 999 620 -433 -854 -305 103 835 708 -435 -1024
3208 -1024 -1005 428 1113 484 64 -1075 -683 125 1099 829 -46 -939 -563 342 887 722 29 -653 -551
3227 -551 -213 855 865 701 -625 -863 -137 721 1040 379 -383 -933 -167 913 1260 609 -149 -846 -259
3246 -259 726 1014 594 -502 -922 -521 309 1022 908 -344 -769 -376 213 1294 739 -98 -757 -577 277
$$ packed form
3115B56j117J8J018P50O9o57r38n06R01P32Q63p15j458n63R16J386N14j437j057
3134a025L45L44R19O84q90j142m28M35J225M81k92j068l88j06R70P66j01j009
3152b80j122K27J281R85m24j103q79J89J155Q70l92p59j025K70R04J228l52q37
3170f4p51j89Q27Q37K00r47p82k20P31P27N99q96j041n93Q11J394M69n20j616
3189a024q4P00Q99M58n44j165k97N36R22N98l79j053m21N49M08P32j27j143n89
3208a024J9J433O85o29m20j139L92Q08R74k70q75q93L76R05N45j65o93o82J02
3227e51L38J068J0j64j326k38P26Q58L19o61p62n50P66J080L47o51p58o97N87
3246b59R85K88m20j096m20M01Q30P13j14j252m25L93N89J081n55q37o59J80Q54
$$ plain form
3265 277 1033 830 342 -850 -767 -4 957 840 -314 -853 -1042 -243 763 477 48 -693 -822 -156 534
3284 534 756 153 -853 -830 -205 540 1181 266 -684 -540 -506 652 1118 520 -595 -869 -343 461 984 381
3304 381 -721 -873 -470 615 828 373 -43 -739 -715 89 1050 698 -32 -809 -809 181 777 749 -543 -604 -1057
3325 -1057 -96 872 1038 215 -733 -764 -54 1204 986 172 -548 -790 136 773 724 308 -454 -675 -43 709
3345 709 772 415 -290 -822 -165 740 1137 733 -610 -689 -300 739 1085 539 -302 -646 -248 519 1126 942
3365 942 127 -823 -197 370 818 938 53 -766 -444 232 1081 809 36 -468 -687 302 1069 1008 61 -536
3385 -536 -867 76 976 900 -14 -542 -574 -137 711 856 276 -414 -817 -365 572 957 346 -280 -841 -411 321
3406 321 954 639 -211 -743 -720 521 592 733 -263 -1057 -543 142 624 328 -107 -681 -678 205 805 441 43
$$ packed form
3265B77P56k03m88j192Q3P63R61j17j154n39j89P99J006k86m29p41j29O66O90
3284E34K22o03j006K3O25P45O41r15r50J44L4J158M66n98j115k74N26Q04N23o03
3304C81j102j52M03J085K13m55m16o96K4Q04R61l52p30p77%R90N96k8j292o1m53
3325a057R61R68J66q23r48l1P10J258k18q14p20k42R26O37m9m16p62k21O32P52
3345G09O3l57p05n32O57R05L97m04j343p9L89J039L46n46q41l44L98P67O07j84
3365I42q15r50O26N67M48J20q85q19L22O76Q49k72p73n04k19R89P67o1r47n97
3385e36l31R43R00p6r14n28l2M37Q48J45n80o90m03M52R37L85o11o26n61M30P32
3406C21O33l15q50n32K3J241P1J41r96p94N14O85M82k96m35n74LQ83O00l64l98
$$ plain form
3427 43 -377 -532 -89 1017 655 10 -815 -219 69 667 667 111 -767 -606 184 682 988 224 -676 -521 -73
3448 -73 641 828 168 -152 -847 -140 604 1100 632 -592 -734 -341 334 738 428 -521 -816 -188 659 906
3468 906 628 -142 -656 -355 412 796 538 -278 -773 -219 -62 1083 379 11 -472 -551 191 725 351 94
3488 94 -432 -570 -142 407 738 28 -618 -589 -35 539 898 92 -576 -500 -231 506 649 207 -277 -570 -313
3509 -313 797 631 450 -505 -476 -493 404 405 406 -119 -837 -445 150 715 240 -143 -918 -21 249 852 425 -166
3531 -166 -638 -436 298 706 611 -362 -682 -523 97 682 806 -9 -359 -569 -2 532 442 -19 -609 -594 -311
3552 -311 934 474 391 -551 -474 -2 490 534 45 -370 -673 -408 357 851 192 -435 -671 -196 641 614 119
3573 119 -395 -643 -429 110 837 395 -90 -391 -486 116 927 410 -254 -557 -411 147 669 562 -198 -812
$$ packed form
3427D3m20j55M43J106l62o45q25N96K88N98%n56q78J61P90M98L06p64r00J55M48
3448g3P14J87o60l20o95P07P44M96m68j224j42L93O75M04l10r49k95O28Q47K47
3468I06k78p70n14L01P67L84k58q16m95N54J57J145p04l68m83p9P42N34l74k57
3488I4n26j38M28N49L31p10o46K9N54N74L59q06o68P6K69P37J43m42m84k93K57
3509c13J110j66j81r55K9j7Q97JJn25p18L92N95N65m75l83p75Q97K70O03m27n91
3531a66m72K02P34M08r5r73l20J59O20N85J24q15l50k10N67N34r0m61n90J5K83
3552c11J245m60q3r42P7M72M92M4m89m15l03K65P65M94o59o27k36M75Q37k7m95
3573A19n14k48K14N39P27m42m85l01r5O02Q11n17o64l03J46N58N22j07p60o14
$$ plain form
3593 -812 -569 -172 200 507 -137 -453 -577 -80 184 546 -229 -707 -572 129 716 678 273 -652 -497 -37
3613 -37 219 606 287 -476 -408 -295 15 699 143 -388 -598 -342 356 530 412 -132 -529 -292 290 437 320
3634 320 -77 -680 -499 298 381 205 -73 -705 -499 326 704 211 1 -588 -487 234 612 314 -138 -327
3654 -327 -230 222 595 279 -255 -140 -550 28 305 795 -162 -397 -323 -115 580 514 105 -479 -856 -190 512
3675 512 583 295 -235 -617 -165 243 566 486 -217 -720 -39 646 391 289 -422 -623 -335 -175 604 229 -229
3696 -229 -629 -536 85 387 207 -45 -624 -746 -18 518 246 179 -363 -410 248 565 542 116 -585 -1114 -33
3717 -33 398 288 4 -587 -601 -386 300 311 133 -419 -692 -78 431 346 530 -380 -544 -392 431 191 168 -374
3739 -374 -502 -586 137 605 147 108 -577 -528 215 472 146 -467 -296 -450 303 776 488 -155 -541 -412 -15
$$ packed form
3593h12K43L97L72L07o44l16j24M97K64L62p75m78J35P01N87l8m05r25J55M60
3613c7K56L87l19p63O8J13L10O84n56n31k10K56O98J74j18n44l97K37N82J47j17
3634C20l97o03J81P97Q3j76k78o32K06Q25L78m93k10n89J01P21L78k98m52j89
3654c27R7M52L73l16n34J15m10N78K77M90r57k35P4K08O95o6m09n84l77O66P02
3675E12P1k88n30l82M52M08L23q0p03n03O81O85k55j02p11k01K88J60P79l75m58
3696b29m00R3O21L02j80k52n79j22P28N36k72o7n42m7O58L17k3m26p01n29J081
3717c3M31j10k84n91j4K15O86J1j78n52k73O14N09q5J84r10j64J52Q23k40k3n42
3739c74j28q4P23M68m58l9o85M9P43K57l26o13J71j54P53M73k88o43l86J29L97
$$ plain form
3760 -15 279 271 -158 -234 -385 -115 540 109 243 -523 -744 -323 259 631 158 -333 -582 -357 333 374 96 -420
3782 -420 -627 -262 211 409 127 -80 -660 -344 479 494 303 -367 -449 -147 86 392 336 -46 -343 -591 17
3803 17 353 382 -194 -446 -364 -36 642 416 75 -588 -300 274 341 210 150 -218 -306 -10 364 445 -56 -556
3825 -556 -543 -147 508 555 131 -534 -609 62 187 357 -73 -514 -466 -146 200 641 -1 -219 -670 -285 214
3846 214 364 17 -206 -596 -426 41 500 300 -152 -629 -523 61 441 161 -330 -749 -474 476 95 176
3866 176 -269 -514 -315 -56 324 147 -203 -411 -715 57 216 237 229 -262 -464 -154 248 334 17 -638 -389
3887 -389 -298 276 451 221 -301 -311 -315 331 387 182 -134 -436 -360 25 423 112 -330 -705 -433 -70 340 372
3909 372 -229 -219 -20 -153 602 178 -396 -662 -479 -121 410 160 120 -323 -433 315 143 274 0 -407 -254
$$ packed form
3760a5K94qm29p6j51K70O55m31J34p66k21M21N82L72m73m91k49K25O90M1k78n16
3782d20k07L65M73J98k82k07n80L16Q23J5j91o70q2L02K33L06n6l82k97k48O08
3803A7L36K9n76k52Q2L28O78k26l41o63K88N74O7j31o0l68q8K96L74Q1n01n00
3825e56J3L96O55M7m24o65p5O71J25J70m30m41M8L20L46M41o42k18m51L85M99
3846B14J50l47k23l90J70M67M59k00m52m77J06N84L80k80m91m19K75R50l81Q1
3866A76m45k45J99K59L80j77l50k08l04P72J59K1qm91k02L10M02Q6l17o55K49
3887c89R1N74J75k30n22j0mO46N6k05l16l02P6L85L98l11m42l75K72L63M10L2
3909C72o01J0J99j33P55m24n74k66J83L58N31k50m0m43j10P48j72J31k74m07J53
$$ plain form
3930 -254 72 -74 450 127 -358 -690 -79 472 607 256 -233 -475 54 233 256 299 -189 -700 -339 329 436
3951 436 475 -215 -314 9 -21 511 100 -446 -363 -62 509 592 44 -182 -489 -303 -24 437 122 -106 -489 -316
3973 -316 211 317 51 308 -416 -455 159 346 436 170 -320 -227 -53 33 265 3 -163 -136 -123 425 418 29 -158
3996 -158 -454 -8 278 507 -43 -149 -48 -159 282 183 -86 -492 -157 -194 259 229 334 -473 -319 -80 289
4017 289 317 150 -166 -470 -131 153 541 199 50 -87 -148 532 185 134 -11 -253 25 51 388 280 -169
4038 -169 -163 -214 238 8 258 349 21 -437 -127 -59 393 -94 -208 -225 19 265 319 332 -213 -344 123 38 495
4061 495 283 -225 -20 -76 82 477 352 -135 -186 -93 372 28 149 14 -143 -240 56 265 348 220 -290 -340
4083 -340 161 453 401 -55 -252 -221 155 420 506 39 11 -311 77 430 234 175 -297 -319 179 337 332 149 -116
$$ packed form
3930b54L26j46N24l23m85l32O11N51J35l51m89k42N29J79K3M3m88n11L61O68J07
3951D36L9o90r9L23l0N32m11n46Q3L01N71Q3n48k26l07J86K79M61l15k28l83J73
3973c16N27J06k66K57p24l9O14J87R0k66m90R3J74Q6K32k62j66K7J3N48pl89j87
3996a58k96M46K86K29n50j06J01j11M41r9k69m06L35l7M53l0J05q07J54K39L69
4017B89K8j67l16l04L39K84L88l42j49j37o1O80l47n1j45k42K78K6L37j08m49
4038a69On1M52k30K50R1l28m58L10O8M52m87j14j7K44K46N4J3n45j31M67q5M57
4061D95k12n08K05n6J58L95j25m87n1R3M65l44J21j35j57r7K96K09Q3j28n10n0
4083c40N01K92n2m56j97L1L76K65Q6m67k8l22L88L53j96n9m72k2M98J58nj83k65
$$ plain form
4106 -116 -42 -161 100 258 184 -371 -489 -63 297 346 407 13 -21 -17 167 258 83 -14 -513 -71 182 466 259
4129 259 -9 5 56 164 282 460 22 -423 -122 -127 608 194 -134 -359 -18 -223 -38 177 190 -3 -444 -92
4151 -92 155 70 55 -148 -464 221 34 367 123 60 -168 -19 338 398 237 -198 -243 -253 -106 274 223 -430 -322
4174 -322 -201 373 357 293 -9 -98 -76 -125 425 246 -135 -215 -469 293 376 316 -1 -407 -207 306 126 -17 -294
4197 -294 112 -280 -6 61 223 -57 -367 -260 -204 288 265 122 -84 -144 -429 17 309 82 70 -102 31 44
4219 44 193 225 -116 -475 -260 140 369 218 -30 -119 -71 235 574 63 32 -130 -335 349 252 163 -257 -204 -238
4242 -238 53 47 10 60 -7 -247 202 238 250 131 -141 -11 -242 177 412 68 -292 11 7 281 330 311 -110 -31
4266 -31 -161 -81 481 205 -92 -324 76 221 342 29 -72 14 -31 223 269 107 -73 -330 100 -62 355 113
$$ packed form
4106a16P4j19K61J58p4n55j18M26L60M9O1l94l4MJ84R1j75r7m99M42K53K84k07
4129B59k68J4N1J08J18J78m38m45L01nP35m14l28k25L41k05J85K15J3j93m41L52
4151i2K47q5j5k03l16O85j87L33k44o3k28J49L57O0j61m35m5j0J47L80n1o53J08
4174c22J21N74j6o4l02q9K2m9N50j79l81q0k54P62Q3o0l17m06K00N13j80j43k77
4197b94M06l92K74O7J62k80l10J07N6M92k3j43k06o0k85M46K92k27j2j72J33J3
4219D4J49L2l41l59K15M00K29j51k48q9M8L06L39n11l1j62k05O84r7q9m20N3l4
4242b38K91ol7N0o7k40M49L6J2j19k72J30k31M19K35l44l60L03mK74M9j9m21P9
4266c1j30Q0N62k76k97k32M00J45J21l13j01Q6m5K54M6j62j80k57M30j62M17k42
$$ plain form
4288 113 182 -64 -297 137 227 135 152 -243 -309 29 95 402 -216 33 61 24 58 262 94 -298 -211 -352 188
4311 188 95 -161 311 46 78 249 86 -15 -59 -105 84 255 358 89 -64 -117 65 168 66 30 -379 -269
4333 -269 -176 247 438 66 -190 -214 -170 55 218 108 -397 -542 23 132 269 122 -62 -342 103 -139 -20
4354 -20 503 36 -240 -499 -99 121 193 -57 -252 -298 176 283 308 42 -320 -141 21 348 338 128 6 -160
4376 -160 -140 81 -20 -25 -153 -191 -211 334 441 20 29 -232 -35 191 114 -156 34 -26 -190 236 182 333 -99
4399 -99 -183 -33 -63 233 142 -206 -84 -342 -185 55 544 89 -464 -253 28 157 107 101 -91 -150 -42 153 75
4422 75 -2 -339 -151 70 389 61 96 -68 -73 -3 10 104 68 98 -382 -129 210 85 76 -201 -127 -238 -238 53 -163
4447 -163 40 -330 -326 283 -111 51 143 -303 -259 -220 237 34 -216 -24 -136 173 26 25 173 -236 -277 -149 349
$$ packed form
4288A13O9k46k33M34R0r2J7l95o6L38O6L07o18K49K8l7L4K04j68l92Q7j41N40
4311A88r3k56M72k65L2J71j63j01m4m6J89J71J03k69j53n3J82J03j02l6m09J10
4333b69R3M23J91l72k56k4M4K25J63j10n05j45N65J09J37j47j84k80M45k42J19
4354b0N23m67k76k59M00K20P2k50j95m6M74J07K5k66l62J79J62L27j0k10j22j66
4376a60K0K21j01nj28l8k0N45J07m21Rk61J97K26p7k70J90o0j64M26n4J51m32
4399i9q4J50l0K96r1l48J22k58J57K40M89m55n53K11K81J29n0oj92n9J08J95p8
4422G5p7l37J88K21L19l28L5j64nP0J3R4l6L0m80K53L39j25rk77P4j11%K91k16
4447a63K03l70MO09l94J62R2m46M4L9M57k03k50J92j12L09j47jJ48m09m1J28M98
$$ plain form
4470 349 -57 8 -71 -129 103 179 55 126 39 -95 -29 192 166 210 -77 9 183 192 314 14 -30 -151 63 244
4494 244 251 -17 -265 -332 -164 127 219 332 222 49 -2 184 9 63 109 -66 -279 -95 98 181 -390 -222 -245
4517 -245 -50 -48 152 -191 -206 22 -5 75 267 159 -116 -65 34 -185 122 -155 -196 -51 70 -79 -334 -194 -56
4540 -56 -50 -92 348 197 262 -147 -219 146 244 76 -74 62 -297 -95 -107 162 510 -39 -440 -143 48 270 -31
4563 -31 29 -105 -119 70 -7 -58 -186 -230 -439 120 46 119 149 90 -6 74 -21 215 -186 -136 -366 120 316 -54 -274
4588 -274 -239 -85 -20 249 73 384 -241 32 -322 77 250 -28 -81 -238 152 161 297 -293 -93 -390 109 229
4610 229 324 -21 -53 138 -69 43 222 -77 -50 -270 73 -7 -19 222 -284 162 -253 96 249 -132 -356 -312
4632 -312 -443 -181 -95 117 137 -151 87 -108 158 62 128 39 -23 102 -8 319 101 -57 -273 30 248 53
$$ packed form
4470C49m06O5p9n8K32P6j24P1q7j34O6K21k6M4k87Q6J74RJ22l00m4j21K14J81
4494B44Pk68k48o7J68K91R2J13j10j73n1J86j75N4M6j75k13J84J93Q3n71J68k3
4517b45J95KK00l43j5K28k7Q0J92j08k75N1R9k19L07k77m1J45J21j49k55J40J38
4540e6Om2M40j51O5m09p2L65R8j68j50J36l59K02j2K69L48n49m01K97J91K22l01
4563c1O0j34j4J89p7n1j28m4k09N59p4P3L0n9r6Q0r5K36m01N0k30M86J96l70k20
4588b74L5J54O5K69j76L11o25K73l54L99J73k78n3j57L90RJ36n90K00k97M99J20
4610B29R5l45l2J91k07J12J79k99K7k20L43q0j2K41n06M46m15L49J53l81k24M4
4632c12j31K62Q6K12K0k88K38j95K66r6O6q9o2J25j10L27k18j58k16L03K18j95
$$ plain form
4654 53 89 -202 -278 22 21 160 55 289 -393 -18 -68 341 187 -274 -91 -6 54 47 168 -150 -234 -188 349 33
4678 33 0 37 -38 -481 -17 240 51 -103 -327 393 -97 21 422 -115 194 -85 192 259 187 32 130 -203
4700 -203 175 100 99 56 -280 -413 -57 38 76 -174 -110 -106 -49 245 86 79 -90 -37 -53 374 -100 141 -243 -138 210
4725 210 60 -51 30 -273 -249 -215 -308 132 202 -109 -212 40 195 240 86 -150 -429 -224 113 -53 121 -267
4747 -267 -238 -69 93 134 17 -169 -112 -78 2 -49 8 449 -95 -118 -49 194 -43 447 71 5 209 91 192
4770 192 17 -115 -168 -195 -2 -19 -176 26 -304 130 46 460 -111 -5 113 -209 243 -122 95 -83 -297
4791 -297 31 -65 -60 309 128 146 -9 -179 -35 -180 103 -19 -188 -13 318 230 -15 82 74 -25 -59 108 -48
4814 -48 80 -119 -385 -122 8 -7 141 -37 -253 -289 -101 259 -265 -36 234 -13 -71 -13 -273 -94 -62 -200
$$ packed form
4654E3L6k91p6L00jJ39j05K34o82L75n0M09j54m61J83Q5O0pJ21l18q4M6N37l16
4678C3l3L7p5m43M64K57j89j54k24P20m90J18M01n37L09k79K77O7p2j55R8l33
4700b03L78p5jm3l36j33L56R5L8k50O4MN7K94j59pj69N3j6M27m74K41l84J05L48
4725B10j50j11Q1l03K4L4r3M40P0l11j03K52J55M5j54k36k79K05L37j66J74l88
4747b67K9J69J62M1j17j86N7L4Q0n1N7M41n44k3O9K43k37M90l76o6K04j18J01
4770A92j75j32n3k7J93j7j57K02l30M34q4M14n71J06J18l22M52l65K17j78k14
4791b97L28r6NL69j81J8j55j70J44j45K83j22j69J75L31q8k45R7qr9l4J67j56
4814d8J28j99k66K63J30j5J48j78k16l6J88L60n24K29K70k47n8N8k60J79L2j38
$$ plain form
4836 -200 181 185 28 -296 -15 85 92 63 -262 66 -111 15 203 -7 176 -462 151 -199 23 69 -60 -132
4858 -132 -318 -27 250 204 -192 101 -106 -81 -28 -103 242 -270 -205 -114 3 1 19 -88 -19 52 -112 299 -8 40
4882 40 29 -202 -65 187 119 -150 -226 -201 199 239 189 -281 -80 102 93 87 -120 -117 12 -115 70 28 73 186 -5
4907 -5 134 -120 106 -88 458 -164 58 54 101 218 -32 -49 -25 -335 213 203 171 103 -269 53 113 82 -30 124
4931 124 -67 240 -90 150 -106 -72 -163 -258 80 233 168 14 206 166 102 168 160 26 -69 89 10 171 -15 93
4955 93 -84 218 243 177 -58 -77 -209 41 69 144 316 65 4 -23 64 170 -84 -57 -80 -17 -12 153 328 -46 -92
4980 -92 -186 32 223 -50 95 -74 87 -329 -235 -159 -1 49 -178 125 -68 211 -30 162 89 253 27 364
5002 364 -55 40 -338 -96 315 -21 156 210 -73 -130 -119 123 54 -137 122 141 97 162 303 33 8 -47 -17 294
$$ packed form
4836b00L81Mj57l24K81J00Pk9l25L28j77J26J88k10J83o38O13l50K22M6j29p2
4858a32j86K91K77m6l96K93k07K5N3p5L45n12O5R1J17kJ8j07O9P1j64M11l07M8
4882D0j1k31J37K52o8k69p6K5M00M0n0m70K01J82rok07LJ29j27J85m2M5J13j91
4907eJ39k54K26j94N46o22K22mM7J17k50j7K4l10N48j0l2o8l72L22O0l1j12J54
4931A24j91L07l30K40k56L4r1r5L38J53o5j54J92m0o4O6qj34r5J58p9J61j86J08
4955I3j77L02K5o6k35j9j32K50K8P5J72k51o1k7Q7J06k54K7k3O3NJ65J75l74m6
4980i2r4K18J91k73J45j69J61m16R4P6J58N0k27L03j93K79k41J92p3J64k26L37
5002C64m19R5l78K42M11l36J77N4k83n7J1K42o9j91K59J9m4O5J41k70k5n5L0L11
$$ plain form
5026 294 289 237 -145 -99 109 182 531 56 -23 -77 104 64 385 91 65 -356 -139 -44 130 217 -3 30 -69 146
5050 146 -35 13 -40 29 -19 5 -58 120 -162 215 -28 -9 282 163 -326 -465 -217 -47 -178 202 86 -167
5072 -167 -154 -89 -334 7 -240 58 -33 173 -145 177 -313 86 64 52 34 -86 184 -116 -47 267 92 253
5094 253 -125 54 29 173 52 -39 158 -174 -235 108 172 12 208 -168 -106 -327 -4 -16 -110 -214 -79 -240
5116 -240 -52 36 -94 -366 -260 40 10 -275 38 -86 -168 74 23 -77 -4 133 -162 -304 -24 54 75 199
5138 199 138 137 -128 204 -61 112 -62 -257 185 89 132 24 -122 -134 44 321 -89 -151 -9 -226 -229 -288 -82
5161 -82 142 -92 -154 155 231 41 45 -49 171 73 53 185 -86 -117 79 -22 -205 -56 108 -181 168 -251 455
5184 455 87 -29 -117 -175 -189 -62 82 -165 -40 -204 -39 9 65 273 258 32 -235 -346 13 -101 -24 -226
$$ packed form
5026B94nn2l82M6K08P3L49m75p9n4J81m0L21k94k6m21K17R5J74Q7k20L3r9K15
5050A46j81M8n3O9m8K4o3J78k82L77k43J9K91j19m89j39K48J70j31L80j16k53
5072a67J3O5k45L41k47K98r1K06l18L22m90L99k2j2j8j20K70l00O9L14j75J61
5094B53l78J79k5J44j21r1J97l32o1L43O4j60J96l76O2k21L23j2r4j04J35j61
5116b40J88Q8j30k72J06L00l0k85L13j24q2K42n1j00P3J37k95j42K80P8K1J24
5138A99o1jk65L32k65J73j74j95M42r6M3j08j46j2J78K77m10o2J42k17ln9K06
5161h2K24k34o2L09P6j90Mr4K20r8k0J32k71l1J96j01j83J49J64k89L49m19P06
5184D55l68j16q8n8j4J27J44k47J25j64J65M8N6K08j5k26k67j11L59j14P7k02
$$ plain form
5206 -226 163 -31 -66 15 -49 -44 -290 -45 104 -131 -2 -128 -57 83 -168 -7 9 -111 -383 -208 -36 -25 61
5229 61 -223 -308 2 36 -115 205 -248 -13 -26 -34 211 401 -55 -64 -66 33 105 134 -50 138 36 97 51 107 -38
5254 -38 -29 113 -61 -158 -74 64 87 -113 -150 -72 106 -8 8 146 354 78 -15 -33 -87 -228 240 201 132 154 -167
5279 -167 -99 71 130 -114 167 70 89 10 -249 122 35 -270 -70 -184 -128 385 -68 -291 -329 -8 138 131 105 -22
5303 -22 86 -70 167 71 104 313 -3 249 32 -69 113 -236 10 -48 -202 -75 70 -255 -121 -110 108 423
5325 423 -255 -108 22 -21 63 227 63 -16 229 -292 237 -244 -32 11 -123 -207 6 -148 -202 1 177 -28
5347 -28 183 150 -279 -339 -141 56 -65 -241 -124 41 -235 84 56 -197 13 -28 -120 235 -477 32 195 63
5369 63 -143 206 167 -49 64 -45 -87 -3 -157 -95 146 23 -137 -210 -111 206 -129 12 263 -80 -278 313
$$ packed form
5206b26L89j94l5Q1o4Nk46K45J49k35J29j26P1J40k51J61J6j20k72J75J72J1Q6
5229F1k84q5L10L4j51L20m53K35j3qK45J90m56rkR9P2K9j84J88j02O1m6N6j45
5254c8RJ42j74r7Q4J38K3k00l7P8J78j14J6J38K08k76r3j8n4j41M68l9o9K2l21
5279a67O8J70N9k44K81r7J9p9k59L71q7l05K00j14N6N13m53k23l8L21J46pk6j27
5303b2J08j56K37r6L3K09l16K52k17j01J82l49K46n8j54J27J45l25J34J1K18L15
5325D23o78J47J30m3Q4J64j64p9K45n21N29m81K12M3j34q4K13j54n4K03J76k05
5347b8K11l3m29o0J98J97j21j76J17J65k76L19k8k53K10m1r2L55p12N09J63j32
5369F3k06L49l9k16J13j09m2Q4j54O2K41j23j60p3R9L17l35J41K51l43j98N91
$$ plain form
5391 313 138 119 114 -277 286 -140 121 215 -66 34 23 21 -57 140 127 5 -22 50 -115 223 -93 -244 -158 -171
5415 -171 91 -17 2 -101 -145 39 26 -27 -323 191 205 -56 163 7 -132 -162 -278 134 -7 64 14 283 166
5438 166 -224 274 204 227 134 -102 -100 9 -18 334 -99 57 -104 128 39 272 194 -148 -208 -192 81 109 -146 133
5462 133 14 -66 59 0 196 -294 -102 -122 -153 -202 -18 175 -229 52 253 -13 -36 -195 -229 -123 129 96 63
5485 63 -212 137 -6 -250 -46 54 249 124 -40 152 83 -263 7 -31 36 144 227 -26 -272 -358 259 -242
5507 -242 212 106 -92 197 182 168 99 110 6 146 -144 -74 186 304 60 148 104 -214 106 116 130 145 -71
5530 -71 -114 -28 125 207 -23 -172 145 -148 -254 -370 -154 -92 -105 -39 -117 -269 172 -121 -95 274 -16 319 -56
5553 -56 -116 -14 -208 57 564 65 120 196 -246 189 -276 340 140 -224 177 221 29 1 -28 -10 26 -169 -11
$$ packed form
5391C13j75j9nl91N63m26K61R4k81J00j1kp8J97j3j22k7P2j65L38l16j51Q6j3
5415a71K62j08J9j03m4J84j3n3k96N14J4k61K19j56j39l0j16M12j41P1n0K69j17
5438A66l90M98p0K3r3k36KJ09k7L52m33J56j61K32q9K33p8l42o0J6K73K8k55K79
5462A33j19q0J25n9J96m90J92k0l1m9J84J93m04K81K01k66k3j59l4J06K52l3l3
5485F3k75L49j43k44K04J00J95j25j64J92o9l46K70l8O7J08Q3k53k46q6O17n01
5507b42M54j06j98K89j5j4o9J1j04J40k90P0K60J18k44Q8m4l18L20J0J4J5k16
5530g1m3Q6J53Q2k30j49L17k93j06j16K16O2j3O6p8j52M41k93K6L69k90L35l75
5553e6o0J02j94K65N07m99N5P6m42M35m65O16k00l64M01M4j92k8k9J8L6j95J58
$$ plain form
5576 -11 188 114 -210 60 -372 -107 261 -291 -58 128 -62 154 -75 -155 -159 201 19 -142 231 35 -328 20
5598 20 223 -138 262 -68 177 111 -13 270 -318 58 135 -19 -4 -79 214 -207 212 -328 11 133 373 68
5620 68 39 -14 166 219 66 -1 -40 -41 8 -54 -25 -213 83 168 134 319 5 -121 68 175 -202 -65 -18 286 113
5645 113 -23 -96 58 -171 -184 -172 -164 -18 -230 175 12 177 112 -238 -166 84 157 3 -64 -91 100 -215 114
5668 114 -86 -266 -90 -250 -219 123 -63 -324 -83 128 -56 41 143 -99 179 -215 65 -299 172 74 -44
5689 -44 -2 161 -29 38 4 17 -219 175 456 273 -74 266 153 255 31 38 203 -131 13 -170 97 -115
5711 -115 -72 -219 12 103 135 -258 -119 47 150 -143 -24 66 -126 -164 -57 2 -64 283 175 -215 270 224 137
5734 137 77 309 -137 -150 -69 -111 -146 -40 19 -121 67 233 60 -18 -330 -21 -123 -413 232 -187 94 -169
$$ packed form
5576a1J99p4l24K70m32K65L68n52K33J86j90K16k29q0mL60j82j61L73j96l63L48
5598B0K03l61M00l30K45o6j24K83n88L76P7j54J5p5K93m21M19n40L39J22K40l05
5620F8k9n3J80N3j53o7l9jM9o2K9j88K96Q5l4J85l14j26J89J07l77J37M7L04j73
5645A13j36p3J54k29j3J2QJ46k12M05j63J65o5l50P2K50P3j54o7k7J91l15L29
5668A14k00j80J76j60L1L42j86k61K41K11j84R7J02k42K78l94K80l64M71r8j18
5689d4M2J63j90O7l4J3k36L94K81j83l47L40j13J02k24PJ65l34J44j83K67k12
5711a15M3j47K31R1L2l93J39J66J03k93J19R0j92l8J07N9o6L47j08l90M85m6q7
5734A37o0K32m46j3Q1m2l5J06N9j40J88J66j73p8l12L09j02k90O45m19K81k63
$$ plain form
5756 -169 237 69 -20 197 -137 -158 -198 -44 15 12 176 -141 11 112 -252 -14 -214 112 -243 -110 -120 -45 482
5779 482 -139 86 163 -93 200 -77 -189 -227 281 300 -134 54 41 53 73 -54 -127 -78 348 -145 30 24 27 -13
5803 -13 146 -139 280 35 194 69 -31 -31 99 -128 103 319 -426 54 135 -10 -74 88 -172 -165 -138 294 -8
5826 -8 118 -273 -106 -95 -273 3 24 85 -315 -188 264 -120 -100 96 209 -7 154 234 259 -146 -73 82 179
5849 179 -59 -225 171 -160 160 -189 115 -15 87 4 -18 -72 -1 89 11 200 60 163 -98 74 -11 -234
5871 -234 -45 -200 51 211 179 116 256 17 121 51 104 -153 81 -299 97 41 52 -109 249 152 -234 -13
5893 -13 118 -106 369 -86 255 319 -294 311 -23 26 96 -148 71 -1 36 37 256 89 -322 171 -228 64 82
5916 82 -61 -112 201 211 -206 -174 29 86 107 -44 -23 51 87 289 75 -20 118 -193 -48 314 51 28 95 252
$$ packed form
5756a69M06j68q9K17l34k1m0J54N9lJ64l17J52J01l64K38k00L26l55J33j0P5N27
5779D82o21K25P7k56K93k77j12l8N08J9m34J88j3J2K0j27p3M9M26m93J75oLm0
5803a3J59k85M19k45J59j25j00%J30k27K31K16p45M80Q1j45o4J62k60PK7M32l02
5826hJ26l91J67J1j78K76K1O1m00J27M52l84K0J96J13k16J61Q0K5m05P3J55R7
5849A79k38j66L96l31L20l49L04j30J02q3k2n4P1R0p8J89j40J03k61J72q5k23
5871b34J89j55K51J60l2o3J40k39J04p0N3k57K34l80L96n6J1j61L58r7l86K21
5893a3J31k24M75m55L41O4o13O05l34M9P0k44K19p2L7JK19j67m11M93l99K92J8
5916H2j43n1L13J0m17L2K03N7K1j51K1P4L6K02k14r5J38l11J45L62k63k3O7J57
$$ plain form
5940 252 141 -326 -86 -218 17 -3 -151 -179 178 -27 -87 -81 -170 45 63 248 -22 70 -99 77 -4 -357 -141
5963 -141 -220 -6 110 -6 -8 -62 -16 296 -161 -173 -207 -116 -192 -120 106 -29 230 127 42 158 13 67 281 127
5987 127 77 -314 -47 102 -22 -154 42 -162 137 106 -2 28 191 -38 103 133 -167 -54 -195 -207 77 93
6009 93 140 56 18 -220 53 -9 113 153 39 18 -147 88 5 77 138 129 -123 44 112 19 -220 49 -207 94 -40
6034 -40 12 57 -243 42 204 -106 -65 133 381 -56 235 45 23 16 -237 133 186 77 29 -63 -144 -4 79 179
6058 179 -101 20 -192 72 281 246 40 -62 -158 67 75 -280 53 -94 -10 6 -133 120 126 -222 -140 91 -76
6081 -76 -169 13 36 -47 -42 162 211 8 189 -155 -24 -90 154 69 -151 -402 -144 -208 -62 -96 -73 155 360 -145
6105 -145 -219 123 114 119 -48 -56 -103 -74 -373 27 280 -168 94 -89 67 -94 11 -138 -178 8 -312 202 10
$$ packed form
5940B52j11m67K40j32K35k0j48k8L57k05o0Oq9K15J8J85k70R2j69J76q1l53K16
5963a41p9K14J16j16kn4M6L12m57j2l4R1p6P2K26j35K59j03q5J16j45N4K14j54
5987A27n0l91K67J49j24j32J96k04K99l1j08L0J63k29J41L0l00J13j41j2K84J6
6009I3M7q4l8k38K73o2J22M0j14k1j65K35q3P2O1rk52J67O8r3k39K69k56L01j34
6034d0N2M5l00K85J62l10M1J98K48m37K91j90k2pk53L70N3j09m8r2q1J40Q3J00
6058A79k80J21k12K64K09l5k06j02r6K25Ql55L33j47Q4J6j39K53Ol48Q2K31j67
6081g6r3J82K3q3NK04M9k03J81l44J31o6K44q5k20k51K58o4J46l4K3K28K05n05
6105a45p4L42rNj67qm7K9k99M00K53m48K62j83J56j61J05j49m0J86l20N14j92
$$ plain form
6128 10 74 72 -148 -137 -57 -334 -318 85 -43 134 119 -25 75 142 333 62 208 55 86 -81 -2 141 174 -174
6152 -174 26 71 -59 58 89 -159 -242 88 26 -101 14 246 174 -18 -113 -25 -228 -145 -212 -64 -282 88 -292
6175 -292 115 210 -64 211 -217 203 242 -174 -29 169 229 -192 33 8 -110 104 165 300 50 161 -21 -261
6197 -261 -31 121 -19 82 -54 -377 237 31 219 134 -283 168 82 35 -70 -23 -189 -322 -5 45 82 -371
6219 -371 -83 -271 171 -12 -11 153 -173 -201 -154 -58 7 -40 -176 93 -340 69 293 72 65 119 80 73 209 272 -390
6244 -390 140 -15 104 -88 120 65 -116 368 246 -1 -61 140 116 -41 -139 11 -58 -256 -108 -51 48 -157
6266 -157 -222 -63 -464 70 347 -73 -61 225 -173 -48 -192 -28 -606 188 -59 316 -97 203 175 68 6
6287 6 -70 -17 -26 37 -418 127 -27 231 -69 -11 -104 -105 6 -11 122 339 -322 -218 184 -13 218 105 192 -199
$$ packed form
6128A0O4kk20J1Q0k77J6M03j28J77j5j44J00O7J91k71J46j53L1j67P9J43L3l48
6152a74K00M5j30J17L1k48q3L30o2j27J15K32p2j92r5Q8k03Q3o7J48k18L70l80
6175b92M07R5k74K75m28M20L9m16J45J98O0m21K25k5j18K14O1J35k50J11j82k40
6197b61K30J52j40J01j36l23O14k06J88q5m17M51q6m7j05M7j66j33L17N0L7m53
6219c71K88j88M42j83JJ64l26k8M7R6O5m7j36K69m33M09K24k21pN4l9pJ36O3o62
6244c90N30j55J19j92K08n5j81M84j22k47o0K01k4j57r8J50o9j98J48N7R9k05
6266a57o5J59m01N34K77m20J2K86l98J25j44J64n78P94k47L75m13L00k8j07o2
6287Fp6N3rO3m55N45j54K58l00N8r3jJ11j7J33K17o61J04M02j97K31j13Q7l91
$$ plain form
6311 -199 162 43 -33 -168 -152 15 45 -138 123 55 268 -167 -24 12 26 -42 184 11 102 86 175 -21 -63 137
6335 137 -166 -355 -75 117 212 -105 15 -91 20 -1 91 468 161 181 -273 -32 -14 54 -337 82 300 73
6357 73 161 -269 -207 258 -191 311 107 -6 -65 -189 28 -201 -5 -147 198 -109 -146 151 83 -85 -146 99
6379 99 -12 -128 -56 -199 -158 -17 51 107 57 74 -46 219 129 -181 78 -312 -217 182 299 90 300 -154 194
6402 194 20 170 -87 337 -200 -18 47 -67 -15 -191 -31 -3 113 169 123 40 47 108 -186 -35 137 -132 43
6425 43 235 37 -48 -389 13 245 17 -12 56 151 -77 7 -93 100 3 -304 213 264 -203 56 229 -43 -19
6448 -19 13 143 317 -231 78 -95 -84 127 -59 -207 -59 216 -17 -116 339 -62 -13 315 -37 -23 -176 55
6470 55 158 203 -143 -40 -28 57 -47 -160 -84 -45 -84 30 1 -165 206 69 -178 -203 112 114 354 -100 -50 108
$$ packed form
6311a99L61j19p6j35J6J67L0j83K61o8K13m35J43L6J4o8K26j73R1j6Q9j96m2K00
6335A37l03j89K80J92R5l17J20j06J11k1R2L77l07K0m54K41J8O8l91M19K18k27
6357G3Q8m30O2M65m49N02k04j13n9j24K17k29J96j42L45l07l7K97o8j68o1K45
6379I9j11j16P2j43M1J41O8N6n0J7j20K65r0l10K59l90R5L99J17k09K10m54L48
6402A94j74J50k57M24n37J82O5j14N2j76J60K8J16N6m6q3PO1k94J51J72k69J75
6425D3J92j98q5l41M02K32k28k9O8R5k28Q4j00J93r7l07N17N1m67K59J73k72K4
6448a9L2J30J74n48L09j73J1K11j86j48J48K75k33r9M55m01M9L28l52J4j53K31
6470E5J03M5l46J03J2Q5j04j13P6L9l9J14k9j66L71j37k47k5L15KK40m54N0J58
$$ plain form
6494 108 -252 -226 -90 280 -119 77 31 174 137 254 276 -117 -216 71 -111 66 217 -86 37 -107 62 230
6516 230 164 -197 296 -40 -54 -328 219 -162 -70 209 -58 -108 -254 -106 275 -80 -330 112 69 -54 122 -6
6538 -6 -32 206 145 -40 191 -83 -352 -89 -77 86 29 -66 168 -126 -166 -236 -112 -201 28 41 -328 -150 -432 -357
6562 -357 -124 108 -13 153 -73 -167 173 -20 299 -109 -205 -42 -14 187 49 -81 -13 173 -284 -134 -254
6583 -254 82 -67 -291 145 106 -60 -50 1 359 -145 -81 -30 132 155 -109 -71 65 -101 -103 128 -238 35 -119
6606 -119 74 72 228 -175 177 0 88 -144 22 121 -113 -314 150 28 -59 159 -101 -262 -48 134 234 -29
6628 -29 -23 -135 -237 42 39 105 182 146 -78 108 34 345 168 -195 -415 77 321 -136 -111 72 -4 278 140 -37
6652 -37 -158 109 -98 158 -124 65 -46 -9 -51 157 109 17 -13 -290 -237 229 -292 70 130 -98 -290 255 17
$$ packed form
6494A08l60K6J36L70l99J96m6J43l7J17K2l93r9K87j82J77J51l03J23j44J69J68
6516B30o6l61M93l36j4k74N47l81R2K79k67n0j46J48L81l55k50M42m3j23J76j28
6538fk6K38o1j85K31k74k69K63J2J63n7r5K34k94m0p0J24q9K29J3l69J78k82P5
6562c57K33K32j21J66k26r4L40j93L19m08r6J63K8K01j38j30O8J86m57J50j20
6583b54L36j49k24M36l9j66J0N1L58n04O4N1J62K3k64L8J36j66kK31l66K73j54
6606a19J93kJ56m03L52j77Q8k32J66R9k34k01M64j22q7K18k60j61K14J82J00k63
6628b9Oj12j02K79lO6P7l6k24J86p4L11j77l63k20M92K44m57K5J83p6K82j38j77
6652c7j21K67k07K56k82J89j11L7m2K08m8r2l0k77N3M66n21L62O0k28j92N45k38
$$ plain form
6675 17 79 -164 -76 -177 -170 -108 -37 286 -113 206 -111 226 34 96 189 383 -78 250 139 157 252 -201 -178 -104
6699 -104 -301 166 137 71 -73 -10 -114 -108 -157 -15 -159 20 -180 207 65 -2 -4 277 167 10 136 105 266
6722 266 460 -53 -100 89 -21 53 -254 94 58 97 186 -49 30 5 65 -83 -112 -46 186 158 68 -39 -200 98
6746 98 53 166 90 42 -35 -183 -65 -289 -46 18 -143 42 136 -103 318 178 29 31 119 242 121 118 -118 1
6770 1 -4 245 262 41 -274 -50 -246 77 159 -143 -276 180 144 -129 124 295 -259 -72 -209 196 105 278 155
6793 155 -146 18 -171 97 -122 -111 39 98 -187 55 4 -72 245 -144 -150 142 59 -91 -13 -63 -124 -203 -343 91
6817 91 245 -212 86 -94 -245 -61 -42 132 -300 224 170 135 55 24 -407 164 217 -27 8 -37 43 -75 110
6840 110 157 18 -93 -42 -173 -74 -8 15 -3 -38 -133 -231 191 102 67 -73 114 -3 81 -34 30 -276 125 76 169
$$ packed form
6675A7O2k43Q8j01PO2P1L23l99L19l17L37j92O2R3J94m61L28j11J8R5m53K3P4
6699a04j97M67k9o6j44O3j04Om9J42j44J79k00L87j42o7kK81j10j57J26l1J61
6722B66J94n13m7J89j10P4l07L48l6L9Q9k35P9k5O0j48k9O6K32k8r0j07j61K98
6746I8m5J13p6m8p7j48J18k24K43O4j61J85R4k39M21j40j49KQ8J23j21lk36J19
6770AnK49J7k21l15K24j96L23Q2l02j33M56l6k73K53J71n54J87j37M05r1J73j23
6793A55l01J64j89K68k19J1J50N9k85K42n1p6L17l89oK92q3j50P8n0o1p9j40M34
6817I1J54m57K98j80j51J84J9J74m32N24n4l5q0l1m31N71N3k44L5m5Q0j18J85
6840A10M7j39j11N1j31R9O6K3j8l5r5r8M22q9l5j40J87j17Q4j15O4l06M01m9R3
$$ plain form
6865 169 17 176 -26 68 15 130 182 96 -186 -97 24 -122 -139 103 139 -361 203 75 -316 31 -342 40
6887 40 8 -492 -13 124 326 -233 -343 34 -139 190 264 -265 220 31 -261 219 289 -17 -89 -237 -57 391
6909 391 43 118 -124 1 148 88 72 30 -300 -177 283 101 162 -64 -15 31 28 -208 70 42 81 -59 -7 149
6933 149 84 169 -139 -26 10 64 -123 -12 -22 -118 -124 -12 -126 -57 61 -192 179 46 27 131 -25 106 263
6956 263 45 91 -46 232 -45 -204 -150 -118 360 -203 -40 130 -85 -231 -99 -83 -116 -91 292 -133 83 129
6978 129 -115 218 97 105 106 131 183 62 209 33 193 -28 -75 137 -158 -246 93 140 -13 53 -85 -92 -53 -204
7002 -204 -126 -1 14 -277 -493 -142 -98 -110 -74 76 -94 -114 -165 -236 19 -47 -222 287 -287 -246 -429 -26 226
7025 226 -328 -351 284 309 -223 -43 27 272 -205 26 114 -214 52 9 102 40 205 247 42 318 -64 130 39
$$ packed form
6865A69j52J59k02R4n3J15N2q6k82Q9J21j46j7K42L6n00N64j28l91L47l73L82
6887D0l2n00M79J37K02n59j10L77j73L29P4n29M85j89k92M80P0l06p2j48J80M48
6909C91l48P5k42J25J47o0j6m2l30J23M60j82O1k26M9M6lk36K78k8L9j40N2J56
6933A49o5Q5l08J13L6N4j87J11j0r6oJ12j14O9J18k53L71j33j9J04j56J31J57
6956B63k18M6j37K78k77j59N4L2M78n63J63J70k15j46J32J6l3K5L83m25K16M6
6978A29k44L33j21QJK5N2j21J47j76J60k21m7K12k95q8L39M7j53O6j38pL9j51
7002b04P8J25J5k91k16L51M4j2L6J50j70k0n1p1K55o6j75N09n74M1j83M03K52
7025B26n54k3O35K5n32J80P0K45m77K31Q8l28K66m3R3o2J65M2k05K76l82J94r1
$$ plain form
7048 39 -201 222 -210 -95 5 -55 237 127 70 -2 7 -93 31 18 -185 -127 330 299 -175 191 -182 17 344
7071 344 69 -26 -79 43 -69 -161 -10 -183 105 -153 -57 128 90 -106 -45 -62 -135 207 -86 -43 118 34 -248
7094 -248 -309 -130 -284 132 -70 -141 -44 -122 28 -102 102 -224 -82 387 118 -40 29 227 -51 235 -44 -21
7116 -21 -135 -85 -441 -28 87 86 -17 83 70 -224 409 -103 -191 -22 -2 -222 -118 -213 16 -122 -284 -41 181
7139 181 38 267 -3 -204 -265 -32 71 -168 -129 144 88 -93 138 131 41 276 -55 48 -66 -42 199 186 349
7162 349 -52 129 3 -104 -148 137 -109 102 23 -48 -153 92 -106 55 126 166 11 -18 -73 125 -233 -42
7184 -42 56 191 278 -100 202 271 -121 -133 235 101 193 410 69 99 51 -53 -73 -58 42 -6 -141 -139 -10 69 1
7209 1 -70 0 -319 195 10 -36 64 265 -439 -83 -6 165 140 -390 46 27 71 -154 -122 169 17 -140 43
$$ packed form
7048C9k40M23m32J15J00o0K92j10n7p2Rj00J24j3k03N8M57l1m74L66l73J99L27
7071C44k75r5n3J22j12r2J51j73K88k58R6J85l8j96O1j7p3L42k93M3J61q4k82
7094b48o1J79j54M16k02p1R7p8J50j30K04l26J42M69k69j58O9J98k78K86k79K3
7116b1j14N0l56M13J15jj03J00j3k94O33n12q8J69K0k20J04r5K29j38j62K43K22
7139A81j43K29k70k01o1K33J03k39L9K73n6j81K31pr0K35l31J03j14K4K41j3J63
7162C49m01J81j26j07m4K85k46K11p9p1j05K45j98J61P1M0j55k9n5J98l58J91
7184d2R8J35Q7l78L02O9l92j2L68j34R2K17l41L0m8j04k0J5J00m8j35KJ29P9o8
7209Ap1P0l19N14j85m6J00K01p04L56P7J71k5n30M36j9M4k25L2K91j52j57J83
$$ plain form
7232 43 -8 98 -305 -44 82 -67 -48 95 -189 -250 172 -90 27 233 -251 319 -168 -325 66 -67 -115 61
7254 61 30 68 53 302 182 31 -42 266 -101 -33 9 -2 -152 75 61 -498 -52 -46 -120 258 -34 27 -165 22
7278 22 -30 286 165 -8 151 -58 -108 177 -210 -205 69 -86 -109 -140 -312 -255 20 13 -96 -128 173 164 -57 -20 -268
7303 -268 205 -41 130 -182 -39 -64 -201 227 -1 144 168 -19 163 8 -186 -109 -89 90 129 -45 -9 346
7325 346 34 -121 264 -46 179 112 -245 -103 -76 -254 74 -71 67 -40 310 -69 52 -91 39 51 224
7346 224 107 113 -95 186 55 -3 0 64 -42 -85 -79 -135 145 -229 148 -106 -35 7 -95 149 165 220 -57 -124 -46
7371 -46 -45 -99 -28 -94 153 42 -41 59 -266 -37 -10 -4 -6 162 76 1 -106 -248 245 -123 -100 -224 48 90 -149
7396 -149 -91 41 65 142 93 21 -18 48 1 -238 -79 -31 -129 386 -309 -168 258 208 130 91 57 68 -44 68 275
$$ packed form
7232D3n1J06m03K61J26j49J9J43k84o1M22k62J17K06m84N70m87j57L91j33m8J76
7254F1l1L8j5K49j20j51p3L08l67O8M2j1j50K27j4n59M46Op4L78k92O1j92J87
7278B2n2L16j21j73J59k09n0K85l87NK74j55k3l1j72N7K75pj09l2L01rk21L7k48
7303b68M73k46J71l12J43k5j37M28k28J45K4j87J82j55j94P7K0J79L9j74L6L55
7325C46l12j55L85l10K25o7l57J42K7j78L28j45J38j07L50l79J21j43J30J2J73
7346B24j17Ok08K81j31n8LO4j06m3On6K80l74L77k54P1M2j02K44J6N5k77o7P8
7371d6Jn4P1o6K47j11q3J00l25K29K7OkJ68q6p5j07j42M93l68K3j24K72M2k39
7396a49N8J32K4P7m9p2l9O6m7k39J59M8r8N15o95J41M26n0p8l9l4J1j12J12K07
$$ plain form
7421 275 79 -276 -64 91 161 -70 -79 -4 -76 116 450 -83 -39 170 -92 188 101 216 192 -287 -315 -136 250
7444 250 -32 280 -218 -190 -82 -211 -85 -161 31 -169 -247 117 -91 -143 219 -12 -74 -17 79 -148 11 -21 -47
7467 -47 -52 120 76 175 -14 -175 -89 324 116 -160 -191 -5 -190 -91 68 -157 -192 -17 -120 -251 101 22 -121
7490 -121 -66 3 -48 -33 -250 27 34 -215 63 -121 59 64 -74 -81 66 -88 -14 -194 -165 -71 -329 -198 -147 38 -122
7515 -122 -33 137 -146 -35 -92 -206 47 -2 83 -123 -21 121 48 36 -213 109 -242 21 206 122 -32 54 109
7538 109 -79 -6 79 33 51 18 214 -132 -295 -270 -148 -8 -77 -203 -195 110 108 35 -2 5 17 -197 85 205 38
7563 38 -227 -289 -68 -142 -95 -92 -12 469 -20 -72 -12 -27 75 101 -122 -98 185 91 95 -24 13 282 174 -175 165
7588 165 -188 -81 -165 -54 221 106 392 208 -431 382 111 -229 236 -227 -50 -41 74 -154 -9 -300 33
$$ packed form
7421B75j96l55K12J55P0k31rP5p2J92L34n33M4K09k62K80q7J15k4m79k8J79L86
7444B50k82L12m98K8J08j29J26p6J92k00p8L64k08n2L62k31o2N7R6k27J59l2k6
7467d7nJ72m4R9j89j61Q6M13k08k76l1J86j85R9J59k25l5J75j03j31L52p9j43
7490a21N5O9n1J5k17K77Pk49K78j84J80Nj38pJ47j54P4j80K9R4k58J31N1J85j60
7515a22Q9J70k83J11n7j14K53m9Q5k06J02J42p3j2k49L22l51K63J85q4j54Q6N5
7538A09j88P3Q5m6J8l3J96l46j63K5J22J40o9j26QL05kp3l7PJ2k14K82J20j67
7563C8k65o2K21p4M7LQ0M81m89n2O0j5J02K6k23K4K83r4Mj19L7K69j08l49L40
7588A65l53J07q4J11K75j15K86j84o39Q13k71l40M65m63J77RJ15k28J45k91L33
$$ plain form
7609 33 171 -56 -270 -140 50 80 -260 -73 332 -42 41 -309 -131 151 87 70 13 279 -68 -172 71 -62
7631 -62 161 -6 112 -112 141 -192 97 -326 147 -154 -31 -96 41 102 -196 -110 56 157 -364 -234 -131
7652 -131 45 -20 20 137 -59 -89 99 191 42 -54 -248 116 156 -142 -145 22 -229 236 -50 -38 38 -249 77
7675 77 -83 41 -116 251 -172 -124 -144 38 132 67 61 -223 -28 -23 131 230 226 137 108 -71 163 11 291 48 -195
7700 -195 -66 132 -116 113 93 -181 3 -83 55 92 -204 102 191 -58 386 -93 44 -311 -30 -249 362
7721 362 93 -162 154 -54 -64 158 -276 40 126 -30 -148 392 -95 -92 -63 80 95 -167 284 -49 242 8
7743 8 -23 68 -13 354 -45 94 104 80 5 -9 97 240 247 22 140 -30 -93 38 218 267 240 -196 -16 177 -72
7768 -72 160 23 -42 -58 -260 79 140 -454 -136 185 240 61 46 -30 5 185 -23 6 181 55 -31 -32 -102 -33 217
$$ packed form
7609C3J38k27k14J30J90L0l40J87M05l74Q3l50J78K82o4j7n7K66l47j04K43j33
7631f2K23j67J18k24K53l33K89m23M73l01J23o5J37O1k98Q6J66J01n21J30J03
7652a31J76o5M0J17j96l0J88R2j49r6j94L64M0k98lJ67k51M65k86J2P6k87L26
7675G7j60J24j57L67m23M8k0J82R4o5ok84J95NJ54R9mq9k9j79K34j52K80k43k43
7700a95J29J98k48K29k0k74J84q6J38L7k96L06Q9k49M44m79J37l55K81k19O11
7721C62k69k55L16k08j0K22m34L16Q6j56j18N40m87LK9J43J5k62M51l33K91k34
7743Hl1R1q1L67l99J39J0k4p5j4J06J43Pk25J18j70o3J31J80M9k7m36J80J93k49
7768g2K32j37o5j6k02L39O1n94L18L21N5j79j5p6L5J80k08K9J75j26q6jp0O9K50
$$ plain form
7793 217 161 31 -271 6 239 -79 305 -197 -221 -102 111 94 59 -175 -154 -4 -184 -137 -50 64 -104 63
7815 63 -269 -27 -22 314 -257 90 247 -3 -48 86 -15 -109 -155 -77 -33 -276 22 209 -20 97 -177 168 -281
7838 -281 -302 -3 45 -115 -252 -214 171 -65 -53 178 129 394 -360 22 318 -7 -86 12 -13 -208 254 130 -50
7861 -50 166 -25 -210 42 226 -5 197 -110 47 -63 129 -182 37 45 53 33 -49 -13 40 -114 192 -248 -94
7884 -94 -23 143 -68 26 190 -326 -287 303 284 172 92 33 148 112 -68 -50 192 -272 -154 -178 311 -143 -10
7907 -10 -88 -348 78 289 118 218 72 215 57 -51 28 253 54 -325 -163 -185 -462 56 -183 -36 250
7928 250 -7 7 80 -288 -15 -181 -141 112 135 82 -116 -10 354 249 207 26 -56 93 -22 9 26 132 -62
7951 -62 -152 228 60 32 -312 -286 63 -11 45 448 -25 -15 -239 196 71 -90 -99 49 8 50 -85 106 -43 35
$$ packed form
7793B17n6j30l02K77K33l18L84n02k4J19K13j7l5k34K1J50j80M7Q7J14j68J67
7815F3l32K42NL36n71L47J57k50m5J34j01r4m6P8M4k43K98J87k29J17k74L45m49
7838b81k1K99M8j60j37L8L85k36J2K31m9K65p54L82K96l25p9R8k5j95M62j24j80
7861e0K16j91j85K52J84k31K02l07J57j10J92l11K19QQk0q2L6N3j54L06m40J54
7884i4P1J66k11R4J64n16L9N90j9j12q0n9J15l6j80J8K42m64J18k4M89m54J33
7907a0p8k60M26K11j71J00j46J43j58j08P9K25j99l79J62k2k77N18k39J47K86
7928B50k57J4P3l68K73j66M0K53K3n3j98J06L64j05m2j81q2J49j15L1J7J06j94
7951f2r0L80j68k8l44K6L49p4N6M03m73J0k24M35j25j61rJ48m1M2j35J91j49P8
$$ plain form
7975 35 -44 188 61 103 36 -124 -64 42 93 288 40 -89 26 1 -179 -26 101 144 187 -43 44 65 77 -74
7999 -74 150 58 -22 -48 144 162 -190 76 122 -122 -4 -135 -180 118 209 26 -69 -239 -290 11 122 301 71
8022 71 -103 255 -131 53 127 178 110 -131 -360 118 -27 -6 -192 -163 -105 89 310 -188 440 169 228 -81 -186
8045 -186 -59 -54 249 26 224 76 -173 85 328 -7 77 245 -66 351 79 -226 90 62 -53 159 18
8066 18 -222 60 63 68 -54 -74 -163 63 -6 248 -45 -77 193 54 -98 82 104 42 12 170 -31 -177 62 321
8090 321 -139 12 77 -3 165 304 -200 192 -331 -205 58 -100 53 -74 -47 187 -97 -38 -59 39 207 -86
8112 -86 -172 -199 211 132 149 -31 284 74 -171 -113 -123 318 145 190 204 -124 124 -57 56 -48 321 -241 -381
8135 -381 -26 191 63 5 -120 167 -37 -83 10 189 -207 -274 -34 271 129 -24 -49 -77 167 -86 41 -253
$$ packed form
7975C5p9K32j27M2o7j60O0J06N1J95k48j29J15k5j80J53J27M3M3k30Q7K1J2j51
7999g4K24r2q0k6J92J8l52K66M6k44J18j31m5K98R1j83r5j70n1L01J11J79k30
8022G1j74L58l86J84P4N1o8k41k29M78j45K1j86K9N8J94K21m98O28k71N9l09j05
8045a86J27NL03k23J98j48k49K58K43l35Q4J68l11M17k72l05L16k8j15K12j41
8066A8k40K82LNj22k0q9K26o9K54k93l2K70j39j52J80K2o2l0J58k01j46K39K59
8090C21m60J51O5q0J68J39n04L92n23J26K63j58J53j27K7K34k84N9k1R8J68k93
8112h6q6k7M10p9J7j80L15k10k45N8j0M41j73M5J4l28K48j81J13j04L69n62j40
8135c81L55K17j28n8j25K87k04m6R3J79l96o7K40L05j42j53k5k8K44k53J27k94
$$ plain form
8157 -253 -133 -53 -11 -237 -66 -248 37 142 -386 200 42 -97 100 -70 -240 -143 138 -122 149 -244 -73
8178 -73 32 -88 137 -209 190 127 23 -65 115 34 -28 415 169
$$ packed form
8157b53J20Q0M2k26J71j82K85J05n28N86j58j39J97j70j70R7K81k60K71l93J71
8178g3J05j20K25l46L99o3j04q8J80q1o2M43k46
8191A69
$$ Imaginary data points
##PAGE= N=2
##DATA TABLE= (X++(I..I)), XYDATA
$$ plain form
0 0 0 0 0 -8 8 -8 8 -16 16 -24 32 -32 48 -56 64 -80 96 -112 136 -160 184 -214 248 -285 328 -374 428
27 428 -487 550 -620 703 -786 882 -988 1100 -1226 1363 -1514 1679 -1863 2063 -2285 2530
43 2530 -2799 3102 -3442 3825 -4261 4767 -5352 6044 -6879 7906 -9207 10915 -13266 16735
57 16735 -22369 33085 -60827 282136 557133 -113681 -316556 -29286 288977 165366 52062
68 52062 136667 177351 -92643 -228302 57226 410592 270704 -120550 -191813 111319 268636
79 268636 134050 10123 65475 63558 -48422 -24668 200390 258844 -17802 -257423 -85798
90 -85798 244317 275757 36063 -88596 -17135 34106 23076 105149 207956 91600 -173848
101 -173848 -206825 71656 264889 111549 -120689 -111812 16927 21029 -2996 116174 198191
$$ packed form
0@%%%qJ6j6J6k4L2m0N6o4Q0j04J20j44J76k08K48k96L44l98M62n33O13p02Q02
27D28r15J037j170J323j489J668j870K088k326K589k877L193l542L926m348M815
43B530n329N901o544P267q086R028j0119J1396j2923J4785j7113K0122k4181L0001
57A6735l9104N5454r3912L42963K74997o70814k02875K87270L18263j23611j13304
68E2062Q4605M0684k69994j35659K85528L53366j39888l91254p1263L03132J57317
79B68636j34586j23927N5352j917j11980K3754K25058N8454k76646k39621J71625
90h5798L30115L1440k39694j24659P1461N1241j1030Q2073J02807j16356k65448
101a73848l2977K78481J93233j53340k32238Q877J28739M102k4025J19170Q2017
$$ plain form
112 198191 -98 -259787 -168498 189466 299208 5425 -253161 -140753 89546 82532
122 82532 -51680 -31888 68750 8347 -129398 -71106 129746 146321 -71693 -194859 -42405
133 -42405 137503 84141 -82813 -116662 -40485 -18252 -27792 39072 99660 1964 -159666 -140865
145 -140865 62658 182345 69175 -106692 -134325 -41747 24799 38996 39802 1286 -83176
156 -83176 -111823 -16916 95194 85244 -15127 -69614 -37426 7084 24768 44801 50223 -17565
168 -17565 -106471 -77391 64029 125140 10401 -119793 -80399 65671 118493 31925 -50492
179 -50492 -33012 14999 20125 22522 55601 44952 -47319 -111404 -36580 99405 126712 16795
191 16795 -90244 -77601 12242 77675 83615 52952 -5080 -69145 -71697 15926 106424 85649
$$ packed form
112A98191j98289k59689R1289L57964J09742k93783k58586J12408K30299p014
122H2532j34212J9792J00638o0403j37745N8292K00852J6575k18014j23166J52454
133d2405J79908n3362j66954l3849P6177K2233r540O6864O0588r7696j61630J8801
145a40865K03523J19687j13170j75867k7633R2578O6546J4197Q06l8516q4462
156h3176k8647R4907J12110r950j00371n4487L2188M4510J7684K0033N422o7788
168a7565q8906K9080J41420O1111j14739j30194L9394J46070N2822q6568q2417
179e0492J7480M8011N126K397L3079j0649r2271o4085P4824J35985K7307j09917
191A6795j07039J2643Q9843O5433N940l0663n8032o4065k552Q7623R0498k0775
$$ plain form
203 85649 -33058 -115575 -65011 56398 105132 37290 -50473 -57995 -1002 44269 45266 21913
215 21913 -7606 -39248 -52742 -17794 47820 64759 -9751 -99327 -89672 15387 97659 68670
227 68670 -32741 -100335 -72687 15604 79399 61786 -23718 -105873 -106895 -21763 64864 65129
239 65129 -12720 -86755 -97418 -44054 33235 75939 40151 -54254 -119452 -81224 24550 78684
251 78684 20009 -75716 -105188 -60876 -1422 33912 30872 -23675 -93590 -92922 4194 91445 49498
264 49498 -80039 -132000 -47445 48937 41556 -24159 -52933 -52171 -63537 -50775 26862 88709
276 88709 25146 -111030 -141836 -13075 111644 80030 -45704 -108409 -74335 -18548 20707
287 20707 47823 31392 -49559 -117218 -70243 53702 103361 21355 -76564 -76446 -14515 20678
$$ packed form
203H5649j18707q2517N0564J21409M8734o7842q7763p522N6993M5271R97k3353
215B1913k9519l1642j3494L4948O5614J6939p4510q9576R655J05059Q2272k8989
227F8670j01411o7594K7648Q8291O3795j7613q5504q2155j022Q5132Q6627K65
239F5129p7849p4035j0663N3364P7289M2704l5788r4405o5198L8228J05774N4134
251G8684n8675r5725k9472M4312N9454L5334l040n4547o9915O68R7116Q7251m1947
264D9498j29537n1961Q4555R6382p381o5715k8774P62j1366J2762P7637O1847
276H8709o3563j36176l0806J28761J24719l1614j25734o2705L4074N5787L9255
287B0707K7116j6431q0951o7659M6975J23945M9659q2006r7919J18O1931L5193
$$ plain form
299 20678 24260 24932 -697 -63432 -86769 -12976 77556 61521 -42469 -95170 -35916 45547
311 45547 55724 16681 -17316 -43176 -56543 -15110 63876 74624 -23201 -112118 -72386 41672
323 41672 81606 20211 -36775 -31400 -19999 -28333 2977 71300 66766 -45379 -123936 -51851
335 -51851 76425 90107 -12773 -82622 -49090 7223 16985 15974 29725 8424 -55233 -66394
347 -66394 14990 79375 29367 -64931 -74346 -3385 36554 9464 -17056 -9611 -15419 -42359 -23890
360 -23890 45028 62022 -18299 -90711 -53400 38510 62768 4815 -48456 -50525 -31498 -10881
372 -10881 23410 46333 4766 -70114 -74330 7946 67517 30916 -36546 -47498 -18548 -8052
384 -8052 -9733 11969 27877 -15033 -74702 -53167 36997 69102 -2487 -72604 -48264 19445
$$ packed form
299B0678L582O72k5629o2735k3337P3793R0532j6035j03990n2701N9254Q1463
311D5547J0177l9043l3997k5860j3367M1433P8986J0748r7825q8917L9732J14058
323D1672L9934o1395n6986N375J1401q334L1310O8323m534j12145p8557P2085
335e1851J28276J3682j02880o9849L3532N6313R762j011J3751k1301o3657j1161
347f6394Q1384O4385n0008r4298r415P0961L9939k7090k6520P445n808k6940J8469
360b3890O8918J6994q0321p2412L7311R1910K4258n7953n3271k069J9027K0617
372a0881L4291K2923m1567p4880m216Q2276N9571l6601o7462j0952K8950J0496
384h052j681K1702J5908m2910n9669K1535R0164L2105p1589p0117K4340O7709
$$ plain form
396 19445 36497 4695 -17091 -19271 -30059 -33699 3501 46306 20449 -55688 -75520 -7875
408 -7875 55005 37055 -18556 -38718 -24429 -13485 -2185 26234 37716 -9978 -73309 -62859
420 -62859 19536 68970 25673 -44503 -59917 -21292 17153 31810 24487 -3737 -41222 -48659
432 -48659 -4271 45976 35380 -24870 -57060 -28730 12979 23759 12410 -2422 -22942 -38812
444 -38812 -19500 31549 54539 7431 -60406 -63207 3147 53782 34849 -16944 -46440 -40315
456 -40315 -11817 24722 45326 21308 -34202 -63862 -25996 40018 57083 9875 -41695 -47977
468 -47977 -19471 12197 31554 27863 -6722 -48417 -48688 4146 56967 45787 -18402 -60445 -34508
481 -34508 20307 43877 22586 -15762 -40421 -33716 1200 35408 34997 -3155 -42926 -40495 4592
$$ packed form
396A9445J7052l1802k1786k180j0788l640L7200M2805k5857p6137j9832O7645
408g875O2880j7950n5611k0162J4289J0944J1300K8419J1482m7694o3331J0450
420f2859Q2395M9434m3297p0176j5414L8625L8445J4657p323k8224l7485p437
432d8659M4388N0247j0596o0250l2190K8330M1709J0780j1349j4832k0520j5870
444c8812J9312N1049K2990m7108o7837k801O6354N0635j8933n1793k9496O125
456d0315K8498L6539K0604k4018n5510k9660L7866O6014J7065m7208n1570o282
468d7977K8506L1668J9357l691l4585m1695k71N2834N2821j1180o4189m2043K5937
481c4508N4815K3570k1291l8348k4659O705L4916L4208m11l8152l9771K431M5087
$$ plain form
494 4592 43828 37549 -2264 -36716 -39185 -9811 30474 45503 14915 -36341 -56709 -20575 38045
507 38045 56944 15934 -37543 -48761 -13673 28703 43227 21214 -19146 -44065 -29505 12811
519 12811 42408 28538 -16226 -44984 -28175 13386 36940 25635 -5806 -31839 -31614 -930
531 -930 34132 36119 -2206 -43763 -42215 3780 42391 30773 -14023 -40927 -28176 4671 28065
544 28065 27164 2490 -28514 -38325 -13932 25285 38096 7095 -35787 -44008 -13163 22262 31294
557 31294 11156 -21278 -39353 -24662 12945 37538 20903 -22513 -46380 -24009 17173 31035
569 31035 8031 -21494 -31004 -18566 4593 21374 17237 -7712 -31537 -27353 4322 29950 19486
582 19486 -14800 -34340 -22632 3982 22054 19412 -3591 -30690 -32727 -1700 32188 31073 -5871
$$ packed form
494D592L9236o279l9813l4452k469K9374M0285J5029l0588n1256k0368L6134N8620
507C8045J8899m1010n3477j1218L5088M2376J4524k2013m0360k4919J4560M2316
519A2811K9597j3870m4764k8758J6809M1561K3554j1305l1441k6033K25L0684
531i30L5062J987l8325m1557J548M5995L8611j1618m4796k6904J2751L2847K3394
544B8065r01k4674l1004r811K4393L9217J2811l1001m2882q221L0845L5425R032
557C1294k0138l2434j8075J4691L7607K4593j6635m3416k3867K2371M1182J3862
569C1035k3004k9525r510J2438K3159J6781m137k4949k3825M184L1675K5628j0464
582A9486l4286j9540J1708K6614J8072k642k3003k7099k037L1027L3888j115l6944
$$ plain form
595 -5871 -37272 -28463 6715 28183 19720 -3302 -21303 -24721 -9343 17470 29312 11251 -20902
608 -20902 -32375 -8278 24891 31184 6723 -19005 -23033 -7009 15171 26780 15316 -13200
620 -13200 -29803 -13239 20996 35881 13021 -20543 -26545 -2665 21873 25921 12703 -6931
632 -6931 -21743 -16028 10768 33173 24633 -8788 -31015 -17675 16103 34164 21754 -4952 -23081
645 -23081 -19476 4941 31255 31082 578 -28794 -26364 6183 33216 26739 -3204 -24251 -18676
658 -18676 2827 21752 25314 8827 -17497 -27595 -7446 24600 32561 6956 -24790 -29354 -3947
671 -3947 22540 26475 8587 -16129 -29262 -14315 18129 35024 15351 -20858 -35156 -13717
683 -13717 19213 30097 11625 -15121 -28113 -18197 6899 27979 23026 -6544 -32204 -25746 6631
$$ packed form
595e871l1401Q809L5178K1468q463k3022j8001l418J5378K6813J1842j8061l2153
608b0902j1473K4097L3169O293k4461k5728m028J6024K2180J1609j1464k8516
620a3200j6603J6564L4235J4885k2860l3564o002K3880K4538M048j3218j9634
632f931j4812N715K6796K2405q540l3421k2227J3340L3778J8061j2410k6706j8129
645b3081L605K4417K6314j73l0504k9372K430L2547K7033o477k9943k1047N575
658a8676K1503J8925L562j6487k6324j0098K0149L2046P961k5605l1746m564K5407
671c947K6487L935j7888k4716j3133J4947L2444J6895j9673l6209j4298K1439
683a3717L2930J0884j8472k6746j2992R916K5096K1080m953k9570k5660O458L2377
$$ plain form
696 6631 31838 24289 -7601 -30194 -23958 2856 24946 24345 916 -25886 -29261 -1946 27832
709 27832 29276 896 -26010 -25352 -539 23138 24867 5996 -17306 -26285 -10597 19584 33079
722 33079 13327 -19069 -29810 -9028 21262 32655 14817 -13416 -26180 -12405 14981 32358
734 32358 21998 -8308 -28216 -16248 14870 33513 22436 -5256 -22711 -14113 10312 28025
746 28025 25242 3575 -19075 -20422 4216 30435 29513 3153 -20534 -18328 5341 27475 27620
759 27620 7390 -14799 -18943 -136 25168 31342 10432 -16147 -20557 -198 23057 28351 11698
772 11698 -11200 -19378 -4726 18251 29467 17363 -8115 -22322 -9636 17224 30061 17376
784 17376 -7845 -21019 -10040 13317 26482 17884 -3502 -19019 -13957 9081 27414 20491 -4190
$$ packed form
696F631K5207p549l1890k2593O236K6814K2090o01k3429k6802l375K7315K9778
709B7832J444k8380k6906O58K4813K3677J729j8871k3302q979J5688L0181J3495
722C3079j9752l2396j0741K0782L0290J1393j7838k8233j2764J3775K7386J7377
734C2358j0360l0306j9908J1968L1118J8643j1077k7692j7455Q598K4425J7713
746B8025k783k1667k2650j347K4638K6219r22k6360k3687K206K3669K2134J45
759B7620k0230k2189m144J8807K5304O174k0910k6579m410K0359K3255N294j6653
772A1698k2898q178J4652K2977J1216j2104k5478j4207J2686K6860J2837j2685
784A7376k5221j3174J0979K3357J3165q598k1386j5517N062K3038J8333o923k4681
$$ plain form
797 -4190 -19682 -13225 7349 22740 19052 -190 -16982 -15916 2412 21765 22444 2279 -18531
810 -18531 -17800 2730 21342 21058 3186 -16511 -18438 -432 19067 21550 5345 -14452 -19610
823 -19610 -3610 18280 23159 6833 -13260 -18514 -4371 15391 22183 9457 -10255 -19366 -8423
836 -8423 12983 24317 12595 -10300 -19858 -7838 13067 23089 13550 -6948 -18959 -10357 10630
849 10630 23183 15893 -5106 -19170 -12033 8875 23166 16886 -2634 -17277 -13371 6603 23037
862 23037 18947 -201 -16630 -15452 3560 22614 21674 1668 -17352 -16284 2540 20987 21798
875 21798 4595 -14266 -17315 -835 19150 24009 7382 -14199 -19027 -3196 17490 22791 9411
888 9411 -11293 -19762 -6372 15494 24349 11809 -9768 -20035 -9262 12454 23985 13204 -8388
$$ packed form
797d190j5492O457K0574J5391l688j9242j6792J066J8328J9353O79k0165k0810
810a8531P31K0530J8612k84j7872j9697j927J8006J9499K483j6205j9797n158
823a9610J6000K1890M879j6326k0093n254J4143J9762O792j2726j9712r111J0943
836h423K1406J1334j1722k2895r558J2020K0905J0022r539k0498j2011Q602K0987
849A0630J2553p290k0999j4064P137K0908J4291o280j9520j4643L906J9974J6434
862B3037m090j9148j6429J178J9012J9054r40k0006j9020J068J8824J8447Q11
875B1798j7203j8861l049J6480J9985M859j6627k1581m828J5831K0686N301j3380
888I411k0704q469J3390K1866Q855j2540k1577j0267J0773K1716J1531j0781k1592
$$ plain form
901 -8388 -20741 -11800 10142 23641 15062 -6242 -19883 -13238 6842 22245 17735 -3624 -20680
914 -20680 -15556 4278 20981 18423 -985 -19299 -18369 961 19787 20056 1987 -17848 -19926
927 -19926 -1429 18201 20622 3844 -15828 -21204 -5246 15937 21397 6232 -14148 -20861 -7897
940 -7897 13208 21719 9185 -11908 -21248 -9915 10938 21221 11349 -9838 -21318 -11944 7727
953 7727 20130 13147 -7477 -20874 -13767 6150 20027 14177 -4518 -19902 -15681 3656 18368
966 18368 15216 -3026 -19106 -17530 464 17625 16987 -259 -17243 -18503 -1904 16111 17948
979 17948 1577 -15940 -18399 -4548 13069 18095 4680 -14531 -19829 -6297 11851 17960 6331
992 6331 -12185 -19448 -8120 9147 17160 7704 -10323 -19763 -10871 7639 16549 8548 -8950 -19691
$$ packed form
901h388j2353Q941K1942J3499q579k1304j3641O645K0080J5403m510k1359j7056
914b0680N124J9834J6703k558j9408j8314R30J9330J8826K69j8069j9835k078
927a9926J8497J9630K421j6778j9672n376J5958K1183N460j5165k0380o713J2964
940g897K1105Q511j2534k1093r340J1333K0853J0283r872k1187j1480R374J9671
953G727J2403o983k0624j3397P107J9917J3877n850j8695j5384M221J9337J4712
966A8368l152j8242j6080J576J7994J7161o38j7246j6984j260J6599J8015J837
979A7948j6371j7517k459J3851J7617N026j3415j9211n298J3532J8148O109j1629
992F331j8516p263J1328J7267Q013r456j8027r440Q892J8510Q910q001j7498j0741
$$ plain form
1006 -19691 -12335 5579 16273 9794 -7223 -18320 -13678 3136 15794 11269 -5751 -18422 -15170
1019 -15170 1001 14756 12269 -3964 -17969 -15722 -844 12972 13174 -1152 -16543 -17107 -2769
1032 -2769 12237 13284 -26 -15324 -17604 -4183 10909 13566 1806 -13081 -17284 -5816 10026
1045 10026 14790 3456 -12318 -17671 -7344 8666 14684 4426 -11480 -17114 -8291 7169 15087
1058 15087 7413 -8864 -17671 -10002 6837 15527 8399 -7612 -17885 -11109 4653 14298 10062
1071 10062 -4973 -16415 -13158 2969 15078 11590 -3623 -15652 -13498 1442 13862 12154 -2037
1084 -2037 -14456 -14479 -1391 13038 13970 -355 -14312 -14726 -1758 12895 14470 1700 -13329 -15034
1098 -15034 -3710 10616 14431 3865 -11827 -17320 -5908 10177 15682 5281 -10798 -16766 -7211
$$ packed form
1006a9691P356J7914J0694o479j7017j1097M642J6814J2658m525j7020j2671L252
1019a5170J6171J3755k487j6233j4005K247J4878J3816K02j4326j5391n64J4338
1032b769J5006J047j3310j5298k280J3421J5092K657j1760j4887m203J1468J5842
1045A0026M764j1334j5774n353J0327J6010O018j0258j5906n634Q823J5460P918
1058A5087p674j6277q807P669J6839Q690p128j6011j0273O776J5762R645m236
1071A0062j5035j1442L257J6127J2109l488j5213j2029K154J4940J2420j708j4191
1084b037j2419k3J3088J4429R32j4325j3957m14J2968J4653J575j2770j5029j705
1098a5034J1324J4326L815j0566j5692n493J1412J6085N505j0401j6079n968R555
$$ plain form
1111 -7211 8264 15337 7132 -8404 -17084 -10533 5646 15501 8761 -7662 -16885 -11217 4219 14752
1125 14752 9625 -5206 -15665 -12414 1801 13459 11524 -3553 -16578 -13682 660 12979 11352
1138 11352 -2068 -14997 -14728 -1240 12175 12593 504 -13911 -16492 -3375 11879 13991 1251
1151 1251 -13480 -16337 -4977 10018 13932 4020 -10629 -16097 -7168 8528 14996 6245 -9686
1164 -9686 -16527 -8402 6479 14098 7563 -7381 -15411 -9511 4504 13711 9566 -4599 -15342 -10392
1178 -10392 4309 14014 9895 -3594 -13791 -11214 1964 12605 10865 -1434 -13209 -12458 341
1191 341 13408 12686 -126 -12338 -12273 -992 11316 13371 2266 -10668 -13362 -3176 10073 14414
1205 14414 4218 -10032 -13662 -3437 9596 13579 5624 -7763 -13173 -5196 7350 12961 6637
$$ packed form
1111g211J5475P073q205j5536q680O551J6179R855o740j6423r223N668J5436J0533
1125A4752n127j4831j0459L251J4215J1658j935j5077j3025K896J4342J2319j627
1138A1352j3420j2929K69J3488J3415M18j2089j4415k581J3117J5254K112j2740
1151A251j4731k857J1360J4995L914r912j4649n468Q929J5696O468q751j5931
1164i686o841Q125J4881P619o535j4944q030N900J4015R207m145j4165j0743M950
1178a0392J4701R705m119j3489j0197K577J3178J0641j740j2299j1775P51J2799
1191C41J3067p22j2812j2212O5J1281J2308K055j1105j2934k694J0186J3249M341
1205A4414j0196j4250l630J0225J3033L983p955j3387n410P977J2546N611o324
$$ plain form
1218 6637 -6156 -13205 -7025 6441 13159 7195 -5186 -12204 -7384 5031 12801 8507 -3703 -12340
1232 -12340 -8954 2919 12330 9303 -3453 -12620 -9535 1932 11310 9789 -1242 -11453 -10579 -184
1246 -184 10519 10662 -59 -11542 -12312 -1294 9473 10501 960 -10152 -12055 -3107 8164 11100
1260 11100 2111 -8856 -12974 -4661 7682 10836 2189 -9136 -12414 -5040 5711 10322 4067 -7325
1274 -7325 -12471 -6787 4774 11141 5589 -6927 -13344 -7597 4049 10530 5742 -5344 -12839 -9221
1288 -9221 2524 10218 7725 -3495 -12524 -9972 1913 10616 7610 -3381 -11215 -10191 -396 9104
1302 9104 8400 -989 -10374 -11359 -1568 9035 10199 181 -10123 -10795 -1892 7692 9966 1631 -9443
1317 -9443 -12090 -3677 7295 10950 2984 -8952 -12154 -4139 7368 10503 3850 -6941 -11784 -6014
$$ packed form
1218F637j2793p049O180J3466O718n964j2381p018M820J2415P770m294j2210q637
1232a2340L386J1873R411l027j2756r167L085J1467R378j521j1031j0211Q74J0395
1246a84J0703J43j0721j1483p70J1018J0767J028r541j1112j903Q948J1271K936
1260A1100q989j0967m118Q313J2343L154q647j1325l278P374J0751M611o255j1392
1274g325n146N684J1561O367n552j2516o417N747J1646O481m788j1086p495L618
1288i221J1745P694k493j1220r029K552J1885Q703l006j0991p834J024R795R500
1302I104p04r389r385r85R791J0603J164j0018j0304o72Q903R584K274q335j1074
1317i443k647Q413J0972L655p966j1936l202Q015J1507L135o653j0791m843N770
$$ plain form
1331 -6014 5564 10922 5676 -5374 -12576 -7724 4137 11814 6666 -4486 -11359 -7811 2777 10692
1345 10692 8422 -2363 -11075 -9449 1463 10413 8714 -2114 -11072 -8937 1040 8961 9026 518
1359 518 -9460 -10162 -1062 8820 9753 1216 -9381 -11252 -2439 8067 10182 1948 -8123 -11021 -3803
1374 -3803 7203 11175 3479 -7144 -11439 -5198 5955 10822 4377 -6694 -11142 -5864 3555 9952
1388 9952 6484 -4100 -11266 -7504 2846 10147 6707 -3649 -10789 -8155 1585 8703 6740 -1831
1402 -1831 -10078 -9097 492 9077 8018 -1654 -9590 -9411 -599 8150 8130 -682 -8902 -9482 -2203 6841
1418 6841 8718 1300 -8324 -10336 -3177 6467 9873 2623 -7579 -10175 -3849 4979 8684 3739 -5893
1433 -5893 -10759 -5535 4506 9303 4185 -4947 -9994 -5573 3681 8661 4971 -3662 -9334 -6685 2388
$$ packed form
1331f014J1578N358n246j1050p202M852J1861P677n148j1152o873L548J0588P915
1345A0692k270j0785q712J626J0912Q950j699j0828q958K135R977P921O5q508
1359E18r978p02R100R882R33q537j0597j871Q813J0506K115q234j0071k898P218
1374c803J1006L972p696j0623m295O241J1153M867o445j1071m448N278R419O397
1388I952l468j0584p166L762J0350P301l440j0356p140K634R740P118j963q571
1402a831q247R81R589Q585j059r672p936J79Q812Q749k0q812q220n80P279R044
1418F841J877p418r624k012P159R644L406p250j0202k596O326Q828L705m945r632
1433e893m866N224J0041M797n118r132n047M421R254M980l690q633n672K649R073
$$ plain form
1448 2388 8728 6051 -3043 -9363 -7411 1611 8778 7045 -2287 -8794 -6881 1019 7608 7583 -237
1463 -237 -8259 -8158 -320 7941 7722 471 -7736 -8073 -803 6930 8274 2558 -5854 -8663 -2423 6734
1479 6734 9366 2601 -5699 -8448 -3207 5527 8658 3575 -4808 -8094 -3609 4839 9295 4619 -3943
1494 -3943 -8097 -3836 4039 8825 5215 -3436 -8007 -4475 3172 8554 6183 -1687 -8102 -6164 2685
1509 2685 9122 6772 -1344 -7920 -6141 1234 8153 6937 89 -6904 -7411 -17 8212 8152 641 -6531
1525 -6531 -7056 -618 6602 8192 1694 -6170 -7960 -2116 5557 8562 2641 -5902 -8231 -2661 5534
1540 5534 8532 3480 -5063 -8256 -3621 4479 7808 3873 -3870 -8934 -4996 3597 8561 4497 -3391
1555 -3391 -8315 -5056 2441 8018 6256 -1866 -8053 -6638 1207 7760 6526 -1841 -7988 -6656 394
$$ packed form
1448B388O340k677r094o320J952R022P167j733r332o507J913P900O589k5p820
1463b37q022J01P838Q261k19p251q207l37P270P733J344n716q412k809O240R157
1479F734K632o765q300k749N241Q734L131n083q383l286M485Q448M456m676q562
1494c943m154M261P875M786l610q651m571L532P647N382k371p870o415J938Q849
1509B685O437k350q116o576J779P375O919j216o848o993n07P394Q229o0p511p172
1525f531n25O438P220J590o498p864j790N844P673L005n921q543k329N570Q195
1540E534K998n052q543l193M635Q100L329l935p743n064L938Q593M964m064p888
1555c391m924L259P497N577j762q122o187J415P845O553j234q367o147J332P050
$$ plain form
1570 394 6983 7021 -227 -6882 -7300 -299 6666 7144 858 -6458 -7645 -1381 6516 7090 1707 -5677
1586 -5677 -7721 -2043 5570 8034 2744 -4394 -7930 -3486 4958 8556 3644 -4642 -7527 -3474 4056
1601 4056 7994 4586 -3031 -7756 -4456 2957 8146 5666 -2040 -7684 -4985 2373 8005 6298 -967
1616 -967 -6803 -5760 1498 7245 6656 164 -5994 -6199 913 7350 7229 557 -5779 -5805 -246 6215
1632 6215 7016 1602 -5136 -6525 -1576 6007 8093 2646 -4790 -6415 -1565 4928 7818 3575 -3468
1647 -3468 -6984 -2682 4430 7528 4178 -3178 -7051 -3304 3877 7516 4135 -2015 -6052 -4267 2656
1662 2656 7382 4981 -1501 -6400 -5076 1602 6500 5457 -1174 -5933 -4998 1065 6275 6072 34
1677 34 -5625 -5576 33 5835 6013 262 -6102 -6249 -604 5266 5991 1172 -4815 -6243 -1716 5134 6281
$$ packed form
1570C94O589L8p248o655m18P001O965M78o286p316j187O264P897N74n383p384
1586e677k044N678P613K464n290p138l536M444Q444L598m912q286k885M053P530
1601D056L938l408p617m725L300P413N189k480p706n644K699P358N632j707p265
1616i67n836J043P258N747n89o492o158k05P112O437j21o672o336k6N559O461
1632F215Q01n414o738j389M949P583K086n447p436j625M850O493K890m243p043
1647c468l516M302P112L098l350p356l873L747P181L639l381o150m037J785O923
1662B656M726k401o482m899J324O678M898j043o631m759R35O063N210k03o038
1677C4n659M9N609N802J78n751o364j47N645N870P25m819n987j428M527O850J147
$$ plain form
1694 6281 2238 -4427 -7011 -2544 4335 6329 2316 -3838 -6580 -3493 3345 6765 2899 -3154 -6277
1709 -6277 -3777 2679 6474 3514 -2805 -6428 -3937 1885 5579 4308 -1838 -6494 -4595 1359 5681
1724 5681 4721 -995 -6203 -5110 824 5721 5002 -280 -5990 -5389 -274 5705 5616 268 -5139 -5892
1740 -5892 -769 5485 6123 1122 -4603 -5846 -1489 4611 6396 1776 -4180 -6128 -1894 4274 6486
1755 6486 2852 -3611 -6450 -2421 3627 6386 3233 -2831 -5937 -3312 3085 6482 3687 -1920 -5937
$$ packed form
1694F281m043o665k584M467O879J994m013o154k742L087O838L420l866o053l123
1709f277K500O456L795k960o319l623K491N822L694j271o146m656J899N954M322
1724E681r60n716n208J093N934M897p19n282n710O01N115N979q9n348n407p53
1740e892N123O254O38n001n725j243M357O100J785m620n956j948M234O168K212
1755F486l634o463k839M029O048K759l153o064l106K625O397L397k795n607m017
$$ [...]
8191A46
##END NTUPLES=NMR FID
##END=
