##TITLE=1H_CA-8717
 DMSO, 8 sc, 
 2.7.2020
##JCAMPDX= 6.0         $$ Bruker NMR JCAMP-DX V2.0
##DATA TYPE= NMR FID
##DATA CLASS= NTUPLES
##ORIGIN= UXNMR, Bruker Analytische Messtechnik GmbH
##OWNER= root
$$ XWIN-NMR		Version 3.5
$$ Thu Jul  2 09:45:32 2020 Russian Standard Time (UT+4h)  she@DPX200
##.OBSERVE FREQUENCY= 200.1315
##.OBSERVE NUCLEUS= ^1H
##.DELAY= (6, 6)
##.ACQUISITION MODE= SIMULTANEOUS
##.ACQUISITION SCHEME= undefined
##.AVERAGES= 8
##.DIGITISER RES= 18
##SPECTROMETER/DATA SYSTEM= spect
##.PULSE SEQUENCE= zg30
##.SOLVENT NAME= DMSO
##.SHIFT REFERENCE= (INTERNAL, DMSO, 0, 15.7039)
##AUDIT TRAIL= $$ (NUMBER, WHEN, WHO, WHERE, WHAT)
$$ ##TITLE= Audit trail, XWIN-NMR		Version 3.5
$$ ##JCAMPDX= 5.01
$$ ##ORIGIN= Bruker BioSpin GmbH
$$ ##OWNER= she
$$ F:/spectra/data/she/nmr/H-F/1/audita.txt
$$ ##AUDIT TRAIL=  $$ (NUMBER, WHEN, WHO, WHERE, WHAT)
(   1,<2020-07-02 09:44:24.28 +0400>,<she>,<DPX200>,
      <created by zg, POWCHK disabled, PULCHK disabled
       configuration hash MD5:
       00 E9 B6 7A A2 85 ED C7 34 08 36 98 17 FE 4E 26
       data hash MD5: 16K
       77 86 37 2A 9B 96 C0 19 E5 95 34 00 CF BC 93 59>)
$$ ##END=
$$ 
$$ hash MD5
$$ B1 DC ED 96 53 CE 68 AC 9C 03 3B 08 63 96 08 10
##$RELAX= 
##$RELAX= 
##$RELAX= 
##$RELAX= 
##$RELAX= 
##$RELAX= 
$$ Bruker specific parameters
$$ --------------------------
##$DU= <F:/spectra>
##$EXPNO= 1
##$NAME= <H-F>
##$PROCNO= 1
##$TYPE= <nmr>
##$USER= <she>
##$AMP= (0..31)
100 100 100 100 100 100 100 100 100 100 100 100 100 100 100 100 100 100 
100 100 100 100 100 100 100 100 100 100 100 100 100 100 
##$AQSEQ= 0
##$AQ_mod= 1
##$AUNM= <au_zg>
##$AUTOPOS= <>
##$BF1= 200.13
##$BF2= 200.13
##$BF3= 200.13
##$BF4= 200.13
##$BF5= 200.13
##$BF6= 200.13
##$BF7= 200.13
##$BF8= 200.13
##$BYTORDA= 1
##$CFDGTYP= 0
##$CFRGTYP= 5
##$CHEMSTR= <none>
##$CNST= (0..31)
1 1 145 1 1 1 1 1 1 1 1 1 1 1 1 1 1 1 1 1 1 1 1 1 1 1 1 1 1 1 1 1 
##$CPDPRG= <>
##$CPDPRG1= <>
##$CPDPRG2= <>
##$CPDPRG3= <>
##$CPDPRG4= <mlev>
##$CPDPRG5= <mlev>
##$CPDPRG6= <mlev>
##$CPDPRG7= <mlev>
##$CPDPRG8= <mlev>
##$CPDPRGB= <>
##$CPDPRGT= <>
##$D= (0..31)
0 1.2 0 0 0 0 0 0 0 0.06 0 0.03 0 0 0 0 0.0002 0 0 0 0 0 0 0 0 0 0 0 0 
0 0 0 
##$DATE= 1593668663
##$DBL= (0..7)
120 120 120 120 120 120 120 120 
##$DBP= (0..7)
150 150 150 150 150 150 150 150 
##$DBP07= 0
##$DBPNAM0= <>
##$DBPNAM1= <>
##$DBPNAM2= <>
##$DBPNAM3= <>
##$DBPNAM4= <>
##$DBPNAM5= <>
##$DBPNAM6= <>
##$DBPNAM7= <>
##$DBPOAL= (0..7)
0.5 0.5 0.5 0.5 0.5 0.5 0.5 0.5 
##$DBPOFFS= (0..7)
0 0 0 0 0 0 0 0 
##$DE= 6
##$DECBNUC= <off>
##$DECIM= 24
##$DECNUC= <off>
##$DECSTAT= 4
##$DIGMOD= 1
##$DIGTYP= 9
##$DL= (0..7)
0 120 120 120 120 120 120 120 
##$DP= (0..7)
150 150 150 150 150 150 150 150 
##$DP07= 0
##$DPNAME0= <>
##$DPNAME1= <>
##$DPNAME2= <>
##$DPNAME3= <>
##$DPNAME4= <>
##$DPNAME5= <>
##$DPNAME6= <>
##$DPNAME7= <>
##$DPOAL= (0..7)
0.5 0.5 0.5 0.5 0.5 0.5 0.5 0.5 
##$DPOFFS= (0..7)
0 0 0 0 0 0 0 0 
##$DQDMODE= 0
##$DR= 18
##$DS= 0
##$DSLIST= <SSSSSSSSSSSSSSS>
##$DSPFIRM= 0
$$ [...]
##$SUBNAM2= <"">
##$SUBNAM3= <"">
##$SUBNAM4= <"">
##$SUBNAM5= <"">
##$SUBNAM6= <"">
##$SUBNAM7= <"">
##$SUBNAM8= <"">
##$SUBNAM9= <"">
##$SW= 24.9337058887773
##$SWIBOX= (0..15)
0 0 2 0 0 0 0 0 0 0 0 0 0 0 0 0 
##$SW_h= 4990.01996007984
##$TD= 16384
##$TD0= 1
##$TE= 0
##$TE2= 300
##$TE3= 300
##$TEG= 300
##$TL= (0..7)
0 120 120 120 120 120 120 120 
##$TP= (0..7)
150 150 150 150 150 150 150 150 
##$TP07= 0
##$TPNAME0= <>
##$TPNAME1= <>
##$TPNAME2= <>
##$TPNAME3= <>
##$TPNAME4= <>
##$TPNAME5= <>
##$TPNAME6= <>
##$TPNAME7= <>
##$TPOAL= (0..7)
0.5 0.5 0.5 0.5 0.5 0.5 0.5 0.5 
##$TPOFFS= (0..7)
0 0 0 0 0 0 0 0 
##$TUNHIN= 0
##$TUNHOUT= 0
##$TUNXOUT= 0
##$USERA1= <user>
##$USERA2= <user>
##$USERA3= <user>
##$USERA4= <user>
##$USERA5= <user>
##$V9= 5
##$VALIST= <valist>
##$VCLIST= <CCCCCCCCCCCCCCC>
##$VD= 0
##$VDLIST= <DDDDDDDDDDDDDDD>
##$VPLIST= <PPPPPPPPPPPPPPP>
##$VTLIST= <TTTTTTTTTTTTTTT>
##$WBST= 1024
##$WBSW= 4
##$XGAIN= (0..3)
0 0 0 0 
##$XL= 0
##$YL= 0
##$YMAX_a= 266773
##$YMIN_a= -187238
##$ZGOPTNS= <>
##$ZL1= 120
##$ZL2= 120
##$ZL3= 120
##$ZL4= 120
##$ABSF1= 10
##$ABSF2= 0
##$ABSG= 5
##$ABSL= 3
##$ALPHA= 0
##$AQORDER= 0
##$ASSFAC= 0
##$ASSFACI= 0
##$ASSFACX= 0
##$ASSWID= 0
##$AUNMP= <proc_1d>
##$AZFE= 0.1
##$AZFW= 0.1
##$BCFW= 1
##$BC_mod= 2
##$BYTORDP= 1
##$COROFFS= 0
##$CY= 11.3945322036743
##$DATMOD= 1
##$DC= 2
##$DFILT= <>
##$DTYPP= 0
##$F1P= 16.9975609425685
##$F2P= -3.02152046262296
##$FCOR= 0.5
##$FTSIZE= 0
##$FT_mod= 4
##$GAMMA= 1
##$GB= 0.15
##$INTBC= 1
##$INTSCL= 1
##$ISEN= 128
##$LB= 0.24
##$LEV0= 0
##$LPBIN= 0
##$MAXI= 10000
##$MC2= 0
##$MEAN= 0
##$ME_mod= 0
##$MI= 1.114404
##$NCOEF= 0
##$NC_proc= 0
##$NLEV= 6
##$NOISF1= 3.799351
##$NOISF2= 2.8
##$NSP= 1
##$NTH_PI= 0
##$NZP= 0
##$OFFSET= 15.70392
##$PC= 1
##$PHC0= -9801.417
##$PHC1= 25.20087
##$PH_mod= 1
##$PKNL= yes
##$PPARMOD= 0
##$PSCAL= 0
##$PSIGN= 0
##$REVERSE= no
##$SF= 200.130013532006
##$SI= 16384
##$SIGF1= 3
##$SIGF2= 2
##$SINO= 400
##$SIOLD= 16384
##$SREGLST= <1H.CDCl3>
##$SSB= 0
##$STSI= 0
##$STSR= 0
##$SW_p= 3612.71676300578
##$SYMM= 0
##$S_DEV= 0
##$TDeff= 0
##$TDoff= 0
##$TI= <>
##$TILT= no
##$TM1= 0
##$TM2= 0
##$TOPLEV= 0
##$USERP1= <user>
##$USERP2= <user>
##$USERP3= <user>
##$USERP4= <user>
##$USERP5= <user>
##$WDW= 1
##$XDIM= 8192
##$YMAX_p= 0
##$YMIN_p= 0
$$ End of Bruker specific parameters
$$ ---------------------------------
##NTUPLES= NMR FID
##VAR_NAME=  TIME,          FID/REAL,        FID/IMAG
##SYMBOL=    X,             R,               I
##VAR_TYPE=  INDEPENDENT,   DEPENDENT,       DEPENDENT
##VAR_FORM=  AFFN,          ASDF,            ASDF
##VAR_DIM=   8192,          8192,            8192
##UNITS=     SECONDS,       ARBITRARY UNITS, ARBITRARY UNITS
##FACTOR=    0.0002004,     1,               1
##FIRST=     0,             0,               0
##LAST=      1.6414764,     0,               0
##MIN=       0,             -187238,         0
##MAX=       1.6414764,     266773,          0
$$ Real data points
##PAGE= N=1
##DATA TABLE= (X++(R..R)), XYDATA
0@%%%%%%%%qJ6j6J6j6K4l2L4m2N5o4P4r0J05j22J42j64J89k16K45k78L15l56M03
$$ 0 0 0 0 0 0 0 0 0 -8 8 -8 8 -8 16 -16 18 -24 31 -33 41 -49 56 -66 76 -88 101 -115 130 -148 167 -189 214
32B14m52N05n67O31p02P84q70R63j068J186j312J450j607J780j974K193k444K734
$$ 214 -238 267 -300 331 -371 413 -457 506 -562 624 -688 762 -845 935 -1039 1154 -1290 1444
50A444l067L461l937M521n261O232p567R541j2789J9333n6657J70612R7017k19927
$$ 1444 -1623 1838 -2099 2422 -2839 3393 -4174 5367 -7422 11911 -44746 125866 222883 2956
64B956j29069J5262O2462N8792J07650l193j67115j34983R4311J67503L7439p6002
$$ 2956 -126113 -110851 -48389 10403 118053 114860 -52255 -187238 -92927 74576 112015 36013
76C6013o3105n2291k8242P1807J48847L3157j42927j48699J7161J41058J16448
$$ 36013 -27092 -79383 -107625 -35818 113029 146186 3259 -145440 -128279 12779 129227
87A29227j6077j32852j20196K1346J35269J03589j8550j13973j12430K075J36827
$$ 129227 113150 -19702 -139898 -118552 16717 120306 101756 -12217 -124647 -122572 14255
98A4255J25603l3683j35351p5331K5063O2152P2574N1816m8753j39688p0850R7220
$$ 14255 139858 106175 -29176 -104507 -79444 -17292 55282 107098 58345 -81343 -152193 -54973
110e4973J44796L0887q0665j01485n8715L7477J41312R9320r4543j81898l1671
$$ -54973 89823 120710 40045 -61440 -120155 -82678 58634 157954 63411 -118487 -150158
121a50158J31987J03828j0144o3054p1538m5815M4096J12803M6751p1054r1352
$$ -150158 -18171 85657 75513 12459 -59079 -104894 -60798 52005 98756 27702 -63650
132f3650k1767L4299O0470O0840j675r5916r8249K2673J22506Q3469l6889j13211
$$ -63650 -85417 -51118 9352 70192 68517 -27399 -125648 -102975 19531 103000 66111 -47100
144d7100q3611L0672J28296R0420n4056j27771n7022M5512Q3881O7158m204j01872
$$ -47100 -130711 -100039 28257 118677 64621 -63150 -120172 -74660 9221 76379 72175 -29697
156b9697r9257L3210J16348M6915m0389m0929l2461m1084K3627J12764N8711r6815
$$ -29697 -128954 -95744 20604 67519 27130 -13799 -46260 -87344 -63717 49047 107758 10943
168A0943j25875Q014J00850O2664l574m3603q1990n3512P9175J43286J1850j37726
$$ 10943 -114932 -106918 -6068 56596 53022 9419 -72571 -126083 -46908 96378 108228 -29498
180b9498r2726M7444Q6024L9512Q95l9392p5642l4910N9122Q6925K1943m9133
$$ -29498 -122224 -74780 11244 50756 51651 12259 -63383 -98293 -39171 47754 69697 20564
192B0564o9052m0450K7244R0048O7243l7845j09191o0038M9832J02793N6292m3285
$$ 20564 -48488 -88938 -61694 28354 95597 57752 -51439 -111477 -61645 41148 97440 54155
204E4155j07497o3501N5553J13296L9566o0207p8183l0079K8104P0964N6938k7967
$$ 54155 -53342 -116843 -61290 52006 91572 31365 -46818 -76897 -48793 22171 79109 51142
216E1142q5932m2985L4816N6969L7455L478n4151q0496q024R3641Q6392k0771
$$ 51142 -34790 -77775 -42959 14010 51465 54943 792 -79704 -87728 5913 92305 71534
228G1534r1132o3947R371P1772Q6505J1747j01828j07187K2997J17151N9892l9637
$$ 71534 -19598 -83545 -74174 -2402 84103 95850 -5978 -113165 -90168 26983 86875 47238
240D7238o1593l8852j4560M0227Q3712K8027p0787p8456l235M8547N3968L3397
$$ 47238 -14355 -53207 -67767 -27540 56172 84199 13412 -65044 -68279 -19732 34236 67633
252F7633k4523q6830n8777N1112J07314L7376o6368q9199k7756N4222Q7270L7213
$$ 67633 43110 -43720 -102497 -51385 55929 93305 26937 -62262 -90018 -35796 51474 88687
264H8687n9297r4236k0673O3859O6322J3006l1846n9189m5389K7105Q4767M1242
$$ 88687 29390 -64846 -85519 -21660 44662 57668 25822 -33367 -78756 -51651 33116 74358
276G4358m3699o3784k7425R922M8194P0443R703q8613q9491K1997J01095O0091
$$ 74358 30659 -33125 -60550 -50628 -2434 68009 77712 -10901 -100392 -78395 22700 82791
288H2791k8444p3157n7065M382P4470P6685j2011q8819n5619L0846O0192L2397
$$ 82791 54347 -18810 -75875 -71493 2977 79662 67651 -21168 -76787 -45941 14251 46648
300D6648j865l7056n6218j5719N2922O1806M755m3942n2082k4041L4962P8777
$$ 46648 44783 7727 -48491 -64210 -11288 50518 55273 11331 -40751 -64792 -29830 48947
312D8947L6141n9608q8406j4296O5335O9835J1654n1725o9789k2416N4165P6253
$$ 48947 85088 25480 -62926 -77222 -11887 57948 69602 17877 -51912 -74328 -20163 56090
324E6090J3372n5952n7701q579L3589M9422L2120k4055o6500l4913L2541N5177
$$ 56090 69462 13510 -44191 -52770 -19181 30241 62361 38306 -28194 -63107 -30566 24611
336B4611K9384r288m9793n9751L840Q2654O2028l5061p8084l1274K8658M9857
$$ 24611 53995 44707 -5086 -64837 -60997 21657 83685 48624 -29460 -60734 -32076 17781
348A7781M0017n751o3269n8130K3344P8954L1430m0417m5525j2434M529K4229
$$ 17781 57798 52047 -11222 -69352 -46008 32946 64376 23959 -21566 -34000 -29471 -5242
360e242M8468J7430n3970o3626N967N6942M3793J595l8567n8960k1088N5198P3667
$$ -5242 43226 60656 6686 -56940 -50973 5969 49762 51357 12790 -46170 -67258 -12060 61607
373F1607N420o5319n8705K966N2368N2739N952m9140n5531k865M7963M3124J031
$$ 61607 67027 1708 -56997 -54031 -1663 51076 57028 7888 -47643 -50508 -2545 40579 41610
386D1610k9713l7340k1836K1599N5035K8452l4481n3800j7138K4434M3810L5500
$$ 41610 11897 -25443 -47279 -25680 29355 57807 23326 -30474 -47612 -23178 20632 56132
398E6132j5896o6313m3265L8574P0974K0617l9560n2366k2175K5030N6871L3599
$$ 56132 40236 -26077 -69342 -30768 40206 60823 21263 -31103 -53278 -28248 28623 62222
410F2222l1286o2867k1610L4209M4101J7239j1430l5094m1084j041N4468M8968
$$ 62222 30936 -31931 -53541 -19332 24769 42008 30578 -4516 -45600 -46641 7827 56795
422E6795j3780n3398l5663M251M1095N1086P690n8421o0038J1710O2494L9681
$$ 56795 43015 -10383 -46046 -41795 -700 50386 58076 -345 -60383 -48673 13821 53502
434E3502j3400m5319l9843Q37M7131M6402o428m7528l4721N561L0838L4066J5265
$$ 53502 40102 -5217 -45060 -44223 2908 49310 42882 -4646 -39367 -33806 -2968 31098 46363
447D6363k7597n4723j8881M4231N3343M486l5065m0232k1536K1864O1804L5498
$$ 46363 18766 -35957 -54838 -10607 42736 47222 12157 -28075 -49611 -27747 34057 69555
459F9555m5284p1702r550N0374M4951P321k4862m3642k8274K3974N7211K4758
$$ 69555 24271 -47431 -56981 -6607 38344 45665 20803 -22839 -51113 -27139 30072 54830
471E4830l3124m7001j5606J8798L5029K9893l552m6699m2877J2707N3862L4527
$$ 54830 21706 -25295 -40901 -22103 12926 42819 39267 -7432 -50309 -37602 16260 50787
483E0787j3970m5679l9686O559N4552M4705j8717n5568k9592J7524M0359L2490
$$ 50787 36817 -8862 -48548 -41989 12563 57268 38551 -17017 -46609 -29085 11274 43764
495D3764l273m3793m1536P781M5973L2445p712l0907l1985j0296K6934M8526J7393
$$ 43764 40491 -3302 -44838 -37057 8916 41361 33649 2742 -29243 -39539 -12605 35921 53314
508E3314l9720n2558o968L9166M2564J2749k8771n1225k1967L9550N6436P202
$$ 53314 13594 -38964 -45932 -6766 35798 48547 19776 -31449 -53416 -13866 42570 49772
520D9772m0579l9447q256K4234M1553K0952k7817m7478j3497K8993L4587J3060
$$ 49772 9193 -30254 -38510 -14276 27277 48229 20412 -27066 -40563 -11570 23017 36077
532C6077j2606l3625k9860R078M8152L3784k2142m8568k1683J8071L6572K9744
$$ 36077 23471 -10154 -40014 -30936 17216 51000 28858 -19710 -41393 -23322 13250 42994
544D2994n466m7715m0208J8773N3931K3619k1864l4815k2897L155L4245L7221
$$ 42994 37528 -10187 -50395 -31622 22309 45928 24064 -10751 -33648 -30493 3752 40973
556D0973m144m2526l1115Q113L1635K7769M896k6797m0892j0464L7464M4685O25
$$ 40973 36829 -5697 -36812 -28699 2936 30705 35601 8804 -32088 -42552 -5088 39597 40222
569D0222l8951l4316k242K8315L8880J1816l5277m5386j964L9359L1655m27k3683
$$ 40222 1271 -33045 -35287 -6972 31908 43724 8447 -36939 -38903 456 32111 31684 8001
582H001l0625j4157K3840M0557J0974k8372l3563r015J7367L2322K2121j4820
$$ 8001 -22624 -36781 -12941 27616 38590 10218 -23345 -32360 -14993 17329 39450 24630
594B4630m3710k5244K4120M4831J6447k2594l5298j9959J2256M0698K9343j9672
$$ 24630 -19080 -44324 -20204 24627 41074 18480 -16818 -36777 -24521 16177 45520 25848
606B5848m6631j8689K4277L1765J5797p855k9972k8909P192L8850K5641j1891
$$ 25848 -20783 -39472 -15195 16570 32367 24512 -5460 -34369 -27177 11673 37314 25423
618B5423l1675k3275K631K9848L2853j04l7009l4462N554L6741K9329l224l1072
$$ 25423 -6252 -29527 -26896 2952 35805 35701 -1308 -35770 -30216 6525 35854 32630 1558
631A558l3246k506L6296L7551n747l7721k5649M494K3239K7409J0751k5404l9914
$$ 1558 -31688 -34194 2102 39653 33906 -3815 -29464 -24970 -1731 25678 36429 11025 -28889
644b8889o605L3130L1846J930k0945k8256j6022J7314M0593J9356k7267m1810
$$ -28889 -35494 -2364 29482 31412 10467 -17789 -33811 -16497 24096 43452 16185 -25625
656b5625j0904K6478L3037J1967j6156l5512k1690K0060M2304J5012k4422l2364
$$ -25625 -36529 -10051 22986 34953 18797 -16715 -38405 -18345 23959 38971 14549 -17815
668a7815j2591J2164K9949K4649j1514l9141k2447J6849L3207J9103p245l0951
$$ -17815 -30406 -18242 11707 36356 24842 -14299 -36746 -19897 13310 32413 25168 -5783
680e783k9468N006L9208K9641j1761l7224k3886Q812K9446K7529q69l2860l3271
$$ -5783 -35251 -30245 8963 38604 26843 -10381 -34267 -25455 3991 31520 30651 -2209 -35480
693c5480M496L7128K4963o561k4864k4483o662K3591L6628O449l2830l2093m77
$$ -35480 -30984 6144 31107 24546 -318 -24801 -31463 -7872 28756 35205 2375 -29718 -30195
706c0195K4719K7697J0129j9942l7640j3286K8206L8384O475k7646l0881q078
$$ -30195 -5476 22221 32350 12408 -25232 -38518 -10312 28072 34547 6901 -23980 -32058
718c2058J9590L2171J5851k0647l7632j3020K4629L1246J0239j5401k8779j9703
$$ -32058 -12468 19703 35554 14907 -22725 -35745 -11116 20130 30369 14968 -13811 -33514
730c3514J2889L6340K0038j8004l2322j6049R854K9548K5196q125l6710k4863
$$ -33514 -20625 15715 35753 17749 -14573 -30622 -20768 8780 33976 25851 -10859 -35722
742c5722J3620L4050J9655r397k8175k3559L023L1559K8838p201l4165k2867Q686
$$ -35722 -22102 11948 31603 22206 -5969 -29528 -26505 5054 33892 26691 -7474 -30341 -21655
755b1655K5561K0891K163k3478l1805k808L2013K9647l656k6395k3754m513K0875
$$ -21655 3906 24797 26960 3482 -28323 -31131 882 30529 26873 478 -23276 -27789 -6914
768f914L1563Q921k7883l3114l113K6959K7403N168k0781k9260j0295K1270L3002
$$ -6914 24649 33570 5687 -27427 -30540 -3581 23822 28990 8209 -21051 -31346 -10076 22926
781B2926Q311k3190k9029p151J6551K6830J5623j5262l4538j4705K1040K9891
$$ 22926 31237 8047 -20982 -28133 -11582 15248 30871 15609 -18929 -33634 -12594 17297
793A7297J0039j3580k5628j8973R848L4265J9828j7460l2007j3067J3026K5152
$$ 17297 27336 13756 -11872 -30845 -20997 13268 33096 15636 -16371 -29438 -16412 8740
805H740J7476n883k8642k3311Q475L2407J9897j2191k6033j6725L438K2592K6373
$$ 8740 26216 20333 -8309 -31620 -23145 9262 29159 16968 -9065 -25790 -22352 240 26613
818B6613q87l0943k6853P852K8475J9905k836k1465k6455k874K8084K8548k434
$$ 26613 25726 -5217 -32070 -24218 4257 24162 21326 -139 -26594 -29468 -1384 27164 24730
831B4730k7711k3105N97K2047K4594M541k2510k8016m253K4421K6118K367j9379
$$ 24730 -2981 -26086 -25489 -3442 21152 25693 3183 -24833 -29086 -4665 21453 23820 4441
844D441k4054q831J7160K9932J0669k2325k8768o128J8181K3759J2342j3098l0313
$$ 4441 -19613 -28444 -11284 18648 29317 6992 -21776 -27904 -9723 14036 26378 13280 -17033
857a7033j5585J8842L1209R951j7006k5161j3234J1289K7916J7841j3020l0635
$$ -17033 -32618 -13776 17433 27384 10378 -14783 -28017 -16728 11188 29029 16009 -14626
869a4626j5643J4113K7236J4584r230k5499j9610O881K9714K0906j1219k7376
$$ -14626 -30269 -16156 11080 25664 16434 -9065 -28675 -21794 7920 28826 17607 -9769
881i769j6606O175K2922K2427j968k8746k3832O825K7546J8254l294k1268k3089
$$ -9769 -26375 -20200 2722 25149 23181 -5565 -29397 -22572 4974 23228 19934 -1334 -24423
894b4423j943K4831K6382k85k6409k3078J061K0962K2330N121j9218k8272o517
$$ -24423 -26366 -1535 24847 24562 -1847 -24925 -23864 -2902 19428 24549 5331 -22941 -29458
907b9458K4817K7457J120k1405k1754o343J4957K7732J1604k0650l0008o186K0206
$$ -29458 -4641 22816 23936 2531 -19223 -25566 -10609 17123 28727 8077 -21931 -28117 -7911
920g911K3488Q687j3079k6308j4272J5113K9806J1869j6807k6181j0754J1915
$$ -7911 15577 24264 11185 -15123 -29395 -14282 15524 27393 10586 -15595 -26349 -14434
932a4434K4372J5821r495k8191j7987J3580K7973J3172j0596k2398j7267M952
$$ -14434 9938 25759 16264 -11927 -29914 -16334 11639 24811 14215 -8183 -25450 -20498
944b0498K6338K1527r252k7477j6444P992K1758J8132j869k3337k2543L568K5438
$$ -20498 5840 27367 18115 -9362 -25806 -17814 3944 22076 20207 -3130 -25673 -22105 3333
957C333K0508m088k2719j9340J83K0744K2815J798k2374k4691L07K2593K0641
$$ 3333 23841 19753 -2966 -22306 -22123 -1379 21436 23234 860 -23831 -23524 -931 19710
970A9710K167j7678k3628o876K1278K5848L119k0639k1760n168J5467K4623Q915
$$ 19710 21877 4199 -19429 -26305 -5027 20821 23940 3301 -18459 -23627 -8160 16463 25378
983B5378j7451k6386p023J8342K3390O424j3801k2802j0835J2658K5479J2059
$$ 25378 7927 -18459 -25482 -7140 16250 22674 8873 -13929 -24764 -12106 13373 25432
995B5432j5028k5006r217J3106K0678J2282p610k4191j6832J1716K6055J2146
$$ 25432 10404 -14602 -23819 -10713 9965 22247 14637 -9554 -26386 -14670 11385 23531
1007B3531j0829k0675j4464N451K2943J8755p153k5981j5639Q026K1396J5747
$$ 23531 12702 -7973 -22437 -16986 5957 24712 17559 -8422 -24061 -16035 5361 21108
1019B1108l182k1051j9708K947K3683J9856n347k2608j6180K569J7569J9329K357
$$ 21108 17926 -3125 -22833 -19886 3797 23653 18306 -4302 -20482 -17913 -344 18985 21342
1032B1342k0858k2651J610K1980J7827p97j5842j8909n328J7216K3552L088j9785
$$ 21342 484 -22167 -20557 1423 19250 18453 2611 -16298 -21626 -4410 19142 22230 2445
1045B445k0635j739J5883J9527N799j3953k2495p650J6054K3640N511j5851k0293
$$ 2445 -18190 -19929 -4046 15481 21280 7327 -15168 -22818 -6764 16876 22387 6536 -13757
1058a3757o943J1781K1304J1586j3646k4167r034J4549K0359R283q920k1539j3635
$$ -13757 -20700 -8919 12385 23971 10325 -13842 -22876 -8327 12032 21315 12395 -9144 -22779
1071b2779J0011K4227J1729j0957k1055j1668P211K0677J4310o141k2150j5644
$$ -22779 -12768 11459 23188 12231 -8824 -20492 -13281 7396 21706 15565 -6585 -22229
1083b2229P912K1639J4031o149j9144j5666K971K0387J8363m291k2028j5633M222
$$ -22229 -14317 7322 21353 15204 -3940 -19606 -16635 3752 22115 17824 -4204 -19837 -15615
1096a5615J7790J6431L88j8672j9916Q13K0634J7338j416j6858j7215k845J6296
$$ -15615 2175 18606 18994 322 -19594 -18781 1853 19191 17775 917 -16298 -19143 -2847
1109b847K0605L344j8633j9688k286J6330J8530M251j3617k0134p597J5215K2306
$$ -2847 17758 21102 2469 -17219 -19505 -3175 15355 19606 5989 -14145 -21742 -6527 15779
1122A5779N244j5731j8656n846J1048J9584J0550j2344k3195q027J3628K0065
$$ 15779 21023 5292 -13364 -19210 -8162 11422 21972 9628 -13567 -21594 -7966 12099
1134A2099P174r604j8407j1951Q823K2015J1635j0721k1184r926R187J8208J1553
$$ 12099 19273 9669 -8738 -20689 -11866 10149 21784 11063 -10121 -20047 -10860 7348 18901
1147A8901n667j9164j4729O459K1279J2899p150j7893j2160K125J7408J6960k498
$$ 18901 13234 -5930 -20659 -14200 7079 19978 12828 -5065 -17225 -15100 2308 19268 16770
1160A6770k0517j5193L574J7824J4609o97j6007j7870q8J8063J7236l59j7199
$$ 16770 -3747 -18940 -15366 2458 17067 16370 363 -17507 -17595 468 17704 17345 146
1173A46j6226q55J5311J6981K954j5469j8929k010J6244J6891J888j2797j6257
$$ 146 -16080 -16935 -1624 15357 18311 2842 -16087 -18097 -1853 15038 16926 4129 -12128
1186a2128o218J2504J9867N072j4443j7880m128J1196J6869Q251j0108k0006p927
$$ -12128 -18346 -5842 14025 19097 4654 -13226 -17354 -6158 10711 18962 8854 -11152 -19079
1199a9079J1527J8717P000r953j6931q614P738J8155J0590q116j9419j0179Q767
$$ -19079 -7552 11165 18165 8212 -8719 -17333 -9595 8560 19150 11034 -8385 -18564 -9797
1212i797J7103R729n619j6304j3147M979J9315J1980o564j6536j1229L287J5643
$$ -9797 7306 17035 11416 -4888 -18035 -13056 6259 18239 11675 -4861 -16090 -12803 2840
1225B840J4400l107j7704j3500L869J6049J2705j371j4863j4653M25J5478J5376
$$ 2840 17240 14133 -3571 -17071 -13202 2847 15552 14181 -682 -15335 -14910 568 15944
1238A5944o05j6300j3949N39J3377J3959K785j2804j7518k506J5627J5681M76
$$ 15944 15339 -961 -14910 -14371 -994 12965 15750 2946 -14572 -17078 -1451 14230 14706
1251A4706j1606j4715m397J0699J7449N291j3074j7040l496J1524J5215N009r165
$$ 14706 3100 -11615 -16012 -5313 12136 17427 4353 -12687 -16183 -4659 10556 15565 6400
1264F400j5570p548R667J6910O723r811j5678o699P538J5192R274o782j7296r628
$$ 6400 -9170 -16718 -7051 9859 16582 6771 -8907 -15606 -8068 7124 16398 9616 -7680 -17308
1278a7308Q657J6290Q083o182j4767j0985M847J7261J1534p047j5892r631M390
$$ -17308 -8651 7639 15722 9540 -5227 -16212 -11365 5896 17430 10383 -5509 -15140 -10750
1291a0750J4519J1356l249j4610j2651L349J5252J1740l246j3419j1418R30J2559
$$ -10750 3769 15125 11876 -2734 -15385 -12036 3216 14956 11710 -1709 -13127 -12197 362
1304C62J3712M32j4856j3856J490J3163J1960J656j1514j5354k444J4156J4736
$$ 362 14074 14506 -350 -14206 -12716 447 12407 14063 2549 -12805 -15249 -1093 13643
1317A3643R67j2123j3611k661J0706J4057M725j1411j5436l779J1203J4340M283
$$ 13643 14610 2487 -11124 -13785 -3079 10978 15703 4292 -11144 -14923 -3720 10620 14903
1330A4903r136j4639n976Q357J6076O701r920j5527n058P698J3912P718o493j5425
$$ 14903 5767 -8872 -14848 -6491 9585 16286 6366 -9161 -14219 -6521 7391 15109 8616 -6809
1344f809q607Q031J5030O493n968j3167q864M256J4628R888n103j4274r451M685
$$ -6809 -15416 -7385 7645 14138 8170 -4997 -13861 -9605 5023 14911 9808 -4466 -13917 -9232
1358i232J3093R573k730j2884j1363J779J4267J2370l571j3694j0017J270J1709
$$ -9232 3861 13434 10704 -2180 -13543 -11764 2503 14873 11302 -2392 -12409 -11139 570
1371E70J2487L9j3615j2807J584J2290J1043M00j0720j2534j680J1374J3150J311
$$ 570 13057 13096 -519 -13326 -11742 548 11591 11991 1271 -11263 -12943 -1569 11581 12892
1385A2892j0891j2359k286R933J2561L617r023j4362m365J0477J3671K989q537
$$ 12892 2001 -10358 -12644 -2711 9850 13467 4444 -9918 -14283 -3806 9865 12854 4317
1398D317j2176n112P225J4055N918q929j3776m080P538J1417O234n254j3421p323
$$ 4317 -7859 -12971 -5746 8309 14227 5298 -8478 -12558 -5020 6397 12631 7377 -6044 -13367
1412a3367O483J3003O880n677j2143p331L968J2177R036l646j3277r628N192J2271
$$ -13367 -6884 6119 12999 7322 -4821 -12152 -8184 3993 13029 9383 -3894 -13522 -8330 3941
1426C941Q044l005j1274r481J206J2937J0759k803j2898q847J962J0145J0507
$$ 3941 11985 8980 -2294 -11775 -10569 2368 13127 10324 -2574 -11421 -9459 686 11193
1439A1193K64j1239j1502K44J1720J0530m58r847j0299j569R920J1158K128j0505
$$ 11193 11457 218 -11284 -11040 680 11210 10752 905 -9394 -10963 -1043 10115 12243 1738
1453A738j1792q01R682J0221K482p996j1580l913Q848J2177K811q260j0653m116
$$ 1738 -10054 -10855 -1173 9048 11530 3534 -8046 -11959 -3111 9066 11877 3617 -7036 -11152
1467a1152O315J1919N526p056j2497m970P141J1227N475n479j1857o622N705J1979
$$ -11152 -4837 7082 12608 5552 -6945 -11915 -4774 6453 11928 6449 -5408 -12030 -6325 5654
1481E654P104n811j2239o356M843J1454P035l441j1879q023M195J1927O366l361
$$ 5654 12758 6947 -5292 -11648 -6805 4649 11684 8243 -3636 -11659 -7464 4463 10829 7468
1495G468r710q016J585J0685R321k714j0785q171J344R705R233l58r930j0180
$$ 7468 -2242 -10258 -8673 2012 11333 8619 -2166 -10337 -8993 712 9945 9587 -343 -10523
1509a0523N00J0281R963j19r967r116p98Q543J0171K038r349j1238o97R023R152
$$ -10523 -10023 258 10221 10102 135 -8981 -9779 -1236 8935 10973 1624 -9614 -10311 -1288 7864
1524G864J936o659j0582m200P945J1942K607q004r901l079O013J0201M873o295
$$ 7864 9800 3141 -7441 -11641 -3696 8246 10853 2849 -7052 -10131 -4118 6083 10956 4661
1538D661j1586m440O910J0520M588o149r762n036L975J0959O724n156j1750n187
$$ 4661 -6925 -11365 -4455 6065 10653 4504 -5258 -10294 -6319 4640 11364 6208 -5542 -10729
1552a0729N019R652N767k749j0124q362L760J1329P190l735r488p311J970R521
$$ -10729 -5710 3942 9709 6960 -3164 -11526 -7766 3563 10753 7018 -2470 -9781 -7811 1710
1566A710Q051j068j0315q283J461J0050P993j620q812q017k88Q811R401K71r162
$$ 1710 9761 8693 -1622 -9905 -8444 1606 9599 7979 -833 -8850 -9138 -327 9074 9345 183
1581A83q459l29P482R130J817q029j0217j217Q360Q866J963o781r693l098P161
$$ 183 -8276 -8605 -1123 8007 9824 1795 -8422 -9639 -1279 7587 9550 2769 -6924 -10022 -2861
1596b861J0134K705o923r641l171O462R455L746n744j0128m015N685J0107L648
$$ -2861 7273 9978 3055 -6586 -9757 -3295 6160 9906 4162 -5966 -9981 -4296 5811 9459
1610I459n179q479m900L310R659O700m377j0453n494M079Q907O173k729r514o973
$$ 9459 4280 -4199 -9099 -5789 3870 10570 6193 -4260 -9754 -5675 3232 9405 6676 -2838 -9811
1625i811K871J0037O537l231q786o712J953Q515P337j017q633q484J850Q879P073
$$ -9811 -6940 3097 9634 6403 -2383 -9095 -7142 1373 8710 7693 -940 -9424 -7574 1305 8378
1640H378j242p503p499r15Q446R157m64q605p839L41O777P841J571o988r140j466
$$ 8378 7136 -367 -7866 -8781 -335 8822 8358 -247 -8086 -7745 -968 6873 8444 1456 -7684 -9150
1656i150P685Q509J578o822q445j912N864Q463L343n929r295l614O894Q392K958
$$ -9150 -1465 7044 8622 1800 -6645 -8557 -2693 5770 9113 3184 -6111 -9725 -2831 5561 8519
1671H519n077p989m912M620J0109M086n358q491m079L715Q888M567l134r414n369
$$ 8519 3442 -4547 -9459 -4839 5270 9356 3998 -4493 -8572 -4857 4031 8598 5464 -3950 -9319
1686i319M126Q546N184l138q127n955K757Q127O126j749q785o431K566P979O168
$$ -9319 -5193 3353 8537 5399 -2728 -8683 -5926 2201 8327 6578 -2207 -8638 -6072 1907 8075
1701H075j299p398p232N52Q528O971j135p467o955M9P129Q040j49p619p279k49
$$ 8075 6776 -622 -7854 -7302 1226 8197 7062 -405 -7360 -7311 -182 7858 7709 90 -7189 -7438
1717g438O762P559R66o422p786j491O218Q116J684o478p696j928N983P718K579
$$ -7438 -676 6883 7849 1427 -6359 -7850 -1632 6484 8168 1690 -6006 -7934 -1951 5767 8346
1732H346n110r153k911O146Q000K954m417q030m622M667R321L770n181q006l637
$$ 8346 3236 -5917 -8828 -2682 5318 8272 3855 -4175 -8797 -4130 5191 8961 3780 -4226 -7863
1747g863L807P688M584l462q315n265L904Q151N103l427p853m574J755P660O106
$$ -7863 -4056 3632 8216 4754 -3561 -8826 -4922 3229 8332 4905 -2948 -7522 -5767 1893 7999
1762G999j716q446n941K340P707N218j011o620p280N95Q138O571r23p301o303
$$ 7999 6283 -2163 -8104 -5764 1943 7161 6150 -470 -7750 -7155 983 7554 6631 -670 -6973
1777f973K69O238P179P66o731p848o17P096P508J8n814p188j461N466P953K294
$$ -6973 -6704 -466 6713 7479 748 -7100 -7717 -621 6887 6905 1091 -6097 -7558 -2092 5861 8155
1793H155o773p522j260N542O780K526m431q147l176N521P638K413m176p421l415
$$ 8155 1382 -6140 -7400 -1858 4922 7448 3017 -5130 -8306 -2785 4853 7266 3090 -4331 -7746
1808g746L737P857L580l638p666m032L381P868M128l399p010m978K986P445N270
$$ -7746 -4009 3848 7428 3790 -3876 -7908 -4527 3341 7469 4070 -2940 -7918 -4932 2513 7783
1823G783k866p849m593K195P118N773j922q026n532K100O942N178o27o631o141
$$ 7783 4917 -2932 -7525 -5330 1788 7561 5639 -2387 -7919 -5819 1123 6301 5674 -957 -7098
1838g098O57P023O240o77o801n795OO066O714J99n799p090q88O723O323P66n612
$$ -7098 -6441 582 6822 6145 -656 -6451 -6445 -379 6335 6534 735 -6355 -7243 -520 5803 6569 957
1855I57o374j280N079P013K218o088o871j474M966O403J932l808p305l065M835
$$ 957 -5417 -6697 -1618 5395 7613 1525 -5346 -6820 -1854 4549 6481 2673 -4632 -7697 -2862
1870b862P421K456m370o661l134L872O686M058l658p299l832L490P503K935k691
$$ -2862 4559 7015 2645 -4016 -7150 -3278 3408 7466 3808 -3491 -7323 -3833 3670 6605 3914
1885C914o588m005J869P422M629k351p710m225K461O128N098j387o767n546J733
$$ 3914 -2674 -6679 -4810 2612 7241 4890 -2820 -7045 -4584 1544 6642 5255 -1512 -7058 -5325
1900e325O459N437j108o545n108P00O234N250j16o226n849K81N965N573K99n666
$$ -5325 1134 6571 5463 -1082 -6190 -5490 744 5994 5878 -348 -6197 -5916 49 5622 5921 255
1916B55n890o37N666O056P96n510n979j310M643O769J666n200o443j759M824O085
$$ 255 -5635 -6272 -606 5450 6246 736 -5243 -6553 -1910 4859 6525 1325 -5118 -6877 -2053 4032
1932D032K327m192o729k574M274O780K662l971o769k761L936O637K880l017o920
$$ 4032 6359 2167 -4562 -7136 -2862 3918 6580 2609 -4160 -6921 -2985 3652 6532 3515 -3405
1947c405l413L055O991L015k807n944m027K201O458M455k596o328l970J923O069
$$ -3405 -6818 -3763 3228 6243 3436 -2508 -6535 -4334 2124 6579 3983 -2345 -6315 -4392 1677
1962A677M289j362o379m641J446O156M942j193n935n479J341N205N602j00n759
$$ 1677 5966 4604 -1775 -6416 -4970 1186 6128 4935 -1000 -6479 -5138 67 5669 5569 -190
1977a90n690L27N971M850J41m969n900o43N372O243M22n363n462r14M844N668
$$ -190 -5880 -5553 418 5268 5409 440 -5460 -6103 -731 5512 5934 571 -4891 -5805 -961 4707
1993D707J563n114n997j260M431O366J550m519n438k224L389O312K453l729o208
$$ 4707 6270 1156 -4841 -6101 -1670 4696 6246 1727 -3711 -5935 -2546 3766 6219 2490 -3718
2008c718k461L852N661K808k676o448l468L222O482K918k776n958l470K197O141
$$ -3718 -6179 -2327 3334 6142 3466 -2982 -6450 -3228 3254 6172 3396 -2562 -6032 -3835 2306
2023B306L955k263n973m035J824N955L925j557n984l668J123N592M561q54n945
$$ 2306 6261 3998 -1975 -6010 -4186 1769 5694 4137 -1847 -5515 -4392 1200 5761 4907 -1038
2038a038m743J021M762N036L59n792n496K80O143M555O1m713n656m04N118N360
$$ -1038 -5781 -4760 2 5038 5397 -395 -5891 -5611 532 5087 5148 435 -5221 -5625 -507 4853
2054D853J83m714n318o13M574N343J074m191n453j612M278N675J257l776n317
$$ 4853 5036 322 -4996 -5609 -1035 4308 5382 1191 -4262 -5874 -1596 4079 5336 1560 -3757
2069c757j666L040N557K686l624o007k461L724N551K309k531n551l114K794O069
$$ -3757 -5423 -2383 3174 5860 2236 -3771 -6232 -2508 3043 5352 2821 -2730 -5844 -3050 3019
2084C019K870l122n552k972K443N577K915j744n397l590K020N284L846j849n017
$$ 3019 5889 2767 -2785 -5757 -3314 2263 5178 3434 -1963 -5553 -3533 1751 5597 3748 -1269
2099a269m029J172N052M645r66n785m107J379M725M109l92m573n013M60N352M207
$$ -1269 -5298 -4126 926 5571 4605 -1180 -5287 -3908 817 4926 4534 -39 -5052 -4592 760 4967
2115D967k46m834m222l09M847M060O72m056m963q97M445M888O66l432n334j032
$$ 4967 4721 -113 -4335 -4644 203 4263 4935 879 -4084 -4981 -536 4352 5018 1586 -3748 -4780
2131d780L375N971Q78m063m913j303L386M914K249l827n465j714L540N121J823
$$ -4780 -1405 4566 5444 1381 -3532 -4835 -1449 3465 5714 1887 -3578 -5292 -1752 3369 5192
2146E192k625m813k650K307N507K132k239n166k647K245M678L009j721m803l810
$$ 5192 2567 -2246 -4896 -2589 2918 5050 2811 -2355 -5002 -2757 1921 4930 3209 -1594 -5404
2161e404J810N710L174j857n037l304J472M802L984j392n286l280J028M218L698
$$ -5404 -3594 2116 5290 3433 -1604 -4908 -3436 1366 5350 3958 -1328 -4608 -3580 638 4336
2176D336n87m050m121M59L906M505J67m649m069k43M040M319O01l905m941o16
$$ 4336 3749 -301 -4422 -3963 -57 4448 4615 -34 -4103 -4346 -306 4013 4614 709 -4232 -4848
2192d848M570M546K89l874m346j061L603M972J036l987m165j034L241M010J619
$$ -4848 -278 4268 4557 683 -3663 -4724 -1121 3851 4887 900 -3265 -4299 -1058 2952 4571
2207D571k863m684j412K518M579K261k812m791k119K503M686K978k628n184k867
$$ 4571 1708 -2976 -4388 -1870 2709 4970 2158 -2633 -4752 -2249 2437 5415 2787 -2397 -5264
2222e264K563N028K413j814m655k937J598N148K621j758l978l317Q29M532L635
$$ -5264 -2701 2327 4740 2926 -1729 -4666 -3068 2080 4701 2943 -1035 -4352 -3523 1009 4644
2237D644j092m220l704Q79M133L823l67m338l903J02M476M319k95m950l994O53
$$ 4644 3552 -668 -4372 -3493 640 4463 4096 -242 -4145 -4043 433 4752 4457 -493 -4487 -3834
2253c834L936M031k70l378m104n98M213L857Q3l092l780j226K725M713J190l255
$$ -3834 102 4133 3863 485 -3619 -4217 -4 3853 3936 844 -2936 -4162 -1437 3276 4466 1211
2269A211m033j919L361M501J509k730m596j546K135M945J909k944m728j491K719
$$ 1211 -2822 -4741 -1380 3121 4630 1900 -2696 -4242 -2107 2838 4747 1803 -2925 -4416 -1697
2284a697L742K179k033m790j858K429M097J998j672l705k579Q58M294K886j064
$$ -1697 2045 4224 2191 -2599 -4457 -2028 2069 4067 2395 -1310 -3889 -3031 1263 4149 3085
2299C085m463k938J229M363L044r24m230l472P83M523L201r50m104l015M11L954
$$ 3085 -1378 -4316 -3087 1276 4320 3396 -834 -4306 -3523 1000 4201 3251 -853 -3868 -3457 497
2315D97L465m97l900k977rL123L410M66l058l688q82L267L859P65k914m220j014
$$ 497 3962 3465 -435 -3412 -3421 -298 3112 3578 520 -3168 -4050 -783 3076 3841 927 -3293 -4307
2332d307L239M289Q15l029m299p40K968M205J003l206l507j130K344M064J182
$$ -4307 -1068 3221 4036 1007 -3292 -4032 -1064 3141 4144 938 -2569 -3699 -1355 2709 3891
2347C891k479l521j466J603L900K014j364m256k255J442M101K468j444m030k673
$$ 3891 1412 -2109 -3575 -1972 1928 3942 2578 -1678 -3933 -2491 1610 4078 2634 -1396 -4069
2362d069J784L640K854j668m142k308J247M093K116j028l367k687N75L801K772
$$ -4069 -2285 1355 4209 2541 -1601 -3909 -2662 1431 3547 2519 -848 -3535 -2960 841 3613
2377C613o50l413k731j39K973L822K97l584l812J65L625L381J74l654l275l92
$$ 3613 2963 -450 -3181 -3320 -347 3475 3772 188 -3624 -3459 166 3547 3721 67 -3208 -3600
2393c600L432L553K77l291l615k13L303L117K83k317l344j316K916L388J070k465
$$ -3600 -168 3385 3662 371 -3244 -3457 -154 2963 3246 929 -2415 -3731 -815 2573 3643 1178
2409A178l213j459J724M071J729k135m071j749K337L784K035k384l783j592J716
$$ 1178 -2035 -3494 -1770 2301 4030 1895 -2176 -3925 -1588 2196 4231 1847 -1936 -3528 -1812
2424a812L503J980k007l386j531J861K801J723p02l189k244Q40L174K069m62l036
$$ -1812 1691 3671 1664 -1722 -3253 -1392 1409 3132 2430 -759 -3003 -2163 1011 3080 2618 -418
2440d18l032N58L456K917j26m273k606L98L457L398p04l346l307R19K939K647
$$ -418 -3450 -2892 564 3481 3355 -918 -3524 -3126 331 3729 3025 -321 -3628 -2709 230 2877
2456B877J76l518k221J3K394K782P08k963k839n94K395L030J130k300l559j405
$$ 2877 3053 -465 -2686 -2673 -279 2503 3211 248 -2591 -3185 -790 2240 3370 1070 -2489 -3894
2472c894K890L795R86k781l407j262K387L383J597k595l316r38J941L324R49j982
$$ -3894 -1004 2791 3777 996 -2411 -3673 -1286 2097 3694 1099 -2217 -3155 -1214 2110 3059 1077
2488A077k564j575J301L210J650j019l312j685R28K833K334o81l560k447Q36L859
$$ 1077 -1487 -3062 -1761 1449 3099 2080 -1232 -2917 -1989 844 3178 2497 -1063 -3510 -2674 1185
2504A185K144r51l483k322Q91L371K123o60l164k195O67L213J838o70j880k857
$$ 1185 3329 2378 -1105 -3427 -2536 835 2958 2298 -866 -3061 -2394 819 2657 1987 107 -2750
2520b750PK387K912M31k660l068k73K587K986P79k735l672k2K855K820L22k558
$$ -2750 -2743 -356 2556 2987 327 -2741 -3014 -427 2559 3338 603 -3069 -3091 -236 2584 2906 348
2537C48k860k79K167K866N66j937k629r12J902K506Q99j290k490j975J535L185
$$ 348 -2512 -2791 -624 2242 2808 871 -1758 -2670 -768 1738 2637 1347 -1143 -3118 -1583 1602
2553A602J420j171l692j279J117L543J975j357l596j692J421L454J477j579l247
$$ 1602 3022 1851 -1841 -3120 -2003 1540 3515 2158 -1438 -3130 -1709 1745 3222 1643 -1604
2568a604j231J322K657J366q63k186k288O31K790J899j29k745k249K23K533K421
$$ -1604 -2835 -1513 1144 2510 1647 -539 -2827 -2196 594 2493 2364 -381 -2630 -2407 126 2547
2584B547J48k569l054l1K898K998k72k852k547M36K126K816k98k539k250l1K433
$$ 2547 2695 126 -2928 -2959 -61 2937 2665 -187 -2734 -2298 -172 2644 2346 -193 -2443 -2474 -41
2601d1J843K47j631k100r45J622K474Q42j144l085j027J635K914J123j596k976
$$ -41 1802 2049 418 -1682 -2627 -1005 1469 2311 1167 -1918 -2945 -1310 1604 2727 1131 -1845
2617a845j544J981L212J150j878l150n39J178K817J548j699k699r49J319K097
$$ -1845 -3389 -1408 1804 2954 1076 -2074 -2613 -1435 1382 2930 1231 -1468 -2417 -1098 999
2632I99J132o92k105j863L67K598K023k17l002j963J69L244J816k8l130k151L94
$$ 999 2131 1439 -666 -2529 -2162 436 2459 2242 -760 -2723 -2554 690 2506 2478 -652 -2803 -2409
2649b409L093K195p92k753j761J97K410K198n46j966j917j45J669K392L66j892
$$ -2409 684 2879 2087 -666 -2427 -2230 180 2378 1832 -134 -2051 -2196 -527 1865 2231 339
2665C39k297n59J673K561J052j811l324l29K064K674Q01j991l084m32J996K660
$$ 339 -1958 -2517 -844 1717 2769 958 -2366 -2695 -631 2043 2844 853 -2231 -2663 -667 1993
2681A993M35j790k155j020J613K360J073j558k147j162P77K724J203j028k036
$$ 1993 2428 638 -1517 -2537 -924 1436 2509 951 -1196 -2358 -1581 1143 2346 1318 -718
2696g18j807P00K738J810p49l098j840J063K673K023r18l125j456J362K354J045
$$ -718 -2525 -1825 913 2723 1974 -1124 -2964 -1901 772 2795 1877 -1248 -2704 -1342 1012 2057
2712B057p57k048j639O54K367J466p47j553j775j75J887K116N21k352k029o02
$$ 2057 1300 -748 -2387 -1733 634 2100 1353 -200 -1975 -2150 -263 1853 2374 22 -2007 -2609
2728b609K012K576P17k358k645m08K015K708K6j999k359j16K280K089J15j393
$$ -2609 -597 1979 2696 338 -2307 -2715 -700 2008 2034 35 -2324 -2440 -160 1929 2044 651
2744F51k047j102J698J881R70q69k281j467J424K323J375j312k700j280J430L013
$$ 651 -1396 -2498 -800 1081 2051 1182 -1099 -2566 -1142 1181 2556 1244 -1456 -2736 -1306 1707
2760A707P51r41k910j212J299K618Q46r85k255j227P18K128J545p56j679j618
$$ 1707 2458 1517 -1393 -2605 -1306 1312 2158 1173 -1082 -2309 -1591 537 2082 1326 -353 -1971
2776a971L75J768J838J48j980k384K44K018K162mk256k431J06K631K004m2k277
$$ -1971 -1596 172 2010 2158 178 -2206 -1962 56 2218 2214 -42 -2473 -2367 264 2268 2226 -51
2793e1k239M03J924J944J88k245j432m11J762J678M48j650j322q59J216J924R43
$$ -51 -2290 -1887 37 1981 2169 -76 -1508 -1919 -157 1521 1969 319 -1003 -1862 -646 1278 2221
2810B221j103k581j105J820K063J058j482k500p29J617K404P50j468k642k46J427
$$ 2221 1118 -1463 -2568 -748 1315 2373 891 -1609 -2338 -721 1683 2433 965 -1677 -1923 -496
2826d96J823O96j236j566j022L83K025J522j098j205j721J32K209J763m04k365
$$ -496 1327 2023 787 -779 -1801 -1418 607 2129 1031 -174 -1895 -1763 446 2209 1805 -560
2842e60j609M58K305J920p70k549j531O15K253J462l90k050j355K4K241R79J37
$$ -560 -2169 -1711 594 2514 1744 -805 -2336 -1721 532 1994 1604 -446 -1801 -1777 464 1443 1580
2859A580j418j467l24J260K034K15j487j785o63J444K374M25j822k209m05J852
$$ 1580 162 -1305 -1629 -369 1665 1880 393 -1392 -2055 -611 1763 2188 366 -1843 -2248 -396
2875c96K244N16j994k225N6J506J797J40j127j649r22J176K026O48o11k145j112
$$ -396 1848 2364 370 -1855 -1799 -293 1504 1644 517 -1132 -2054 -878 1148 1796 1185 -960 -2072
2892b072P90K180J068p45j992j574Q89K382J419o53k912r47R82K061J533j137
$$ -2072 -1282 898 1966 1221 -771 -2345 -1456 926 2345 1692 -1220 -2167 -1185 876 2409 1272
2908A272k299q42O09J981J234l87j981j418M51J511J764j96j633j782Q0J871J087
$$ 1272 -1027 -1869 -1260 721 1955 1568 -413 -1831 -1380 131 1895 1699 66 -1716 -1636 235 1322
2925A322P11j757k360k9J724K193K39k085j584j0J687J856J19j809j735k39J546
$$ 1322 2033 276 -2084 -2113 -389 1804 2043 -42 -1626 -1636 51 1907 2026 217 -1518 -1757 -211
2942b11J530N65j578j327n57R65K049M94j088j743j136J051K048J325j466k047
$$ -211 1319 1884 306 -1021 -1578 -613 1436 1930 842 -901 -2037 -986 1062 2387 921 -1126
2958a126j187J357K019P38m40k679r59J219J875J046j203j550n98L89J862R93
$$ -1126 -2313 -956 1063 1801 1361 -1318 -2277 -1058 817 1863 660 -890 -1488 -1099 763 1756
2974A756n24j695j307N4J958J405Q5j836j691L82J771J350J7j940j851N16J732
$$ 1756 1232 -463 -1770 -1716 242 1647 1732 -104 -1795 -1413 358 1708 1725 -215 -2066 -1550 182
2991A82J537j06j411j812J03J629J274j5j128j533n88J722J390M54j160j788l92
$$ 182 1719 1613 202 -1610 -1507 122 1396 1381 253 -1280 -1868 -146 1244 1698 538 -1250 -1642
3008a642J104J646R03j364j937n68J300J937P04j233k513k03J287K083L09j155
$$ -1642 -538 1108 2011 647 -1290 -1858 -558 1379 2083 850 -1663 -1866 -579 1504 1813 658
3024F58j645p27P74J852O90o26j786m62L24J279J252m62j766r94L14J634J470
$$ 658 -987 -1714 -940 912 1602 976 -810 -1272 -948 331 1583 1121 -645 -1639 -1325 309 1779
3041A779o81j723j013n8J834K161j156j728j003J59J822J385o14j433j053l8J296
$$ 1779 1098 -625 -1638 -1696 138 2299 1143 -585 -1588 -1429 393 1778 1164 -269 -1322 -1360 -64
3058f4J591q5j403j344k02J443J258L83j210k046j5J377J347O71j403j721j78
$$ -64 1527 1442 39 -1305 -1507 -64 1194 1577 367 -1679 -1694 -317 1030 1701 298 -1423 -1601
3075a601J149K004J30j315j612l31R46J652O25j190j459m92O89J610J080r14j858
$$ -1601 -452 1552 1682 367 -1245 -1576 -630 1022 1647 457 -1002 -1494 -805 805 1885 971 -887
3092h87o59O43K034N46j78k073q44L80J430J549r24j627j252J085J655Q12q13
$$ -887 -1546 -903 1131 1677 1499 -574 -1418 -1038 392 1941 1017 -610 -1862 -777 878 1690 877
3109H77j225j315P60J344J264p50j192r57Q4J237J519m7j724j247j58J662J132
$$ 877 -348 -1663 -903 441 1705 955 -237 -1194 -1110 127 1646 1599 -125 -1372 -1530 132 1264
3126A264M05j493j645o2J630J383J28j296j903K84R52J774k66p16j405m69R00
$$ 1264 1669 176 -1469 -1531 99 1482 1610 314 -1589 -1305 -353 1421 1155 439 -966 -1435 -535
3143e35J694K59r29j516n31Q45J693L14o65j488r25J083J720O40j123j606o70
$$ -535 1159 1418 489 -1027 -1558 -713 980 1294 629 -859 -1784 -701 1019 1659 536 -1070 -1740
3160a740R05J594J012q93j876o14Q94J410Q71n95j659j180R75J346R78m86j266
$$ -1740 -835 759 1771 878 -998 -1612 -718 692 1563 968 -691 -1871 -896 450 1428 942 -324
3177c24j041jJ633J006j19j434j617Q42J218J151Q1j903r26K90J280J204k56j403
$$ -324 -1365 -1366 267 1273 1154 -280 -1897 -1055 163 1314 1395 -508 -1434 -1144 136 1340 1084 -319
3195c19r70L7J318J305j43p46j772m8R46J277N86j278j377l42J270J366M03j158
$$ -319 -1289 -1252 66 1371 1228 482 -1290 -1338 -392 885 1471 193 -1184 -1526 -256 1110 1513 355
3213C55j313k24Q36J309L10r26j317k61O70J166O70m83j639o01P34J430P71o92
$$ 355 -958 -1182 -346 963 1273 347 -970 -1231 -561 605 1275 792 -847 -1448 -714 716 1487 795
3231G95j311o44J74J625Q42p85r82j332O77J320J302p61j265j306O51J465P77
$$ 795 -516 -1160 -986 639 1481 696 -286 -1618 -941 379 1681 920 -345 -1651 -1000 465 1242
3248A242k79j354j097M45J461J088l49j229j124J31Q62J514lj146j495K8J414
$$ 1242 963 -391 -1488 -1043 418 1506 1157 -72 -1196 -1065 -203 1311 1308 162 -1333 -1305 109
3265A09J063K92j465j137k59J224J077N44j128j520k11J261J188J43o17j236q47
$$ 109 1172 1464 -1 -1138 -1397 -173 904 1448 320 -1200 -1411 -150 1038 1181 564 -672 -1519
3282a519J168J227K07o25j097q27R29J552M39p01j594n63P90J098J133r75j450
$$ -1519 -351 876 1083 458 -639 -1466 -537 1015 1454 753 -841 -1404 -614 484 1617 642 -808
3299h08o43R31J131O95l26j434p08P19Q96J007m63j578n51J89J177P80k85j017
$$ -808 -1451 -520 611 1306 980 -454 -1162 -443 453 1460 997 -581 -1132 -943 234 1014 729 -288
3317b88j125J72J263J332k40j005j408k8J252J599j64j609q43k14J238J310pj189
$$ -288 -1413 -1241 22 1354 1114 109 -1299 -1327 -75 1524 1360 -249 -1092 -1306 -68 1242 1235 46
3335D6j034L6P42J558J80j350r33n82J182J068M46j071j110o71J175J350K73r90
$$ 46 -988 -952 -210 1348 1528 178 -755 -1337 -155 913 1359 288 -822 -1493 -318 1032 1305 315
3353C15r16q33P05J494O62q16j317l44K15J576M14l19j538p60P67J274P28n75
$$ 315 -601 -1434 -729 765 1427 611 -706 -1050 -835 741 1155 836 -702 -1462 -695 579 1307 732
3371G32j180p69M87R66R51k74j212j061M09J253J010n39q70r98j97J267J130N8
$$ 732 -448 -1217 -730 236 1187 913 -299 -1360 -951 302 1312 773 -97 -1095 -1292 -25 1105 1163
3389A163j470q86L12J356P76k77q29r77n09J114J200J73j070j170r1R10J225K20
$$ 1163 -307 -1193 -881 475 1251 974 145 -832 -1341 -227 973 1146 76 -1094 -1185 -275 950 1170
3407A170p88j106m50P51J292K85r52j318k87J021J193L05m02j729l01Q26J158
$$ 1170 382 -724 -1174 -423 869 1154 202 -1116 -1403 -382 811 1116 714 -1015 -1316 -490 668
3424F68O09q05j315m11P22J137Q23o49j339m34M97Q87Q90p03j181n09N41N24R64
$$ 668 1277 472 -843 -1254 -532 605 1428 779 -560 -994 -497 390 1280 577 -604 -1113 -572 -48 916
3443I16L0j247j113O23R73Q34K45j346r80p8J167J119mj480r55K68J121Q96l59
$$ 916 946 -301 -1414 -791 182 1016 1261 -85 -1065 -1143 24 1143 1139 -341 -1296 -1028 93 989 630
3462F30n89j022j40R05R63K41r09r10R7K99J430K54p60j410l43P53J312M24q71
$$ 630 41 -981 -1121 -216 747 988 79 -831 -734 -435 995 1249 489 -921 -1264 -511 801 1225 354
3481C54r50p09J025J063L86q70j195m57R87Q47L29l24j149l75M69R87R27n80j513
$$ 354 -596 -1305 -280 783 1169 299 -896 -1353 -366 481 810 486 -663 -1038 -569 418 1345 765 -748
3500g48k77J06J288J037p44j117m03P9J041J017m53q15j359O31J311L72k54j124
$$ -748 -1025 -919 369 1406 662 -455 -858 -779 262 1279 826 11 -1348 -717 594 966 712 -412
3518d12n98J70J025P91k93p59p90j09R07J065j86r07j125P6R57J153q5q93j029
$$ -412 -1010 -840 185 976 683 -76 -866 -975 -68 997 811 -96 -1221 -1145 -188 965 880 -13 -1042
3537a042j9J041Q59P03j345j201J51K92J486K42p32j153n56Q64Q91P98o74j227
$$ -1042 -1061 -20 839 1542 197 -1004 -853 -561 925 1167 435 -718 -1274 -410 481 1279 605 -622
3555f22q22J055R85O21n89j094p23N21J354N45o16j285m42P83Q04M39k48j169
$$ -622 -1444 -389 596 1217 628 -466 -1189 -668 686 1231 615 -670 -1112 -329 475 914 666 -503
3573e03m03J79P75Q66p8q55j093M10R71O87q6q78q71P5J241M11L67j000j265K8
$$ -503 -906 -727 48 914 836 -19 -1112 -702 269 956 870 -8 -879 -804 437 848 1215 215 -1050 -1022
3593a022J270Q75l26q22o09k10P23N80M26o91p68m28Q82R35K5n38j069l58Q17
$$ -1022 248 1123 797 -25 -634 -844 -121 459 885 194 -574 -1002 -120 815 840 302 -767 -1125 -308
3612c08R26L37q31r64j39Q82O01N12q86o80m94O82R73J06l56o96p02L99J069O56
$$ -308 618 955 124 -840 -979 -97 504 1016 130 -550 -1044 -362 611 717 361 -335 -1037 -638 431 1087
3632A087l62j400L4K20O01Q52l66r95m58J83R10Q02k15j352n98N28P53N80j06
$$ 1087 725 -675 -641 -421 180 1032 666 -329 -787 -604 306 1108 893 -459 -1057 -529 224 804 698
3651F98r06n38r2Q85R89m52n02r51j57J147P29N4p87q45l66J146R12K63j074q72
$$ 698 -208 -746 -838 47 1036 584 82 -869 -1026 121 850 904 117 -728 -1094 52 964 1227 153 -719
3671g19j64P21J097k43m31o83o99R63O04O16j062p11k07L99Q23M61k99r69j26
$$ -719 -883 -162 935 692 261 -422 -1121 -158 446 1062 0 -711 -918 -519 304 765 466 -503 -629
3690f29K90Q58N84n83j052n69R15P56N78m54p70r99O16O05P84l73q91o83L87R57
$$ -629 -339 519 1103 520 -532 -1101 -186 570 1148 694 -76 -1075 -459 146 930 557 -334 -1017 -630 327
3710C27M94j03o79r41k56J266Q50m6j192n98O3R16Q88j49q33r26O2O46Q42L93
$$ 327 821 718 39 -902 -1158 108 958 912 -280 -878 -815 101 989 840 7 -919 -857 -211 631 1024
3730A024j058n19l74J051P44q8p89m94o80R65P35L85o02q41n28N90R87N00o43
$$ 1024 -34 -553 -927 124 868 780 -9 -503 -1183 -218 517 902 300 -541 -1069 -479 508 1008 365
3749C65q46k83J39J013N47m26o44n48L29R54M23o83q78n53M50J041M85l27p15
$$ 365 -481 -764 -625 388 935 509 -135 -683 -354 600 1023 340 -538 -1091 -641 400 885 558 -157
3768a57q34L58Q04P88k68j070l17K67P52P57m70j165m51N41M68J023j80q60q97
$$ -157 -991 -633 171 959 691 -379 -696 -429 323 1080 610 -555 -1006 -465 3 1026 846 -14 -911
3787i11R8J133J67L73r74p78O0P21P98M60r63p71k23Q76Q50k88n94l48o18P17
$$ -911 -813 320 487 860 -114 -892 -832 -111 687 1147 184 -587 -810 66 916 628 34 -314 -932 -215
3807b15Q49P0n21o65m67O18J041j8n11p68m29N57J072J38n82p08l79O77N60J92
$$ -215 634 704 183 -482 -949 -331 710 692 181 -587 -1016 -459 613 751 169 -539 -918 -241 319 511
3827E11J33j148l78J47J193M87l91j076m95O29O83N30n16l28p09R1Q18N70k5r23
$$ 511 644 -504 -882 -735 458 945 554 -522 -1017 -388 295 825 309 -19 -728 -637 181 751 726 -197
3847a97n87L46M55P37N7j045r24Q73L36R05j28q92q23j64R51P92j9p34n15N5L99
$$ -197 -784 -438 17 754 811 -234 -1158 -285 51 956 828 -64 -887 -1051 -100 692 673 -61 -576 -521 -122
3868a22P21J20n88p98k06N94R50J20n82r13j67P02P29L44m82o94n30M94Q02L53
$$ -122 599 719 131 -667 -873 -279 671 791 209 -704 -871 -169 560 904 422 -272 -802 -308 494 847
3888H47n27p78k58R6J021N16m27p86m47K12P06O22k87m92r18K37Q72N15l77m65
$$ 847 320 -458 -716 -620 401 917 490 -296 -743 -531 175 797 510 18 -900 -663 209 724 347 -118
3908a18o87L38O62Q50k33q95m07l23Q86O48p8o11o22L13J38J193m71m69p84l1
$$ -118 -805 -467 195 1045 812 -83 -490 -813 73 721 643 32 -590 -277 -139 1054 583 114 -670 -701
3928g01P66P16k47n36q52k4Q12J131k19p25n85o50P31J052j4m02r42k24N13P06
$$ -701 65 781 534 -2 -854 -878 -66 1065 846 121 -464 -1114 -383 669 655 253 -689 -913 -400 306
3948C06N04n56r58j37M56P75N85n72p75j68L12N20O44l88q70m28L14O75N31Oj230
$$ 306 810 254 -704 -841 -385 390 975 403 -372 -540 -228 292 936 548 -322 -750 -436 239 770 776 -454
3969d54k15M57N19K52m8n05o19P1Q70N84k65r12n27J76O85N58k38k29n91j18K93
$$ -454 -669 -212 307 559 511 6 -613 -542 328 912 647 -265 -792 -616 69 627 389 160 -431 -549 -256
3990b56Q90Qo97k85j43J89P09K93m68q70J5N83M65M17m58j025l36P22Q90J29m95
$$ -256 634 642 -55 -340 -483 -294 415 708 240 -630 -615 -32 433 850 392 -633 -969 -247 643 772 277
4011B77p03p16P07R57J01j78p83m85N67O73N84l39r03m96J89P39Q20n95p49k22
$$ 277 -426 -1142 -435 522 623 445 -338 -823 -256 417 1001 662 -241 -737 -548 191 1011 416 -333 -555
4031e55J1J023L52l90m10p02K47N25M55J59n42j211O49M61N37j39n97o85K15N44
$$ -555 -544 479 831 441 31 -671 -424 101 556 715 173 -1038 -389 72 609 470 -127 -812 -597 -53
4051e3Q16k3o47q33K8M63J171l49q10m4k57P31P70j88p31o13l65O48O37P50r08
$$ -53 763 740 93 -740 -712 -249 922 573 -237 -281 -538 193 963 775 44 -569 -934 -286 351 1101 193
4072A93o98o0N89O42j24R3j082n17P11O48M07o38o42o5K11P73M59o45n99l98J14
$$ 193 -505 -565 24 666 542 635 -447 -964 -253 395 802 164 -478 -543 -332 441 900 255 -344 -742 -628
4093f28J144K48l27r02n06K80R86M57j07r31m63J99J149J68k03q47o56J30R68
$$ -628 516 764 437 -465 -971 -691 295 752 645 -286 -749 -550 599 767 564 -283 -939 -809 159
4112A59M12J24q84l35M0M32P74j34m62q73K42K62J127l1q85o21P8P36M28N1l97
$$ 159 571 695 -189 -524 -484 -52 722 588 126 -747 -505 -243 884 853 -32 -653 -575 161 589 640 243
4133B43q94r1P69O64j2o89o13R0M34M65K27o19o23K9K45N83N20l56q01l48P49
$$ 243 -651 -742 27 691 679 -10 -623 -533 -99 366 593 -26 -649 -620 -375 208 728 372 -429 -777 -28
4154b8L77K44l99n71l04J2P38N13q4o53l24j45P73Q38q06m78n38M18P43L82R6
$$ -28 349 593 194 -377 -681 -669 69 582 498 -155 -479 -624 149 987 181 -297 -835 -417 326 708 804
4175H04j101l24K00P60M61q4r38m15m16J358K05J38k51q45k76O95Q36j43o21o87
$$ 804 -297 -621 -421 339 800 716 -222 -637 -1053 305 510 648 397 -448 -724 -29 807 664 43 -644
4195f44J0O96L61K13p43l17k05M86R27Q2p13p33m7N11K60L06k95p23K45L43L84
$$ -644 -634 62 423 636 -107 -424 -629 -143 784 866 153 -580 -627 -116 144 450 155 -568 -323 20 404
4216D04J95m07q69J42J81P11L21l26p28j85J68Q08K43n82l65j23k59Q00O09k58
$$ 404 599 192 -677 -535 -354 357 678 352 -376 -561 -393 415 658 76 -289 -412 -671 129 738 480
4236D80p74m88M9P01N12K8q16k40J88O64K86l22n83l74J67N35N47K96r67o09J05
$$ 480 -294 -782 -733 -32 480 508 -308 -548 -360 304 590 268 -315 -689 -522 13 560 856 -111 -720 -615
4257f15N92M90j20k00r04J80O63L9N99q95j28rK75N51K06p11o53p4M65O00L50
$$ -615 -23 467 347 147 -757 -577 86 125 724 -171 -299 -308 -33 518 724 13 -640 -714 -249 351 701
4278G01m78r92p6M27R71p9k43p99m38P80O82L48n26k81q22M03O90K91K6q82o23
$$ 701 223 -769 -845 -418 553 474 231 -568 -1006 -226 456 804 278 -3 -825 -422 268 559 585 -297 -920
4299i20N41P05P32q28l25m92L34N72J55K43q87n60L14O45L60pq32l82L92M50M88
$$ -920 -379 326 1058 230 -95 -587 -253 319 474 717 -170 -730 -416 229 589 582 -250 -632 -240 210 698
4320F98j15q97o88M02P19M66Q8m76o05O2K50O96J8n12m44m41O13P70%o60j77k85
$$ 698 583 -314 -1002 -600 119 585 673 197 -408 -346 -96 600 618 106 -338 -779 -166 604 604 -56 -233 -518
4342e18M03M01J57J73j008k66M85M29P06n53r85J2L16M38N01m24o05l23J43J052
$$ -518 -115 286 443 616 -392 -658 -173 256 962 409 -576 -564 -248 190 691 267 -338 -661 -518 534
4362E34L15o27p00j08J99O97M03l47n70l78n2P61N16m7q48l90L22L96N29Ml30
$$ 534 849 222 -478 -586 -387 310 713 366 -204 -582 -634 127 643 596 -252 -642 -320 76 605 609 279
4383B79q09rP09R8J76n25m38K48K63K66L99r04l76%N42N53M91r30l27o19O23O88
$$ 279 -530 -539 170 268 444 -81 -519 -271 -8 258 657 -247 -623 -623 -81 472 963 33 -294 -913 -290 398
4405C98J27l96l07n13M72N52J91l88m95R9J8P20o1j21o56M0K27K27N79m93p33
$$ 398 525 129 -178 -691 -219 333 524 136 -359 -260 -242 478 417 296 -360 -320 -93 134 713 220 -513
4426e13j26M23N10K15k43m99j86j22R87L02n35k00n19L14Q7N50j64l69n67M84
$$ -513 -639 -216 294 509 266 -233 -419 -541 446 748 213 13 -506 -192 -105 445 281 -88 -655 -171
4446a71K86K99Q4r64j47L2N64L34J62m53n82P1N17O75o8n34n45m02N65R45j29
$$ -171 115 414 498 -466 -613 -581 -17 317 479 26 -556 -485 32 707 639 105 -440 -842 -277 668 539
4467E39m47n96j33O39L97L69p20q38L50J14Q13L4j71j085R1N99L78K91k3j256
$$ 539 92 -504 -637 2 399 768 48 -790 -440 -326 487 521 350 -735 -644 -45 333 624 601 -655
4487f55L08q7Q81M67n97n06p54O60N83J81j12o76j47k44Q06L59q6n80o47J43Q21
$$ -655 -347 -434 447 914 317 -189 -943 -283 300 481 369 -307 -454 -698 108 467 381 -199 -846 -703 118
4508A18O61l25n56o43L27M83K89J10o00k41O0L92O61j99o19l87R4N24K77j07r2
$$ 118 779 454 -102 -745 -418 65 354 464 -136 -377 -317 75 736 537 -82 -469 -375 149 426 319 227
4529B27q03k52J088K12k21m48l29O1J52P81J24m39n93k51N81M16J82j44o97k71
$$ 227 -576 -828 260 472 251 -197 -526 -465 -313 468 592 153 -440 -691 -110 306 488 344 -353 -624
4549f24L46Q05P4m15m97j20J36K48P94m61l80m32K29P05J34Rq23k22L3N07O69
$$ -624 -278 527 601 186 -311 -431 -295 -47 747 286 -94 -526 -297 408 542 551 -272 -494 -461 46 715
4570G15l88m21l59R2O56M44m35l48m89J00M32N04R3l81o35K3L94M62j1p59k86
$$ 715 327 -94 -453 -361 295 739 304 -44 -533 -433 -1 503 596 215 -420 -397 -3 459 448 -311 -597
4591e97k15R81M79l25O0p17j46N34M92J4m76q55L18nR52j13j79m56j76L59P68
$$ -597 -812 169 648 323 383 -334 -480 54 546 560 84 -771 -453 -458 494 381 202 -254 -430 -71 697
4612F97j22l71o52J1J52P59M72n66o40m26L18P90r1P0n21l88qO50K94k23j96o85
$$ 697 575 204 -448 -437 -285 474 946 380 -260 -686 -368 422 331 401 -120 -508 -516 134 428 205 9 -676
4634f76M48M55N00m31n94k19K78L75K67N6o27l75K19L57K33K20p81l93K52M94
$$ -676 -228 227 727 296 -298 -517 -239 136 403 459 -168 -543 -324 33 266 486 -295 -688 -436 58
4654E8O81l18n56k69R1J56Q17n0o79l10j79O81N1K64m77n24J14M19M18M35o29
$$ 58 739 421 -135 -404 -313 -157 660 610 -69 -379 -558 123 174 438 -39 -563 -449 -30 388 823 194
4675A94k66l22K37N01P7Ko68l25K12Q28q5m14k32o7j49O23M71m79k56m46K84N14
$$ 194 -72 -394 -157 344 421 423 -245 -570 -358 470 385 -29 -261 -328 -477 146 617 138 -118 -564 -280 234
4697B34J24K9n08k71pP24M13k67o49n31J93O04N01l14l45l38j62N08P48l99l81
$$ 234 358 387 -121 -392 -399 325 738 471 -178 -709 -516 88 589 275 -70 -408 -570 -62 686 287 -94
4718i4k72k3K27O82k26n99m3J83R2N15K99r19m77K16N24K69mk1o65M3K6P27j29
$$ -94 -366 -389 -162 520 294 -305 -348 -165 -73 442 741 -178 -655 -439 85 354 350 329 -336 -293 -267 460 331
4741C31j89m75k07M52O83Q4n23l22k46R7M68N77o21m75K24n8O07M05q39j94J24
$$ 331 142 -333 -540 -88 595 679 156 -166 -412 -315 153 730 109 -366 -142 -200 407 812 -27 -221 -97
4762i7k64Q17j73j25n21j86K45N76J01m04o4n00O00L21R8jp96j56K37M73l3J29
$$ -97 -361 456 283 158 -363 -549 -304 272 373 -31 -95 -595 5 326 424 423 -373 -529 -292 181 148 277
4784B77m13m20j73P14M14J22l81n07j93O82M6M33n44n16J34K68M42K97n13m55
$$ 277 -136 -556 -729 -15 399 521 140 -367 -560 122 168 601 57 -459 -325 -57 385 682 169 -286
4804b86n5M86J65L93r30k35N5M68J45L61n74k34l10M11N82m8R5q58k13K66P55
$$ -286 -341 145 310 703 -227 -462 -407 61 206 567 -7 -241 -551 -140 442 394 489 -369 -582 -316 439
4825D39j9k68l16l24L79M65P3k68n06j88N01N5M37j09n01m46L55N82r3L6m57l40
$$ 439 420 152 -164 -488 -109 356 429 161 -345 -533 -32 23 460 351 -150 -596 -241 341 248 284 -173 -513
4847e13J51O09J86j76n36m15J89N21M46j28r11r8K20O65J16J90n44l81J33L79
$$ -513 -362 247 433 257 -279 -694 -505 16 462 334 -577 -675 -455 210 326 516 -28 -409 -276 103
4867A03M8N11q22j75K04k8M23M27m99m92j6n2Q67p6m00m02J9M14J94J30k81n19
$$ 103 151 662 -160 -335 -131 -159 264 691 192 -300 -316 -368 499 423 23 -379 -360 54 248 378 97 -422
4889d22K50M5K41L58l01n88L48k84N49M24n72l20J32RK55M15m10j81m16J3O11
$$ -422 -172 -127 114 472 171 -417 -69 -353 196 620 48 -272 -140 -131 124 539 129 -52 -468 -455 156
4910A56P5O4l89l17K7L11L97J38o46m78K06Q02q7J92l40r07M51K30N92l86j83
$$ 156 231 295 -94 -411 -384 -73 324 462 -184 -662 -456 346 259 451 111 -796 -345 -115 477 91 -92
4931i2l01O9K02M30Q2n99p7l9K78L94J1j07o72m4J29R28J22l81n31l42J39R85
$$ -92 -393 -324 -122 308 390 -209 -286 -325 -47 347 358 251 -421 -465 -336 592 714 333 -198 -540 -401 584
4953E84j38n30j64k56N07M36l14J29m09m10K99O31J07l42k03l67M3L78L74j47
$$ 584 446 -84 -248 -504 3 439 125 254 -155 -565 -266 365 472 130 -73 -440 -397 -19 355 208
4973B08n24j46J52L66L64K31p64k25k12O28K10j15l73l57J08L58O50k53m18j59
$$ 208 -316 -462 -310 56 420 651 -113 -338 -550 78 288 173 -200 -557 -449 -91 559 306 -112 -271
4993b71m9o1O82L83m63n59J44Q6O13J04n43k46l09L20Q29k93j35n76J5M00m6M24
$$ -271 -320 -381 301 684 221 -338 -194 -108 505 609 66 -180 -489 -169 660 367 232 -344 -329 71 25 449
5015D49j82n93r5M72j6J52Q2p06J64j4P37j09l01n31p2N42O5L49k54o1p00K74
$$ 449 267 -326 -421 51 35 187 269 -437 -273 -287 450 341 40 -491 -563 -21 44 393 139 78 -622 -348
5037c48P69j06n9l87qO7J60M33j54n63j63K45M22P2j8m46m78L77J78N34l39l76
$$ -348 421 315 256 -131 -139 -72 88 521 367 -196 -359 -114 308 380 362 -84 -562 -185 -7 527 188 -188
5059a88l27r1O73K74J32m65n99J58M97M25L7m89l36j27M30L88K84m01k06j49J8
$$ -188 -515 -606 67 341 473 8 -591 -433 64 489 526 37 -299 -426 4 392 676 275 69 -80 -62
5080f2K69qJ15l43m36J99K85K34k21k87j33p6Q62j75L72o07p24O52K57K77j33
$$ -62 207 199 314 -29 -465 -266 19 253 32 -255 -388 -464 398 223 595 -12 -736 -84 173 450 317
5101C17m80m03M15J74K49N9m87n6l17Q03J99k75k23l49J71J67L63j7o27k92L20
$$ 317 -163 -566 -151 23 272 331 -156 -212 -529 274 473 198 -25 -374 -203 -36 327 310 -317 -609 -289
5122b89M83M9O3k19n20J80N79J39pl18k51k12M18M8K75j67n80r3K49K78M78o11
$$ -289 194 243 306 87 -433 -253 326 465 458 140 -111 -323 95 143 418 251 -329 -422 -173 105 583 -28
5144b8p18M27M43R6Q0j61n01k06N26P37m98Q1p89J86K56J76M14j87n01l48K32
$$ -28 -746 -319 124 220 300 139 -362 -568 -42 695 197 278 -511 -325 -69 107 521 334 -167 -515 -283
5165b83M96K82k81l38m68K41O12M0Qm63k07J19M24M48m95m6o06L66J9K46M0m11
$$ -283 213 495 214 -124 -592 -351 261 301 309 -154 -361 -242 182 630 135 89 -517 -151 -132 114 154 -257
5187b57k75J34N16R1J57m07m51j49R33N0J49p74j32P7M27L56L3n94m56L36K85
$$ -257 -532 -398 118 209 366 -41 -492 -641 292 342 491 -283 -415 -338 89 445 478 -116 -572 -236 49
5208D9M01pp64L9j56J95L10K98l01l29o5L47L31k06m17L7j70N26J16M1k43k25
$$ 49 450 443 -321 -282 -438 -243 67 365 64 -265 -330 17 348 142 -275 -238 -408 118 234 275 32 -193
5230a93J75M8J18J95l04l71m52Q83ON91m75m88k86M4N78K62j05N6n86K48M98j02
$$ -193 -18 30 148 343 39 -332 -784 99 105 696 221 -267 -553 -509 69 331 226 282 -304 -56 442 340
5252C40K82n69k52k73N02K31J94n75m95RJ000p7K84n39n33K33L85J25R0m41j67
$$ 340 622 53 -199 -472 30 261 455 -120 -615 -606 394 317 601 62 -471 -238 147 272 362 -79 -246
5273b46l75L10P20k99j93k66MK31N51j00j45m10N8o6N32K94l59o36k3L12M25j27
$$ -246 -621 -311 409 110 -83 -349 -345 -114 437 337 192 -218 -160 -226 306 600 241 -395 -418 -106 319 192
5295A92p6j97k50J47N97m7j00k78j92l64O98N8J18l75k58Q9K88K38%m32n42N31
$$ 192 116 -81 -331 -184 413 366 266 -12 -204 -568 130 188 306 -69 -327 -238 50 288 288 -144 -686 -155
5317a55M28J88p6p60j5J11K83M06qn57j88M7O83jM8m78m0k13K25L89Pk15m87m13
$$ -155 273 461 385 -375 -390 -279 4 410 402 -155 -343 -296 387 386 434 -44 -84 -297 -72 317 324 109 -378 -791
5341g91Q14J69O1l40K2n01K09M75j9J98n98K15j99L72J23P0o20j4J53J93M04K4
$$ -791 23 192 253 -87 -65 -566 -357 118 99 297 -301 -86 -285 87 210 280 -340 -354 -201 -8 396 420
5363D20n73j76R0O21j08p1j55l31J00L95J41k20j48k21k5O32M1k46k56k6j92M48
$$ 420 -153 -329 -239 382 274 203 48 -283 -183 212 353 133 -15 -236 -261 371 412 166 -90 -116 -308 140
5385A40K02k48k63j20J44J41M63l36q8k50j85N86j39K71k05n44K66K54J75l9j29
$$ 140 342 94 -169 -289 -145 -4 459 123 35 -215 -400 186 47 318 113 -431 -165 89 264 225 96
5406I6k69k13M32J7J07k29m41L63J57K18J19l70k18O8L92J34M0l43j19m79J1P46
$$ 96 -173 -386 46 63 170 -59 -500 -137 20 238 357 -13 -231 -163 229 363 403 60 -59 -538 -527 219
5428B19K56l68m97j4L6N83M1m7n81k97O98L93l49O5l56m56M51M85J06l68J35o03
$$ 219 475 107 -390 -404 -368 215 256 209 -372 -669 29 422 73 138 -218 -674 -223 262 368 0 135 -468
5450d68q4P74O4k66k59j00K01L69K27m30J4l97P7M41L40l47m71M4j60M66K63n
$$ -468 -552 222 286 20 -239 -339 -138 231 458 28 42 -355 -278 163 503 156 -315 -271 -431 35 298 293
5472B93k86j91J29Q0J69j88j10o7l38N21M21l30Pk20k7P5mM59n56l68K5M53K0
$$ 293 7 -184 -55 25 194 6 -104 -171 -509 12 433 103 110 -110 -137 -62 -66 393 -163 -531 -506 -53 -33
5495c3M04n30k49L07MN8M06j52j89k15l59M92L97m37j08k76J90O21L37m12k73
$$ -33 371 -159 -408 -101 -97 -39 367 215 26 -189 -548 -56 341 -96 -204 -480 -290 331 668 256 -17
5516a7lj96N01J71n08j89j41L74N01j63j20k88r2j09L39N54l06o16j36K62J81
$$ -17 -20 -216 285 456 -52 -241 -382 -8 493 330 210 -78 -170 -279 60 614 308 -308 -444 -182 -1
5537aJ75J53k54l66M4J22K06L58n26j05j10M70n7L61n66l94J79J55O53n59J72
$$ -1 174 327 73 -293 -249 -127 79 437 -89 -194 -304 166 109 470 -96 -490 -311 -156 497 -62 110
5558A10l06j55K67L55j43J9k57m33J29O22Rq4m07n5J52O34l63J10o20k00J96M75
$$ 110 -196 -351 -84 271 128 147 -110 -543 -414 208 217 133 -274 -329 -177 457 94 204 -416 -616 -420 55
5580E5M92o8q04J75J08K10o3J06m65m6J92R6L13k26K8l80k0J48M92j2l70m13J11
$$ 55 547 479 -325 -150 -42 168 105 211 -254 -300 -108 -12 301 75 103 -277 -297 -149 343 331 -39 -452 -341
5603c41M08J00J62j90m82J30K28K16J01k20n59L48j26N09L6l26nm84N94k2N51
$$ -341 67 167 329 139 -343 -213 15 231 332 112 -447 -99 -225 284 320 -6 -11 -495 99 77 628
5624F28n05j94q8j06M94j41l08K24m05K26n5L91j74m05M03r9M45l9J4l54k56L17
$$ 628 123 -71 -159 -265 229 88 -220 4 -401 -175 -230 161 -13 -418 -15 -114 331 292 306 -48 -304 13
5646A3M53j79o5n29LL06O1L48l94k52q9K76J15J96j35l68l0j7M25N1M3l14M4j78
$$ 13 466 287 222 -307 -304 2 63 411 17 -235 -324 -48 67 263 128 -240 -270 -287 138 189 232 -82 -38 -216
5670b16K23J14N0J78p53J01K09N28p4m09k00R9j50N21K70l66l59R1Q8L61k21k18
$$ -216 7 121 171 349 -404 -303 -94 434 360 -49 -249 -150 -300 221 491 125 -234 -143 -55 306 85 -133
5692a33k44j14K68O31J64m19n47J85J85M34j24r4n10j40L40N15O0l08j79l99J54
$$ -133 -377 -491 -223 408 572 153 -394 -209 -24 410 286 192 -318 -458 -118 397 457 149 -30 -429 -275
5713b75O07J67n12k44Nj19L75r2K91k73k45K68m4M50n27K39m31K13L65m28M54
$$ -275 332 499 -13 -257 -252 -371 4 -88 203 -70 -315 -47 -91 359 -168 71 -360 -147 218 -210 244
5734B44l12j28o8J92O89l49l99m52M95K1M36O6j18l55k41L63M28J2p38l19L43
$$ 244 -68 -196 -264 -72 617 268 -131 -583 -88 -67 369 435 317 -38 -279 84 512 524 -214 -533 -190
5755a90j1O07k26m25l4j91L44J41N00k95k89k25K89L14l59r8K51l36J80J57K27
$$ -190 -201 406 180 -245 -279 -470 -126 15 515 220 -69 -294 -5 309 -50 -148 103 -233 -53 104 331
5776C31m51k04L02l35M54K02k57j49k26M04N2O9q0Rl74J96L78q0k91q5k8J75J27
$$ 331 -120 -324 -22 -357 97 299 42 -107 -333 71 123 192 112 121 -253 -57 321 241 -50 -135 -163 12 139
5799A39K5J60o67J30k0J99J43k0p9l29P7L10J90L2m71J44l73M85R2j5j83k36l9
$$ 139 164 324 -343 -213 -233 -34 109 89 10 -319 -242 68 258 290 -181 -37 -410 75 167 152 -31 -267 -306
5822c06K79K51K79m42k93P4L37j33j11j67L3j38Q4Q91n90l15r5m0M26O6J09J0
$$ -306 -27 224 503 61 -232 -158 179 46 -65 -232 -199 -337 -253 638 48 -267 -362 -402 24 90 199 209
5844B09k84k17j00O98j44l52R6j99M9M81J19m13j13J16r9K08M10l45k32j64K1
$$ 209 -75 -292 -392 306 162 -190 -94 -293 -244 237 356 -57 -170 -54 -153 55 465 120 -112 -276 -255
5865b55M32l2k42k11j30M70k08L95k76J72l92J31J33K81j70K70o12j55N31pr9
$$ -255 177 145 -97 -308 -438 32 -176 219 -57 115 -277 -146 -13 268 98 368 -244 -399 132 125 26
5886B6J79m82L15J18J5J36l9n56M6L68p1J09n91M37l14J81K28L85m81j15k17k4
$$ 26 205 -277 38 156 171 307 268 -288 -242 126 55 164 -427 10 -304 -123 105 490 9 -106 -323 -347
5908c47L57J05pO0n41O7O27O7l10l43l7P8K39K42j69l98R9k94N45K11Q5m14J45
$$ -347 10 115 108 168 -373 -306 321 388 78 -265 -302 -224 15 257 88 -310 -211 -505 40 251 336 -78 67
5931F7l2m0K73K17p45K3nK42K48l69P4K89p00P61P3l49N7l52K21J95L4K4l81l61
$$ 67 35 -5 268 485 -260 -237 -242 0 248 -121 -47 242 -458 303 376 27 84 -268 -47 148 182 206 -175 -536
5955e36K53N25lo7l84J8k0j09N09k52L06l41J93j18M5J27j08j15l06L42K6L73
$$ -536 -283 242 239 172 -212 -194 -214 -323 186 -66 240 -101 92 -26 19 146 38 -77 -383 -41 -15 358
5977C58j87k24j95L10k23L96l48l2J03M8J68j55j0k00J5J68l0P6J49k59l58L55
$$ 358 171 -53 -248 62 -161 235 -113 -145 -42 6 174 19 9 -191 -176 -8 -38 38 187 -72 -430 -75
5999g5K93n9m3k3l59J85J33r9J18k7k46l7RN36p8k85k73m2L05J96K77k53k96J06
$$ -75 218 159 116 93 -266 -81 52 -47 71 44 -202 -239 -230 306 228 -57 -330 -372 -67 129 406 153 -143 -37
6023c7j32M65o2L3p01J40J50K59L11m60k29lK21o5K72j46j51l6p3M15J9R7o37
$$ -37 -169 296 234 267 -434 -294 -144 115 426 -34 -263 -266 -45 -110 162 16 -135 -171 -244 171 190 287 -350
6046c50J2qN29j1l0j00m76R5L64L51m0n21r9J90Q2K33k88K93l69m3L21J91k38
$$ -350 -338 -346 183 172 142 42 -434 -339 25 376 336 -185 -284 -94 -12 221 -67 226 -143 -186 135 326 88
6069H8m18J09J87N4N7K14l26k96M96j00M69k59j45l27K44K05j48N6k22j96L27
$$ 88 -330 -221 -34 20 77 291 -35 -331 165 65 534 275 130 -197 47 252 104 160 -62 -258 69
6090F9p3k59N03k47j04j25M25n7J6j01j50k91J68L83l1j94k23J66P0K90L03m46
$$ 69 -4 -263 240 -7 -111 -236 189 132 148 47 -103 -394 -226 157 126 -68 -291 -125 -55 235 538 92
6112I2j16l67O25l92L69k92o3j32p5M41M28n48lm9l02N29J17p1m73j86O92l33
$$ 92 -24 -391 234 -158 211 -81 -144 -276 -351 90 518 -30 -33 -82 -384 145 262 191 -282 -468 224 -109
6134a09K53k14J48j13j92L7L15M0k33j99Q0K14L31l11l3R5l64M04J97l54k34J10
$$ -109 144 -70 78 -35 -227 -190 125 165 -68 -267 -187 27 358 47 14 109 -255 149 346 -8 -242 -132
6156a32KK36k29N73k97l88J05j03K57L22l7m77Q2K02j31M24l03k94l00O07J8j66
$$ -132 -130 106 -123 450 153 -235 -130 -233 24 346 309 -168 -86 116 -15 409 106 -188 -488 119 137 -29
6178b9J25l52J06R7K07Q0k97J42m54J68L39J22j39j53k55Q7Q6J93K65n90K83j11
$$ -29 96 -256 -150 -53 154 234 -63 79 -375 -207 132 254 115 -38 -293 -206 -120 73 338 -252 31 -80
6200h0K83J29j44l96k9K54J33L6j47j29k18m2K46M14J50o69K14k07K93J02m38
$$ -80 203 332 188 -208 -237 17 150 186 39 -90 -308 -350 -104 310 460 -209 5 -202 91 193 -245
6221b45J60k36J40K39K32Lk55j57M4J60O6J68n77K9L4L37r9P2J78n98Q0L07J7
$$ -245 -85 -321 -181 58 290 293 38 -119 -75 85 151 319 -258 -229 -195 142 43 115 293 -305 -225 82 99
6244I9K78n2q04J01R1O08n6k81k35q7J66L31K32j7o23j78qM64j91M91o49k8J15
$$ 99 377 325 -479 -378 -287 321 265 -16 -251 -338 -172 159 391 374 -249 -427 -435 29 -162 329 -320 -348 -233
6267b33M42L15l93m40J22K21LJ45m8p4j36j65J35M20j78l09J30j98P81m70r6k43
$$ -233 209 524 131 -309 -187 34 37 182 134 60 -76 -241 -106 314 136 -173 -43 -241 540 70 -26 -269
6289b69K58j36J96l5J77j00n73L41J06L36j37L10p87o8L56M0J42P5j62q9J42J96
$$ -269 -11 -147 49 14 191 91 -482 -141 -35 301 164 474 -313 -381 -25 15 157 232 70 -19 123 319
6311C19j98k11J37r7R5K41l23J89n51N5J63K94K96m04j43j84M43j01M02n58N5
$$ 319 121 -90 47 -50 45 286 -37 152 -399 -344 -181 113 409 5 -138 -322 121 20 422 -136 -81
6332h1k31L35K20r2j29n9k23L26Q6J7j33k3k85K27J17J0K85q8m39L7J47k3K63
$$ -81 -312 23 243 151 22 -37 -260 66 152 169 36 13 -272 -45 72 82 367 279 -160 -123 24 1 264
6355B64r5k37J44n8M2j03J78j83j70J82K06ok48j59R6K86K4J65l40j85R2K81r2
$$ 264 169 -68 76 18 60 -43 135 -48 -218 -36 170 164 -84 -243 -147 139 163 328 -12 -197 -105 176 84
6378H4k46K89o09K33j8lM21J02l37p0j21M83om14J46l80K41L29J03k38n9p5M4
$$ 84 -162 127 -482 -249 -267 -270 151 253 -84 -154 -275 208 202 -212 -66 -446 -205 124 227 -11 -70 -145 -101
6401a01K25PN6l25n6p3K02K33j16j38j95K40M6j10K7j65K70Q6k93M02j86j51m3
$$ -101 124 131 187 -138 -194 -267 -65 168 52 -86 -281 -41 5 -105 -78 -243 27 113 -180 222 36 -115 -158
6424a58r6K34J95j50k26L8l50L92J31K73j09l24J69j28J65N3j08k65L0K98%K55
$$ -158 -254 -20 175 25 -201 -163 -513 -121 10 283 174 -150 19 -109 56 109 1 -264 -234 64 64 319
6446C19k28k04k6jO74l00m20mJ77j00J02K09j61m16J61K60q1n4L00n54J6K52j82
$$ 319 91 -113 -139 -140 534 234 -186 -190 -13 -113 -11 198 37 -379 -218 42 -39 -93 207 -347 -331 -79 -261
6469b61O13O2l02j02K9j9O2k62K78p2K1k2J34j3k81k01N9K97L51k92j14N9l45
$$ -261 352 414 112 10 39 20 82 -180 98 26 47 25 159 146 -135 -336 -277 20 371 79 -35 24 -321
6492c21J04L11L3j58l31J99K52J55N6n12L1r9L84j55p4J91j04n1L78k00j18l3
$$ -321 -217 94 127 -31 -362 -163 89 244 300 -212 -181 -280 104 -51 -125 66 -38 -89 289 89 -29 -62
6514f2r2k71N93j54K57n51K65K45n42M27L16p37o2qK55J38J67m5L2k15K01J97
$$ -62 -154 -425 168 14 271 -280 -15 230 -312 115 431 -306 -368 -376 -121 17 184 139 171 -44 157 354
6536C54p5J5m68N6J28J71n8L10j29r7m17K66M0k2k23J09J1p2J6M2j01k14J12R5
$$ 354 279 294 -174 -118 10 181 123 433 304 207 -210 56 96 74 -149 -40 -29 -101 -85 -43 -144 -358 -246 -151
6560a51M39q2j95j84o8L29o5K86m23J6q5K86l70N03l57N1j62q6M65j2m4j15Q6
$$ -151 288 206 11 -173 -241 88 23 309 -114 -98 -183 103 -267 236 -121 -70 -232 -318 147 135 91 -24 62
6583F2o3k8M1J22k46j03r5M18M6j80l5L0J89j60j11K05p4k25J08K64k28j67K57
$$ 62 -1 -29 12 134 -112 -215 -310 108 154 -26 -61 -31 158 -2 -113 92 18 -207 -99 165 -63 -230 27
6606B7k24N43m80J62o9N5p1M1k10M8J79k18K22l0m1M87m09j60o5j67R9K87k1J13
$$ 27 -197 346 -134 28 -41 14 -57 -16 -226 -178 1 -217 5 -25 -66 421 12 -148 -213 -380 -281 6 -15 98
6630I8l16K38J06k25L50j78l45L74J24m60J97L59m27K62M8j31L88k59m01J67K20
$$ 98 -218 20 126 -99 251 73 -272 102 226 -234 -37 322 -105 157 205 74 462 203 -198 -31 189
6651A89k48L65j86k37M6O2J64M0j88j65K35j59J9K90k64l92L36l6K08Q1l53K44
$$ 189 -59 306 120 -117 -71 -9 155 195 7 -158 77 -82 -63 227 -37 -429 -93 -129 79 160 -193 51
6673E1k05J02J14K0M9n2k63J33lL5Q2j98q1K04J40J9l06J47k10q4K93N1PK0k75
$$ 51 -154 -52 62 82 131 79 -184 -51 -54 -19 63 -135 -216 -12 128 147 -159 -12 -222 -306 -13 38 45 65 -210
6698b10N2j03M15l20M75n60r9K02K15k58Q6l4j8M29l53K00l0k96J35J51lK26m41
$$ -210 -158 -261 154 -166 309 -251 -350 -148 67 -191 -105 -139 -157 272 -81 119 89 -207 -72 79 76 302 -139
6721a39K29l93L31J6j1K82l80r7m86N24oJ9j29mK26j22K79j6l48k88M13Q8n5Q1
$$ -139 90 -303 28 44 33 315 -65 -162 -648 -124 -130 -111 -240 -244 -18 -140 139 123 -225 -513 -100 -12 -67 14
6745A4r4j22J55K19q4r5j02J03j87L31r0p2j1k47n2K80J48N8k10M3j44K27l19
$$ 14 -80 -202 -47 172 88 -7 -109 -6 -193 138 48 -24 -35 -282 -334 -54 94 152 -58 -15 -159 68 -251
6768b51M21j29k35o8K20J44l1J5l86K50r8K12K40O7o24J51J59j4M3k49j14K51
$$ -251 170 41 -194 -262 -42 102 71 86 -300 -50 -148 64 304 371 -253 -102 57 43 86 -163 -277 -26
6790b6k08J10nJ61k53J0M8L29P4k54M9m40L66J89j07J86k79r5R8k72L06m6j17
$$ -26 -234 -124 -129 32 -221 -211 -163 166 240 -14 35 -405 -39 150 43 229 -50 -145 -47 -319 -13 -59 -176
6813a76L93j62N7l6R8k00j9J46j41L61j93l58k9R1J50K59l04J07l71J63K55m23
$$ -176 217 55 112 76 174 -26 -45 101 -40 321 128 -230 -259 -168 -18 241 -63 44 -327 -164 91 -332
6835c32N81k70k3L8K6M2Q8k51o5o4L72l43L01k46K3l2K49J49L0k94j76k34J56
$$ -332 249 -21 -44 -6 20 62 150 -101 -166 -230 142 -201 100 -146 -123 -155 94 243 273 -21 -197 -431 -275
6858b75N90m6l56k80j8M83K1K93m83m07M14K40o8k15J68m2J1j96K97j56L9J89
$$ -275 315 269 -87 -367 -385 98 119 412 -71 -478 -64 176 108 -107 61 19 30 -166 131 -25 14 203
6880B03m46K59k38J82q4l5k48L24r2J0O4j25K32k95J78J87J32J28n15K49m8L01
$$ 203 -243 16 -222 -40 -124 -159 -407 -83 -175 -165 -101 -226 6 -289 -111 76 208 336 -179 70 22 323
6902C23j30j78Q0n23M89k38J36K93m85K56K17k20M4J5j68jK13J29j29l19m4M63
$$ 323 193 15 95 -428 61 -177 -41 252 -233 23 240 20 64 79 -89 -90 123 252 123 -196 -240 223
6924B23n21L25l8J12k90L1J57R6j8O6k8j48P7k04M63l95k5J24R2p7k99K89l00
$$ 223 -298 27 -11 101 -189 -158 -1 95 77 143 115 -33 44 -160 303 -92 -117 7 99 22 -277 12 -288
6947b88K1O12m40J53k2p7O0k9J81j40j37J11p3j48K55M7J89m62N9L2L78k05K0
$$ -288 -267 345 -95 58 36 -41 19 -10 171 31 -106 5 -68 -216 39 86 275 -187 -128 -96 282 77 97
6970I7j4k78L06p4j07J05Q3j37m19M4K79L6k0K54k03RR3lJ16j61pJ80j82K38j96
$$ 97 83 -195 111 37 -70 35 118 -19 -438 -394 -115 -79 -99 155 -48 -39 54 51 167 6 -1 179 -3 235 39
6995C9N5l4k91J15R1j68p5k4L88n2K28k42k3j22J52K13l02R9r1j49J54K15o1J85
$$ 39 94 60 -231 -116 -25 -193 -268 -292 96 44 272 30 7 -115 37 250 -52 47 -44 -193 -39 176 115 300
7019C00m12J06K74Kr6k1q0m5J75j17k67L19k87J09R3l39J36K93l67J22q8J38K58
$$ 300 -112 -6 268 270 174 153 73 28 203 86 -181 138 -149 -40 53 -286 -150 143 -224 -102 -190 -52 206
7042B06k13J26j78J34j97J64J78k9j00P4k77K78j1n4J21j47j99K09j00r9m8L76
$$ 206 -7 119 -59 75 -122 42 220 191 91 165 -112 166 155 101 222 75 -124 85 -15 -114 -162 214
7064B14l96J07j34M85m01J56J76j28RL7j35K4j15K42j0k4l42M46l23J54L27k31
$$ 214 -182 -75 -209 276 -125 31 207 79 88 125 -10 14 -101 141 131 107 -235 211 -112 42 369 138
7086A38Q0l57p3L6M97r7m19M24k15p3L00J8j77%o71O75k30k03L0K12J92l52L86
$$ 138 218 -139 -212 -176 321 224 -195 229 14 -59 241 259 82 82 -589 86 -144 -347 -317 -105 87 -265 121
7109A21p0J07j34j12qj36L85l1j75j23K39K92n55L42m10K05M24l15N0KJ08k98
$$ 121 51 158 24 -88 -96 -232 153 122 -53 -176 63 355 -200 142 -268 -63 361 46 96 98 206 -92
7131i2K07j71K72Rl26L45j32kJ05o81L70J52J37l71K31n7J15m88N80j41j98K85
$$ -92 115 -56 216 225 -101 244 112 110 215 -466 -96 56 193 -178 53 -4 111 -377 203 62 -136 149
7153A49l47J57J46j5L4n7Kn4J5J87k52qk65K02j24L05J03m8k27L6Q9K08Rj99j7
$$ 149 -198 -41 105 90 124 67 69 15 30 217 -35 -43 -308 -106 -230 75 178 130 -97 -61 28 236 245 46 29
7178B9q4j40K33n6K02m26L3L96j94%m7j09j4K29p1j14K89j49P4l83L53K6j44K2
$$ 29 -55 -195 38 -18 184 -242 -209 187 -7 -7 -54 -163 -177 52 -19 -133 156 7 81 -302 51 77 -67 -45
7202d5M6j22J12J31k30L1m7K31j74LK80k96J84k40L46j17l61K85K16k71J98j17
$$ -45 1 -121 -9 122 -108 -77 -124 107 -67 -64 216 -80 104 -136 210 93 -268 17 233 -38 160 43
7224D3j45J68m5q6J74k72M4K99l22L21j3Q4k07P6P7l16J75o7M3K6m32N13k44J5
$$ 43 -102 66 21 -65 109 -163 -119 180 -142 179 166 250 43 119 196 -120 55 -12 31 57 -375 138 -106 -91
7248i1K4J95p7l01L62l07L58K40m82o2M09n3j96k37M15k14O0K1j9k1J33K5m00
$$ -91 -67 128 51 -250 112 -195 163 403 -79 -141 268 215 19 -218 197 -17 43 64 45 24 157 182 -218
7271b18K63J45j54J85k70L3r6J85j98J1K1J16N8m44K06K6L53l01J61n1m2k8l4
$$ -218 45 190 36 221 -49 -16 -112 73 -125 -114 -93 23 81 -363 -157 -131 222 -79 82 31 -11 -39 -73
7294g3P2q8L92m07M3k56L38J58K08m13m3K04r6P0l38L17K6j26j17K09k53K12J03
$$ -73 -1 -89 303 -104 -61 -317 21 179 387 -26 -69 135 39 109 -229 88 114 -12 -129 80 -173 39 142
7317A42l1k60k61M66J29j36j95J47j99o0Q6J65M4K90n83J15L32j82k08J36Q0P6
$$ 142 111 -149 -410 56 185 49 -146 1 -198 -258 -172 -7 37 327 -256 -141 191 9 -199 -63 17 93
7339I3j42Q6j8k21K65j04K10k01J83j29J97k84r4oL22j19j55J72K56l00j07j4
$$ 93 -49 37 19 -202 63 -41 169 -32 151 22 219 -65 -159 -165 157 38 -117 55 311 11 -96 -110
7361a10K74k20J3r4L59j56r9Q6M5j2p2J14j21K09J5J05j5m0k91J57j48K92p59
$$ -110 164 -56 -43 -137 222 66 -33 53 98 86 14 128 7 216 231 336 321 281 -10 147 -1 291 -468
7384d68M94l12K02j7J7l4Q1j73M4L3L03k19j25J15n2M4J75j38K3J59K4l97N7q0
$$ -468 26 -286 -84 -101 -84 -118 -37 -210 -166 -133 170 -49 -174 -59 -111 -67 108 -30 -7 152 176 -221 -164 -244
7408b44K22k46N00m68Q9N27k64q0n1k0K03L1m50K4M77l3j37J08J94m48M2J03j13
$$ -244 -22 -268 232 -236 -147 380 116 36 -15 -35 168 199 -251 -227 250 217 80 188 382 -66 -24 79 -34
7431c4K6K23p4K0l99M11L0j64K7Qj24J99R3j05j31j52J14J6q3J94j0J54k31k9
$$ -34 -8 215 141 161 -238 173 203 39 66 74 -50 149 242 137 6 -146 -32 -16 -99 95 85 239 8 -21
7455b1M4L3l00J79Q2j45Q2J25k8LL2o5J77j45l3k73K93k23K69J15j12p0p8j55
$$ -21 23 56 -244 -65 17 -128 -46 79 51 54 86 21 198 53 20 -253 40 -183 86 201 89 19 -59 -214
7479b14K54j20j7n2q6Q8L10k40K51nL7l07L85k6J50l46j4J96j71k42k9Rj31M33
$$ -214 40 -80 -97 -149 -235 -147 163 -77 174 169 206 -101 284 258 408 62 48 244 73 -169 -198 -189 -320 113
7503A13k61J23L24j08j09j86L52k12n6L2j61P6J01j46q1J80j43P6K48k06M6J1
$$ 113 -148 -25 299 191 82 -104 248 36 -20 12 -149 -73 28 -118 -199 -19 -162 -86 162 -44 2 13
7525A3l37J81P3L22l41j7O3P6J28l28j15L41j25nq6M09k31n9j40J22J58j8p1j33
$$ 13 -324 -143 -70 252 -89 -106 -43 33 161 -167 -282 59 -66 -71 -157 252 21 -38 -178 -56 102 84 13 -120
7549a20j69L03M1k43L91n0l2K8k39J53M2j47r9P6q6o9L62k23r3k10L52JK83l26
$$ -120 -289 14 55 -188 203 153 121 149 -90 63 105 -42 -141 -65 -151 -220 142 -81 -174 -384 -32 -31 252 -74
7573g4r6N9J18L50l11j87N33m73K44m53L39k9jJ01o5J26l86O73n72J30J71j70
$$ -74 -170 -111 7 357 46 -141 392 -81 163 -290 49 20 19 120 55 181 -205 468 -104 26 197 27
7595B7j11k1R6K52k29K06k80L12J8l65J93qJ5M23m11o0k84m8J28K85l98K46K00
$$ 27 -84 -105 -9 243 14 220 -60 252 270 -95 98 90 105 528 117 57 -227 -275 -147 138 -260 -14 186
7618A86j56K11n72O17k56m37L95K26n35K02Qj9K18j42N07l30M7L89l92k72J62
$$ 186 30 241 -331 286 30 -407 -12 214 -321 -119 -111 -130 88 -54 453 123 170 559 167 -105 57
7639E7L5l54J72R8l67K18J92m04K35K38K03l59Q7K32m16q2K69q4J31j28K0k6j93
$$ 57 92 -262 -90 8 -359 -141 51 -353 -118 120 323 -36 51 283 -133 -215 54 -30 101 -27 -7 -33 -226
7662b26J58j3K94j68l3Q9l0J72o90J45K11l0J13k6j8l35M59j64J75n5J54j36k76
$$ -226 -68 -81 213 45 12 101 71 243 -447 -302 -91 -121 -8 -34 -52 -387 72 -92 83 28 182 46 -230
7685b30N8K32j10J23mk28O5J89l2J45O7o45K25K13Q4j00Q5j2p1m5J63j65o6j2
$$ -230 -172 60 -50 73 69 -159 -94 95 63 208 275 -370 -145 68 152 52 137 125 54 9 172 7 -59 -71
7709g1K11m54O1n5K46M6j81L31M9l35L58o68L25l3J91N1J67k76J20K2R7k52O7
$$ -71 140 -314 -253 -308 -62 -16 -197 134 183 -152 206 -462 -137 -170 21 72 239 -37 83 105 202 -50 17
7732A7L09l23L55l88J68O6l07J31K19l43L67k98j70L82l63J71qp1K63QM2k70Q9
$$ 17 326 3 358 -30 138 204 -103 28 247 -96 271 -27 -197 185 -178 -7 -15 -86 177 185 227 -43 46
7755D6L03k38J10n21M27r7n8j33J11o2J21o5K37o3k31P6p9M52k37k7k66N17l05
$$ 46 349 111 221 -300 127 30 -28 -161 -50 -112 9 -56 181 118 -113 -37 -116 336 99 72 -194 323 18
7778A8K7M4k41J22J01l2J81k47P2J27P2l65l77L26L26k16R6L1j26L12m06J98K5
$$ 18 45 89 -152 -30 71 39 220 -27 45 172 244 -121 -498 -172 154 -62 34 65 -61 251 -155 43 68
7801F8k01K41n8NK07l75M18m3l47N6k66L02l4j48J19O2J54j45K3O4j6q0NK38O4
$$ 68 -133 108 50 55 262 -113 305 262 -85 -29 -295 7 -27 -175 -56 6 160 15 38 102 86 6 11 249 313
7826C13n14K36J3j67p0J37L36m15J25M2J14J17j28l5K00l42L7N07n23k5k2J77
$$ 313 -201 35 48 -119 -189 -52 284 -131 -6 36 150 267 139 104 304 -38 -1 506 -17 -42 -64 113
7848A13j25m45O02m7j63K1J37l6k12J93J45k23P3q6K09m53N01k05J49n46O68j42
$$ 113 -12 -457 145 98 -65 -44 93 57 -155 38 183 -40 33 -53 156 -297 204 -1 148 -398 270 128
7870A28j26j12R8J45l57M50k88N6P3k87K59K53n57J85L12k68j21K09o1O0j29r
$$ 128 2 -110 -12 133 -224 226 -62 -6 67 -220 39 292 -265 -80 232 -36 -157 52 -9 51 -78 -87
7892h7L68l17K58l20J31k07p1L44R4l80J08k9J61o6l73M35j40J80j22n0p4k6J33
$$ -87 281 -36 222 -98 33 -174 -245 99 193 -187 -79 -108 53 -13 -386 49 -91 89 -33 -83 -157 -183 -50
7915e0P2J60l48J75k29K09k82L28J93J70o5m22j26J98R7qj7l00K20K62l11M35
$$ -50 22 182 -166 9 -220 -11 -293 35 228 398 333 -89 -215 -17 80 72 55 -245 -25 237 -74 361
7937C61j93k76K71k79K57K45n40Q0m2L41Q9j79j20J19j3k49L48j37k23K35L1j76
$$ 361 168 -108 163 -116 141 386 -154 -74 -116 225 314 135 15 134 121 -128 220 83 -140 95 126 -50
7959e0K76j6j89R9L4j40J49N9l27J38k56J81J63j52k7O4k40L70j53O1J94m63J30
$$ -50 226 210 21 120 154 14 163 222 -105 33 -223 -42 121 -31 -58 6 -234 136 -17 44 238 -225 -95
7982i5j96L56pj46L39k07k64M38j59k72N06m37K16Jl08K92L3l76K73L45k72K20
$$ -95 -291 65 58 -88 251 44 -220 218 59 -213 293 -144 72 73 -235 57 90 -286 -13 332 60 280
8004B80o1k67J86l37L66Q3j14L6N5j43l68J05K91l0Oq0Q3k05K03k2k63K08M46
$$ 280 219 -48 138 -199 167 250 136 172 227 84 -284 -179 112 82 88 8 91 -114 89 67 -196 12 458
8027D58m22n6k0n1O4J3o8N7l19J73J20J90J01k63Kr4j42L48p6J83o29N94j08Q
$$ 458 36 -20 -40 -91 -27 -14 -82 -25 -344 -171 -51 139 240 -23 -21 -115 -257 91 15 198 -431 163 55 63
8051F3kk77M04j04j05m4M4L1l66K59Q4K42l5p1k70L17j5m12L05J02k10k2o9K04
$$ 63 61 -216 188 84 -21 -65 -21 10 -356 -97 -13 229 194 123 -147 170 155 -257 48 150 -60 -82 -151 53
8075E3n0J39j03k86K52J95l45N5L16k04R2N7j14KJ00k45J34m0O6N54o40j62m5
$$ 53 3 142 39 -247 5 200 -145 -90 226 22 114 171 57 59 159 -86 48 8 74 628 -12 -174 -219
8098b19L43J16n36M68k09j96L56N6J2j13J4p0l65L90k41K21K04l63l1K8J06m0
$$ -219 124 240 -296 172 -37 -233 123 179 191 78 92 22 -343 47 -194 27 231 -132 -163 -135 -29 -69
8120f9K04Nn9n6O5j01j0k0L4J65J68l29l9l22J61K61j33Q8J40k35O2M8J22k63
$$ -69 135 140 81 25 90 -11 -21 -41 -7 158 326 -3 -42 -364 -203 58 -75 13 153 -82 -20 28 150 -113
8144a13J94J94k45l35O15r2j45k10J12l9k19K59k26L77m16L05p3j0M3j33J98j4
$$ -113 81 275 30 -305 310 218 73 -137 -25 -64 -283 -24 -250 127 -289 16 -57 -67 -24 -157 41 27
8166B7j82K23J24j63l67M87Q8m76M32j42K53j8j3k82J07M7k85K88m44M17j83l8
$$ 27 -155 68 192 29 -338 149 237 -239 193 51 304 286 273 -9 98 145 -140 148 -296 121 -62 -100
8188a00J79M9k21
$$ -100 79 128 -93
8191i3
$$ Imaginary data points
##PAGE= N=2
##DATA TABLE= (X++(I..I)), XYDATA
0@%%%%%%Qj6J6j6K4l2M0m8N6p2Q8j04J21j44J68j94K26k61L02l46L94m50N12n79
$$ 0 0 0 0 0 0 0 8 -8 8 -8 16 -16 24 -24 32 -40 48 -56 65 -79 89 -105 121 -140 162 -184 210 -240 272 -307
30c07O54p35Q23r23J032j147J278j422J575j749J939k145K377k633K914l232L591
$$ -307 347 -388 435 -488 544 -603 675 -747 828 -921 1018 -1127 1250 -1383 1531 -1701 1890
47A890l996M460m998N629o383P301q447R931j1933J4800j9283K7329m6237J70331
$$ 1890 -2106 2354 -2644 2985 -3398 3903 -4544 5387 -6546 8254 -11029 16300 -29937 140394
61A40394J26379l24034j04875R4318J34373L4141L8218n9098j54618q2076J48523
$$ 140394 266773 -57261 -162136 -67818 66555 100696 138914 79816 -74802 -156878 -8355
72h355J65437j3711j32970o1690J201K6753P1880R6136l0932j59441r7806R2592
$$ -8355 157082 143371 10401 -51289 -50088 -23335 48545 144681 113749 -45692 -143498 -50906
84e0906J58965N4544r4435j44041o0383R3234J50323N1346r0540j30414n8978
$$ -50906 108059 162603 68168 -75873 -136256 -43022 107301 158647 68107 -62307 -121285
95a21285O7458J44081P2310r3664j48681l2682Q4950Q2482L3196j0694p4816j05855
$$ -121285 -53827 90254 162564 68900 -79781 -112463 -27513 54969 88165 77471 2655 -103200
107a03200n764J34826J19397l8608j31754q0721J4426Q7482J14960K7635j37391
$$ -103200 -108964 25862 145259 106651 -25103 -105824 -91398 -3916 111044 138679 1288
118A288j58083L1099J73032Q3519p0320r5920m3417P718O8670Q9543J049j02076
$$ 1288 -156795 -125696 47336 130855 60535 -35385 -78802 -71084 -2414 87129 88178 -13898
130a3898p8177K4403P2245N0320J1366m3433r0445m7943P4053J25830L3015r3865
$$ -13898 -92075 -67672 4573 54893 66259 22826 -67619 -115562 -41509 84321 117336 23471
142B3471j15483k6841Q5070J23634L5969j02632j27232q121R5499Q4451J6534
$$ 23471 -92012 -118853 -33783 89851 125820 23188 -104044 -112165 -16666 67785 84319
153H4319n0752r6175n2013P5318J20102J1128q5618n4063n62O606M0490Q2462
$$ 84319 33567 -62608 -114621 -39303 80799 91927 6309 -47754 -48316 -41710 -1220 81242
165H1242J0470j19373j00813N8478J28755L7362n6822o7435m8890j43R4848J07974
$$ 81242 91712 -27661 -128474 -69996 58759 96121 39299 -28136 -77026 -77169 17679 125653
177A25653l7617j53414n9876R6813J00268J740m7992n0734m4581P344P9505O9024
$$ 125653 88036 -65378 -125254 -28441 71827 73567 25575 -25159 -69740 -62396 17109 86133
189H6133k2728q0387n4200O547O1427P7095J8873p7068j02145j2873R0690R4766
$$ 86133 63405 -16982 -71182 -64635 -3208 73887 92760 15692 -86453 -99326 -8636 86130
201H6130N712q3848r4807j2494R2132J00134o572r5996o9261J4749O2359N9242
$$ 86130 91842 7994 -86813 -99307 -7175 92959 86387 -9609 -78870 -64121 -1762 57480
213E7480J4004n8951q2556r173O9760O0972L372l5668n7457m5538L1133R9341
$$ 57480 71484 12533 -70023 -79196 -9436 51536 54908 19240 -38217 -83755 -52622 46719
225D6719N3007o4521j01915k7714N6403P9849M3724l7031j06664o5057O9380J24632
$$ 46719 99726 35205 -66710 -94424 -38021 41828 85552 48521 -58143 -123200 -53820 70812
237G0812K3458q5701p2624m241L0253N1963N5596j1944q9868o1366L6772P5468
$$ 70812 94270 8569 -64055 -68296 -38043 13920 69516 57572 -32296 -93662 -56890 18578
249A8578L7331r571n0149p0149j6475Q0051R3521p028r6065p3047K0558Q1679
$$ 18578 55909 46338 -3811 -73960 -90435 -10384 83137 76109 -19956 -93003 -72445 9234
261I234O5973j0350q3534p4127K1174Q9568N1356k7475n8974m4755n008N3404
$$ 9234 75207 64857 -18677 -92804 -71630 17938 69294 41819 -17155 -61910 -66918 -13514
273a3514P5479P982p3469o3492O259M4961M8735L3767k6672r1124n4173O2655
$$ -13514 61965 69947 -3522 -67014 -60755 -15794 32941 66708 40036 -51088 -105261 -42606
285d2606J06634K3396p0915p7300j8076M5991P7162M0233n0458r3816k5942O6219
$$ -42606 64028 87424 16509 -60791 -78867 -32876 44286 84519 34061 -59755 -85697 -19478
297a9478O8248M702l6366m4314l2686J4409O5151M5204k6836o1954l4356J2239
$$ -19478 48770 53472 17106 -27208 -59894 -45485 19666 64870 38034 -23920 -58276 -46037
309d6037N1849N8583j729p8565o9402K5005Q6165M8939l0240p0421m7629J8068
$$ -46037 5812 64395 62666 -15899 -85301 -60296 25869 74808 44568 -25853 -73482 -55414
321e5414P2913N6255k2943p6114m3604K6223N4294L7001j352m5285n8251o702
$$ -55414 17499 73754 50811 -25303 -68907 -42684 11610 48611 47259 1974 -56277 -62979
333f2979N6690N4016k21l8294m7534k7446L2994P9785L0864o5074p8324m03O0022
$$ -62979 -6289 47727 47506 9212 -38322 -65768 -32774 47011 77875 12801 -65523 -65926 -5904
346e904M8672P032l5079o0106k7995N0290P6884O055o4793m6742J1646K9942K6324
$$ -5904 42768 49800 14721 -45385 -73380 -23090 53794 59849 -4944 -51686 -40040 -10098 16226
359A6226K5169p675n8925m4820L3328O8203K2996l1445m8932l5009J2854O6160
$$ 16226 41395 33720 -25205 -70025 -36697 31506 54502 23057 -25875 -60884 -48030 18130
371A8130N2739k9125p8888l6396L7778O4438L0373k6779o0331l6233K5879N9754
$$ 18130 70869 41744 -37144 -73540 -35762 28676 59049 32270 -28061 -64294 -38415 21339
383B1339K8535k5117m3401k4608N483L5482M4635K830n0741m6850R053M5409L6261
$$ 21339 49874 24757 -18644 -43252 -37769 -2287 42348 45178 -5563 -52413 -43360 2049 38310
396C8310M697l6562n7655j2860O0032O4182r617o2937m3167R365M6125M6433M828
$$ 38310 43007 6445 -51210 -64070 -4038 60144 50527 -12410 -55577 -46212 -87 46346 51174
409E1174n1240n5346M353N4837L9686p785l3299l3013j6591K2894N4705K7412
$$ 51174 -66 -55412 -51059 3778 43464 35679 2380 -30633 -47224 -24330 30375 57787
421E7787l9199n8009j3740L3571M6058K6656k1649o3270l7666L9852O9489J8034
$$ 57787 18588 -39421 -53161 -19590 26468 53124 31475 -31795 -69461 -29609 39880 57914
433E7914m2438n0125j7185K7159N1299K6500l0210n3880j7736K9203L9404J7726
$$ 57914 15476 -34649 -51834 -24675 26624 53124 22914 -30966 -48702 -19499 19905 37631
445C7631j0051l7880l8667O325N6309M1052k2551n0754k7563Q915L8277M7922
$$ 37631 27580 -10300 -48967 -42642 13667 54719 32168 -18586 -46149 -37234 1043 48965
457D8965N542o1571n9806J9325O8385L2830k2341m1256l2168r20L9981M9034N80
$$ 48965 54507 -7064 -66870 -47545 20840 53670 31329 -9927 -42095 -43015 -3034 46000 46580
470D6580n0253m2413Q638L8640L1276O251k4954m4593k1004L4785N4898J3112
$$ 46580 -3673 -46086 -37448 1192 32468 38719 13765 -30828 -51832 -17047 37851 50963
482E0963l9166m7276j4575L1123N4353K1310m1150n7750p249M0788M1857R956
$$ 50963 11797 -35479 -50054 -18931 35422 56732 15582 -42168 -49417 -8629 33228 43184
494D3184k6363m4476k1698K9586N0129J4840l0160l8101j5345J3762L5860L3288
$$ 43184 16821 -27655 -49353 -19767 30362 45202 15042 -23059 -38404 -24642 11218 44506
506D4506p552n0773l9465J8651N2783K9244j5497m1967l7131M668N2592M4118
$$ 44506 36954 -13819 -53284 -34633 18150 47394 31897 -10070 -47201 -42533 10059 54177
518E4177j7477n4528k8404J7195L8138K9516k771m0205l8854P537M3478K8803
$$ 54177 36700 -17828 -46232 -29037 9101 38617 35846 -4359 -43213 -35676 7802 36605
530C6605q126k9099k8160r399K6667M4916J2892m0249m6868o48L8032L5225O848
$$ 36605 28479 -620 -28780 -38179 -11512 33404 46296 6047 -40821 -41469 -3437 31788 38636
543C8636k5838m4610j9064L7504N3488L538m2016l4874j918K2490L4734J9153
$$ 38636 12798 -31812 -50876 -13372 40116 43654 1638 -33236 -35154 -12664 22070 41223
555D1223k3344m5800j5648K8991L7310J2454j6340l3498k5862J0838M5465L0582
$$ 41223 17879 -27921 -43569 -14578 22732 35186 18846 -14652 -40514 -29676 15789 46371
567D6371k0516m7753k1127K0911L7108K4023j0316m2390l2171J8595M8190J9814
$$ 46371 25855 -21898 -43025 -22114 14994 39017 28701 -13689 -45860 -27265 20925 40739
579D0739k1842l2710j8451O036L3105L1066p687l9889k5966J0706L0515K4851
$$ 40739 18897 -13813 -32264 -26228 6877 37943 30256 -9633 -35599 -24893 5622 30473
591C0473J927k8308l7909n170L9152L9791l826l8509l0767R94K8809L5412Q972
$$ 30473 32400 4092 -33817 -38987 165 39956 36130 -2379 -33146 -32152 -3343 32069 41041
604D1041l4882m3147N10L9308L0188l480k3851k7945j1515K2720L8510J0609k8569
$$ 41041 6159 -36988 -36478 2830 33018 29538 5687 -22258 -33773 -11053 27457 38066 9497
617I497l4049p413K0380L1618J7760j8378m0396j8996K4426M0149J4120k2837
$$ 9497 -24552 -31965 -11585 20033 37793 19415 -20981 -39977 -15551 24598 38718 15881
629A5881l5292j7712J7259M0415K2438k3614m2833j2848K3803K9251J4787q598
$$ 15881 -19411 -37123 -19864 20551 42989 19375 -23458 -36306 -12503 16748 31535 22937
641B2937l1691k8749J1062M2016K1989j7297l1162j8314L615K7188L2201K90l8489
$$ 22937 -8754 -37503 -26441 15575 37564 20267 -10895 -29209 -25594 1594 33795 34085 -4404
654d404l4790Q657L9351K5515p893k9257k7979j956L2021L6169k612l7644k8043
$$ -4404 -39194 -30537 8814 34329 26436 -2821 -30800 -32756 -735 35434 32822 -4822 -32865
667c2865N946K6617K5584O872k5064l6354o102L1898L2298K293k4065k9599j2162
$$ -32865 -26919 -302 25282 32154 7090 -29264 -35366 -3468 28830 31123 7058 -22541 -34703
680c4703K1469L9196J3901k9048l8613p193K6326L1791J0883j8354l4866j8322
$$ -34703 -13234 25962 39863 10815 -27798 -34991 -8665 23126 34009 15655 -19211 -37533
692c7533K1608M0367J2419k4083l0410j1042J1377K8753K4698j0762l8912k2745
$$ -37533 -15925 24442 36861 12778 -17632 -28674 -17297 11456 36154 25392 -13520 -36265
704c6265J8084L3200J6986q537k8275k7544M696L7782L0033j2607l7652k2423
$$ -36265 -18181 15019 32005 23468 -4807 -32351 -27655 10127 40160 27553 -10099 -32522
716c2522J0707L0376K3920k767l1142l0688M695L5769K5588p422k7475k3244k170
$$ -32522 -21815 8561 32481 29714 -1428 -32116 -27421 8348 33936 26514 -961 -24205 -26375
729b6375K4573L2189L903l1108l0493O58K4935K7145Q186k2401l5249r784K8778
$$ -26375 -1802 30387 34290 3182 -27311 -26653 -1718 25427 33613 11212 -24037 -33821 -5043
742e043L4275M038k4910k8802q633J9010L2031J4207k1757l6345r749K3917K8958
$$ -5043 29232 33270 8360 -20442 -29075 -10065 21966 36173 14416 -21929 -31678 -7761 21197
755B1197Q213j4620k6229j9556J2556L6239J8881k0221l2610j2287J2829K6618
$$ 21197 29410 14790 -11439 -30995 -18439 17800 36681 16460 -16150 -28437 -15608 11010
767A1010K1033p996l4960k3315J4313L4241J7774j2009k8266k0426N950K9687
$$ 11010 32043 24047 -10913 -34228 -19915 14326 32100 20091 -8175 -28601 -22651 7036
779G036K5152p597l2145k1806R106K6066K0802j274k5078k8093K0L1543K5785
$$ 7036 32188 24591 -7554 -29360 -20254 5812 26614 25340 262 -27831 -27811 3732 29517
792B9517n271k5582k2023k323K1270L0527N458k9365k9644J345K5907K3045K622
$$ 29517 24246 -1336 -23359 -25682 -4412 26115 31573 2208 -27436 -26091 -184 22861 25483
805B5483j8757k6523r888K2147L1799O353k5465k6734l425J7485K3717J2989j4534
$$ 25483 6726 -19797 -29685 -7538 24261 30614 5149 -21585 -25010 -7525 16192 29181 14647
818A4647l2635j4842K2600L1561P691j7860k5224j3488J1626L0832J7904j7658
$$ 14647 -17988 -32830 -10230 21331 29022 11162 -14062 -27550 -15924 14908 32812 15154
830A5154l1562j2400J5808K6554J4677j0203k8085j8923J1213L0155J7598j2420
$$ 15154 -16408 -28808 -13000 13554 28231 18028 -10057 -28980 -17767 12388 29986 17566
842A7566k6885j5479O309K4367K2093m302k9985k2292R038K7003J8249l956k2451
$$ 17566 -9319 -24798 -18489 5878 27971 23669 -6316 -28608 -19570 7433 25682 21726 -725
855g25k4201o29K7994K6929n265k7377k1030J805K1660K4446L307k3923k7890
$$ -725 -24926 -25555 2439 29368 24103 -3274 -24304 -22499 -839 23607 26914 2991 -24899
868b4899j691K5963K4935P77k1611k3783n902J9341K8499P633k3721k7818l493
$$ -24899 -26590 -627 24308 25085 3474 -20309 -26211 -6870 21629 29262 5541 -22277 -25770
881b5770J9664K3386R672j5586k9186j2479K0464K9255P553j7895k3766j1573
$$ -25770 -6106 17280 26952 11366 -17820 -30299 -9835 19420 26973 9078 -14688 -26261
893b6261J1600K8148J6098j4794l0500j2936J5511K5781J2653r847k4525j8796
$$ -26261 -14661 13487 29585 14791 -15709 -28645 -13134 12647 25300 15453 -9072 -27868
905b7868Q068K9879J9314j3096k8180j3815Q196K2563J9563k386k8156k3729Q513
$$ -27868 -19800 10079 29393 16297 -11883 -25698 -17502 5061 24624 22238 -5918 -29647 -21134
918b1134K8356J7514n889k2225k0058n4K3729K5185j758k6857k2263L321K2225
$$ -21134 7222 24736 18847 -3378 -23436 -23490 239 25424 23666 -3191 -25454 -22133 92
931I2K0607K513j9804k5989m281K3525K6854M52k2555k1469l856J6900K4823R247
$$ 92 20699 23212 3408 -22581 -26862 -3337 23517 23969 1414 -20055 -23911 -7011 17812 27059
945B7059k0414k8231m689K0594K2652O538j4715k4404j1171J5303K7452J0073
$$ 27059 6645 -21586 -26275 -5681 16971 23509 8794 -15610 -26781 -11478 15974 26047
957B6047j7011k4994r191J3376K3491J2901j1121k5993j5307J3178K6829J2348
$$ 26047 9036 -15958 -25149 -11773 11718 24619 13498 -12495 -27802 -14624 12205 24553
969B4553j1896k2928j4961P214K5996J8204j0025k6861j4649Q625K1906J7417
$$ 24553 12657 -10271 -25232 -18018 7978 26182 16157 -10704 -25353 -16728 5178 22595
981B2595m222k4086k0614O538K5515J7499n949k1917j7684J755K0996K1392r05
$$ 22595 18373 -5713 -26327 -19789 5726 23225 17276 -4641 -22325 -20570 426 21818 20913
994B0913k3750k0684K727K1664J7894M88j7432k1288m637K0760K4524N6k0776
$$ 20913 -2837 -23521 -20794 870 18764 19252 1820 -19468 -24105 -3345 21179 21235 459
1007D59j9327k384J5467K1627P827j7764k5621m954J9328K1714M890j4573k1725
$$ 459 -18868 -21252 -5785 15842 23669 5905 -19716 -24670 -5342 16372 21262 6689 -15036
1020a5036r133J3910K5011R486j6195k4342p036J4480K0499R789r739k2880j4474
$$ -15036 -24169 -10259 14752 24238 8043 -16299 -23335 -8855 11644 21433 11694 -11186 -25660
1033b5660J2772K5809R989j3546j9523j1213O846K1571J6331q763k4400j3879
$$ -25660 -12888 12921 22910 9364 -10159 -21372 -14526 7045 23376 14613 -9787 -23666
1045b3666R817K1300J3228n862k0160j6474M334K2101J7615n495k2811j5191M849
$$ -23666 -13849 7451 20679 14817 -5343 -21817 -17483 4618 22233 16738 -6073 -21264 -16415
1058a6415J8629J6903l36k0545k0321K344K2185J7484k560j7873j7866k810J8584
$$ -16415 2214 19117 18781 -1764 -22085 -19741 2444 19928 17368 -505 -18371 -21181 -2597
1071b597K1854R80k0083j8957r71J6449J9294M099j5614k1533m989J7272K1267
$$ -2597 19257 20237 154 -18803 -19774 -3325 15969 20068 4454 -17079 -22068 -4796 16471
1084A6471M074j6220j9773n362J3291K0861Q579j4204k2945o851J4915J9699O965
$$ 16471 20545 4325 -15448 -20810 -7519 13342 21921 7717 -15228 -22079 -7164 12535 19500
1097A9500j0171k0527j1728J1803K3224R579j2650j9811r704Q314J9779J3646
$$ 19500 9329 -11198 -22926 -11123 12101 21680 9030 -10781 -20485 -12171 7608 21254
1109B1254q155k2248j3145Q929K1202J2224o964j9006j4052L759K0388J7047n705
$$ 21254 13099 -9149 -22294 -13365 7837 20061 13097 -5909 -19961 -16202 4186 21233 15528
1122A5528k1627j4317N678J7470J4686p97j7846j9262K538K0731J6494l590j6754
$$ 15528 -6099 -20416 -14738 2732 17418 16621 -1225 -20487 -17949 2782 19276 15686 -1068
1135a068j5922j281J6898J9205J586j9109j8767K09J7519J6827J663j4595j7788
$$ -1068 -16990 -18271 -1373 17832 19418 309 -18458 -18249 -730 16097 17760 3165 -14623
1148a4623n129J4941K0647M127j6219j8124l371J2181J7455Q043j1453k1431p543
$$ -14623 -19752 -4811 15836 19963 3744 -14380 -17751 -5570 11885 19928 8475 -12956 -20499
1161b0499J3964J8996O453j0384j8264r988R879K0594J0103j1201j9878r234R453
$$ -20499 -6535 12461 18914 8530 -9734 -19722 -9843 10751 20854 9653 -10225 -19459 -10006
1174a0006J8532J0080o689j8993j2486P385K0236J1446q649j7114j0711L901J7368
$$ -10006 8526 18606 11917 -7076 -19562 -12177 8059 19505 10856 -6258 -16969 -13068 4300
1187D300J4483m117j9975j3370N506J7020J2571j984j6051j5916J516J7969J5528
$$ 4300 18783 14666 -5309 -18679 -13173 3847 16418 14434 -1617 -17533 -16017 1952 17480
1200A7480k338j6857j4193P93J4469J5474J777j5002j7206j357J5707J6018O30
$$ 17480 15142 -1715 -15908 -15115 -646 14828 16605 1603 -15603 -16960 -1253 14765 15395
1213A5395j3200j4940m376J2170J8793M061j4314j7469k776J1748J5952N985j0940
$$ 15395 2195 -12745 -17121 -4951 13842 17903 3589 -13880 -16656 -4908 11044 17029 6089
1226F089j8255o182J2678J7179N210j0452j6422o973Q604J7318Q853r482j8007
$$ 6089 -12166 -18348 -5670 11509 16719 6267 -10155 -17128 -8524 8794 17647 8165 -9842
1239i842q009R563J5929P991o289j5504j1672O262J8369J1159q319j6715q653
$$ -9842 -17851 -8288 7641 15632 9343 -6161 -17833 -11571 6798 17957 9638 -7077 -15730
1252a5730M512J4677J3026l474j7829j2497N407J6200J0910l297j4258j2871J947
$$ -15730 -11218 3459 16485 13011 -4818 -17315 -11908 4292 15202 11905 -2353 -15224 -13277
1265a3277J4802J3769j729j5206j3523J879J3755J2564J068j2703j5566j545J5214
$$ -13277 1525 15294 13565 -1641 -15164 -13285 470 13034 14102 1399 -14167 -15712 -498
1278d98J4666M0j3119j3440k840J1749J6326L437j3829j5887k020J2402J3991
$$ -498 14168 14208 1089 -12351 -15191 -3442 12884 16321 2492 -13395 -15415 -3013 10978
1291A0978M171j0386j5553n384J0696J6556M694j0576j4909n187Q230J4559P415
$$ 10978 15149 4763 -10790 -16174 -5478 11078 15772 5196 -9713 -14900 -6670 7889 15304
1304A5304p295j6517q099R125J5762O684p171j4032r226N604J6194J0036p271
$$ 15304 8009 -8508 -16607 -7482 8280 14964 7793 -6239 -15465 -9861 6333 16369 9098
1317I098j5714q410N200J4013J0223l914j4677j1256M180J5241J0699l688j4151
$$ 9098 -6616 -15026 -9826 4187 14410 10496 -4181 -15437 -11257 3984 14683 10995 -3156
1330c156j0820K258J3132J2796j205j5082j2614K281J3717J1210l99j1653j3470
$$ -3156 -13976 -11718 1414 14210 13005 -2077 -14691 -12410 1307 12517 12118 465 -13005
1343a3005j062J3796J3548p56j1965j1735j790J0452J3104L222j1274j3857k996
$$ -13005 -14067 -271 13277 12521 556 -11179 -12969 -2517 10587 13809 2535 -11322 -14318
1356a4318J1326J3023L262r479j2946m939Q359J5041N715r904j4619m867Q833
$$ -14318 -2992 10031 13293 3814 -9132 -14071 -5712 9329 15044 5140 -9479 -14346 -5513
1369e513J3006O491o813j4886p640Q592J4700N893p255j2765p658N377J4412Q358
$$ -5513 7493 13984 7171 -7715 -15355 -6763 7937 13830 6575 -6190 -13848 -8471 5941 14299
1383A4299o129j3646q019M813J3336Q330l676j2664j0116L125J4126J0045l966
$$ 14299 8170 -5476 -13495 -8682 4654 12984 9308 -3356 -13472 -10347 3779 13824 9858
1396I858j2962q996K084J1821J0709o61j3141j1768K493J2398R659q66j0195j1195
$$ 9858 -3104 -12100 -10016 1805 12514 11853 -1288 -13056 -10563 1835 11494 10628 433 -10762
1410a0762r82J1185J2332R4j0827j1422j023R727J1766K417r331j2852l382J0624
$$ -10762 -11744 -559 11773 11867 1040 -10382 -11405 -1678 10088 12505 3174 -9678 -13060 -2436
1424b436J2764J772r028j0829m292P443J3160N396r050j3452l750Q468J1119M918
$$ -2436 10328 12100 3072 -7757 -12049 -4606 8554 13950 4900 -8552 -12302 -3834 7285 12203
1438A2203o049j2481o511O644J3270N747o602j2165n899N277J1726P416m667j2615
$$ 12203 6154 -6327 -12838 -6194 7076 12823 6221 -5944 -11843 -6566 5160 12576 7909 -4706
1452d706p888N033J2818O910m618j0940p919K684J1813R388l491j2197p938K567
$$ -4706 -12594 -7561 5257 12167 7549 -3391 -11310 -8626 3187 12575 9084 -3113 -11051 -8484
1466h484R958R387p13j1120j0293J190J1176R803r70r985r851r75J0490J0566
$$ -8484 1474 10861 10148 -972 -11265 -10075 1101 10904 9934 -51 -9902 -10877 -387 10179
1480A0179Q38j0337j1173j53J0179J0032Q22q106j1370k345R037J1706J477q878
$$ 10179 11017 680 -10493 -10646 -467 9565 10387 2281 -9089 -11434 -2397 9309 10786 1908
1494A908r776k682O844J0747M250p355j1704l440P337J0355M502n720j1219n615
$$ 1908 -7868 -10550 -3706 7041 11291 3936 -7768 -11208 -3871 6484 10986 5266 -5953 -11568
1508a1568O118J1445N917o194j1125n769N032J0775O211l797j1302p550M945J1558
$$ -11568 -5450 5995 11912 5718 -5407 -11176 -6144 4631 10842 7045 -4257 -11807 -6862 4696
$$ [...]
8191A75
##END NTUPLES=NMR FID
##END=
