##TITLE=1H_CA-8713-1
 CDCl3, 8 sc, 
 11.6.2020
##JCAMPDX= 6.0         $$ Bruker NMR JCAMP-DX V2.0
##DATA TYPE= NMR FID
##DATA CLASS= NTUPLES
##ORIGIN= UXNMR, Bruker Analytische Messtechnik GmbH
##OWNER= root
$$ XWIN-NMR		Version 3.5
$$ Thu Jun 11 10:45:24 2020 Russian Standard Time (UT+4h)  she@DPX200
##.OBSERVE FREQUENCY= 200.1315
##.OBSERVE NUCLEUS= ^1H
##.DELAY= (6, 6)
##.ACQUISITION MODE= SIMULTANEOUS
##.ACQUISITION SCHEME= undefined
##.AVERAGES= 8
##.DIGITISER RES= 18
##SPECTROMETER/DATA SYSTEM= spect
##.PULSE SEQUENCE= zg30
##.SOLVENT NAME= D2O
##.SHIFT REFERENCE= (INTERNAL, D2O, 0, 15.7039)
##AUDIT TRAIL= $$ (NUMBER, WHEN, WHO, WHERE, WHAT)
$$ ##TITLE= Audit trail, XWIN-NMR		Version 3.5
$$ ##JCAMPDX= 5.01
$$ ##ORIGIN= Bruker BioSpin GmbH
$$ ##OWNER= she
$$ F:/spectra/data/she/nmr/H-F/1/audita.txt
$$ ##AUDIT TRAIL=  $$ (NUMBER, WHEN, WHO, WHERE, WHAT)
(   1,<2020-06-11 10:42:45.92 +0400>,<she>,<DPX200>,
      <created by zg, POWCHK disabled, PULCHK disabled
       configuration hash MD5:
       00 E9 B6 7A A2 85 ED C7 34 08 36 98 17 FE 4E 26
       data hash MD5: 16K
       5A AF 7C 5D B0 BD BA 42 C0 B5 25 F4 78 72 5A EC>)
$$ ##END=
$$ 
$$ hash MD5
$$ 37 33 77 27 7D C9 8A 1E B5 B6 59 AA AF 29 4A 80
##$RELAX= 
##$RELAX= 
##$RELAX= 
##$RELAX= 
##$RELAX= 
##$RELAX= 
$$ Bruker specific parameters
$$ --------------------------
##$DU= <F:/spectra>
##$EXPNO= 1
##$NAME= <H-F>
##$PROCNO= 1
##$TYPE= <nmr>
##$USER= <she>
##$AMP= (0..31)
100 100 100 100 100 100 100 100 100 100 100 100 100 100 100 100 100 100 
100 100 100 100 100 100 100 100 100 100 100 100 100 100 
##$AQSEQ= 0
##$AQ_mod= 1
##$AUNM= <au_zg>
##$AUTOPOS= <>
##$BF1= 200.13
##$BF2= 200.13
##$BF3= 200.13
##$BF4= 200.13
##$BF5= 200.13
##$BF6= 200.13
##$BF7= 200.13
##$BF8= 200.13
##$BYTORDA= 1
##$CFDGTYP= 0
##$CFRGTYP= 5
##$CHEMSTR= <none>
##$CNST= (0..31)
1 1 145 1 1 1 1 1 1 1 1 1 1 1 1 1 1 1 1 1 1 1 1 1 1 1 1 1 1 1 1 1 
##$CPDPRG= <>
##$CPDPRG1= <>
##$CPDPRG2= <>
##$CPDPRG3= <>
##$CPDPRG4= <mlev>
##$CPDPRG5= <mlev>
##$CPDPRG6= <mlev>
##$CPDPRG7= <mlev>
##$CPDPRG8= <mlev>
##$CPDPRGB= <>
##$CPDPRGT= <>
##$D= (0..31)
0 1.2 0 0 0 0 0 0 0 0.06 0 0.03 0 0 0 0 0.0002 0 0 0 0 0 0 0 0 0 0 0 0 
0 0 0 
##$DATE= 1591857765
##$DBL= (0..7)
120 120 120 120 120 120 120 120 
##$DBP= (0..7)
150 150 150 150 150 150 150 150 
##$DBP07= 0
##$DBPNAM0= <>
##$DBPNAM1= <>
##$DBPNAM2= <>
##$DBPNAM3= <>
##$DBPNAM4= <>
##$DBPNAM5= <>
##$DBPNAM6= <>
##$DBPNAM7= <>
##$DBPOAL= (0..7)
0.5 0.5 0.5 0.5 0.5 0.5 0.5 0.5 
##$DBPOFFS= (0..7)
0 0 0 0 0 0 0 0 
##$DE= 6
##$DECBNUC= <off>
##$DECIM= 24
##$DECNUC= <off>
##$DECSTAT= 4
##$DIGMOD= 1
##$DIGTYP= 9
##$DL= (0..7)
0 120 120 120 120 120 120 120 
##$DP= (0..7)
150 150 150 150 150 150 150 150 
##$DP07= 0
##$DPNAME0= <>
##$DPNAME1= <>
##$DPNAME2= <>
##$DPNAME3= <>
##$DPNAME4= <>
##$DPNAME5= <>
##$DPNAME6= <>
##$DPNAME7= <>
##$DPOAL= (0..7)
0.5 0.5 0.5 0.5 0.5 0.5 0.5 0.5 
##$DPOFFS= (0..7)
0 0 0 0 0 0 0 0 
##$DQDMODE= 0
##$DR= 18
##$DS= 0
##$DSLIST= <SSSSSSSSSSSSSSS>
$$ [...]
##$SUBNAM2= <"">
##$SUBNAM3= <"">
##$SUBNAM4= <"">
##$SUBNAM5= <"">
##$SUBNAM6= <"">
##$SUBNAM7= <"">
##$SUBNAM8= <"">
##$SUBNAM9= <"">
##$SW= 24.9337058887773
##$SWIBOX= (0..15)
0 0 2 0 0 0 0 0 0 0 0 0 0 0 0 0 
##$SW_h= 4990.01996007984
##$TD= 16384
##$TD0= 1
##$TE= 0
##$TE2= 300
##$TE3= 300
##$TEG= 300
##$TL= (0..7)
0 120 120 120 120 120 120 120 
##$TP= (0..7)
150 150 150 150 150 150 150 150 
##$TP07= 0
##$TPNAME0= <>
##$TPNAME1= <>
##$TPNAME2= <>
##$TPNAME3= <>
##$TPNAME4= <>
##$TPNAME5= <>
##$TPNAME6= <>
##$TPNAME7= <>
##$TPOAL= (0..7)
0.5 0.5 0.5 0.5 0.5 0.5 0.5 0.5 
##$TPOFFS= (0..7)
0 0 0 0 0 0 0 0 
##$TUNHIN= 0
##$TUNHOUT= 0
##$TUNXOUT= 0
##$USERA1= <user>
##$USERA2= <user>
##$USERA3= <user>
##$USERA4= <user>
##$USERA5= <user>
##$V9= 5
##$VALIST= <valist>
##$VCLIST= <CCCCCCCCCCCCCCC>
##$VD= 0
##$VDLIST= <DDDDDDDDDDDDDDD>
##$VPLIST= <PPPPPPPPPPPPPPP>
##$VTLIST= <TTTTTTTTTTTTTTT>
##$WBST= 1024
##$WBSW= 4
##$XGAIN= (0..3)
0 0 0 0 
##$XL= 0
##$YL= 0
##$YMAX_a= 886242
##$YMIN_a= -529898
##$ZGOPTNS= <>
##$ZL1= 120
##$ZL2= 120
##$ZL3= 120
##$ZL4= 120
##$ABSF1= 10
##$ABSF2= 0
##$ABSG= 5
##$ABSL= 3
##$ALPHA= 0
##$AQORDER= 0
##$ASSFAC= 0
##$ASSFACI= 0
##$ASSFACX= 0
##$ASSWID= 0
##$AUNMP= <proc_1d>
##$AZFE= 0.1
##$AZFW= 0.1
##$BCFW= 1
##$BC_mod= 2
##$BYTORDP= 1
##$COROFFS= 0
##$CY= 11.3945322036743
##$DATMOD= 1
##$DC= 2
##$DFILT= <>
##$DTYPP= 0
##$F1P= 16.9975609425685
##$F2P= -3.02152046262296
##$FCOR= 0.5
##$FTSIZE= 0
##$FT_mod= 4
##$GAMMA= 1
##$GB= 0.15
##$INTBC= 1
##$INTSCL= 1
##$ISEN= 128
##$LB= 0.24
##$LEV0= 0
##$LPBIN= 0
##$MAXI= 10000
##$MC2= 0
##$MEAN= 0
##$ME_mod= 0
##$MI= 1.114404
##$NCOEF= 0
##$NC_proc= 0
##$NLEV= 6
##$NOISF1= 3.799351
##$NOISF2= 2.8
##$NSP= 1
##$NTH_PI= 0
##$NZP= 0
##$OFFSET= 15.70392
##$PC= 1
##$PHC0= -9789.369
##$PHC1= 12.40088
##$PH_mod= 1
##$PKNL= yes
##$PPARMOD= 0
##$PSCAL= 0
##$PSIGN= 0
##$REVERSE= no
##$SF= 200.130013532006
##$SI= 16384
##$SIGF1= 3
##$SIGF2= 2
##$SINO= 400
##$SIOLD= 16384
##$SREGLST= <1H.CDCl3>
##$SSB= 0
##$STSI= 0
##$STSR= 0
##$SW_p= 3612.71676300578
##$SYMM= 0
##$S_DEV= 0
##$TDeff= 0
##$TDoff= 0
##$TI= <>
##$TILT= no
##$TM1= 0
##$TM2= 0
##$TOPLEV= 0
##$USERP1= <user>
##$USERP2= <user>
##$USERP3= <user>
##$USERP4= <user>
##$USERP5= <user>
##$WDW= 1
##$XDIM= 8192
##$YMAX_p= 0
##$YMIN_p= 0
$$ End of Bruker specific parameters
$$ ---------------------------------
##NTUPLES= NMR FID
##VAR_NAME=  TIME,          FID/REAL,        FID/IMAG
##SYMBOL=    X,             R,               I
##VAR_TYPE=  INDEPENDENT,   DEPENDENT,       DEPENDENT
##VAR_FORM=  AFFN,          ASDF,            ASDF
##VAR_DIM=   8192,          8192,            8192
##UNITS=     SECONDS,       ARBITRARY UNITS, ARBITRARY UNITS
##FACTOR=    0.0002004,     1,               1
##FIRST=     0,             0,               0
##LAST=      1.6414764,     0,               0
##MIN=       0,             -529898,         0
##MAX=       1.6414764,     886242,          0
$$ Real data points
##PAGE= N=1
##DATA TABLE= (X++(R..R)), XYDATA
$$ [...]
2296b094J574j155m172j522K958M446N13k536k515L63L464J587k994j884L756
2311b11K755j343k386j924J205M574L020l801n265J061M850J216k207j713L14
2326A45J666J360k083l004P43L322J463j221k733k037J800K987N47j922K52o9
2342A216j160J73J752k44o27K079Q75k940o41J689m7J5Q35N78j097j411p40K22
2360E27K104J495j565k426n58P44L95L75j334j230K406J549l619l474J773L183
2376C45K75j621k071j511J568K744o67l091q6K896J000j598j857j213K504L195
2392H12q9l047j444J014K043J241l40l004l3L509O16k680q93J699O64J130k18
2409I80k011j372K093J777p06j447N01M77K7Q9o14l12J091P61j529J29P11p62
$$ y = [-2094, -520, -1675, -5847, -7369, -4411, 35, 548, -1988, -4503, -4140, -676, 911, -2083, -3967, -211, 2544, 1201, -1185, -3109, -1904, 2670, 5690, 1889, -3376, -2315, 2535, 3751, 1544, -169, 145, 1811, 3171, 1088, -1916, -1173, 2149, 3612, 2391, -342, -2379, -579, 2408, 2955, 1033, 1285, 1216, 56, 229, 1981, 1737, 1110, 3189, 4064, 1124, 483, 2172, 2125, 2140, 2975, 3553, 2456, 1045, 305, 527, 2631, 4126, 2561, 135, -423, 321, 716, 1091, -243, -1473, 933, 2482, -1137, -4611, -2838, 345, 620, -1001, -3072, -4583, -3015, -271, -938, -4029, -4115, -1219, -219, -1817, -3674, -4887, -2383, 812, 723, -2324, -3768, -2754, -711, 530, 190, -2814, -2847, 662, 1278, -1402, -2295, -596, 68, 1198, 980, -1031, -2403, -310, 1467, 761, -686, -185, 292, 319, 408, -206, -518, 573, 1334, -195, -66, 645, -117]
2427a17l45J710J28r38O18q2j630P29K185l52j757J93J109L79K06r06j269Q65
2445G26K508n02k150j078J311J333P50p31k418J9K412L88k125l54K09O98J370
2462B366Lk970j063K323J919j186j289j149N6J710J217j964j893J477J980o90
2478H47j840r06j16J925J324j941j939R14J262k06l22j4m70j6L38m79p52L29N09
2497a553m62R03R54j875j531J508J257pk58m43o37N57J505q85p00R20J220p05
2515b32l12J53n38J44J345R22m48n55n86o74K067J623k263j409J679J765p48j221
2533G12r31L64K211J025k303k234J617K376p56j763J12M21R06K44j065j209J068
2550G95M52l72L93L43j509o75J980K45j553l34q4J00J084M67k202q26K121Q36
$$ y = [-117, -462, 1248, 1376, 438, 1056, 974, -656, 73, 2258, 1906, 149, 342, 1451, 1830, 2036, 1130, -139, 726, 3234, 2732, 582, -496, 815, 2148, 2898, 2167, -251, -232, 2180, 2568, 443, 89, 298, 996, 2366, 2369, -601, -1664, 659, 2578, 1392, 103, -1046, -990, 720, 1937, -27, -1920, -443, 1537, 847, -993, -1899, -2015, -90, 1234, -707, -2646, -1732, -470, -676, -998, -1012, -1482, -1498, -1160, -1639, -2391, -2062, -1553, -2015, -1112, -158, -2033, -3564, -2056, -799, -806, -1064, -1507, -2144, -1587, -82, -967, -1667, -747, 473, -232, -544, -391, -929, -785, 560, 1482, 1034, 479, -107, -781, 1286, 2909, 646, -763, 916, 2681, 1933, 712, -219, 145, 2356, 3381, 1078, -1156, 461, 2837, 2081, 318, 430, 851, 1757, 2001, 936, -273, 795, 1247, 875, 1268, 1611, 102, -573, 1407, 1652, 99, -235, -319, -219, 865, 1332, -870, -1696, 425, 1261]
2568A261j615o74O85O94l80r99p18L28J857k64j340j38Q68j086k86J155K35l80
2586g97K82o79n37O85J036j246m7J627R51k158q22O68Q64k2K66J59J59P13q23
2605B79j478J051J154j46K32j91m77o72R91M10l65P01M58j593k66J113k3j394
2623b16L61J364M12p93n75q28L62R31l31j096R10M82o56p79R7j97P0J021j95j213
2643h69j2L03r78j51J564J74j164L04M61j554n28J379K72J47L65q82o21J024K32
2662e34p32L07P58m9l7M10j293j070J866J814q38n02P59r02m82J168O75q00j36
2681C82J182r2j334L16J25O07Q06j79j126m99P63J15o73Q94k16m99P97lj286m07
2701c27J326k61m18J159m34j615O60J474p47j024N88K62J8J79o50j213J015J246
$$ y = [1261, -354, -1028, -343, 351, -29, -1028, -1746, -1418, 439, 175, -1165, -1303, -435, -1521, -1807, -652, -417, -797, -515, -1194, -1731, -1046, -10, -1256, -1303, 324, 1275, -883, -1705, -1037, -173, -195, 71, 230, 389, 1102, 279, -1199, -148, 1006, 860, 1092, 901, 424, -248, 743, 1153, 788, 1489, 1947, 354, 88, 1201, 1178, -216, 145, 1509, 1921, 1128, 553, -275, 87, 1018, 687, -409, 501, 983, 327, -452, -355, -552, -482, 539, 344, -869, -881, -578, -1556, -1707, -143, 31, -1133, -829, -368, -1922, -2450, -1071, -799, -652, -287, -1169, -1790, -766, -534, -1266, -959, -201, -250, -287, 123, -1170, -2240, -374, 1440, 602, 100, 859, -43, -525, 643, 1318, 518, 382, 1564, 1472, 138, 454, 579, 1186, 1992, 1813, 687, 188, 951, 1066, 393, 1287, 1071, 572, 1369, 1366, 80, -327, 999, 738, 320, 1479, 1045, -570, 90, 1564, 817, -207, 381, 643, 661, 840, 190, -1023, -8, 1238]
2719A238m57n97L7n19j86Q46r0j011O16L08q67j05J246k89j645L69P21o5l58o1
2739h69j70m19N59M25r94J54O58n87m26M94K99J1K79j44o24O85P04r36L46Q93
2759C38o51p00O08J323o12n05O97j77o3P37n99r06R61J025n50j017M21J58N2N38
2779A078n74r56O86N79o03m73R67p68p59Q01O60l94l85J77n17J21O94K04j155
2798f17L81J045m88n22L92k57j59P61N34j012M28j8p88M22J098k57p62O82K02
2817A065j143q04P48N63Q76M79j198j946M32J393j44N0J10n42n8N91j278j158
2835a964J656J525k33p32j057j222J33K093R44j071r6J71n16n62N92l76l90K326
2853A221Q15j897j533n46J165J654R07q52j604J87J75o85L79J121j35m6O61j265
$$ y = [1238, 781, 184, 221, -298, -484, 362, 272, -739, -123, 185, -682, -787, 459, 170, -1475, -1106, -385, -450, -808, -869, -1039, -1458, -899, -474, -1468, -1314, -656, -1243, -1669, -1175, -876, -865, -586, -730, -1354, -669, 35, -901, -555, 338, -313, -1013, -405, 918, 306, -199, 498, 321, 258, 995, 396, -510, 451, 1476, 926, -91, 330, 488, 540, 1078, 504, -452, 234, 813, 210, -263, 704, -64, -823, -22, 638, 244, -141, 36, -481, -360, 334, 538, -617, -236, 809, 321, -201, 191, -66, -225, 536, 1070, 58, 486, 468, -320, 102, 1200, 943, 181, 863, 1065, -78, -882, -134, 429, 1305, 1784, 586, -1360, -928, 465, 321, 371, 481, -61, -119, 472, -806, -1964, -308, 1217, 984, 252, -805, -2027, -1894, 199, 1143, 72, -24, 147, -369, -931, -339, -715, -1105, 1221, 2036, 139, -1394, -1940, -775, 879, 1786, 934, -670, -483, -308, -993, -614, 507, 372, 326, 987, -278]
2871b78j949N25J926M99m98O0j051j045J185R45m76p34O92L82k0j18j170n68J624
2890f9J258q52o60l92L09Q40Q56r42j636Q45J582k47m56J42r81k68J614o3j083
2909b03l63J095K79l31n66q71j51K052J265j120j520p67k64J058J635o49n71O75
2927F83L23j810p83J002M90Q40J263o99l077l87J588J242O09K37q65j391N82j55
2945c08p56L74J669Q63q5j127k441n28K083J820m07k17m85j496l59J076O72p44
2963c96R75J534j509j725m49K30J279J160O64j736r06l68J092J13K31K6l86Q75
2981G04k46j490m9J235j47L81J049j468j653R00J221m09o68P37j88l16P77k43
2999A27r14j82J048J79l76k29o89J15J656j10j221j08O01l01M54N97j098p43Q73
$$ y = [-278, -2227, -1702, 224, 723, 225, 285, -766, -1811, -626, 319, -157, -891, -199, 183, 163, 45, -1125, -1693, -69, 1189, 337, -323, -715, -406, 434, 1290, 348, -1288, -443, 1139, 892, 436, 578, -403, -671, 943, 880, -203, -566, 529, 808, 477, -89, -960, -1111, 941, 2206, 1086, -434, -1201, -1465, -407, 1228, 579, 8, 683, 1006, -804, -1587, -585, -95, 745, 2008, 1309, -1768, -2155, -567, 675, 1284, 1521, 656, -735, -153, -308, -1064, -690, 979, 1842, 1757, 630, -1811, -2339, -256, 1564, 1157, 940, 455, -1041, -1400, -324, 348, -396, 579, 2113, 604, -1121, -1570, -1340, -61, 1099, 1763, 27, -879, -1247, -155, -42, 189, 215, -171, 704, 458, -1032, -1081, 154, 7, 388, 1437, -31, -1684, -784, 437, 28, -640, 97, -91, -407, 370, 127, -787, -969, 79, 258, -118, -347, -1036, -921, 735, 625, -596, -704, -103, -404, 50, 647, -451, -1194, -321]
3018c21Q65n14k97L74l64K54M39m43r93M32J852p9q65q32q15J136J306j05j583
3037e53K40O54l17J86q2n53P7J375N90j833o75P15K5M06L86k81o92J39P29l80
3057A56j95%M84P5L56j159o76R68N74kj41N64j184q52J282O10j058K39P13o36
3077A18l72Q31k47q48N99O56L5r13m99J82P41K79m23l37Q2O20o69n2K17m70J9
3098d51J806l60k120l53J322K63J50L24n89q37J66R09n57n80P27N77N89q57j486
3117a357k87J483P42j67n17K86p84L8R79n32o52J590M76j388j213R66R3q1R36
3136F11N61r51p49O5l80J56R32N27l55J04j216m27M05J234m44M03O30j150j345
3155a389N09P37L9P18O29q79j584O93J174r26R5M83K75r8J11j069o09J380Q02
$$ y = [-321, 544, 30, -267, 107, -257, -3, 436, -7, -1000, -568, 1284, 1205, 340, -492, -1307, -171, 1135, 1030, -553, -313, 341, 24, 210, 128, -425, -348, 1027, 1617, -216, -891, -176, -151, 255, 641, 360, -332, -193, 536, 156, -39, -39, 445, 520, 876, -283, -959, 9, 583, 581, 440, 1004, -180, -1032, 250, 860, -198, 41, 754, 118, -254, 577, 330, -518, 81, 737, 772, -141, -640, -458, 283, 562, 139, -198, -116, 504, -165, -217, 0, -470, -451, 1355, 995, -1125, -1478, -156, 107, 257, 581, -8, -845, -679, 230, -327, -907, -180, 397, 986, 129, -1357, -1644, -161, 581, 414, -103, 183, -601, -563, 416, -116, -768, 822, 1298, -90, -1303, -337, -244, -325, 611, 1172, 221, -528, -463, -843, -687, 245, 772, 417, 521, -695, -1122, -717, 517, 73, 476, 1106, -44, -1389, -880, -143, -104, 614, 1243, 364, -1220, -527, 647, -279, -184, 299, 574, 476, 587, -482, -1091, 289, 1091]
3174A091k29o37p62k20Q61P97j446l37J296Q50j122r23R26l49l0Q58j54j492N02
3193e20J205q7q29r5k00K02N96M52r29K9M70m56l93J52J28P36J255j158j914N63
3213g93J122k11j48R90P1p76l78k88p13O66J815K47j129o79k63j70M85O03M83
3232I34M16%j635q49M23N67O70J022q7j458r94Q01j72o67J564J002p46j225k53
3251f87q69K27J872P49j311m77lq46J63M84J82R01K87r40j286j33J031K68P3K82
3271c3l70o52Q27m61p20O07J610j35r79n21m32O98R79Jq35o4Q48N55n85p31N7
3292c36L08R73L3j443j44J473K8n45O2n0p40R94O59j127q05Q78L90m53J20Q4l17
3313D2M41N42q56q64O92R77J06M80j082q52L67J235q52n22Q71N98p35n91M46o43
$$ y = [1091, 862, 225, -537, -757, 104, 901, -545, -882, 414, 1264, 142, -781, 145, -204, -234, 624, 470, -1022, -520, 685, 598, -231, -326, -526, -324, 272, 724, -205, -176, 294, -162, -555, -403, -275, 461, 1716, 558, -1356, -793, 329, 118, -30, 960, 1031, 255, -123, -411, -1124, -458, 1357, 1604, 475, -204, -467, -637, -152, 451, 934, 1350, 1350, -285, -1134, -711, -144, 526, 1548, 1461, 3, -991, -190, -362, -1029, 535, 1537, 791, -434, -687, -1556, -1329, 543, 1292, -19, -496, -499, -1345, -1182, -698, -516, 385, 672, -268, -1554, -1687, -656, -388, -315, -33, -403, -1055, -228, -689, -1409, -802, 808, 673, -306, -827, -1259, -561, 418, 419, -416, -480, 368, 923, 338, -393, -336, -28, 945, 978, -465, -609, 864, 892, 347, 409, 359, -381, 613, 1272, 145, -660, 218, 608, 155, 275, 359, 42, 483, 1025, 169, -695, -3, 974, 1080, 1560, 478, -374, -7, 1228, 376, -146, 725, 1323, 588, -3, 443, -200]
3333b00j31J675k61p90J99k76q58P2J242L96p87k53o24p6P17n2j397O16J040k36
3353A6j008k67J1K08J147L41j331n91L94O47n50M92k70j76J250K64j529p88J138
3372f02Q58J71l39q64n68J652J278j777j214J176J023L19p24j228n63J633J594
3389A825j231j542N7R48K55J37k80p47J08Q63j04n57K43k96N6Q78L29p76r83P94
3409b3M64n34J73N50k10M28l23p72L57J152j04q13K9L55m89J82J29j38K9M77l53
3430E66r94R73M96r67l39Q25L35m66o92o08J5R36J275j604j218Q15L05R0K01l49
3450d05n75O65J006q58q92o1L51N83P28K60k016j03J541M56q48o06N97j3R10l93
3470C27j373J43J356M2m74o56O44L0J65k93j009M69J528k61j290L9M96l91K01
$$ y = [-200, -331, 1344, 1083, 293, 492, 216, -642, -570, 672, 1068, 281, 28, -596, -672, 45, -7, -1404, -788, 252, 16, -992, -1259, -1248, -1040, 107, 448, -883, -1474, -1080, -433, -983, -491, -761, -937, 313, 577, -952, -1740, -602, 256, 427, 88, -776, -1344, 308, 1586, -191, -1405, -229, 794, 1113, 389, -839, -1402, 231, 1825, 594, -948, -891, 57, 312, 449, 169, -578, -470, 393, 289, -268, -25, -321, -265, 613, 942, 166, -817, -23, 441, -93, 80, 630, 420, 848, 525, -247, 110, 1262, 1158, 345, 374, 729, 240, 422, 551, 413, 442, 919, 566, -428, 545, 1041, 74, -265, 560, 895, 429, -263, -871, -856, 80, 1355, -249, -1467, -652, -347, -257, -56, -405, -980, -315, 691, -167, -1059, -1120, -769, -186, 542, 802, -1214, -1317, 224, 680, -168, -774, -177, -190, 720, 327, -1046, -903, 453, 495, 21, -635, 9, 39, 204, -89, -1098, -629, 899, 638, -652, -613, -117, -508, -307]
3489c07N80m91m98R27j9n27L22K01n22R2J107p3j144L15N1j35K72M48K61j83J3
3510F90n44p01J142R0o17K0R74m42l77j37l28K19J102L28j172q37M60P12m62J15
3530B35K36j82K69l5j361kR38kL9J17L3p75J70Q3k44j28Q62n8o64j89p9n09P77
3553d69J101m73p02Q6j48n0K53K0r6N4Q11o64k60K55L7j08K37K05J26l41p3k93
3575d92q5R84N49q81k07L59M63m28k49J72j02Q24K51q33m18K73J10J6L41l54l4
3596B59j00L11k05q50N38L08L12k37k67j145K41J299l82q08O35M98m10k4l92o14
3616a033O16R62N5p09k12J86l8L75K40p40J48P01j96m46L71l60l98Q27O48o48
3636C49p50K97K73l87J56J63j48J14M06l55o38O61K28o33L58j17j77l67M79j5
$$ y = [-307, 273, -218, -716, 211, 192, -335, -13, 188, -334, -242, 865, 792, -352, -37, 14, -121, 151, 599, 860, 677, 690, 146, -555, 587, 677, 60, 80, 1054, 612, 235, 98, -230, -11, 1091, 1419, 247, -590, -130, 582, 120, 235, 471, 289, 558, 523, -838, -840, 98, 96, 135, 252, 285, -490, -320, -237, -481, -609, 253, 195, -469, -658, -737, -1246, -469, 632, 159, -543, -457, -605, -655, -402, -382, -478, -424, 387, -277, -537, -282, -245, -353, -116, 89, 215, -126, -199, -492, -577, 407, 956, 75, -132, 227, 690, 262, 13, 185, 83, 907, 1158, 325, -93, 180, 290, 306, 647, 293, 259, 159, 470, 265, -585, -47, 261, 573, 336, 69, -1076, -835, 464, 82, -726, -91, 407, -3, -27, -419, -1033, -417, 545, 600, -109, -321, -135, -173, 202, 442, -298, -150, 551, 355, -91, 280, -80, -478, 349, 997, 349, -401, -104, 169, -218, -62, 101, -47, 67, 473, 118, -520, 141, 369, -264, 94, -23, -200, -567, -88, -103]
3656a03N3M50l6n90ON38m95m27Q20r9j82L81q4m02K63K73m37l40L73L47l36l7
3678f4J56l56L2N21r8p55L88j27l51L16L63l57k63M52j38m28L89N7l03J91N05
3699A30m94n5M47J30k12k20L52o15M77N69m51l03M65Kl62K05J48k73L17L13l09
3720B61j64M85j46n40J84P69o88o0M91L11r20p7O08l17L23O7j10m80Q22m99k24
3741I6j03J89q5O6K77o42o55J046J33o88L70Q1l79R2L68p69kN10L8J23l14j31
3763c79k27K64N42l19k27n0L16l79R8M86m19o5P05m80m86K70P40m10m41N41j21
3784d1k90N35k84n9K08J92j73K37N9n37j76O01J41l72M1K25q20K32O33k07n74
3805d29K78M90n36K76L19k44p42P69K53m48j74rP4N36L16q11l62M43M26j94J55
$$ y = [-103, -50, 400, 364, -226, -220, 318, -177, -604, 216, 117, -65, 316, 232, -170, 93, 366, -71, -411, -38, 309, -27, -64, 92, -264, -232, 289, 191, -564, -176, -303, -654, -338, 25, -332, -595, -143, -281, -709, -320, -263, -566, -375, 130, -364, -419, 28, 158, -54, -274, 78, -537, -60, 509, 58, -245, 220, 222, -140, 65, 213, -60, 257, 570, 261, 97, 582, 436, -104, 80, 849, 161, 101, 592, 903, -17, -94, 514, 197, 520, 587, 477, -3, 819, 320, 96, -7, 182, 97, 163, 440, -202, -857, 189, 322, -366, 4, 85, -294, -202, 166, -603, -605, -95, -57, 66, -248, -379, -606, -342, 200, -119, -346, -396, -80, -459, -361, 125, -294, -359, 346, -134, -620, -350, 390, -20, -461, 80, -41, -331, 204, -80, -139, 69, 261, 88, 325, 384, -153, -329, 272, 413, 41, 82, 307, -513, -281, 352, 145, -429, -151, 339, -197, 79, 398, 154, -588, 181, 434, -14, -188, -197, -123, 413, 729, -82, -444, -1, 425, 231, 386]
3826C86r8o43N27O94m60j018N83O41n23l19N3P0p0M51N5r08Q0P50l70J06n69M3
3848e39K39N96o73q30L03P33l44Q27j1p33m20Q61J59o87K76P22k36n96N01K08
3868C56k41K16K30j15J42k15m41J5R11J86l40m6k69r01O96Q08p73l52O39K24r19
3889a89J93J68m46K31Q04k59j077j51L84M27K36o40m15K38N94k39p91J89P46L19
3909C22J66n16j127K03J738J03j194k00M60k2J54J51k91o16R94L35q03j84J9L92
3929H4J52L46p20n07M98J00J29K31k34n48J49P07n82o02N30O57n01m74Q21l59
3949a23n30L45P26m28l0R4m77K98O94l0o87j6J32N77on45k79L39J403n99j043
3970a85m5N07j56N37j0p10o84O91J027o72n41j8l9Q59J36p67q41R56Q32m10k84
$$ y = [386, 288, -355, 172, 866, 406, -612, -29, 612, 89, -230, -177, -107, -177, 274, 329, -579, -499, 251, -119, -13, -582, -539, -300, 296, -377, -1207, -904, -171, -515, 312, 301, -432, -852, 9, 168, -519, -243, 479, 243, -353, 148, 356, 115, 331, 561, 446, 588, 373, -68, -53, 858, 1044, 704, 658, 389, -512, 184, 992, 219, -133, 506, 730, -189, 4, 172, -274, -43, 761, 502, -575, -726, -342, 85, 321, -319, -734, -496, 98, -141, -932, -743, 3, 322, 488, -28, -1155, -952, 786, 889, -305, -505, -45, -67, 87, 238, -53, -669, 325, 660, -143, -327, -308, 84, 236, 582, -138, -645, -147, -47, 82, 313, 79, -469, -320, 387, -195, -797, -267, 390, -111, -585, 236, -123, -653, -308, 418, -10, -40, 54, -423, -125, 569, 539, -148, -164, -32, 545, 539, -6, -285, 54, 1457, 858, -185, -230, 277, 121, 658, 648, -62, -746, -55, 972, 300, -241, -259, -298, 561, 697, -70, -911, 45, 877, 467, 183]
3991A83j062L67R25O35j258q46R53J031r12k39k00R6K89J009k68j384L5R27L3
4010C14j55j29j28j44L26M96q04L82l64l28O49K44n09n59Q01m7l07K71L79r97
4030f09p4O96R8j14l23j37k0L72P82r67q41J078O29k61m81n12L4R09M69j302l92
4051i66Q16P90o88K07r00R4J066O87r54j285M54J254k00j76j49o35P1J208K17
4070I11r35k73J68Q19M51q65r91J15J541J46j289J36l51O61L60O3j012L8R56q9
4090E60q91J31L93o6k92M53K71r43J38R5j89K45M66l36k85L29m0k59M12k90j22
4111b20L81L26p62p03O71M80jJ37k09p62J70J026L64j153j94N87N17J8o38j153
4131a118O55J602J78j302r23L20P78M26p4j246j64J382m9p58j03M13K30j82L37
$$ y = [183, -879, -512, 413, 1048, -210, -1056, -103, 928, 16, -223, -423, -327, -38, 971, 703, -681, -646, 281, 314, 159, 30, -98, -242, 84, 580, -224, 158, -206, -534, 115, 359, -150, -709, 92, 45, -262, 9, 388, -609, -683, 13, 111, -3, -326, -463, -483, -111, 671, -296, -1137, -59, 570, 309, -172, -684, -650, 259, 728, -574, -966, -150, 640, -48, 159, -741, -647, 419, 1106, 152, -1133, -679, 575, 375, 199, 50, -585, -514, 694, 911, -24, -297, -129, 690, 1141, 276, -715, -600, 941, 1087, -202, -66, -417, 244, 604, 667, -345, -307, 649, 560, -331, -200, 193, 127, -165, 288, 559, -384, -246, -151, -340, -95, 371, 35, -250, 79, 39, -220, 192, -98, -220, 161, 487, -275, -978, -307, 173, 172, 309, 100, -662, -492, 534, 898, -255, -449, 138, 655, 673, 35, -1118, -463, 1139, 1317, 15, -908, -588, 190, 616, 542, -704, -868, 514, 465, -293, -396, 17, 247, 65, 402]
4150D02q92l87O55M34j86l53J91J5K17N67p77l80P36M69n93m85J35J19O38M37
4170I62n10j023O48L41k22j30q7L57p14N44k6k82O2L35p06J56L55K3n70l7N1M68
4192eM88l62j433j72J682J96n54j97j50N5M47M82r10m53J014P22j002k27j46M26
4212i9O39P91r00j096M99M23q8Oj94N8N89P33j012p80M12Q29Mn41m17rK46M98
4234E91l80n92K77N33q4k8m12n01K42O49L61q93k31J91J27j38Q59m83k60K11m17
4255c78j41O79N08p56k73M58J88l51L42l97l68L93N79l99n53L21L39j49J60k42
4275d0o20K80P43k08m98M6K77J35M6l02l10K05J031p37p03q5O19L95K99o15o92
4296g34N60Q15l15o54j74N34N5K50L10j125j43J238m33k01r8K31n34R9Q21r18
$$ y = [402, -490, -877, -222, 212, 26, -327, -136, -121, 96, 663, -114, -494, 242, 711, 118, -367, -232, -113, 525, 962, 452, -571, 77, 418, 196, 66, -21, 336, -378, 166, 140, -142, -80, 255, -451, -295, 60, 83, -487, -524, -473, -5, 483, 121, -1312, -1484, 198, 394, -160, -357, -507, -452, -5, 477, -433, -886, 128, 850, -152, -379, -525, -99, 540, 1331, 431, -665, -166, 257, 169, 175, -19, 39, 628, 1361, 349, -431, -19, 810, 814, 273, -144, -153, 93, 591, 211, -381, -104, 429, 345, 317, -95, -596, -354, 295, 656, -237, -468, -277, -150, -288, 571, 88, -172, 39, -378, -519, 160, 668, -88, -361, 97, 285, -66, 276, -121, -489, -96, 483, 84, -469, -148, 191, 42, 202, -40, -660, -380, 363, 155, -343, -297, -20, 115, 161, -141, -451, -246, 785, 48, -655, -740, -121, 274, 573, -42, -734, -174, 641, 326, -328, -502, 32, 87, 337, 647, -478, -621, 617, 184, -17, -115, 116, -418, -319, 502, -416]
4316d16L31J97L79n57LM47m41Q1J42j50M4K3j30m65L16M91j66k82J59k89j35N43
4338A25J02n95L40N05n12n77P51l64m6M24m6n37O0N58l26j02R8L76j74L66l51
4359G5k71m50J098M46p09l42K04j51Q70j12p76J6L81L03m28n4M5J59K6J24j26
4380C28n39Q5L60l17O4K41m17J11J90n44j10O34K25m79pM91m68l70N49M37n83
4401a19n6N07m80n8J04j24K21J32j59k34K97P9m68J61N08K39m71k26R0n84P94
4422A53M71q41K1L63j4m41o3j66J38N52j03j89n77M92K01m23N75m85k21L06L58
4443A07j31l24J61q0J74L6J43n19M42O59l58r18N41L76k62j10K30k15P1L95l12
4464A06l40R9N78n33J54Q3l61l3P33n73JL04J73m79n1M82k29l13N44m20m94L87
$$ y = [-416, -85, 112, 491, -66, -63, 384, -57, 24, 166, 16, 60, 83, -47, -512, -196, 295, 129, -153, 6, -283, -418, 125, 227, -368, -28, 477, -35, -612, 139, -225, -271, 153, 107, -430, -370, 188, -138, -240, -142, 234, 60, 426, 75, -196, -646, 452, 898, 189, -153, 51, -100, 770, 658, -118, -102, 279, 582, 154, 100, 145, 304, 330, 454, 328, -211, -126, 234, -83, -19, 222, -195, -84, 106, -438, -548, 86, 311, -168, -175, 316, -152, -522, 27, 464, -119, -175, 332, -148, -206, -102, -226, -5, 127, -32, -266, 31, 110, -358, -197, 311, 550, 79, -147, -57, -641, 153, 624, -217, -196, 167, 153, -288, -351, -517, -379, 173, 70, -119, -696, -204, -3, -426, 149, -336, -557, -251, 107, -24, -348, -187, -267, -93, -57, 86, -433, 9, 668, 310, -608, -67, 309, 47, -63, 167, -48, 23, 418, 106, -234, -135, 443, -90, 64, 147, -214, -247, 486, -87, -86, 218, 391, -88, -139, 343, 114, -199, 345, -75, -569, -182]
4486a82J75L7l38N30j12L9J0J17q65N40L80n3m59N57l86n17N86M7J03j50N81p85
4508a45k53L50n5J19J66L28o57J1M01j68j34K3N49n96r3j01l74M79K99k91o6J56
4530e2o5l16J59K70l14K04K33K06q99K46M91m11J11j20L25l20J03K78m36J53M76
4551C22k74j57K89r7m29L29M07m88L8M60p19kO07m25j00L95k03j57Q8K34J84m47
4573a45L25k94m12P49K61q63L26K04Pk08L01r1l55J23L68j37l98M90Po27N82J73
4595C86l96q1M98k11m92N33j28n45L03J91m69L06M43n35L4K22k5p4J8K06m13J21
4617a08M09k76o29R16j10k33l0J29J33l60K56Q6l01M68j87R8l19p9L90n66N21
4638B08Ll63L29k4n37L42K02m43l5L64J00l71n1N52j98k83L68j46k20M16r7j69
$$ y = [-182, -7, 30, -308, 222, 110, 149, 159, 276, -589, -49, 331, 278, -181, 376, -10, -527, 59, 106, 209, 59, 640, -145, -398, -48, -103, 16, 182, 510, -147, -136, 265, 97, -37, -14, 535, -61, -154, -255, -629, -150, 149, -142, -208, -52, -117, -433, -274, -4, -318, -114, 119, 325, -574, -328, 163, -248, -137, -257, 68, -252, -149, 129, -307, -154, 322, 48, -109, 180, 83, -346, -17, 390, -98, -60, 400, -319, -321, 286, -139, -239, 156, -47, -204, -116, 118, 302, -145, 180, -114, -526, 223, 484, -379, -53, 151, 158, -50, 251, 160, -195, -72, 296, 159, -239, 251, 258, -369, 213, 386, -10, -91, 407, 196, -296, 237, 109, -436, -133, 58, -411, -105, 338, -197, -163, 59, 34, -40, -22, 184, -229, -108, 301, 25, -604, 312, 202, -31, -61, 68, 201, -159, 97, 183, -118, 350, 163, 261, -58, -137, 253, -313, 208, 211, -152, 177, 153, -384, -42, 160, -283, -318, 46, 146, -225, -276, 276, 78, -205, 163, 17, -203, 213, 116, -53]
4660e3k16N99m97J90k23K73j42K15K38o85K13M10k64l59N53k08j02j27J67j05
4680a23j69O48l76j86N25l15k24K26q3J52j41r1J1k04O36j26n87K42M05m16o7
4701b63K69J04m54K82L88n27K30o8J11j60J75J02l34J32J99R7j91j74J86j06M05
4722D03l78k91K99M42m17k83L05J18l06K65K91n74j88N21j44k10N52R4p20O5L05
4743A49j86k21L02l3o8J19q5k38o8P64l76k41L99l4k88K35K4l03j36O93k90J7
4765A35j25J79k43j07L08q4J64J76l01k76K92m7k89J69K15n62K58O18n71k18L28
4786A9J17l76K05L55p41L85J92k29j66R0K15k34N4J93p8J08n0o7l9J28m2l10J21
4809a50L29l11j27O34j70m96J89K66l77l60P73l18l7j3K17J12n15N14J54l1n03
$$ y = [-53, -269, 330, -167, 23, -200, 73, -69, 146, 384, -301, -88, 322, 58, -301, 252, 44, -58, -185, -18, -123, -292, 356, -20, -206, 319, 4, -220, 6, -77, 75, -66, -157, -146, -350, 286, 160, -427, -185, 220, -196, -263, 6, 110, -344, -62, 326, -201, 29, -39, 72, -88, 87, 189, -145, -13, 186, 283, 92, -82, 104, -2, 403, 25, -266, 33, 475, 58, -225, 80, 198, -108, 157, 448, -126, -314, 207, 63, -147, 405, 499, -221, -156, 149, -37, -258, 44, 11, -57, 62, -23, -261, -329, 435, 59, -182, 217, 183, -105, 130, 154, -149, -285, 408, 118, 135, 10, 189, -54, -161, 147, 63, 227, 403, 102, -174, 118, 71, -218, -49, 166, -396, -138, 480, -91, -309, 19, 136, -240, -35, 320, -421, -36, 156, -73, -239, -149, 66, -168, -114, 79, 1, 109, 59, -8, -47, 81, 39, -271, -150, 179, -132, -259, 375, 205, -291, -102, 164, -213, -573, 200, -118, -155, -168, 49, 161, -354, 160, 314, 283, -220]
4830b20J23j03L28k26j82N02J45n08J3N18k89o85N85M08m84j9K42J36l59L09k82
4851d8o3qP40o32j2j21N5K24l3j55J28m2Q0P4m09N59l29L0J8L00q16L11N36l8
4875C49k72J24l58J53k64L39k07j16N18k23N2o3O0l1k3J85j36o2J06j57rJ90n7
4898I8j46k9M49l38l13J18L45m81L47j63l38M7K75K28m30P6L89n07O17l90l62
4919e08K60L87j0o2j5K04o62J78N00k98l40M90J21m02K77K8m37j83N40l7J45j52
4941B4K0q4R3J4m03K16L90l09P6J27m08L04J61L12p59k63N93n6j50K92j75m17
4963d02RP98p9p80L12J13J62K35m11l74J87P81m47N8j02j22j01K47Q9n64N7O89
4985C55k36k53K46j62k35J13O47k96k59K67j60J99j89J18o7p9L3K38l13k14L44
$$ y = [-220, -97, -200, 128, -98, -280, 222, 367, -141, -128, 390, 101, -584, 1, 409, -75, -94, 148, 284, -75, 234, -48, -111, -119, 621, -11, -23, -144, -89, 135, 102, -53, 75, 33, 113, 187, -222, 337, 8, 38, 56, 356, -460, -149, 387, 349, 77, 201, -157, -4, -268, 71, -136, -252, 266, 43, 95, 32, 92, 61, 38, 223, 87, 25, 131, -26, -35, 155, 98, -48, -77, 372, 34, -279, -161, 184, -297, 50, -113, -451, -404, -129, 99, -331, -255, 134, -373, 244, -146, -508, -248, 139, 129, 67, 52, 256, -406, -228, 272, -26, -366, 124, 245, -157, 120, 148, -289, -472, 68, 31, 176, 24, 44, -40, 53, 67, -336, -120, 270, -39, 37, 164, -244, 60, 221, 533, -226, -489, 104, 48, -102, 190, 15, -402, -393, 405, 326, -454, -142, -29, 133, 368, -43, -417, -230, 551, 104, 162, 60, -62, -163, 84, 173, -391, -334, 355, 119, -134, 112, -50, -285, -172, 475, 179, -80, 187, 27, 226, 37, 155, 88, 9, 42, 280, -33, -247, 97]
5006I7l7O1M50q75qP72k04l66k34M25k15K53J72p42j74N56J20L06j34k65l69O11
5028B00J96k64o60M65L26l36M11j44n80L4N22L1nK3m88k84O81J35l75m29N17J0
5050a4J6k07J32J17J48L97n51m51M53l52K79M74k03l61J50K30m79l58L32L32j97
5071a13L74j66o16K11N21j75m23L26k6j72L25K78o06M9J63L44m58J01j13n56O59
5092g3N46o50P0p1l90R3O50j3n23k5M33O5j07J16n4l17K30N04o17l82N86J59r5
5115A35p5k08l7K47N20o66O2M47l09l59L16o5l03K14N55l38p22P18Lp9N12l84
5137A84n13j40Q49J08n02q9J43K49L32j73p92P5M50L09J36m56k80k60M52K10j41
5158A51l15J4p2j35L5L82o9k17M19j13j32k64K4j03K78L27k68j21p9L97n5J23
$$ y = [97, 60, 121, 571, -304, -312, 460, 256, -110, -344, 81, -134, 119, 291, -451, -625, -69, 51, 357, 223, -42, -411, 200, 396, 132, -528, -63, 263, -73, 338, 194, -386, -352, 170, 201, 196, 219, -269, -553, 128, 263, -112, -541, -24, -14, 2, -205, -73, 44, 192, 589, 38, -413, 40, -312, -33, 441, 238, -123, 27, 257, -222, -580, -248, 84, -113, 261, 95, -521, -310, 211, 36, -387, -61, -87, -259, 66, 344, -262, -213, -50, 294, -164, -63, -176, -732, -73, 473, -177, -107, -178, -568, -475, 175, 162, -361, -386, 47, 112, 5, 121, 67, -250, -20, 484, -133, -515, 71, 230, 135, 60, -148, -185, 62, 582, -84, -22, 425, 116, -243, 73, 8, -295, -81, 474, 136, -586, 132, 135, 56, 568, 184, -329, -469, 380, 488, -14, -103, 40, 289, 621, 448, -344, -269, 181, 490, 626, 170, -110, -370, 82, 292, 151, -164, -150, -222, -357, -322, 60, -9, -226, 193, 80, -52, -316, -292, -395, -117, 210, -58, -179, -258, 139, 84, 207]
5180B07l08j43qO35k41m00J57k08M24k79J18l50L84K29Q0m61o1R5n4N42m91l89
5202e22L61K92j08j22k69r2J10O11L92r34l45M64L55J08j71n0o54Q63Ol65J16
5223D6P9L7J60o2j30l09K00L65j83o0J28l63p5L01r5j80j66Q60n24o0l0N9j77
5246a79L10r3p3m38O05J87n26J74J6k21J10M52O4l56k25m1q9R00n50m21j1M44
5268C9L67m62K19l00n0L43K43m02n12O36K61k92J86l78k94M20L09j30n99M39N1
5289I4n6K11m47k15M26J29j46k52L14k40L03RQ1o24L03K72j86l35M0K70j07Q1
5311g5K84k97m43L80L60m4k67R6k17K29N36m70j33r3J73k33L37K67j77n44L38
5332GQ4j25k1r0j55K39Q36o52l44k06K55J67K1k2l91K10K73j29j02J46k59K42
$$ y = [207, -101, -244, -252, 383, 142, -258, -101, -309, 115, -164, -46, -396, -12, 217, 297, -164, -225, -130, -184, 358, -133, -522, -161, 131, 23, -99, -368, -460, -350, 261, 653, -281, -626, -162, 193, 301, 130, 80, -574, 289, 295, -70, 46, 125, 162, 322, 260, 130, -179, 21, 386, 203, 143, 271, -92, -167, 134, 39, -141, -307, 553, 29, -31, -61, -2, -179, 131, 38, -35, -473, 132, 319, -207, -33, -17, -238, -128, 324, 388, 32, -193, -234, -323, 577, 27, -394, -405, 39, 406, -56, 163, -137, -187, 156, 399, -3, -515, 121, 382, 90, 276, -102, -396, 24, 333, 203, -396, 43, 94, 38, 249, -198, -413, 13, 142, -4, -256, 58, -182, 121, 130, 211, -413, -110, 162, -24, -359, -319, -49, -156, -75, 209, -88, -531, -151, 209, 165, -102, -6, -223, 6, 542, 72, -61, -154, 19, -214, 123, 390, 213, -331, 7, 91, -34, -55, -145, -300, -61, 775, 123, -221, -427, -172, -5, 16, -6, -397, -187, 86, -43, -145, 1, -258, -16]
5354a6L89l34o17N57L67k50l88R0J75J78n6J24o26K77O84n20K88m77j16J38K69
5375A36J86n12R0J71J65p1n5j46k14M96J53l24j37j43O2K93o5n6l65K59p6J46
5397gJ7Q2j27j00J02J55j88P2j92J99K09M1k19k83K88K66k29j51k27J34j0N77
5419D09n0p50M51J34j43l66K22J17r0L86l20o6j99L55J16j0k36q4l25L94N32n59
5441h2j20R2J33lj18o5j26L71J75l53R6J1j1r3J14K6j83K15m69N35n18K70L05
5464B02k26L68j08Ml62L71l36M3p4J69n31M54J43l01J31L14l80j32O95j84n89
5485c29K98N2K64o2l98K50j9J81J21k70j52J64M8o6J77n54J26L44K82m86l15M22
5507G8J88o4j54j53n3j21L93j2l36O11J4m31N9k72L20J7N22p94M9J96j4o5L14
$$ y = [-16, 373, 39, -578, -21, 346, 96, -292, -202, -27, 151, 95, 219, -407, -130, 554, 34, 322, -155, -271, -133, 136, 322, -190, -100, 71, 236, 165, 110, -36, -250, 246, 399, 75, -62, -205, -143, 150, 85, 29, -336, -77, -153, -7, 10, 92, -35, -135, -33, 122, -66, 6, -186, 13, 222, 263, 44, -239, 49, 315, 86, -65, -292, -158, -168, 409, 359, -391, 60, 194, 51, -315, -93, 24, -66, 320, 0, -66, -265, 90, 206, 196, -40, -124, -449, -55, 477, -82, -202, -110, 23, 20, -98, -163, -289, 82, 257, -96, 0, 11, 0, -93, 21, 47, -136, 79, -390, 145, -373, -103, 202, -24, 344, 236, 240, -122, 249, -87, -44, -118, 51, -480, -26, 117, -184, -53, 261, -119, -251, 444, 260, -329, -31, 21, 285, 223, -175, 75, 56, 237, 358, 88, -64, 100, 148, 82, 259, -295, -169, 175, 457, -29, -344, 78, 266, 202, 48, -105, -158, -279, 114, 102, -234, 377, 391, -40, 19, -253, 67, 84, 606, -188, -139, 57, 43, -22, 292]
5530B92k9o64N85J9jR9j09j27j6P9j30j18L9J80j22j36J53j05p8J74O6j87q9K06
5554a9N5m2J49j53p4J02M24n51J61o0J23l67J76N32n52j15K88Kn3j44J61J06n20
5577c71L04J38k99J20N0K1J69j83j37K41R6k15qj6j29j43O16m05j68n8N79J17
5599C19l05J19m8k82M7K97k09l40L09J46j45J40k3o4K14j24q6n5L26r2k83K04
5621F5m3k07J99N1pm83N59J72l95J24k34K59Q0l6Q2j9m0K46j09m30K91r1J01j83
5645d8Q7ll9O2l18J89J96m9Q3l14K34k94J83K31m13J41L48k25j96J42J2k06J49
5668d8K04k17j54K13j04J57k24J09j64J21J98J00l03j12K44j25J2K87n46k7O42
5689B63j91n61O05Lj33j22R0j2j93R8Q0k46L50l9Q2l49L63k04J34J04m35J79J90
$$ y = [292, 263, -401, 184, 203, 202, 301, 192, 65, 49, 128, -2, -120, -81, 99, -23, -159, -6, -111, -189, -15, 51, -136, -225, -19, 36, -6, 143, -10, -84, 18, 442, -109, 52, -8, 115, -252, -76, 456, -96, -211, 77, 79, 26, -118, 43, 149, -371, -67, 71, -228, -108, -58, -37, 132, -51, -188, 53, 149, -66, -74, -90, -219, -362, 254, -151, -319, -377, 202, 319, 14, 133, 85, -197, -150, 147, -62, -402, -93, 53, -92, 48, 25, -39, 175, 51, -35, -90, 236, 144, -139, 65, 22, -185, 14, 65, 58, -425, 134, 306, -89, 35, -199, 60, 140, 104, 186, 167, 127, 373, 264, -166, 125, 34, 135, -48, 39, 36, -3, 59, -259, -70, 126, 77, 160, -154, 80, -214, -31, 200, -213, -72, 276, 51, -145, -3, 9, -197, -48, 156, -61, -215, -2, -106, 51, -173, -64, -228, -107, 91, 191, -112, -224, 20, -105, -93, 194, -352, -379, 263, 72, -489, 116, 119, -14, -136, -46, -58, -251, -153, -73, -319, 31, -8, 74, -275, 88, -116, 18, 122, -313, -134, 56]
5712E6j33K9P6p2Q1l54L90L95o51M41J62m74l37M92O3k14L11j26j35L3L01k03
5734A31j67L19m04J23J47k56k98M24M39m82k12N16k44j75l7J15k05K05j5P2J91
5755A87m12N1q9J36K40K1k26M24n23j50L10j36ok6L17j88j80K37j87j45K05L96
5777B56o35M74R7k13L6J55k3j17K03l00K78k6j11m34K87K30l3l16q3M95l79nM22
5800B58q2k64L28K03o30L81j25j58J38K97M6k87j19N9jK06N9m05L4L82j09l64
5822a53M44k76k25K91L72n92n7k0K58j26J17J88k48J00K69k48m25L75J1j57o7
5843a69K36m68K01J73j2j91J80j49j33J16J30k52J87K28J72r02O81Q2k61M1L97
5864B87j71m74P18j15n04K20K21l85J99K06l12M3J00J1oJ20j38k75L00J01l04
$$ y = [56, -77, -48, 28, -44, 37, -317, 73, 468, -183, 258, 420, -54, -391, 101, 164, -50, 261, 135, 0, 33, 334, 131, -36, 283, -121, 2, 149, -107, -405, 19, 458, -24, -236, 280, 36, -139, -176, -61, -266, -61, -76, -4, 187, -225, -174, -263, -127, 113, 134, -92, 332, -191, -341, -31, -167, -173, -199, 118, -70, -250, -13, -200, -345, -140, 256, -379, 95, 192, -21, 15, 170, 147, 30, 233, -67, 211, 185, 74, -360, -73, 157, 124, -192, -275, 220, -159, -164, 258, 176, -88, 240, 443, -187, 194, 69, -89, 49, 346, 392, 105, -14, 45, 44, 250, 309, -96, -62, 320, 211, -153, 291, 15, -210, 81, 453, -139, -196, -216, 42, -84, 33, 221, -27, 73, 342, 94, -331, 44, 55, -102, -169, 67, -401, -200, -27, -39, -230, -50, -199, -332, -216, -86, -338, -151, 77, 249, -653, 28, 110, -151, -110, 287, 116, -358, 360, 245, -259, -39, 182, -203, -4, 202, -110, -67, 33, 44, 38, 158, 20, -255, 45, 146, -158]
5885a58k0K99%j78p5J82j81L3j84N65l75M03Qj77o3J77m23l16M00J75j85rM85
5908C83l88j89O02k48j77J0J34l98M77j90O4k02J66k4k08L36J52k82j79L99L8
5929B76K2o1j33k27P0M03j64m64L58n0j86K94j4l2j20J59k14J56l2J71n21J97
5951a12P9R1k99K27j35LL87m50R3R9J10l6j73M57m42q6J20J55m12K26K19m0n07
5974d26M35M23m57K7J20l03Q0j6R4j30J07K07l08K85R0l34l05J94J82K60n30L80
5996G5m78K59O6L07L8k81j30K68J46K56p31J03K53k96P7j18J0j72L81r7Q2q5Q5
6019A8O4n4L1J12k69N01k82k08n5L82o9k77K6L58n06L64J59k9l65J6J74j12l7
6042e8m2J22j16L56m6k65Q2m5j84K8K67k41L2j35R6q0O48k05l71n8M58l49R2K84
$$ y = [-158, -178, 121, 121, -57, -132, 50, -131, -98, -282, 283, -92, 311, 319, 142, 79, 256, -167, -483, -83, 92, -93, -102, 383, -5, -194, 408, 160, -17, -7, 127, -271, 206, 16, 80, -122, 44, 20, -188, 148, 300, 18, -161, 238, 276, 298, 237, 104, -123, -53, 350, 186, -278, 80, 30, -156, 138, 124, 92, -28, 131, -83, 73, 41, 212, -309, -112, -33, 58, -241, -14, -149, -146, 241, -209, -116, -17, 93, 57, -116, 341, -101, -187, -67, 88, -324, -98, 121, 81, -426, 9, 432, -25, 2, 122, -181, -101, -117, -23, -153, -46, 161, -147, 138, 228, -106, -411, -217, -35, 225, -305, 75, -403, -144, -78, 229, 267, -14, -144, 124, 270, 526, -205, -102, 151, -145, -68, -186, -176, -348, 33, -64, 18, -67, 18, 82, 28, 59, 171, -98, 403, 121, -87, -142, 240, 171, -106, -80, 278, -228, 136, 295, 266, -99, -83, 91, -21, -58, -100, 22, -94, 262, 216, -49, 33, -12, -196, -168, 99, -142, -110, -245, -149, -229, 419, 214, -157, -215, 243, -106, -14, 270]
6066B70p21M32L36P1l18m60K97r0R6J20m90M10k1L49l57k50L46M5l60L41k65o4
6088b83P3K62K5j43j6K43j67o9j52n3k4M25n5m23J66Q8K33J62k80k39j66N67L81
6111E55o31J41n64K77K11N63m11l17J65k21M8M01l1n59L77K7k34N48m13l15K89
6132i4J20J53k08J5l5k54K56L71k38j78J67m1R0j32L92l3n08R5J60k97N35n5k97
6155a6Q9j53j2M17k30k04K95m07L93Q4k63j07j30J06M84k05m00j5L83J2j78j24
6177a81J59l35M0N48j02k63R1K04p4K67k6m58j18J61J48L0L6m88J73M19O6p32
6199d35M42K73n77K16q8p5K03K46l72P4j93L44R8j36l49L25j39M01K08l74k51
6220a59j63K17k1M54k81k12L9N11j17k48R3m46q8R31k76l81o6K63K15k49J63k69
$$ y = [270, -451, -19, 317, 388, 70, -390, -93, -183, -87, 33, -457, -47, -68, 281, -76, -326, 20, 65, -295, 46, -219, -283, -210, 52, 77, -66, -82, 161, -6, -75, -227, -280, -304, 121, 66, -357, -191, -103, 130, 292, 12, -227, -393, 174, 555, -76, 65, -499, -222, -11, 552, 141, -176, -11, -232, -184, 217, 186, -373, 4, 31, -203, 345, -68, -383, -94, 26, 179, -29, -14, -49, -303, -47, 324, 86, -92, 75, 34, 124, -8, 384, 351, -157, -62, 98, -199, 336, 281, -16, 73, -80, -92, 325, 95, -109, 186, -221, 172, 256, -7, -114, -244, -138, 346, 141, -259, -274, 109, 121, -57, -181, -22, -357, -317, 231, 129, -134, -43, 161, 87, 354, 328, -130, -248, -87, 61, 91, 127, -361, -188, 231, 297, -435, 7, 280, -297, -81, -169, -244, -41, 205, -167, -93, -286, 58, 156, 20, -329, -4, -143, 258, 466, 92, -159, -322, -105, -126, 328, 47, -165, -126, 385, 268, 20, 113, -333, -421, 510, 234, -147, -213, 50, 265, 16, 179, -90]
6242i0J84N2Q5j02l18L9J04j76M03l31j43K22J07j50K1J99k26k7k78N84k07J00
6264E2O3k71j18L68k31J67L6j1k42J38K82q9m9j23J68l21K87J87k92j35M61k80
6286D7J33J98l90pn1L99K2n67j0K31j39M18L9j65m03K47k7J20K01k82k13K21L8
6309F0J50r0O8j65J24J07K46m79J58k30o1j35L81O0l50Q6J30l56L18K21m35j4
6331b06K02j42J60P0k43M8k12M80j78j78L17n09K1O03J06l44l48L35n5K8L12m8
6353B19l98J52Q7R7j15L1K4l76L83Jk3j04lj66O02m40P2j33L68k09p2N2j29j53
6377b33L23JO9P1k39K47l17K03o3k49K87K21m82L4jJ87J32k76K54j70j41J24M35
6400D17o32M6J52j44J72Q3j41j66M04p0j26j82K74m8j5M37r1k20o9k6J60l42J70
$$ y = [-90, 94, 146, 231, 129, -189, -150, -46, -222, 181, -150, -293, -71, 36, -114, -93, 106, -120, -147, -425, 159, -48, 52, 115, -156, -274, 94, -137, 30, 66, 55, -187, -49, 233, 144, 95, -28, 140, -181, 106, 293, 1, -134, 327, 47, 180, 378, -12, -19, -70, 329, 351, -216, -226, 5, -134, 284, 323, 158, -245, 2, -25, 95, 296, 14, -199, 22, 60, 210, 120, 188, 23, 147, 254, 500, 21, 179, -51, -112, -247, 134, 194, -156, -70, 60, -296, 22, 243, -192, -206, -4, -146, 14, 84, -159, -111, -323, 157, -21, -199, 118, -391, -370, 233, 339, -5, -353, -18, -73, -45, 267, 219, -179, -27, 60, 157, 42, 73, 97, -279, 104, 105, 82, -22, -25, -191, 411, -29, 43, -90, 278, 69, -3, 49, -80, -233, 90, 91, 160, 231, -8, 239, -78, 125, 62, -187, 100, 321, -161, -127, -128, 59, 191, -85, 169, -1, -142, -18, 417, -215, -169, -17, -161, 11, 94, -47, -213, 191, 121, -5, -187, 87, 39, 24, 461, 370, 150, 81, 55, 215, -127, 43]
6423D3j4k34M15N5k41k0J41j25k11J59l45L1N82l51K32m6k29j45L05l38J35K00
6445aj84K47L6l13J62J10n0J10j51l86M22k0O0N3K2n45N45K62p6p04J25L51r2
6468a7n0J54j10m41K75M33o8l09J66j43K07J26k10j29j84L43R1R6j71l38O43l57
6490GK81l37m9J09j02l9J06j3l14L92L18l49k26L44Lk27K98p0j93J34l4l1k8K50
6514B30m67K34K80l37j16k11M67K24j91K0jO0L3k9l45l14K57qM23O7n21K09K28
6537A92j31R3j53R6K8k4J3j35O4q7k6p6n5K92k29K87p9L41m89r2N49l37j25j92
6561b75J40J30n5n9M1J38j56L44j51o4l8m77N08j30j18J91j80K80K0K1k8n33L06
6584a45K52j88K45l62L75k36j21M16l73K6K16j40k38K95j66K25l39J60j55l8M52
$$ y = [43, 29, -205, 210, 265, 24, 4, 145, 20, -191, -32, -377, -346, 236, -115, 117, 71, -158, -303, 2, -336, -201, -1, -185, 62, 98, -215, -53, 57, 7, 117, -34, -420, 2, -18, 42, 95, 117, -428, 117, 379, 303, -401, -276, 75, -17, -67, 87, -23, -464, -189, 244, 176, -133, 33, -110, 97, 223, 13, -116, -300, 43, 134, 230, 59, -279, 364, 7, 288, -49, -98, 11, -91, -130, -24, -37, -351, 41, 359, 10, -216, 128, 131, -96, 202, 132, -61, 73, 39, 8, -20, 230, -237, -3, 277, -60, -176, -387, 80, 304, 113, 133, 132, 192, 225, 196, -149, -463, -206, -214, 209, 276, -245, -36, 192, 61, 154, 1, 97, 125, 101, 114, -21, 43, -44, -70, -146, -201, 91, -138, 149, 70, 411, -78, -170, 379, 42, -83, -275, -135, -5, -60, -119, -78, 60, -96, 248, 97, 33, -5, -482, 26, -104, -222, -31, -211, 69, 89, 110, 82, -451, -145, 107, -81, 164, -198, 177, -59, -180, 236, -137, -111, 105, -35, -273, 22, -144, 81, -258, -98, -253, -291, 161]
6605A61k4j75R0l6K9R2k73M0J1k30K07M7M24j86m03J30J57R1l7k08k62q7N09J6
6629H3l05J22K77r8q6l3j76K38n3J35lK20m04P5Q0J30l74J22O1j86nO0n6J56j74
6654a94N03k49k05J68m1o7J52J14q0j27R4n9j49n4J18J57n7N6P6k78N4K88j60
6677F0o8J44k9j48L38j14j20j22j19J45j37N50l29m5K97j65j66N4n7Kl8J21rj98
6701a53K44m5J7l31L61O6j50J78o6l57J17K21k54M52j81k51P9j01j67J88J11N13
6723D91n66J6L25j98j80r0J62j33N27k52l07J91k50M14j03l4O3l25J47K24l0j31
6745c9l03J18J99jK53j69l66K45J94k20l03O23m61K6K57m1K4L71n45j76M25J3
6767A24j57k2q7L4p1N40k06l52J96Rn1l1M89m50J80J1M0m33L22J15j84j4K89l87
$$ y = [161, 137, -38, 52, 16, 45, 137, -136, -96, -85, -315, -108, -61, 363, 177, -226, -96, 61, 152, 115, -93, -355, -442, 67, 83, -222, -100, 177, 79, -7, -40, -216, 22, -31, 104, 101, 321, -83, -8, 72, 202, -172, -50, 11, -175, -180, -120, -176, -20, -194, 309, 60, -145, 23, -18, -85, 67, 181, 101, -26, 68, 9, -140, -194, -76, 81, 24, 80, 156, -122, -68, 220, 60, -8, 136, 107, -41, 297, 183, 63, -59, -178, -33, -170, 380, 51, 6, 303, 138, -28, 26, -31, -29, -67, 54, 45, -153, 91, 46, 63, -268, 93, 159, 9, 187, 121, -236, -119, 102, -152, 300, 119, -132, -53, -154, -321, -133, -22, 491, -75, -59, 266, 68, -112, -202, -40, -173, 354, 102, -205, -14, -264, 150, 47, 13, 76, -249, -102, 122, 92, -39, -342, -224, -25, -26, 227, 58, -308, -63, 131, -89, -392, 231, -230, -204, 53, 12, 36, 407, -138, -314, 111, 124, -33, -55, -142, -108, -179, 361, 155, -197, -1, 8, -43, -74, 415, -35, 145, 156, 196, -237, 85, 200, 16, 2, 291, -96]
6791i6K92j23K2P8k02R8N5L7r6n7M8KK07k44k08M24m25N8K93j81J04K09j19j53
6815B3j56M51l26k78P17l67k30J34n9K14J76k89k28J20J15Lj49m1K69o1j44J59
6837E3l03K74J21l26J90J53l6J12k89N8N5n20L68j34J74k82M57j84n0K7L8p9J46
6860B3L97l65k73J07J47k3k54M63m24kN06l56k15M83l17p8L55l3l72K41L51r3
6882B68o18N52n7r1P1r4j28J23K55m15J83RL8j58P9K12l90q7L28K4J84j98j58
6905f8P6k7j64J05n6J17k04K51N6K85n74K11J71k43J97k11nL71k49l6lk96j70
6928d66M84j68K79k58p9k9L54%k86L14m92L28n5J92j58k37J36O5L1J07n5j84K24
6951D7k1m52O7N59l86KK87J60l37L24l10N0R5p2l00JK34K56n1j70M11l88q3J56
$$ y = [-96, 196, 73, 95, 173, -29, 69, 124, 161, 65, 8, 56, 58, 265, 21, -187, 237, -188, -130, 163, -18, 86, 295, 176, 23, -133, 318, -8, -286, 431, 64, -166, -32, -91, 123, 299, 10, -218, -98, 17, 20, -129, -170, 99, 38, -106, 53, -250, 24, 145, -181, 9, 162, 126, 238, -51, 7, 62, -458, -90, -224, -50, -332, 125, -59, -109, -82, -44, -123, 23, 420, 55, -218, -111, 36, 13, -241, 222, -202, -204, 302, -54, -269, 214, -103, -181, 174, 141, -231, 10, 361, 268, -350, 202, 145, 54, 125, 31, -97, 26, 281, -134, 49, 58, 96, -62, 17, 229, -161, -248, 80, 104, 288, 90, -68, 8, -19, -183, -78, -134, -17, -221, 30, 86, 371, -203, 8, 179, -64, 133, -78, -83, 288, 39, 3, 0, -296, -466, 18, -150, 129, -129, -208, -237, 117, 117, -169, 145, -347, -19, -74, 118, -40, -277, -141, -76, -45, 62, 7, -177, 47, 26, -426, -359, 200, -186, -184, 103, 263, -74, 250, -60, -10, 85, 13, -287, -286, -52, 204, 153, -17, 394, 6, -77, 79]
6975G9R4l6o5Mk4j72K20j47JJ36j08K48k96L84l54k29L99j80K7m6J45k37J3M00
6999B56K0l44j08K11k18K75l90j13M08J2j23J9K6P7j25O1l1O4k61M71k13J01l50
7022b75K06K1o9J42L5m68M37K02q5r0k03J34M9k6k21O15r63M03j20K79l7k15K24
7045b5P7j00l30L51J16j27j33M08m21K8PK61j57J25K08n02R4L24j65l81L44L62
7067C64m02J0L00k45j28K17J97m50K84k65J25k4L1P1k67N0J72J27J4l64K18P1
7089A06k26J8o0J04j48K49K23m13j07J19K42K21n52M57j9k69j46M02K1j04o8r3
7111d3J28l00J97j30j7K43k38J75J05l0j37R9M2J56j50k18L43l96J71J8k49Q6
7133a45J72o2q1K87l20n6L09p8J9l90N91j58j78L8P7m68O45k63J31J00m79M53
$$ y = [79, 173, 137, 72, 76, 52, -120, 100, -47, -46, 90, -18, 230, -66, 318, -36, -265, 134, -46, -19, -65, 80, -157, -144, 256, 276, -68, -176, 35, -183, 92, -298, -411, -3, 9, -114, -95, -69, 8, -117, -56, -87, -23, -284, 187, -26, 75, -275, -69, -48, -117, 25, 60, -408, 29, 231, 146, 56, -147, -13, 36, 10, -211, 404, -559, -156, -276, 3, -34, -249, -25, 52, -48, -378, -27, 89, -38, -171, 237, -184, -156, -149, 112, -45, 80, 288, -214, -120, 204, 39, -342, 2, 364, -38, -28, 272, 27, -101, 116, 313, -137, 147, -118, 7, -17, 14, 85, -182, -132, 40, 167, 181, -183, 35, 106, -120, -102, -162, -58, -206, 43, 266, -147, -254, -135, 107, 328, -224, 233, 214, -55, -201, 201, 222, 118, 50, -43, 85, -215, -18, -148, -165, 78, -160, 15, 120, 90, -47, 52, 94, 250, 100, -118, 225, -171, 0, 18, -231, -145, 27, -35, -116, 171, -149, -205, 104, 26, 45, -345, 246, 88, -90, -52, 25, -443, 202, -61, 70, 170, -309, 144]
7155A44m12L59j11L1J03K22j59l61K24j25J9k7J97j84J4J40j4J06J31k38m2J18
7177A35P8m59J72J69J19j94k4j14J84L3J7k42p9K74j0N7j29L10l58k02M35k03
7199c1J63J3o8j91N8K35k53O3J03j15K46k12K30k41P3l0J5k61P2K08k27M76m9
7222B77l91k5L41l64L6n4J89j14J75r2k79M2K26L7q3lj89M00j81oj7P1m9K05m01
7247b49N12l79J10O9M1j88J29R4n3o2K45r3j96L0K42O3l31QJ60j76j38J34qq6
7271a22J04J32nj31M8l39L46J60k87L9K55k87M10j46k08l9N3L33j80l06J00j6
7293h6K05j87j3r0K57k79j49L35k37m1K15m3J12Q7N9m74J33R5J78j12j51R4K34
7316A42k20N9j7j74K67J23m67R0J92M2m9n9K36n1J14o4rk13J06M43j63k00j35
$$ y = [144, -268, 91, -20, 11, 114, 336, 177, -184, 40, -85, -66, -93, 104, -80, -66, 74, 60, 166, 297, 59, 17, 135, 213, -246, -74, 95, 214, 20, -4, -118, 66, 99, 116, -126, -205, 69, 59, 116, -13, 297, -61, -263, 172, -31, 132, 145, 77, -114, -56, 179, -74, -11, 92, -23, 223, 11, 241, 0, 73, 43, 58, -203, -131, 77, -150, 326, 277, -114, -139, 202, -162, -126, -180, 9, -105, 70, -22, -301, -259, -33, 4, -79, -82, -271, 129, -52, -58, -75, -4, -53, 152, -249, 263, -116, -6, 63, 104, -84, 45, 139, 86, 24, 269, 176, -20, 10, 252, 315, -16, -8, 152, -24, -162, -28, -36, -122, -18, 114, 109, -22, 26, -313, 33, 193, -94, -55, 200, -87, 323, 177, -31, -70, -17, 316, 136, -170, -70, -86, 119, -68, -81, -171, 86, -193, -342, -7, -244, -285, -70, -113, -1, 86, 145, -329, -196, -101, 77, -35, -186, -92, 142, -78, -19, -36, -210, 57, 180, -287, -197, -5, 37, -12, -71, 165, 114, 228, 164, 155, -58, 48, 491, 328, 128, -7]
7339gO5j58J90K57m37K66K54k37j7Q1l94J38j4L86l84n7J67j35k0K1L00n05K09
7362c1J82L4k61K82l33p1J34k6j39J03r6K11j08K09j01n3Q1L44l63k8L8l0J08
7385H6N3j38m5N4J60k79p6P5%Q2r9J72k01RM08l30k06J15J93QK80O9l37p4J41
7410A20j66K8n4q6p2M36l19KJ43O7k30J75J09l9j77k6J1J09k22K69J11k67J95
7433A17r0Qk5J38o7r2J21k53n8j46M83k53K54n43J04L71K31n48K28m8K37k04K0
7456a5P5l03L55KJ97m94M4j59R9J71M33m43J77j47J46N7j6k48K83k29j8o3J23
7479B7K82l12J37j35k93L74k56L69k21M9k3Q2j75J04O9k0j94n1M00l21K63K0n4
7502A21k39L49k06k75j20N22k23O8J96l44J01J45m8j84j8J03J24k13J01P3m00
$$ y = [-7, 58, -100, 90, 347, -90, 176, 430, 193, 176, 257, -137, 1, -13, 373, -11, -68, 99, -36, -56, -35, 265, -240, -31, 151, 185, -76, 206, -127, -198, -64, -90, -229, -126, -222, -11, -119, 90, -11, -64, 17, 361, -2, -30, 8, -22, 86, 139, 1, -44, 10, 170, -109, -185, -110, -110, -28, -127, 45, -156, -147, 261, -69, -275, -160, 33, 41, 321, 390, 53, -21, 120, -46, -18, -72, -158, -230, 206, -113, -111, 32, 99, -131, 44, 153, 114, -63, -89, -78, 31, -191, 78, 189, -78, 117, 27, 35, 10, 148, 81, -11, 110, -143, -201, -347, 136, -117, 137, -406, -302, 69, 300, -248, -20, -68, 169, -35, -15, 60, -243, 112, 114, 311, -183, -139, -298, -199, -28, 405, -38, 139, -8, 138, 195, 179, -69, 214, -15, -33, -96, 27, 309, -3, 134, -1, -294, 80, -176, 193, -28, 21, -2, 80, -95, 9, 78, 58, -136, -187, 213, -108, 155, 175, 121, -118, 231, 25, -250, -370, 152, -71, -3, 193, -151, -50, 95, 47, -137, -155, -52, 72, -141, -40, 33, -367]
7523c67J75N00j99o3J48J2k32J61l23M25j00P5k67k6N4q0K66J82j39j65r5J98
7545A40n4M7q8P3j79M12n17K21k39K09O5p7m1k43K7N09l74q6K01j20J51k01L30
7568A66l39K42k58K51L64k57m51M35j89J55km17L81j26K16l63K75j21k08N13j94
7589G3j66K06Kk91J64K71l03j82J72k1L86n05J7K39l6M3l50L06N9o2j50L00l09
7612a37K66R3k10l0l1rJ93L2k98M52l94m79O76k46Q5RM9N0k18J6Q2q5J69q7j8
7637g0J22oj97Mp4l6L48k78K69l24K2J81K5q3K1j32q1K46K25l05k5K09k34K13
7661D0O5k2N2k43J62j86K86j79J30k22q1M82j89K13m13M9j2J33K10k30n8L46j81
7684A52j74N8m9j6K21%p6n8n1j63P5K31k41j47K83r9K81k55J46r3l5Q9p2K5j82
$$ y = [-367, -192, 308, 109, 46, 194, 206, -26, 135, -188, 237, 137, 212, -55, -81, -27, -107, 159, 341, 202, 37, -58, 140, 86, 133, 45, 118, -61, 351, -166, 55, -184, 25, 90, 13, -28, -271, -244, 265, -109, -195, 6, -114, 37, -164, 166, -173, 69, -189, 62, 426, 169, -282, 153, -36, 119, 117, -300, 81, -45, 171, -192, 83, -38, -246, 267, 73, -93, 113, 115, -176, -12, 259, -44, -226, -54, -75, 311, -194, -177, 62, 26, 69, -281, 25, 84, 22, -128, 172, -137, 129, 222, 12, -18, -49, -58, 135, 167, -131, 321, -73, -552, 124, -122, -37, -28, 21, 71, -147, -131, -49, -134, 35, -52, -70, 52, 46, -151, -147, -221, -257, 91, -187, 82, -242, -220, -39, -14, -97, -76, -208, -289, -43, 182, -123, -148, 61, -173, 40, 105, 83, 135, -108, 54, -132, 154, -25, 105, -117, -198, 284, 95, 308, -105, -56, -68, 65, 275, 45, -13, 333, 152, -22, 36, -13, -29, 192, 192, 116, 58, 7, -156, -81, 150, -91, -238, 45, -54, 227, -28, 118, 25, -10, 79, 7, 32, -150]
7709a50M34j7k40J19k81Q1J4J06j07j12k19L67j56pJ08L00k41m5m4J60j92j92
7731c14L85k86R7j52L64j17Lm6L67j86q9O0N4m08J41K31j96R3JP2o6m3Q3k11K84
7756A21j27JJ38OJ37l56L17P4l24j0K89j02j46J9K6L9m88M45k8J32l11k59K13
7779a94K97m5l91J76JK35k88K38M2l05K69M9o0O7J29j68q7j61L26k22L3R6j26
7802h9n4L03j77m8J21j91J95k77q2N2K39k49K33j17J48K12k25K00mn97L42J8J21
7825G4m9j98N3j87J50L34k35K36j20o2r4j3L26q9q0n0j07R2r3k06L91q5O6J36
7849A90j3j35P4N1r9J19j55l0N0k6j88J02K63j32O0M5o5n6j72K19k01j00J60R7
7873E8o0j3M7K19L8n85J6P06n03l79K98J00K39m40N71m51M9J4K37l19n2K69j13
$$ y = [-150, 284, 267, 27, 146, -135, -54, -40, 66, -41, -153, -372, -5, -161, -168, -60, 240, -1, -46, -90, 70, -122, -314, 71, -215, -118, -270, 94, -23, -20, -66, 301, 115, 26, 86, 140, -268, -127, 104, -92, 1, 2, 74, 8, -35, 48, -163, 121, -6, -5, 133, 139, 276, -80, 237, 311, -13, -23, 266, 164, 18, 37, 63, 102, -386, 59, 31, 163, -148, -407, -194, 103, 58, -333, -157, -156, 79, -209, 29, 71, -234, 35, 84, 24, 91, 220, 52, -35, -196, 130, -92, -59, 37, -89, -143, 160, -17, -65, 56, -135, 60, -217, -299, -247, -8, -257, -24, -141, 7, 219, -6, 194, 190, -407, -65, -47, 74, 25, -173, -120, -307, -157, 177, -58, 178, 58, -4, -98, -111, 215, 126, 46, -4, -111, -19, -112, -318, 73, -12, 54, 190, 177, 42, 116, 167, 68, 187, 32, 2, 52, 26, -162, -60, 203, 71, 131, 176, 111, 55, -117, 102, -99, -199, -39, 58, -2, -15, 32, 251, 289, -296, -280, 426, -77, -456, -158, -58, 181, -259, 312, -139, -90, -76, 161, -158, -210, 59, -54]
7896e4J18j23j5Nn5J82k42K62R5m63K86rK35j22N3k89n4J76L17m68J02P4l0J3
7920fR7k24J03j75K38j12k8J28j64J12Qm2j07L11k54r1L47j20r6k60K25R4j57
7943a73J03N5j35J77j6J77K16m86J79l56J20j67J45K55j97L69l70J05m3Q9n4K03
7965A96L7m43k1O59k24m02K04K93m08N3K44k63o5L13j2J0j36Qk29L61n0j06j4
7988EJ3k9K59J13m20k85L91M39m05l04L80j7o72M10p6q0L86q7l4P5j25j8J87q1
8012B5J37l5k57J36J60j85j61K55J0j29J61K1j96J80k19j41K96l40N8j00L38o7
8034e3k71J44J3K39J5j28J31j93R6j23j06K77k18q3L03J40k80K7K17k20N3J05
8056H5p6M4q9J62o1OJ1k38J36K09j72O4N2k2J18j97J44l59R9P9L9j75K13K51k71
$$ y = [-54, 64, -59, -74, -69, -124, 58, -184, 78, 173, -290, -4, -13, 222, 100, 153, -136, -190, -14, 303, -165, -63, 11, -19, -6, 91, -133, -30, -205, 33, -79, -107, 21, -143, -31, -23, -65, -172, 139, -115, -206, 141, 21, -75, -335, -110, -16, -173, -70, -15, -150, 27, 11, 188, 404, -82, 97, -259, -139, -306, -161, 94, -103, 266, -104, 1, -42, 47, -7, 196, 233, -210, -231, 428, 204, -198, 6, 299, -109, -56, 188, -75, -140, 173, 161, 171, 35, 43, -186, 175, 125, 19, 5, 18, -11, 248, 361, -59, -344, 47, 486, 81, -223, 157, 140, -532, -122, -198, -278, 108, 21, -13, 62, -63, -81, 106, 25, 162, 127, -130, 6, 166, -19, -180, 75, 85, -44, 117, 138, -58, 122, -97, -238, 58, -282, -224, -324, 14, -53, -324, -180, -167, 72, 87, -41, 90, -103, -7, -130, -236, 41, -177, -260, 43, 183, -97, -70, 147, -73, -20, 85, 9, 53, -36, 126, 65, 71, 82, -156, -20, 189, 17, 81, 133, 111, 229, 32, 176, -183, -84, -5, 34, -141, 72, 323, 52]
8081E2j16j98L87n64M25L2l8j85J8J91%N6j85L90l36RN6M8N3p9j02R8%o6j1K8
8107c7j24R9j2K01k61L9NK64j36K7o0k10K16R3l07J53J32M0J28k55K30m46J48
8130g3LJ57m53M43q4M6J64j39l1J99k78J57p3l2J60k51M64k89j43Q5j7R3k23j3
8154a28J14J75k3n2Q7J3k5m09J98L5k87R3L91n52M26l7J64j34k02M13M7m74L81
8177B14j40j14P8nMj50L45J91r02M82n1q7k7Q7
$$ y = [52, -64, -262, 125, -439, -14, 18, -20, -205, -187, 4, 4, 60, -125, 265, -71, -62, -6, 42, 95, 16, -86, 12, 12, -54, -65, -37, -161, -62, -74, 127, -134, -95, -90, 174, 38, 65, 5, -205, 11, 104, -203, -50, 82, 122, 250, -5, 225, -221, -73, -70, 87, -366, 77, -7, 39, 203, 64, 33, 232, -46, 111, 38, 6, 166, -85, 379, 90, -53, 32, 15, 108, -115, -128, -14, 161, 138, 86, 173, 186, 161, -248, -50, -15, -302, -209, 182, -370, 56, 19, 183, 49, -153, 260, 307, -167, 214, 74, -40, 38, 33, 37, -113, 232, 423, -479, 3, -48, -135, -162, -75]
8191g5
$$ Imaginary data points
##PAGE= N=2
##DATA TABLE= (X++(I..I)), XYDATA
0@%%%qJ6j6K4m0M8n6P2q8J12j42J74k08K48k99L54m17M91n72O62p65Q79j007J154
27F16j312J485j682J897k130K391k681K991l332L714m126M575n077N626o225O891
43C621p633Q455r374J0414j1593J2939j4499J6335j8527K1202k4548K8878l4734
56a9064M3136n6302Q0047j36192M99673M74944r68133l83989L97462O08641q8107
67D52116m02449j64811K91198K11830j23135l03913o3060J36959J55684L5946
77B26365k4805j34329j86737r0131J78282K62124q541l39144j74182K71156K76184
88B56242k36186m04278Q2114M80317J68226l75885l98544J03923M31889J67385
98B75203k94489k90048J19457K95040K8121k10469j06072R8170J02969o055j5512
$$ y = [0, 0, 0, 0, -8, 8, -8, 16, -24, 24, -32, 40, -48, 64, -78, 96, -112, 136, -163, 191, -226, 265, -307, 355, -410, 469, -538, 616, -696, 789, -893, 1004, -1126, 1265, -1416, 1575, -1757, 1957, -2169, 2406, -2671, 2955, -3270, 3621, -4012, 4443, -4931, 5483, -6110, 6829, -7670, 8665, -9862, 11340, -13208, 15670, -19064, 24072, -32230, 47817, -88375, 411298, 886242, -81891, -465880, -68418, 540223, 452116, 49667, -115144, 176054, 387884, 264749, -39164, -102224, 34735, 190419, 226365, 201560, 67231, -119506, -209637, -31355, 230769, 222228, -116916, -291098, -19942, 256242, 20056, -384222, -302108, 178209, 346435, -29450, -427994, -324071, 107818, 275203, -19286, -309334, -189877, 105163, 133284, -77185, -183257, -85087, 17882, 11827, -3685]
109c685K8118n0619j44030J1383K51413J28960k58250k95210J20952L73152J01022
120B63206k96667k96428P8548L36590J37359k36055k45094R7278K49130J4567
130A02434j99937q8262J30406J39913j7810r5514l1478J4449m781L8724J12984
141A01128K6616j37366q7326J19879J37704o8834j70578k429K12461J61165j44322
152A48098l05463m5286L04755K34122j51199k90896l3513K13922J30093j19292
162H5341j81795P394J63901Q3090q5015j23318m7873L1607Q2947P0165k2863r5902
174c2321o4843K0625P2725M8658l9922q2386J2700J03788J7606j15913o7369Q8252
186c8400J12230j4354r8742l5348P2742N9415n0270p2547L1102Q7093J8194n6062
$$ y = [-3685, 24433, -26186, -170216, -158833, 92580, 221540, -36710, -331920, -210968, 162184, 263206, -33461, -329889, -251341, 85249, 222608, -13447, -258541, -161263, 87867, 102434, -97503, -185765, -55359, 84554, 66744, -28770, -60248, -45799, -50580, -11856, 101128, 127744, -9622, -96948, 22931, 160635, 91801, -78777, -81206, 131255, 292420, 148098, -157365, -202651, 102104, 336226, 185027, -105869, -139382, 74540, 204633, 85341, -96454, -89060, 74841, 157931, 72916, -50402, -98275, -66668, 16279, 86444, 63581, -32321, -97164, -76539, -3814, 44844, 4922, -77464, -64764, 39024, 56630, -59283, -126652, -38400, 73830, 59476, -39266, -74614, -1872, 57543, 7273, -65274, -34172, 52921, 71115, 15053]
198A5053n1582o717L7271M7028N324l0389j6506q212j9267J3029N1056M387n9710
211a9235k7859M5781M6333k0087o3923l2948M6907P4065K902o6272m5526J2098
223d7764L7023L2861N431l0956k7057R418J8112K286j235p261p422K4959L2365
236D0760k7388n6054M956N1950J8343k2750j5331P372J1024j1920l3266k675N5571
249B0592M4752l2220o9147k9400L4502O1837K0639n0919m9002K8581N0466j3327
261A7354m7540j0844K6579L5620J8838k6109n3239j1416M3053L6319m192k1697
273B726j3018P431J3228j3303k3584J8307M5550N746l8540l2363N536L6291L0837
286D4844k2482n1604K899N6771K0605m2559l9759N474L6962L2988j2306n0395
$$ y = [15053, -36529, -43246, -5975, 41053, 46377, 15988, -518, -8730, -27997, -14968, 36088, 40475, -19235, -47094, -1313, 45020, 24933, -38990, -71938, -25031, 49034, 51936, -14336, -59862, -47764, -10741, 22120, 27551, -3405, -30462, -21044, -2932, -646, -1881, -9142, -16564, 8395, 40760, 13372, -42682, -37726, 14224, 32567, 9817, -5514, 1858, 12882, 962, -32304, -34979, 20592, 65344, 33124, -36023, -65423, -30921, 30916, 51555, 636, -48366, -19785, 30681, 17354, -30186, -41030, -14451, 21169, 40007, 13898, -39341, -50757, -7704, 28615, 24423, 2726, -10292, -2861, 10367, -2936, -26520, -8213, 37337, 43083, 4543, -27820, -22284, 14007, 44844, 22362, -29242, -26343, 30428, 51033, 8474, -31285, -25811, 11151, 44139, 31833, -18562]
298a8562j9695L8144L3947j2801l2059j6746J0353L1418J8534k0043k8944p410
310b3864M401J1898K0052L445j6233l502M984j5472j4075J9536K4153p10o629
323G984n253j3606r166N434P086J2828K3830M269k8820k8991o991J1899K7001
336G504K5974L27j5740j3530k5193k2435K5486N5653J7068l1219l3679j1286P813
349a3257J5225Q67o617J8989L0312j3627n2182l1403J3390M2069M1171K160m2845
362D252l6924J443J6426J0846P520R50j938O848o015l3318j8238K6763L5057Q281
376B1953j2296k3198j8234P738J7744o062q352K0722K2057j3219l2497j6471J3973
389b6142L4178J5219k3125k2160J1572J5059n925p718J360J590R597J4798n864
$$ y = [-18562, -38257, -113, 33834, 21033, -11026, -27772, -17419, 13999, 32533, 12490, -16454, -23864, -19463, -7565, 12487, 15932, -301, -3803, 1181, -14291, -28366, -8830, 15323, 14613, 7984, 2731, -10875, -20041, -14607, -7521, 5307, 29137, 33406, 4586, -24405, -31396, -19497, 7504, 33478, 33805, 18065, 4535, -20658, -43093, -17607, 38046, 55114, 23895, -9784, -21070, -13257, 1968, 2835, -3782, 15207, 45519, 31892, -20290, -51693, -38303, 3766, 44937, 47097, 4252, -32672, -31229, -14803, -3957, 3563, 4513, 2575, 9423, 3408, -29910, -48148, -21385, 13672, 21953, 9657, -13541, -31775, -24037, -6293, -12355, -20707, 15, 22072, 8853, -23644, -40115, -26142, 8036, 23255, 130, -22030, -10458, 4601, -1324, -9042, -7682, -6092, 3505, 18303, 12439]
402A2439j9390j645P821J247M755R967O16m751J019n305q015N840R887p21K021
417A5785N844l981o725m84p591n956J8473K2980p751k4065j1975K95Q526J2756
431A6131l08j0614M726P523j6889k1971K898J6040J0142L786q591j6961n698L595
445a6191k792Q87J4731P823q748j0894j1398q285J2066K3966L025j0640k566k628
459a1644q889L136J0887R18L071J3868J41j6214q726L957R665J2823P068q538
473A1523p400J419n312n723J1775J4986j943o565l989r448l348R978K763o189
487B527N928Q995j0233j4800r81M408O483R678k461j4826l474P061q19k708N740
502E18L757n11J753m445j0954J712J1858L067m62P74o377o655Q582O649j0584
$$ y = [12439, -6951, -8596, -775, 472, 5227, 15194, 15810, 11059, 12078, 6773, -1242, 4598, 14485, 13764, 15785, 21629, 17648, 10923, 10439, 2848, -3108, 15365, 38345, 30594, 6529, -5446, -5151, 3375, 16131, 15823, 5209, 9935, 17458, 569, -21402, -18504, -2464, 7678, 11464, 2873, -14088, -19786, -16191, -18983, -18096, -3365, 4458, -4290, -15184, -26582, -34867, -22801, 1165, 4190, -6450, -9016, -11644, -20533, -17397, -6510, -5592, -2521, 11347, 11488, -4726, -13452, -9495, 170, 12993, 20061, 11523, 4123, 5542, 230, -5493, 6282, 21268, 19325, 12760, 8771, -677, -4025, 5953, 8716, 2527, 8455, 17450, 7217, -7583, -8564, -4156, 2327, 12005, 9544, -5282, -8756, -1695, -2514, -5222, 518, 4275, 3764, 5517, 1072, -9882, -8170, 3688, 6755, 6293, 7067, 690, -5965, 2617, 9266, -1318]
517a318l700J1858K553j0485n181j43j60O850N366q857q882K196Q78k289J445
532i869j485l945M541M155q166n177O588K495l055M606L088o990j193Q585J792
547d030q36O765K185l911L845N638m028p25R360L713j965L680O27n063J451O894
563B3600j969k073K872j948m050K919k321q964K743R733m628j0130j725l490o325
578e756M674N211o722n351K614j563o562j459j043n69P715N065r599r412K201
593b0556N108M632O685k240q232M197Q417o742q398Q230J1231L740M55o625j0867
608a0965J710J3113M208l961j67k419m257L608J858p905j027J2370N358q375j0419
623g270q034K172J5800Q647j2803j1782P334Q928k348n480m126J540J4500Q868
$$ y = [-1318, -5018, 6840, 9393, -1092, -6273, -6416, -6576, 274, 5640, -3217, -12099, -9903, -9025, -11314, -9869, -11354, -15299, -10758, -6603, -14769, -19946, -13358, -10863, -13918, -9312, -6224, -13214, -14407, -5822, -4030, -4866, 1899, 4084, 173, 4018, 9656, 5628, 4903, 14263, 17976, 16011, 19691, 20318, 15255, 16706, 23600, 21631, 19558, 22430, 20482, 16432, 19351, 17030, 8066, 10809, 20542, 15914, 5784, 4059, 569, -5756, -1082, 4129, -2593, -7944, -5330, -6893, -13455, -14914, -15957, -16526, -8811, -3746, -13345, -22757, -20556, -15448, -10816, -4131, -6371, -14603, -10406, -1989, -8731, -17129, -8899, 2332, 6072, 6527, -98, -10965, -9255, 3858, 8066, 4105, 3938, 1519, -2738, 870, 2728, -5177, -6204, 6166, 11524, 3149, -7270, -15304, -13132, 2668, 11315, -1488, -13270, -5936, 2992, 644, -4836, -8962, -7422, 7078, 15946]
637A5946j3493j3448P673J3222K372j450l460m704N294J0149k926r598j182N181
651I576O172P370m794j6686l271J5845N256j3401r728K776R338P318p813k1042
665a3084o505J6338J0800p043q666n057k318M094K929p741k827J1687P066o644
679f971p944n661n003R822K0310N619j3554j3169o03J0390J2306j492j0258M780
693a428J6853j753j9828p784J0515J6628J3080l538k1668j2784J0659J1983N23
706A1458j306r61l675J235K962j0506j1538Q363J8944P352j1885k2996j2631J6833
720h351K6345m88k1366q505Q691Q949j308j2756q289J5514K2788o896k7619q374
734b1665J5630J5023N517o785j6661o608J3793J1776n391j0009j210O610Q976
$$ y = [15946, 2453, -10995, -3322, 9900, 12272, 10822, 7362, 2658, 7952, 18101, 15175, 5577, 4395, 9576, 15748, 23118, 18324, 1638, -1633, 14212, 19468, 6067, -3661, -885, 8453, 15771, 7958, -13084, -19589, -3251, 7549, 506, -8160, -13217, -15535, -11441, -8512, -16253, -19080, -7393, -327, -6971, -14915, -20576, -25579, -15757, 4553, 10172, -3382, -16551, -17154, -6764, 5542, 4050, -6208, -1428, 15425, 13672, -6156, -13940, -3425, 13203, 26283, 22745, 1077, -11707, -1048, 10935, 11458, 10152, 9191, 5516, 6751, 9713, -793, -12331, -3968, 14976, 22328, 10443, -12553, -25184, -8351, 17994, 17506, -3860, -12365, -3674, 5275, 3967, -8789, -17078, -1564, 21224, 14328, -13291, -21665, -6035, 8988, 14505, 7720, -8941, -15549, -1756, 10020, 4629, -5380, -6590, 20, 8996]
747H996k158j6716q955J4824J7701j936j6569j4830J298K1220J4727j5420k0204
760a8022O263J5625k338j0549j379N007R044O065r284j5730K7J4822J0104R63
774A0618o089j1462m952R603J0396J071l791m165j30P243l46j3993l929J9385
788I459J4286j0463j6011n049L347J1467J0705o671j4456L84Q736j368n810n96
802b040K885M830M709m804j2594n073N186J1126R156o408j9514l766J8339P960
816I992j3567p400Q320P439l17p280j1778r40J8615J2836j1440j6972n93J0254
830b831Q270j288r705l526Q649O548n619o088p88K205Q571O286j0108j4448N630
845h242J4439O23p161l212o77M365Q911l189j4830j887J5327Q583q085j1127k140
$$ y = [8996, 6838, -9878, -18833, -4009, 13692, 11756, -4813, -19643, -18345, 2875, 17602, 2182, -18022, -11759, 3866, 1528, -9021, -10400, -5393, 3651, 9716, 432, -15298, -15271, -449, 9655, 10618, 4529, -6933, -11885, -2282, 8114, 9185, 5394, 1229, 1099, 8342, 7996, -5997, -9926, 9459, 23745, 13282, -2729, -7778, -4431, 7036, 17741, 11070, -3386, -3002, 5734, 4366, -1444, -2040, 845, 5675, 10384, 5580, -7014, -12087, -6901, 4225, 13381, 6973, -12541, -16307, 2032, 9992, -3575, -10975, -2655, 4784, 4467, -2813, -14591, -15531, 3084, 15920, 4480, -12492, -13085, -2831, 5439, 4151, -5554, -9080, -431, 6117, 498, -5590, -6378, -4173, 4398, 10684, 576, -13872, -8242, 6197, 6820, -341, -3553, -4230, 135, 9046, 5857, -8973, -10860, 4467, 13050, 4965, -6162, -8302]
860h302Q404R149k827r631o35O692J629j870k082o065J253J2715L362j3240o835
875h283P885L523j687J901q14o760J361Q095l84q151k275N452O163O92p517q464
891i263L019Q523L143j56l872p439N66J0498k8j1510N14J2847J068j0029l702
906e821r06J977J0263P828q740j4049j027P933O026J184l413l885K805K335m096
921a586m608K63M569J0217M928j4710j8631O095K0798M644q619m538j018j189
935c385L139o56p289L124J5946M471j4623j3676N39J0563J1010K796o007p829
949a877m879q34P115P999k583n018O484M376j3170j1653P255J3526O979kj0745
964B973j5406J492J6236N521o551l242K552j975m312j772J227N725M280j040l674
$$ y = [-8302, 102, 9251, 6424, -3207, -3842, 2850, 4479, 2609, 527, -5538, -4285, 8430, 11792, -1448, -8283, -398, 3125, 1438, 3339, 2525, -4235, -2874, 5221, 4837, -3314, -5589, -137, 6026, 6718, -799, -9263, -6244, 2279, 5422, 5266, 1394, -6045, -5479, 5019, 4991, -6519, -6005, 6842, 7910, -2119, -5821, -6727, -4750, 5513, 13341, 4601, -9448, -10475, -2542, 3484, 4668, 1255, -2630, 175, 2510, -1586, -6194, -5931, -1362, 8855, 13783, -927, -19558, -13463, 7335, 11979, 3360, -1178, -2196, -3385, -246, -902, -8191, -5067, 10879, 15350, 727, -12949, -12410, -1847, 9163, 11959, 5952, -1877, -6756, -7590, -475, 7524, 4941, -77, 6407, 10783, -2387, -14040, -6785, 6741, 13720, 13718, 2973, -12433, -10941, 5295, 10816, 4265, 1023, 3575, 1600, -2712, -4484, -3257, 2468, 6748, 5708, 2034]
979B034m942p117o66J2879R515o988j0364l054j87M814R095j170r927P24P798
994B444n339j1136L605J3201M521m343q304p241M37P799P600M115l573j1318p071
1009a4603O702R005N44Q82K192m047m822m08l348j588J4027J5103p705j9009o629
1024a3704O431Q870Q661K860o553o536k406k058J999N399M543L728K912o147j4332
1039f333n777Q528J2273R946L91j5465j5908N407J4064J615l822K717K780m506
1053E910o079n922k595J0804J5439Q47j3081j3237m190P441J3244L715p878n814
1067a396l30L03K19N1l291R12J1609L175j6315j2673O128J1860N679q17q446r630
1083a2962K476R304P38o791k158L095L711R91o208p060L864R662L093m750p201
$$ y = [2034, -2908, -10025, -10691, 2188, 11703, 4715, -5649, -8703, -8890, -4076, 5019, 3849, -6078, -5354, 2444, -2895, -14031, -10426, 2775, 7296, 2953, -5351, -12592, -12155, -4356, 3244, 7359, 3786, -7532, -14603, -7901, 1104, 1648, 2530, 4722, 675, -4147, -4555, -7903, -9491, 4536, 19639, 11934, -7075, -13704, -7273, 1597, 10258, 13118, 6565, 29, -2377, -4435, -2436, 2963, 7506, 11234, 14146, 7999, -6333, -12110, -3582, 8691, 18637, 19028, 3563, -12345, -6938, 7126, 8741, 4919, 7636, 10416, 5910, -169, -6091, -8686, 2118, 17557, 18404, 5323, -7914, -12104, -4663, 8581, 12296, 4418, -1396, -1726, -1423, -1204, -1153, -4444, -3532, 8077, 11252, -5063, -17736, -11608, 252, 5931, 5114, -3332, -12962, -10486, -1182, -444, -7235, -9393, -6298, -2587, -1596, -7804, -14864, -11000, -1338, 1755, -2995, -10196]
1098a0196o695M197J4713M372j3295q953O484Q561K177k486o596k493R978Q296
1112H064q138j1502K364J2498R159k113j1912r435O808J4209L406o621p526j682
1126b421P144J0060m350j3763O93J4816O580q493j0869m685O230J4174M222j3362
1140E976j0448N973Q959m99o368n598K704J0240L122j0608r444K322P647O472
1154A0450K074r221j1718L633J2121J374o868m402R94N137O178m685j3661k520
1168a1114J3756Q929m481j0367o372J730R771N282o383o731K4K886K539M70p190
1183g251o366P605J1682j339j1818q925L71R953J1879k958j5697m980J1046O524
1197b74n409o566R76Q422O956n528j4324l703J2000J1444J791o337r598l258R001
$$ y = [-10196, -16891, -12694, 2019, 6391, -6904, -15857, -9373, -812, 1365, -1121, -7717, -10210, -232, 8064, -74, -11576, -9212, 3286, 12445, 10332, -1580, -11015, -4207, 10002, 13408, 6787, -739, -2421, 4723, 14783, 10433, -3330, -2637, 12179, 18759, 10266, -603, -5288, 942, 15116, 19338, 5976, -4472, 1501, 10460, 9961, 3593, -2005, 699, 10939, 14061, 3453, -5991, -3669, 3978, 10450, 12524, 3303, -8415, -4782, 7339, 8713, 1845, -2557, -1563, 3574, 9752, 5067, -8594, -11114, 2642, 11571, 7090, -3277, -9649, -7919, 1852, 7134, 751, -5980, -5956, -3070, -531, -61, -7251, -13617, -6012, 5670, 4331, -7487, -16412, -16041, -6088, 5791, 2833, -12864, -17844, -6798, -274, -5683, -12249, -11273, -2851, 4105, -1423, -15747, -19450, -7450, 3994, 5785, -552, -10150, -13408, -4407]
1212d407P995m462n313L852N753J401l259r170n802J2049J8060k54j6043j1090
1226a0690K178J0215Q597j860o795P29N279k328n982r55L165M736P147M29r888
1241C977p366J428M844P669O841m489j1695j769O716J725k290J000K478J655J381
1256A2105n547p977J616R009L552l227m055m474p33N453J812n298k365K901J389
1271D161j309k297o410l443Q597Q675p082j2876m09Q732O619j962j2022q526Q003
1286a1549J2819O62r373o286P67N133M843l713o360L541Q429L0o843m190j099
1301a3189L869J0788N787p921q739m22K128K078N409L713o78j167k047o125k359
1316h875N762P331L776L83o037q075r22M351L017N457N594m246q298j208Q48k630
$$ y = [-4407, 3588, -874, -6187, -2335, 3418, 4819, 1560, -7610, -13412, -1363, 16697, 16443, 400, -10690, -8512, 1703, 10300, 8440, 1645, 2374, 7653, 5325, -657, -1612, 1553, 6289, 13436, 13865, 3977, -3389, -1961, 2883, 10552, 17393, 12904, 1209, -560, 6156, 7881, 5591, 6591, 9069, 10724, 12105, 6558, -1419, 197, 9206, 12758, 9531, 5476, 1002, 269, 5722, 7534, 2236, -129, 2772, 4161, 2852, 555, -5855, -9298, -701, 7974, 892, -11984, -12393, -3661, 2958, 996, -11026, -19552, -11549, 1270, 1932, -7441, -13727, -12960, -7827, -2984, -6697, -13057, -9516, -1087, -1057, -7900, -12090, -13189, -9320, 1468, 7255, -666, -9405, -9827, -7699, -5621, -212, 3501, 2823, 1656, -391, -6516, -8875, -3113, 4218, 7994, 8377, 2340, -5735, -6657, -2306, 711, 6168, 11762, 7516, -782, -1990, -1142, -3772]
1332c772K873J0096M689l589p342r098l490J0187J3359Q61q202o771j588L547
1346A760L069k328k390O453P395m091r303o899j214Q516J3747M85j3140p858M160
1361a638L943j03j18k54K4L385j61p564n399M974P072J616k781m346k358L405
1377c03P65m610K03M405K272j811o54m143l304L740N987k617l630J653Q26k118
1393c339J573R90m485r71M592L287o69l073m720k411M301O233R27k540l176l266
1409f747K248N789j934o419J963P806J987l593m465n070J442J0701N867o838p769
1424e032Q67L749J683K80k353M86N270J928o041n789J466M484M481J965m718m901
1440b175K827L530m188k095M314L036p5q90m546o079L703R199J365n262k735o48
$$ y = [-3772, -899, 9197, 13886, 10297, 2955, -6143, -9633, 554, 13913, 14774, 6572, -199, -1787, 1760, 4829, 2501, 111, 6564, 13959, 9868, 565, -6334, -7548, 968, 14715, 15200, 2060, -5798, -1638, 2305, 2202, 2084, 1830, 1854, 5239, 5078, -2486, -7885, -2911, 4161, 5777, 2996, -1350, -3708, -303, 462, -4148, -3945, 460, 2732, 921, 267, -3876, -7180, -3440, 2547, -70, -3700, -2047, -1221, -3339, -1766, -776, -5261, -6232, -1640, 1647, 978, -2095, -6815, -9226, -4925, 1308, 2235, -305, -3481, -6747, -4499, 1290, -644, -7063, -5100, 2706, 4693, 1100, -3365, -8435, -6993, 3708, 9575, 2737, -5032, -4165, -416, 1267, 1547, -806, -320, 4950, 6878, 837, -4952, -3486, 998, 5479, 7444, 2726, -2175, 652, 4182, -6, -2101, 2213, 5249, 5174, 4284, -262, -6341, -2638, 6561, 7926, 2664, -71, -719]
1456g19L39K357K67l213P17L220Q11k034k526k802j53N283M021l509l729p19k014
1473d403R42N806J368n414j235K081n27j331Q59p42q96M023K701m903m557J021
1489e207L063L519R30m635l184L309K482k844j203K881K141J019o08n309l724
1504g370N860P209k065m753mP81J064J916m64l460K039O044n04m999l224L38M356
1521B764O556K86o914l442K745K230O37k89j618m27M502K81p198k692M841K635
1537D897r73j44j762l639k08J736j421J93K622n50k743j088j218k934J026L216
1553b990N94r46m93k877j979K348J579k382J033M075q06l478o87o60o0M877M152
1570A300k134k274K6j201r51L397K800n10J128J920k215k981p30J000L552N127
$$ y = [-719, -380, 1977, 2244, -969, -252, 2968, 3779, 1745, -781, -3583, -3736, 1547, 5568, 2059, -1670, -2389, -4403, -3461, 2345, 3713, -1701, -2936, -855, -1382, -2713, -1854, -2596, -3492, 531, 3232, -1671, -6228, -5207, -2144, 1375, 2305, -2330, -5514, -2205, 277, -2567, -3770, -889, 1252, 2271, 1663, -3646, -7370, -1510, 5699, 3634, -1119, -1123, -342, 722, 2638, 2174, -1286, 753, 6797, 6293, 1294, -1930, -1592, 2764, 9320, 9606, 2692, -750, 1995, 4225, 4862, 4573, 2955, 2528, 7030, 7311, 113, -2579, 2262, 4897, 3924, 3780, 2018, -1621, -1829, -93, -1514, -1321, 1301, 751, -1992, -3080, -4298, -7232, -6206, -2990, -2396, -3342, -3835, -6712, -8691, -6343, -4764, -7146, -6113, -2038, -2844, -6322, -7009, -7669, -7729, -2852, 1300, -834, -3108, -3082, -4283, -5234, -1837, 963, 453, 1581, 3501, 1286, -1695, -2425, -1425, 2127, 7254]
1586G254j76n826k080J617j22M64L175J585m25k17k733n492N62N457L311K49N50
1603G153l019m486J63K992J53J107K873Q45l319j867k100j261M579N266q48l196
1619E035j164k245k259J703K183L00J530J182m951m387LO32n02L214K167l817
1635a376l603R8j392j824J082K320J293Q87k165o258j946M342L205M40Q49j07
1651d155j502l56n44k244K272O653K416k220l39p99l460N37N746M057M15m55k298
1668C724l108K61J563K79L949M946k696o350k554O06J363K101J337l71N00m91
1684E059o522n245M365O593j19j640r95l279l538L70K139K546M316j77n931l180
1700e238K578J529j119J222K953J767J54m573n058K316O239O34j266J176j371
$$ y = [7254, 7078, 1252, -828, 789, 667, 1131, 4306, 5891, 5466, 5249, 2516, -2976, -2414, 3043, 6354, 6603, 7153, 4134, -352, -189, 2803, 2956, 4063, 6936, 7781, 4462, 2595, 495, -766, 3813, 9079, 8231, 5035, 3871, 1626, -633, 1070, 3253, 3553, 5083, 6265, 1314, -3073, -3070, -2438, -2940, 274, 2441, -1376, -4979, -4881, -6273, -8097, -7015, -4695, -3402, -2515, -4680, -10938, -12884, -8542, -5337, -4897, -4048, -4155, -5657, -6013, -6557, -8801, -6529, 124, 2540, 320, -19, -818, -4278, -3741, 2005, 6062, 6477, 6022, 3724, 616, 877, 2440, 2719, 6668, 11614, 8918, 2568, 14, 620, 1983, 4084, 5421, 5050, 5550, 5059, -1463, -6708, -2343, 4250, 4131, 2491, 1496, -1783, -5321, -4951, -2812, -266, 4050, 3873, -2058, -5238, -2660, -1131, -2250, -1028, 1925, 3692, 3846, -727, -5785, -3469, 2770, 3404, 2138, 3314, 1943]
1715A943n116n00M678J445j427q49K28m51L22k273m306K086O199L76n443k190
1731e278J962K034m83l797o86N902L684n786n171L614N106r35j445P22L56J468
1747A267K067j792l698K178M253O1N37J485j978l364O59K900K159k49k722p43
1763C020K349M07m379j828M947J735l889j752R82j476j781M79k37J324L044k143
1779H02p277j607O469K570l964k580J370K695n8l548k239M044M131j287l274J50
1795c603O46K58K088P2j532J689L409k426l740J312K540J8J700J602m143l184
1811c294L116M290j008l486j612K148L566j074n948j697N506L712j287l456k540
1826c064o1L554J447m375Q3N330N19o378j905M423K501m54O7j488q73Q56R2j595
$$ y = [1943, -3173, -3673, 1005, 2450, 1023, 174, 402, -49, 273, -2000, -6306, -4220, 1979, 2355, -3088, -5278, -3316, -1282, -1765, -5562, -6248, -346, 3338, -2448, -7619, -4005, 1101, 166, -1279, -557, -201, 1267, 3334, 1542, -2156, 22, 4275, 4336, 4873, 6358, 4380, 1016, 1675, 4575, 6734, 6485, 3763, 3020, 5369, 5776, 1397, -431, 4516, 6251, 2362, 610, 1592, 116, -1665, -1186, -1423, -99, 2945, 802, -6475, -8082, -1613, 957, -3007, -5587, -4217, -1522, -1580, -5128, -7367, -3323, 808, -479, -3753, -3603, -2957, -2699, -611, -539, -2071, -382, 3027, 601, -3139, -1827, 713, 731, 2431, 4033, -110, -3294, -178, 4112, 3104, -382, -1994, 154, 3720, 2646, -3302, -4999, 507, 4219, 2932, -524, -3064, -3125, 429, 1876, -2499, -2416, 2914, 3433, -2945, -4850, -427, 2074, 1620, 1687, 199, -674, 182, 274, -1321]
1844a321J197L159J307m91k385l602r37M133L479j109q96m20k686j029K118K10
1860G27p47L933J641n291n013J172L491J851N10j089j304O94m34m125j063M818
1876b29N205Ln088m866p06N506M373k969k774K240J123k707j425n02P67M420L331
1893E702l530n770L49L136O68k74k05m86P40J091l246k662K754L584M8k214k542
1910b857j083L217L105k690m213K410M084j494k419L4K08J297J836k723l094K880
1926a502N342n99m218k309N56K667K373j306k047K112J952l220l563R31L804L885
1942D858J760m615o834P63N751Q66j388J238J673r27k039l489k388M504P112J046
1958G891n226m738j527J766L485J487j258J486J486m460n650j67M080M651L309
$$ y = [-1321, -124, 3035, 4342, 3851, 1466, -2136, -3073, 1060, 4539, 3430, 2534, 2114, -572, -1601, 517, 727, -20, 3913, 5554, 263, -4750, -3578, -87, 1764, 2274, 1185, -119, 575, 141, -3984, -5047, -229, 4976, 4979, -109, -4975, -5681, -175, 4198, 1229, -1545, 695, 1818, -889, -2314, -2816, -2049, 2371, 5702, 2172, -3598, -3249, -113, 555, 281, 76, -410, 330, 1421, -1825, -4487, -1733, 1851, 1899, -315, -2857, -3940, -723, 2382, -308, -4521, -2111, 1973, 479, -1940, -1906, -1698, -401, 1435, -1288, -4382, -1502, 3840, 3241, -977, -3286, -2730, -63, 2310, 1004, -1043, 1069, 3021, -199, -3762, -2831, 973, 4858, 6618, 2003, -4831, -4068, 1683, 2549, 1161, 2399, 4072, 3145, 1106, -2383, -4771, -267, 6845, 7891, 2665, -2073, -3600, -1834, 1651, 3138, 1880, 3366, 4852, 392, -5258, -5425, -1345, 3306, 6615]
1973F615k292o782l270L048J714j434J792L698n38m049m278k240L947O698J214
1988C843m868k973L13L62j4l5N82L187L379k823o637q90M406L929O20j632k750
2005b001m15L130R13l673M03N080J861l053l261j305K790M668K14m087k128K969
2021B105K646q82k149j887J681M212p36n398q26M688K550k827k880j088O33L405
2037C247J380l673k585J692J347j460q85M16J327J304j480m393j651L468K728
2052G82j273j736o22K24J405o31m272J53O066K632m037n143m27K835L970J229
2068A155l854j867L061J940l277k585J625M301K567j432m748k201M290L710j918
2083G67k134R52J391J053m77l563j437N643M268k268n341j415K510K827J817k747
$$ y = [6615, 4323, -2459, -5729, -2681, -967, -2401, -609, 3089, 2551, -1498, -5776, -8016, -4069, 2629, 3843, -1025, -3998, -3685, -3323, -3337, -3372, -2790, 397, 3776, 953, -5684, -6574, -2168, 1761, 2381, 749, -2001, -2416, 714, 1627, -2046, -1643, 3437, 5298, 2245, -1016, -2321, 469, 5137, 5351, 1264, -864, 2105, 4751, 3869, 1720, -167, 1514, 5726, 4990, -408, -1234, 3454, 6004, 3177, 297, -791, -158, 3247, 4627, 954, -1631, 61, 1408, -52, -937, -521, 806, 2110, 630, -3763, -5414, -1946, 782, -491, -2227, -2849, -2625, -1220, -1851, -6123, -5970, 96, 2728, -1309, -6452, -6879, -4044, -74, 1155, -2699, -4566, -1505, 435, -2842, -5427, -3802, 499, 3066, 1634, -3114, -5315, -1025, 2685, 767, -1367, -415, 976, 2029, 1552, -2011, -3448, 2195, 6463, 4195, -1146, -2561, -51, 2776, 4593, 1846]
2099A846k758K421L611j488l971p74K943K953Q72l258l576K259K581j020j488
2114A153K277J474k059j926q81M76K668J942k948k870J301K052j164j974m90O69
2130c00K116M19l864l276J623K996M96j066k320j199J310J729k595k999K910M709
2146F89j072m263k511O93M583L659k249n697R72N391J811l444l039J824N961L020
2162F328m559o566J200O344L010r07k972k767J068M215L9m023p52L875J164k412
2178B285k367r94O67K805Q74k661j887N45K60q39l2o8J501J292j938l234L80L530
2196A19P29j603M6J1o77O70R08o90P67K730o59l910R0L395J842j325k058p91J930
2215A524J753j535k789J41L708J174k019m020l245L859O410l91o791k971K244
$$ y = [1846, -912, 1509, 5120, 3632, -339, -1113, 1830, 4783, 5655, 2397, -1179, 1080, 3661, 2641, 1153, 3430, 4904, 2845, 919, 38, 514, 3182, 5124, 2176, -694, 607, 2659, 1495, -479, -969, -300, 1816, 2235, -1629, -4905, -3282, -286, 210, -856, -3176, -4375, -3065, -1336, -3931, -6930, -4020, 689, -383, -4646, -7157, -6464, -1881, 1778, -471, -6168, -5196, 195, 2006, -1438, -4477, -2653, 3308, 6328, 1769, -4797, -3597, 2747, 5757, 4850, 1878, -889, 179, 4394, 4433, 410, -342, 3533, 4697, 2285, -82, -1076, -409, 2396, 3270, 609, -1278, -733, -473, -1312, -1344, -1412, 89, 1381, -557, -3791, -3411, 119, 848, -755, -709, -698, -1375, -705, 203, -487, 280, 3010, 2351, -1559, -1469, 1926, 3768, 2443, 385, -406, 1524, 3277, 1742, -1047, -906, 2802, 3976, 1957, -2063, -5308, -1449, 4961, 4570, -2221, -5192, -2948]
2230b948L006P49p32l081j59M038J196m885l558L376N508K238l243m508r32L727
2246b08K780r06n13Q28O88K44j566k817N70N884L334m153n124N3J527J646J442
2263C709n26k483L5N73j867k667R18K450R84j404k047k391K16M67L37J606J795
2280b95k225l708m55J794J796K184m4k974j159L139J634k820j014L121K883j42
2296A715j502l081J94M237L672j274l366j549J377L260J153l278j677L389K569
2311E839k887k887j25J785L199O24m062m712K589N567l80l612j818J291J509N90
2327B510k143k412J904L242O22k663k567l49K349K977k62l178j58O35m34J40J729
2344A942l12j425P60M39k322r87J774P72p06K84j28j738j010K38P98J391L98k575
$$ y = [-2948, 58, 807, 75, -3006, -3165, 873, 2069, -2816, -6374, -2998, 2510, 4748, 1505, -3003, -3935, -208, 2572, 1666, 1153, 1981, 2669, 2913, 1347, -1470, -900, 4984, 8318, 4165, -959, -906, 621, 2267, 3709, 3183, 700, 735, 1308, -559, -3226, -2308, 142, 1126, -278, -2325, -4716, -4500, -4033, -3696, -2090, -295, -2520, -6228, -6683, -4889, -3093, -909, -953, -3927, -5086, -1947, -313, -3133, -4147, -1026, 1857, 1715, 213, -2868, -2674, 1563, 5235, 3961, 595, -954, 423, 3683, 4836, 1558, -119, 3270, 5839, 2952, 65, -60, 1725, 4924, 5548, 1486, -3226, -637, 4930, 4550, 938, -880, 411, 1920, 2510, 367, -2045, -141, 3101, 3723, 1060, -1507, -1856, 493, 3470, 3208, 30, -128, 507, 73, 213, 1942, 1630, 205, 965, 1404, -918, -1905, -131, 641, -65, 219, 91, -1647, -2657, -2419, -1621, -230, 168, -2407]
2362b407j999P32J424M99j83q82q46J852J104l210k153K544M272n67k784j136
2378c740K36J762K960j033l142N69L323M02j760j689L48K961K752j718l259o11
2394a639J991J978O16j079k532J26L105R31l200q82K185Q65p8p87j740o85K224
2411A399J487j386j693J151O37r4m98l38j71R55J30j196k04J045k29k27J193J27
2429B088j459m1N03j264O11K065n78k349M0J736p0l16r15l94L79K034r38k471
2447a339m99K084J083p42r66j757L79K264J43k064p23R64O88O46n67k169m14K583
2465d06J356j755j681k75O97J802O98k253j631J558K246j225j819j92J169J655
2481e6N28j761k051J395K093m23q46k46K25kM95K7n01J034O28l82J68P36j336
$$ y = [-2407, -4406, -3674, -2250, -1751, -1934, -2816, -3662, -1810, -706, -3916, -6069, -3525, 747, 180, -2604, -3740, -3504, -1742, 1218, 185, -2957, -2388, 935, 1337, -423, -2112, -1764, 1197, 3949, 2231, -1028, -1639, 352, 2330, 2946, 1867, -665, -539, 2566, 3497, 297, -585, 1600, 2465, 2387, 1600, -140, -825, 1399, 2886, 1500, -193, 958, 1595, 1501, 1003, 665, 494, 1449, 1579, 383, 179, 1224, 995, 768, 1961, 2088, 629, 588, 1091, -173, 438, 2503, 1925, -424, -384, 1352, 1282, 966, 51, -343, 36, 2070, 1132, -1339, -1838, 246, 1329, 587, -379, -2136, -1757, 507, 650, -1414, -2137, -1173, -485, 161, -406, -2575, -2989, -406, 950, -805, -2486, -2761, -2064, -262, 436, -1817, -3448, -1890, 356, -869, -2688, -2880, -1711, -56, 472, -1289, -3340, -1945, 148, -275, -1121, -1367, -1142, -1144, -649, -622, -1123, -89, 539, 157, 325, 1061, -275]
2500b75r76J491J784n99q82O5m10N10J556n61j220P80J582j377j001J055j81J77
2518A518J075j01j108o13q7k54J368J178k091j649J815J816j673j539J70Q27J426
2535B078J33k632j897K143K185q55k150J31R90L74rj370j056J293Q93l79m61N54
2553c5j396k12J548N88k134l69J138N34K58m11j577n19K435R79k119q81J611P02
2571A40j251n41j90R87J396m47j272o7J319p83l33J158M06n07K23J2j056Q85J249
2590A328p15p47J376O44j747r14J479P25j06k07k13j48M52l87j192J259J060n99
2608A348r92L09k61n46Q65K82k82K3k3j164o89J140N52r65k03J409l40j444q4
2627a065j14K11Q64m1j171M81L88k95j007L37L40R9R27j71j871K42J241l22k85
$$ y = [-275, -1251, 240, 2024, 1425, 543, 608, 198, 708, 2264, 1703, 483, 1263, 2845, 1468, 467, 1522, 1341, 1518, 2593, 2492, 1384, 771, 684, 430, 1798, 2976, 885, -764, 1051, 2867, 1194, -345, -175, 652, 2078, 2211, -421, -2318, -175, 2010, 1155, -995, -864, 126, 500, 491, -879, -1935, -642, 251, -128, -589, -35, -1431, -1643, -95, 493, -1641, -2010, -872, -338, -80, -491, -2068, -2587, -152, 827, -1292, -2173, -562, 140, -1111, -1652, -1842, -855, 541, 94, -1178, -1245, 74, -709, -1042, 116, 522, 15, 238, 250, -806, 79, 1328, 613, -134, 1242, 1886, 139, -775, 704, 1429, 1323, 1116, 903, 755, 1207, 820, -372, 887, 1947, 1348, 356, 665, 404, -142, 723, 1005, 723, 746, 723, -441, -1130, 10, 562, -403, -606, 803, 463, -981, -1065, -1179, -968, -104, -145, -1316, -835, -447, -742, -1749, -1412, -1072, -973, -46, -217, -2088, -1846, -605, -927, -1212]
2646a212J238L85j260N5P28j168J17J434O00k19m36l08m55J208O43o61j21R58
2664A526k22l62N02q18m23J186J630j288j059K00j25n68J291P20r80n05Q40k61
2682A284j308K52N90k4O77q46j339R3R03Q5m62M86j74m81RN72j446J20J104K84
2702C79q52M82k0j227R1J365o06r73O57Q06o18Q8k60m27M24J069j43j585K65j31
2722a216J95L87N42j159k1Q84m20p35J155K54j553P9J803n03q65N77j19l67R81
2741a01K63n31K50N72n36m60R50M16n18L88L64o41L60Q35q29k55O74J22j183P62
2761I02J383p95j240N18L89m83J04lr91K56J482q72j068N79L56p0K81p81r32N86
2781c99P93l96m31M50r3q43R44J069j137o08L76O7j51J332j80j154M5J326n62
$$ y = [-1212, 26, 411, -849, -794, -66, -1234, -1117, 317, 917, 698, 262, -46, -501, 707, 1350, 689, 568, 1526, 1304, 942, 1444, 626, 203, 1389, 3019, 1731, 672, 872, 747, 179, 1470, 2190, 1210, 705, 1545, 1284, -24, 228, 818, 794, 1471, 625, -714, -621, 282, 367, -95, 391, 217, -264, -255, 317, -1129, -1009, 95, 379, -473, 9, -11, -1238, -1147, 218, -388, -1361, -704, 102, -516, -428, -688, -1115, -691, 378, 235, -1350, -1085, -1216, -1021, -634, -92, -1251, -1272, -388, -808, -1543, -388, -134, -1687, -1608, 195, -308, -1173, -596, -715, -1082, -101, 162, -369, -119, 453, -83, -543, 407, 823, 305, 693, 1057, 416, 776, 1611, 782, 527, 1201, 1323, 140, 902, 2285, 1490, 250, 768, 1157, 674, 778, 775, -216, 40, 1522, 650, -418, 161, 517, 447, 728, -53, -985, -399, 394, -2, -433, 17, -76, -919, 25, 1094, -43, -651, -275, -208, -359, 973, 793, -361, -316, 1010, 448]
2800D48o46L37J0m71R88M52j429l38Q37l88n6J028n90n49j08M06q62j29Q32O45
2820D17J95O6j407j752Q07K040n3j078N48m38k67L71l79l73J527J402p48j729
2838h51p67mO86K032O10j581o80M31m30l7N21L33m75J472L15j875j485P00J412
2857C27J288K57j391j729K07R87m02L95Q00k0m03j93p98j071Q72K194p2j102j01
2876D5r35k03J221R31p31o15O39N3k29j35p44PJ758R07j583r31N86J51O30L33
2896A155p83j244N22K158r64p06K55p61r5J307N44j717l98J232M99j208k81m01
2914h86K68J686P55j839j425L03L28J033J228p67j187L90N38j490o20K047Q11
2931A173j82K24j019k324J54K676N82r3k71j232p63O6O42j50N27J370L63j484
$$ y = [448, -198, 139, 149, -322, 666, 1118, -311, -649, 188, -200, -256, 772, 182, -367, -475, -69, -931, -1060, -228, 417, 612, 678, -729, -2481, -1674, 366, 313, -765, -217, -655, -922, -551, -930, -1303, 224, 1626, 878, -851, -1618, -1622, -936, 1096, 1706, 125, -555, -124, -554, -591, -70, 263, -212, 1260, 1575, -300, -1785, -1085, 327, 1615, 1872, 481, -1248, -1041, -54, -456, -61, 739, 719, 316, 123, -675, -1746, -874, 1320, 1248, 146, 45, -890, -1093, 128, 1059, 328, -287, 352, 405, 176, 41, -703, -696, 1062, 1969, 386, -545, 41, 192, 822, 1155, 372, -872, -350, 1808, 844, 138, 393, -368, -463, 844, 1388, -329, -727, 505, 1004, -204, -485, -886, -618, 1068, 1823, -16, -1441, -1138, -810, 223, 1451, 684, -503, -113, 425, -1065, -1685, 362, 1173, 991, 1215, 196, -2128, -1974, 702, 1284, 1191, 920, -312, -1075, -1009, -367, -517, 10, 1380, 1743, 259]
2949B59j119j053N5K274J734j206j068n66n64j77J846M00n16M43L50j435k040
2966b383R73J137J002R48n50k061p46Q42N19N72J08n20j12M07o6j161N25J072
2984E06M19o59L30p35j644J119J524n61r71O73J62p13O10J45j001K52J581m60
3002E77p62J32m42K59J225l14j137k06P99K42j9N84j039j100J386J307j096o06
3020b10K74M55p51M94k62o88P94J534m43j316k69k74J229R46o51j182j59R89k60
3039B50l75M10k94j14R55K78j605r99J480R01p03N08l13j297N92R85m28l11K37
3058A57J03R8o1p60o45J255J120p92o80M16m40r47J159Q71p39l35P64m36o82N64
3078a0O6q21L81J081m65j170L7M39O85L60m80j301P46Q02r50k44Q39m52N81P57
$$ y = [259, -860, -1913, -1858, 416, 2150, 944, -124, -690, -1254, -1431, 415, 815, 299, 742, 1092, -343, -2383, -1410, -273, 729, 1677, 1127, -934, -1680, -838, -319, 253, 361, -159, -271, 136, 70, -1091, -566, 506, 925, 266, 596, -139, -1783, -664, 860, 299, -672, 1, 163, -550, 60, 205, -796, -544, 1037, 577, -185, -53, -495, -236, 989, 675, -462, -668, 131, 373, 354, 938, -101, -1201, 185, 1492, 396, -210, 64, 519, -232, 262, 0, -688, 106, 1640, 1197, -119, -388, -662, 567, 1513, 862, -320, -479, 510, 250, -125, 285, -9, -123, 832, 1110, -495, -1494, -14, 887, 184, 692, 379, -918, -326, 659, 231, -80, 157, 260, 358, 297, -463, -1108, 147, 1267, 475, -205, 211, -229, -1176, -17, 854, 115, -220, 544, 108, -574, -10, 56, -765, -384, 697, 232, -938, -901, -462, 223, 583, 103, -1198, -452, 350, -600, -844, -5, -457, 124, 881]
3098H81l50j893k32K064L37o05L24j148r53R73J280n96q79P88R26m94q94o85q6
3117a242K176M05r71n30j17m0J5R29Q8r05O05O79j638p71Q71J103j80K10L81j296
3137b28p98P36L87J77N68L55p65l31m75n06J157M52L6m69M15j012p99O67J033
3156F00j29K81O22j544j415J163J305n57m75O41K48o03k13n20Q4Q73J044j288
3174A17n59m41L18Q85N77j052m13J303K85j318p07Q37L49n00Q34k33j267N48J599
3193A162m90j097n1K18K49N69k70o20M53K89n62j74N31j20J55N22p61j434K58
3212a173K300j93r12R82k22j007m49L31n3M63J364m8j926l66O0N16L13R01k57
3231F24q3p56j157n18J483R22L22J54m55j680p19J440L80p11P31J129j419j594
$$ y = [881, 531, -1362, -1594, 470, 807, 202, 526, -622, -1575, -602, 678, 82, -797, -9, 917, 423, -471, -1156, -1242, 934, 1339, 368, -162, -279, -319, -304, 625, 713, -192, 413, 1092, -546, -1317, -446, 657, 477, 687, 1068, -228, -1026, -290, 97, 274, 842, 1197, 432, 101, -374, -880, 277, 729, 765, 296, 711, -301, -1100, -433, 600, 471, 752, 1374, -170, -1585, -422, 883, 326, -149, 492, 740, 137, -76, -596, -512, 361, 1405, 117, -442, -883, -565, 320, 897, -155, -568, 735, 1020, -298, -1005, -168, 181, -319, 515, 282, -985, -437, 1162, 672, -425, -476, -258, -9, 560, 290, -330, 123, 412, -150, -324, 207, 87, 242, 764, 3, -1431, -1173, 1127, 934, 22, 1004, 782, -225, -674, -343, -396, 67, 1431, 1383, -543, -909, -849, -333, -20, 881, 624, 541, -215, -1372, -1890, -407, 515, 837, 991, 536, -1144, -1863, -423, -43, -754, -23, 1106, -313, -1907]
3249a907P2Q62N55J421J22j836n33L50L41k30Q43L10K78j04r12j253P92J549k0
3268G00n24K68l55q01R09J52n66N49J452j27j754m88M55O26R21P7j232l84J234
3287A112j68q66J32l65M09J066k66j462o2J389K18r81j92P8l06J128K90j358m12
3306f16O78P87q67K0M27j65K3L0q42l32R34J085k78m73n99p55P78R84r43m83M17
3327a90P51r71n04N00j63J46P29j39j258K88q2n70L47J568m50n85m76m1L66K85
3347d49K27q95L21J022l91j218L52O76Q3P85K07j587k95J090P10m77L17J4m9K89
3367G32J79r92p14J284J123m73r05n63j14J384O80j274j461J683R80k85j355p81
3385h72J42J420J398j568j386j19J382N25p09k24k96L05P55M0j021Q3M79o9N04
$$ y = [-1907, -1835, -973, -418, 1003, 1125, -711, -1244, -894, -553, -783, 60, 370, 648, 544, -368, -1621, -829, 720, 700, 176, 444, 89, -712, 197, 349, -217, 332, 1784, 1657, -97, -585, -130, 496, 1417, 1494, 262, -122, 1112, 944, 78, 210, -155, 254, 1320, 1054, -408, -470, 919, 1137, 156, -36, 42, -264, 864, 1154, -204, -616, 62, 849, -18, 2, 429, 264, 287, 317, -525, -857, 77, 1162, 884, 411, -188, -943, -165, 819, -124, -607, -190, 561, -410, -914, -414, -577, -431, 298, 159, -1099, -811, -893, -1463, -1116, 452, 2, -583, -1059, -1100, -734, -449, -222, -1117, -796, 226, -165, -1383, -1031, -355, -272, 513, 720, -867, -1162, -72, 638, 161, 478, 492, 443, 732, 911, -81, -795, 489, 1612, 1139, 234, -329, -443, 941, 1621, 347, -1114, 569, 1549, 1264, -91, -872, -730, 690, 2088, 520, -866, -985, 397, 922, 213, -11, -307, -2, 753, 793, -228, -145, 334, 265, 769]
3404G69J52j175l01J231K92n08j62J19k35O2r2j46KJ152m81r11k77N49L1j35J30
3425F6j64j87J13k72o67N82O64m80r27J308L83j024o58M9K11J363K36j181j125
3444a710Q20Q90Q7l41l2k53P9J136o57j079N72L60L81M30k49j360J11J614L81
3463A180j261m94M39N48K14n02o99j21J319K14j090j74N80M02l15l23o28M98J288
3482A075j52j324j78P00M00k15L09j65p54N96N49n21m80N86j80K84N25k23j072
3501b40K46L61m10M99N09m29m68j00m00K9J072K00j182l50R67K57j270L5K12O32
3521A70Q01l22j522p12J173N15K6m66L94m81k2q7p43J89J300K29m29j05l51j93
3541f36k29Q34R3j81L53l28p65K37K75k57L01J233p42j097J80Q40P5j1K5mk23
$$ y = [769, 921, -254, -555, 676, 968, 460, 298, 417, 182, 244, 152, 6, 8, 1160, 679, -232, -509, 40, 71, -64, 66, -98, -285, -172, -444, -1111, -529, 135, -345, -1272, 36, 419, -605, -1263, -1214, -1003, 360, 596, -585, -1710, -890, 0, 87, -254, -286, -539, -460, 676, 19, -1060, -488, -128, 253, 683, 434, -926, -815, 799, 1180, -81, -575, -136, 412, 626, 124, -575, -696, 623, 837, -253, -427, 153, 555, 240, -83, -711, -213, 1075, 923, -401, -579, 121, 521, 306, 615, 450, -304, 292, 841, 320, -160, 426, 246, 530, 1055, 832, -240, 6, 367, -43, 456, 965, 536, 68, -32, -432, -403, 669, 869, -313, -663, 304, 561, -709, -674, -462, 170, 971, 649, -873, -1585, -412, 103, 129, -337, 57, -424, -446, -533, -1276, -1087, 213, 442, 13, -92, -443, -636, -865, -31, 62, -119, 234, -94, -859, -622, -347, -604, -303, 930, 188, -909, -729, 111, 186, 175, 200, 196, -27]
3562b7O93l9r80M55K98j29k30R75l33o86J02M44m44O42L65j133m94J057J43q87
3582b08L25O4J40K93K9p97n92P85J60l49j20M44p69L26O66n27m03N50r2M0l4k71
3604c40q38N86J229l56q41K21Q56l57j76j17o01P80O72k25q14J40K60P1n0L70
3624D70p80L34L10k42m94O45l5l28K38L69p72k74K82M35m09%M78o03J68L55l38
3645a91m57M24N03o12PM27l11m2J89p6j13O32k12p11K97N10k97k37N55J49l87
3666D7j2J42m38j98P90k26o39M71L29p36K29J78j96k17O21J32p47L01j17J0J68
3687a08N11n89p2L80J03p60P13P7m15J75M99l78l89O69L99o94P0J85l07M84R5
3708F48k52l76N52J98p12L42J10k69l95M34J38l49K34O8m12K59J13m28j75N91
$$ y = [-27, 666, 627, -353, 102, 400, 271, 41, 1016, 683, -3, 99, 543, 99, 741, 1106, -27, -521, 536, 679, -208, 117, 181, 321, 614, 643, -154, -746, 39, 199, -150, -270, 174, -595, -269, 397, -130, -533, 17, -75, -35, -69, -340, -1178, -592, 637, 281, -560, -339, 517, 160, -16, -133, -734, 46, 718, 493, -321, -181, 79, 150, 100, 470, -310, 24, 334, 92, -402, 243, 208, -120, 118, 487, -285, -559, -277, 158, -251, -251, 227, -376, -208, 147, -191, -648, -224, 279, -333, -326, 101, -210, -252, -63, -139, -252, 380, 168, -543, -246, 264, -33, -270, 285, 434, 47, 35, 177, -261, -459, 331, 105, -534, -63, 266, -470, -241, -63, -259, -476, 145, 277, -470, -169, -286, -276, -108, 403, -186, -258, 122, 225, -535, 178, 255, -160, 15, 514, 136, -253, 416, 815, 121, 191, 376, 69, 553, 648, 396, 20, 572, 770, 58, 400, 510, 241, -154, 280, 418, 69, 303, 371, -41, 218, 331, -97, -272, 319]
3728C19j0p84K42J54L1q7J06k17j23P33l39m01j06N03l61l08L00j93n5O44n0o46
3750f48J5O67o20O3O4J12j96L31L99n15N3J72m71L06Q66m35o89P70J27o86L07
3771hL73j04k68N46m66j13J44M41l25j29N59j28o55M2M63l63J08M91o21k0K68
3792B35l12k63P17K10l77r0O8n46M1M21P9l04p4M86l03J69j12j91k81O97L05o18
3814d3l23L4M76L24J07q77n23Q99L68m11j44l26J85K78N52n48n69K45P24m94o30
3835f96K40P5K99L59l8o61l8N95r9m47p1JO18M29j58j227K62J152j05j66N39j080
3857b17m03J084K92l12j23M36l60j83J71L25l07P3J87m68M7J47l21k49J036l77
3877D78k28m20k34m08N68N47l95j033R62Nn34J01N02l19j19O11k81j126K55Q96
$$ y = [319, 309, -475, -233, -79, -48, -135, -29, -246, -369, 364, 25, -376, -482, 21, -340, -648, -348, -541, -596, 48, -2, -648, -633, 34, -586, -523, -459, -347, -543, -212, 187, -328, -275, -103, -574, -268, 598, 163, -526, 244, 371, -315, -8, 365, 261, -7, 539, 73, -40, 104, 545, 220, 91, 650, 522, -133, -91, 372, 9, 117, 608, -13, -33, 235, -77, -340, 377, 587, 210, 120, 188, -358, -317, 104, 183, -121, -195, 291, -12, 157, 45, -146, -427, 270, 575, -43, -366, -332, 144, 468, 575, -302, -825, 74, 442, 31, -113, -439, -254, 24, 576, 28, -541, -296, 428, -66, -696, -456, -381, -82, 277, 239, -422, -460, 135, 36, -411, -482, -481, 137, 566, 408, -819, -557, 595, 490, 324, 863, -217, -620, 464, 756, 444, 321, 757, 397, 214, 385, 710, 403, 476, 663, 195, 242, 389, 68, -181, 855, 478, 250, -170, -404, -812, -244, 303, -92, -1125, -163, -158, -692, -591, -89, -408, -527, 84, -197, -1323, -1068, -172]
3897a72N18l64m27l23O63L44j60n19n3J082k81nl68q63P76J165K05j336l78P56
3917B60l9M8R1k2o65O29K74m87p87O88L81k19N5q10k26N51M07j51L7j76k26j23
3939e10O93r9n86M15O90m40l57O19m8p93R96K2R5l49k20L4j5Q76j78o60j62K68
3961B91Q3k76j85j81J28J072k21j132l95J076k90N11j98r74q9O01R92n76r29K08
3981d84N37J92P8q96n13J170M34l35q29k61O01R85L0j239m44P51R81n81q63M95
4001a91J14L75L93n80p71K24O46L7k45l09P6j61N92%n75L1J07K47m9K10r08j33
4023h70R77K82p47K17L63p33k95P77K55l28m36M83o5N42L40r65o53J008R34r01
4043A85m77n79P00R44J60r75p17J323O53j075m16K01j01R30K19p50j048P19J281
$$ y = [-172, 346, -18, -445, -768, -105, 239, 79, -440, -493, 589, 308, 303, -65, -928, -152, 1013, 1218, -118, -496, 260, 221, 269, 360, 338, -327, 302, 576, 89, -698, -10, 371, 152, 207, -603, -829, -278, 129, -22, 15, -161, -387, -510, 183, 84, -502, -87, 603, 163, -194, 425, 377, -416, 580, 602, 697, 348, 128, 162, 147, 1023, 845, 185, 23, 291, 374, 98, -87, -268, -140, 932, 711, -421, -816, 260, -30, 481, 283, -691, -780, -179, 813, 237, -692, -484, 53, 245, 323, -573, -1086, 84, 518, 183, -646, -907, -306, 679, 709, -530, -974, -223, 758, 177, -686, -191, -77, 298, 691, 111, -660, -436, 210, 247, 2, -307, -231, -392, 200, 200, -375, -344, -237, 10, -39, 171, -737, -870, 107, 389, -358, -141, 222, -511, -806, -29, 226, -102, -538, -55, -120, 422, 762, -203, -856, 152, 1086, 185, -292, -871, -171, 773, 933, -42, -759, 564, 1217, 142, -274, -73, -174, 756, 975, 225, -823, -104, 1177]
4062A177l23r09q1l40N10Q41j74q28m97O56Q29l5r57o33K66J826m80j255m79R84
4082I8L30j06M0n38m60P03K38j163K78O96rl36o3M98m12l23L79k54O79k61l73
4103c59j26K34M30o29L36L41k51M1P0p06k23R56M11l98k25j13j42J67J145j6j355
4124d12k29J124K15n22m44p19P59J219J15j784m76P26O00Q41q80j001N2J384Q7
4143F55j042j37O24J4Q6n1o91k05Q49R21j051o15O18l53K87K83n63K24M83Q1k01
4164B16m29lK08J10N61p94p28L21O29j0n70N51o1l69J25R0l71n8N08k44j64M85
4186Cj70m28L39M42J20l3k88j005K28J484N39j059n31K69J70L12M88o35m12P86
4206F19N21r13l20KN60N03P1r87n60O37O26m89j36M7k61N68l43l24p28J006J116
$$ y = [1177, 854, -55, -136, -476, 34, 875, 701, -127, -624, 32, 861, 826, -131, -764, -498, 1328, 848, -407, -886, 98, 428, 322, 362, -176, -636, 67, 305, -858, -580, 116, 107, -229, -292, 206, -206, -529, -150, -404, 275, 14, -359, -485, -251, 179, -450, -114, 227, -24, 17, 87, -619, -842, 114, 525, 127, -98, -211, -353, -186, 959, 943, -412, -641, 483, 698, 176, -268, -987, -228, 991, 1106, -678, -1154, -428, 172, 1013, 133, -868, -816, 568, 655, -387, -524, 100, 114, 200, 149, -542, -747, 102, 1023, -28, -643, -25, -378, -91, 192, -371, -147, 336, 417, 216, -213, -216, -8, 102, 663, -131, -859, -538, 91, 81, -489, 62, 1, -368, -243, -153, -524, -582, -74, -318, -482, 3, -167, -595, -256, 186, 306, 273, -15, -1020, -792, 692, 1231, 172, -359, -90, 80, 392, 880, 245, -167, 619, 1140, 227, -93, -91, 469, 972, 1043, 56, -504, 133, 759, 270, 134, 181, -80, 488, 145, -179, -907, 99, 1215]
4227A215j146n05k17r6N94O06k25r55K19O61l46k5m01P7J13O97m69m04j4N82j43
4248a82n8O15o45J48l02M57l01L20L49o90k67N69K89l88k10N4J07L98L63j019
4268c93m52P29M16ko06m0j16L41N96m46n25L91M51l38j32k30PN62N81n82r54J84
4290e58J075J63m28j15o62M05O34r4r49K09P63L33m58k44m84J18Q98k86k45k74
4310a99L16k19K8O69o18k7K14M03r59p2P25l80l60M45pl23N25J46p64M39M11l89
4332Dl06k71O44n10L78L04l75R6L30k40m01K68K16J1k28R0j91J31P95m59l33j31
4354a78M78J8r4l3n98j9Q82J34o04j33M23k34M65J57r57j1O12K74q57K87L7j44
4376i5M74J5o13m61P18R9l00j49L54j94J4L91o39k04O02K30o41L44J16m04J40
$$ y = [1215, 69, -436, -653, -749, -155, 451, 226, -729, -510, 151, -195, -220, -621, -544, -431, 266, -203, -607, -621, -39, -182, -240, 375, -270, -122, -424, 33, -268, 52, 401, -289, -556, 13, 302, -86, -296, -242, -135, 263, 626, -393, -845, -116, 300, 298, -308, -348, -464, -123, 473, 27, -498, -107, 344, 6, -126, -356, -349, 213, 794, 212, -742, -558, 517, 680, 252, 137, -525, -120, 514, 420, -529, -320, 443, 776, 318, 74, -410, -292, 606, 320, 75, -199, 117, -102, -74, 595, -23, -50, 164, 567, -392, -464, 261, -119, -479, -34, -41, -364, 161, 307, -457, -18, 393, 4, -302, -573, 71, -439, -61, 243, -132, -36, 294, 54, -347, -79, 137, 148, -80, 10, -181, -50, 745, 286, -47, -178, 300, 318, 224, 191, -407, -426, 456, 590, -14, -147, 276, 42, 507, 664, -293, -304, 308, 582, -275, 12, 49, -95, 379, 394, -219, -680, 38, 137, -163, -312, 42, -152, -138, 253, -386, -590, 12, 242, -399, -55, 61, -343, -203]
4397b03M36Qn34M02J65l68m20M60L3K91k40K84n67j32M51n3k01N34N0o70N9K10
4419ek82J94O49o36k61L34M5n90K4L11R2M18J09o58n14Q70Rk35J03j14k12N67
4441B18J97n71L0K75M05l55J62l06K0%M31k35j59L3N14l76l69P25k38l07J09r
4463A94k06n1L02l8m43K58r7P1J95j18n60M64K86q27K12M69j32m24O70k76o37
4484f88J46Q67l12o4K65k40j96L57l65J88K89R1k56r8n5m5k45O62l2m38K75r6
4506A0J36n75M46p7RK33L6n51J3N05j73m64L49L69m98j37K93l21J26O24j88k39
4528g4k68L35o1m77N93p1k06K31q8l45K22N66l54j07M17l56j82J03K96l96K32
4549A0K45j90l34L72J3n47N49M13q30L74j17o2j05L74k77k14M87L64n17p2L40
$$ y = [-203, 233, 241, -293, 109, 274, -94, -514, -54, -21, 270, 30, 314, -253, -385, 66, 13, -188, 346, 396, -274, -215, -5, -287, -93, 556, -80, -341, -7, 38, -552, -528, -217, -125, 293, 402, -256, -770, 100, 109, -126, -23, -137, -349, 218, 415, -156, -126, 149, 554, 199, 361, 55, 75, 75, 506, 271, 112, 145, 659, 283, -86, 639, 401, 94, 203, 194, -12, -63, 239, 201, -242, 16, -81, -10, 185, 67, -493, -29, 257, -570, -358, 111, -21, -445, 225, -51, -688, -542, 325, 13, -51, 214, -26, -222, 135, -230, -42, 247, 338, 82, -16, -71, -116, -361, 301, 269, -169, 106, 10, 146, -429, 17, -60, -51, 182, 218, -333, -320, 185, 12, -452, -103, 266, -232, -369, -76, -397, -271, 353, 165, -74, -342, -7, -68, -545, 48, -23, -229, 2, -86, -431, -209, 357, 3, -104, 313, -43, -225, -122, 174, -222, 10, 255, 65, -269, 103, 116, -431, 118, 531, -299, 75, -42, -104, -209, 165, -112, -326, 161, 525, 8, -64, 276]
4570B76k43Q3O8J04n30L81L08j31n16J40L04j46K76J3m20L5M0J25m76N73k63k27
4592b26L64L43q75J97J50K76j01p7n9l41K82K12l28J3J01L02m56K02m2j79J92
4613e0J90k71J5J27J63m47L72K83m46p8J27K34n07L41j53J55L65kq84K63N02l25
4635b6j92j8Q9k6M5O48o22j38L86k82k72M62K9l29L27J68j27l71J41J53k21L01
4657A25O3m23Q2M06k41k58M35l5k61K14M5k48M0N82m40m56K51J70m82K5M90l65
4679b81Q9j54R0lL13J00j49j04M56n26l11L30L10j34Q4M9l89P0O26n02k55L43
4701E2K31n17K45M64o49QM60J64n36K06K95l00J92K49n07O2k07J34k09M13n7m20
4723b27L26L11k92k35K73o9j33L85J51o62J76L6JJ1q2K76l15J36L8j20j13K39
$$ y = [276, 33, 116, 184, 288, -242, 139, 447, 316, -200, -60, 244, 98, 374, 387, -33, 2, 42, 167, -309, 264, 1, -226, 138, 481, -394, -197, -47, 229, 128, 51, -8, -349, -67, 145, -183, -170, -69, 233, -223, -21, -63, -242, -50, 140, -131, -116, 11, 174, -273, 99, 382, -64, -142, -15, 219, -288, 53, -100, 55, 420, 418, -466, -203, 299, -26, -218, -236, -147, -173, -128, 520, -102, -240, 146, -136, -408, 54, 83, -246, 81, 249, 122, -249, -108, 45, -176, 125, 188, -235, -153, 253, 12, -246, 189, 154, -107, 107, 152, -96, -56, 526, 86, -370, -119, 51, -431, -406, 84, -281, -192, -346, -256, -259, 54, 154, 5, -99, 357, -169, -480, -150, 160, 26, 110, 159, -230, -160, 466, -36, -291, 52, 283, -234, 11, 475, -174, -166, 294, 458, -78, 128, 423, 123, 315, 564, 57, 119, -88, 46, -163, 250, 193, -227, 99, 410, 118, -117, 156, 87, -46, 339, 490, -172, 4, 40, 41, 52, -30, 246, -69, 67, 105, -15, -128, 111]
4745A11N7j1l2l21k3q5O11n66L78M70m04m34K32O7k41J42L77m91O9J68K5k04j73
4768b78M26j79L4K95l86l20J74L14m93N63J60p90K73M56l5o03M24K11n81L23K68
4789B56k19l95O25j78k53K33j17j69m4K7M17k50J16O0L4R8p8m17N8N28k35k81
4811a84M67M4p71L52N01k90m48M32M1l12j51M45l6k43L85K2k29J4O4q6j78K15
4833E4j24J74L86l57o09N91j83j72L32M77n48l00N23J13m93K08L98m73J43J15
4853B55n48j85N26Q5l3j80R1j44K01L52k15m09O24j66k84N8J41o05L67N30j59
4874C02o85L48J90n12P6K61M1k42L03P5j61j56K49k66L02j30j43k35L71Q6k84
4895b10K94K0l63K09M03j67p51P91J52n92J79J71l00m2L42J55m15r3L00l61J35
$$ y = [111, 168, 157, 125, -196, -219, -304, 307, -259, 119, 589, 185, -249, -17, 50, -191, -49, 328, -163, -94, 74, 99, -105, -278, 148, -31, 3, 298, -88, -408, -234, 80, -413, 150, 310, -480, -207, 249, 214, -389, 35, 246, -335, -12, 256, 37, -358, 267, 89, -164, 69, -48, -217, -261, -234, 183, -67, 49, 109, 143, 241, 163, -254, -196, 332, 97, -184, 283, 327, -444, -92, 409, 119, -329, 103, 144, -168, -319, 126, 90, -153, 232, 254, 25, 39, 103, 17, -161, 54, -70, 104, 490, 133, -476, 115, -68, -240, 92, 569, 21, -279, 244, 357, -136, 72, 470, -3, 140, 255, -293, -478, 48, 133, 100, -80, 11, -133, 68, 420, 205, -204, 420, 254, -30, 28, 169, -436, -69, 461, 302, -383, -35, 155, -357, -281, -20, 21, -221, 82, 157, -4, -160, 89, -177, 125, -5, -148, -383, -12, 74, -210, 84, 104, -259, -50, 353, 186, -565, 226, 378, -214, -35, 136, -164, -206, 136, 291, -124, -217, 83, -278, -143]
4916a43L41k64j19M85j2l87K59k55l20L95L29m9m72K76Q5m02K13o8n9j44M75l06
4938a42k3j53K97k52L42K14l98J72o3Q1j75j31M13l55P4P06q06J54L40k92j10
4959a07l6L41M4l30O87l90o45L34L91J6k46K49n98K34L62Oj92M5K7q1J42K5n37
$$ y = [-143, 198, -66, -185, 300, 288, -99, 160, -95, -415, -20, 309, 260, -212, 64, 149, -253, -40, -108, -167, -311, 164, -142, -165, -318, -21, -273, 69, 283, -115, 57, -6, 75, -100, -231, 182, -173, -99, 607, -199, -45, 295, 3, -107, -143, 198, 242, -88, 599, 209, -436, -102, 289, 305, 59, 308, -290, -56, 306, 312, 120, 165, 192, 111, 253, 278, -259]
$$ [...]
8191A99
##END NTUPLES=NMR FID
##END=
