##TITLE=1H_CA-8712-6
 CDCl3, 8 sc, 
 11.6.2020
##JCAMPDX= 6.0         $$ Bruker NMR JCAMP-DX V2.0
##DATA TYPE= NMR FID
##DATA CLASS= NTUPLES
##ORIGIN= UXNMR, Bruker Analytische Messtechnik GmbH
##OWNER= root
$$ XWIN-NMR		Version 3.5
$$ Thu Jun 11 10:13:24 2020 Russian Standard Time (UT+4h)  she@DPX200
##.OBSERVE FREQUENCY= 200.1315
##.OBSERVE NUCLEUS= ^1H
##.DELAY= (6, 6)
##.ACQUISITION MODE= SIMULTANEOUS
##.ACQUISITION SCHEME= undefined
##.AVERAGES= 8
##.DIGITISER RES= 18
##SPECTROMETER/DATA SYSTEM= spect
##.PULSE SEQUENCE= zg30
##.SOLVENT NAME= D2O
##.SHIFT REFERENCE= (INTERNAL, D2O, 0, 15.7039)
##AUDIT TRAIL= $$ (NUMBER, WHEN, WHO, WHERE, WHAT)
$$ ##TITLE= Audit trail, XWIN-NMR		Version 3.5
$$ ##JCAMPDX= 5.01
$$ ##ORIGIN= Bruker BioSpin GmbH
$$ ##OWNER= she
$$ F:/spectra/data/she/nmr/H-F/1/audita.txt
$$ ##AUDIT TRAIL=  $$ (NUMBER, WHEN, WHO, WHERE, WHAT)
(   1,<2020-06-11 10:12:18.64 +0400>,<she>,<DPX200>,
      <created by zg, POWCHK disabled, PULCHK disabled
       configuration hash MD5:
       00 E9 B6 7A A2 85 ED C7 34 08 36 98 17 FE 4E 26
       data hash MD5: 16K
       DE E1 AF 44 96 7F 2B 91 73 AB 39 AF 5B 9E 84 F1>)
$$ ##END=
$$ 
$$ hash MD5
$$ F7 22 4C 98 7D CB 2C 3D A2 CE DF 20 0F 1E 51 9B
##$RELAX= 
##$RELAX= 
##$RELAX= 
##$RELAX= 
##$RELAX= 
##$RELAX= 
$$ Bruker specific parameters
$$ --------------------------
##$DU= <F:/spectra>
##$EXPNO= 1
##$NAME= <H-F>
##$PROCNO= 1
##$TYPE= <nmr>
##$USER= <she>
##$AMP= (0..31)
100 100 100 100 100 100 100 100 100 100 100 100 100 100 100 100 100 100 
100 100 100 100 100 100 100 100 100 100 100 100 100 100 
##$AQSEQ= 0
##$AQ_mod= 1
##$AUNM= <au_zg>
##$AUTOPOS= <>
##$BF1= 200.13
##$BF2= 200.13
##$BF3= 200.13
##$BF4= 200.13
##$BF5= 200.13
##$BF6= 200.13
##$BF7= 200.13
##$BF8= 200.13
##$BYTORDA= 1
##$CFDGTYP= 0
##$CFRGTYP= 5
##$CHEMSTR= <none>
##$CNST= (0..31)
1 1 145 1 1 1 1 1 1 1 1 1 1 1 1 1 1 1 1 1 1 1 1 1 1 1 1 1 1 1 1 1 
##$CPDPRG= <>
##$CPDPRG1= <>
##$CPDPRG2= <>
##$CPDPRG3= <>
##$CPDPRG4= <mlev>
##$CPDPRG5= <mlev>
##$CPDPRG6= <mlev>
##$CPDPRG7= <mlev>
##$CPDPRG8= <mlev>
##$CPDPRGB= <>
##$CPDPRGT= <>
##$D= (0..31)
0 1.2 0 0 0 0 0 0 0 0.06 0 0.03 0 0 0 0 0.0002 0 0 0 0 0 0 0 0 0 0 0 0 
0 0 0 
##$DATE= 1591855938
##$DBL= (0..7)
120 120 120 120 120 120 120 120 
##$DBP= (0..7)
150 150 150 150 150 150 150 150 
##$DBP07= 0
##$DBPNAM0= <>
##$DBPNAM1= <>
##$DBPNAM2= <>
##$DBPNAM3= <>
##$DBPNAM4= <>
##$DBPNAM5= <>
##$DBPNAM6= <>
##$DBPNAM7= <>
##$DBPOAL= (0..7)
0.5 0.5 0.5 0.5 0.5 0.5 0.5 0.5 
##$DBPOFFS= (0..7)
0 0 0 0 0 0 0 0 
##$DE= 6
##$DECBNUC= <off>
##$DECIM= 24
##$DECNUC= <off>
##$DECSTAT= 4
##$DIGMOD= 1
##$DIGTYP= 9
##$DL= (0..7)
0 120 120 120 120 120 120 120 
##$DP= (0..7)
150 150 150 150 150 150 150 150 
##$DP07= 0
##$DPNAME0= <>
##$DPNAME1= <>
##$DPNAME2= <>
##$DPNAME3= <>
##$DPNAME4= <>
##$DPNAME5= <>
##$DPNAME6= <>
##$DPNAME7= <>
##$DPOAL= (0..7)
0.5 0.5 0.5 0.5 0.5 0.5 0.5 0.5 
##$DPOFFS= (0..7)
0 0 0 0 0 0 0 0 
##$DQDMODE= 0
##$DR= 18
##$DS= 0
##$DSLIST= <SSSSSSSSSSSSSSS>
$$ [...]
##$SUBNAM2= <"">
##$SUBNAM3= <"">
##$SUBNAM4= <"">
##$SUBNAM5= <"">
##$SUBNAM6= <"">
##$SUBNAM7= <"">
##$SUBNAM8= <"">
##$SUBNAM9= <"">
##$SW= 24.9337058887773
##$SWIBOX= (0..15)
0 0 2 0 0 0 0 0 0 0 0 0 0 0 0 0 
##$SW_h= 4990.01996007984
##$TD= 16384
##$TD0= 1
##$TE= 0
##$TE2= 300
##$TE3= 300
##$TEG= 300
##$TL= (0..7)
0 120 120 120 120 120 120 120 
##$TP= (0..7)
150 150 150 150 150 150 150 150 
##$TP07= 0
##$TPNAME0= <>
##$TPNAME1= <>
##$TPNAME2= <>
##$TPNAME3= <>
##$TPNAME4= <>
##$TPNAME5= <>
##$TPNAME6= <>
##$TPNAME7= <>
##$TPOAL= (0..7)
0.5 0.5 0.5 0.5 0.5 0.5 0.5 0.5 
##$TPOFFS= (0..7)
0 0 0 0 0 0 0 0 
##$TUNHIN= 0
##$TUNHOUT= 0
##$TUNXOUT= 0
##$USERA1= <user>
##$USERA2= <user>
##$USERA3= <user>
##$USERA4= <user>
##$USERA5= <user>
##$V9= 5
##$VALIST= <valist>
##$VCLIST= <CCCCCCCCCCCCCCC>
##$VD= 0
##$VDLIST= <DDDDDDDDDDDDDDD>
##$VPLIST= <PPPPPPPPPPPPPPP>
##$VTLIST= <TTTTTTTTTTTTTTT>
##$WBST= 1024
##$WBSW= 4
##$XGAIN= (0..3)
0 0 0 0 
##$XL= 0
##$YL= 0
##$YMAX_a= 805015
##$YMIN_a= -484110
##$ZGOPTNS= <>
##$ZL1= 120
##$ZL2= 120
##$ZL3= 120
##$ZL4= 120
##$ABSF1= 10
##$ABSF2= 0
##$ABSG= 5
##$ABSL= 3
##$ALPHA= 0
##$AQORDER= 0
##$ASSFAC= 0
##$ASSFACI= 0
##$ASSFACX= 0
##$ASSWID= 0
##$AUNMP= <proc_1d>
##$AZFE= 0.1
##$AZFW= 0.1
##$BCFW= 1
##$BC_mod= 2
##$BYTORDP= 1
##$COROFFS= 0
##$CY= 11.3945322036743
##$DATMOD= 1
##$DC= 2
##$DFILT= <>
##$DTYPP= 0
##$F1P= 16.9975609425685
##$F2P= -3.02152046262296
##$FCOR= 0.5
##$FTSIZE= 0
##$FT_mod= 4
##$GAMMA= 1
##$GB= 0.15
##$INTBC= 1
##$INTSCL= 1
##$ISEN= 128
##$LB= 0.24
##$LEV0= 0
##$LPBIN= 0
##$MAXI= 10000
##$MC2= 0
##$MEAN= 0
##$ME_mod= 0
##$MI= 1.114404
##$NCOEF= 0
##$NC_proc= 0
##$NLEV= 6
##$NOISF1= 3.799351
##$NOISF2= 2.8
##$NSP= 1
##$NTH_PI= 0
##$NZP= 0
##$OFFSET= 15.70392
##$PC= 1
##$PHC0= -9790.743
##$PHC1= 14.40088
##$PH_mod= 1
##$PKNL= yes
##$PPARMOD= 0
##$PSCAL= 0
##$PSIGN= 0
##$REVERSE= no
##$SF= 200.130013532006
##$SI= 16384
##$SIGF1= 3
##$SIGF2= 2
##$SINO= 400
##$SIOLD= 16384
##$SREGLST= <1H.CDCl3>
##$SSB= 0
##$STSI= 0
##$STSR= 0
##$SW_p= 3612.71676300578
##$SYMM= 0
##$S_DEV= 0
##$TDeff= 0
##$TDoff= 0
##$TI= <>
##$TILT= no
##$TM1= 0
##$TM2= 0
##$TOPLEV= 0
##$USERP1= <user>
##$USERP2= <user>
##$USERP3= <user>
##$USERP4= <user>
##$USERP5= <user>
##$WDW= 1
##$XDIM= 8192
##$YMAX_p= 0
##$YMIN_p= 0
$$ End of Bruker specific parameters
$$ ---------------------------------
##NTUPLES= NMR FID
##VAR_NAME=  TIME,          FID/REAL,        FID/IMAG
##SYMBOL=    X,             R,               I
##VAR_TYPE=  INDEPENDENT,   DEPENDENT,       DEPENDENT
##VAR_FORM=  AFFN,          ASDF,            ASDF
##VAR_DIM=   8192,          8192,            8192
##UNITS=     SECONDS,       ARBITRARY UNITS, ARBITRARY UNITS
##FACTOR=    0.0002004,     1,               1
##FIRST=     0,             0,               0
##LAST=      1.6414764,     0,               0
##MIN=       0,             -484110,         0
##MAX=       1.6414764,     805015,          0
$$ Real data points
##PAGE= N=1
##DATA TABLE= (X++(R..R)), XYDATA
0 0 0 0 0 0 -8 8 -1 8 -16 16 -20 27 -32 40 -49 61 -72 89 -104 123 -142 166 -194 226 -258 297 -339 387 -437
29 -437 494 -562 628 -703 791 -885 984 -1097 1221 -1351 1500 -1663 1839 -2035 2256 -2499
45 -2499 2769 -3074 3421 -3816 4274 -4810 5447 -6222 7186 -8423 10082 -12424 16009 -22227
59 -22227 35926 -127540 326160 627526 -61703 -484110 -242461 219272 218931 -37825 -163669
70 -163669 27575 239828 250036 53905 -80801 -52920 86417 197837 260716 223258 64937
81 64937 -115381 -47221 244712 341519 36166 -177103 88992 396947 178601 -251877 -235262
92 -235262 188164 405986 161327 -199699 -233973 61620 273369 113729 -160413 -146200
102 -146200 94786 179959 24605 -100448 -51433 16014 3703 33004 124574 67454 -152043
113 -152043 -182821 101033 282761 60671 -240928 -197382 101025 258808 96425 -187831
123 -187831 -243382 10623 217075 68891 -196815 -171376 62121 113389 -71362 -190010
133 -190010 -101916 12297 2869 -45062 -43268 -71999 -152185 -130302 15804 59569 -79652 -167520
145 -167520 -56607 74019 22857 -149184 -207577 -23890 215382 171677 -143361 -290775
155 -290775 -46460 233335 169041 -88537 -149317 37844 179249 89796 -76502 -89668 36957
166 36957 131516 121270 49938 -34839 -71007 -6948 90110 106535 42535 -25264 -45988 315
178 315 61923 32268 -61853 -53374 65781 92787 -32072 -119299 -49175 54767 47181 -37618
190 -37618 -60585 7462 47081 -11732 -74660 -48045 21201 53178 36709 -11971 -53314 -33192
202 -33192 22943 36932 18873 20516 14113 -20674 -16483 38163 49733 -2464 -29232 9401 55929
215 55929 49965 -7647 -52283 -25637 38605 62064 30287 -15960 -44099 -28230 19123 35395
227 35395 5212 -12521 -2635 -4423 -9816 999 -6021 -26854 -3583 39518 21433 -32196 -36351
240 -36351 -199 12813 -195 -4298 12778 28892 7686 -41265 -50654 4549 58287 52112 -3823
253 -3823 -55896 -46572 22133 53291 -353 -45274 -7001 37077 17222 -23229 -37695 -30652 1186
266 1186 41462 32200 -24409 -52626 -26562 7569 11675 -6621 -13772 5428 16034 -16973 -48522
279 -48522 -25689 22079 35647 10025 -28821 -41871 -1431 43946 16230 -43980 -34195 28211
291 28211 47112 10025 -28859 -36308 -5822 38371 38723 -8670 -36340 -10192 25790 29936 1500
304 1500 -28983 -23738 11881 26715 11556 -1432 -8050 -18793 -13938 4580 4584 -1823 12284 14197
318 14197 -17104 -32475 -12981 1483 2312 9312 11846 -1244 -11831 -18748 -26480 -17386 12605
331 12605 31289 23874 -1676 -31102 -38699 -12417 12995 19368 29749 32264 -7137 -50616 -34968
344 -34968 14568 37891 32201 14944 -2396 -3874 2479 -10120 -22120 8313 53492 55749 15914
357 15914 -28179 -44810 -17148 32021 52399 32901 7217 -8910 -15455 -5794 4578 1067 10454
370 10454 38019 34034 -10890 -38089 -24443 1096 20687 26434 7799 -11493 -6573 -3769 -23593
383 -23593 -28556 1295 29000 23235 -9525 -39942 -34381 -52 11757 -7192 -14154 -2926 -3625
396 -3625 -11180 -11886 -19247 -25304 -7203 11875 990 -15031 -12588 -11788 -16996 -12463 -3932 -1390 2699
411 2699 2215 -8825 -12746 -5016 -3114 -3782 3373 6499 4910 13279 13393 -9782 -20306 4915 28258
426 28258 26711 16760 4580 -5547 3350 18246 10928 2971 19638 33367 17430 -4490 -10480
439 -10480 -3236 12486 22900 15943 5472 3941 -4170 -16581 -13070 -970 4878 10859 9791 -13837
453 -13837 -34172 -23640 -7138 -6357 -2544 1937 -11517 -23792 -16184 -14339 -22956 -14412 6171 9422
467 9422 -4092 -16490 -20925 -13625 -112 5400 6335 11645 7394 -8289 -9783 3256 8230 11820
481 11820 20282 14921 332 3762 11467 1743 -1007 16640 24501 12781 3146 -538 -5046 1557
495 1557 14425 12330 2822 2329 3323 -1196 -2395 -2216 -453 7789 12121 1458 -6212 -2277 -873
510 -873 800 10453 11079 -2475 -1071 13103 7710 -6467 118 13781 12446 8008 6196 -2663 -4926
525 -4926 6591 11452 3109 -2137 -1454 -2067 -1846 -5747 -12522 -9927 -1487 -6380 -16698 -15301 -15306 -22090
541 -22090 -18639 -9037 -15385 -23556 -18625 -16856 -22795 -19215 -12461 -16489 -15400 -6442 -7875 -15301 -10796
556 -10796 -2817 -1646 2363 7818 4706 3049 8236 10327 10702 16253 18089 15452 21132 23751 13111
571 13111 8639 20189 24756 18918 19281 18302 8353 7259 14303 11249 4553 7379 9361 3132 -139
586 -139 -3017 -11447 -9964 2139 2536 -7061 -12522 -14913 -15907 -8867 -4956 -13027 -13025 -905 -1882 -14671
602 -14671 -17874 -11426 -5379 3974 8045 -2925 -11388 -5528 -742 -246 4403 6402 844 3666 10130
617 10130 465 -11814 -5495 8266 12757 9402 -1795 -14932 -9695 5859 5603 -7175 -8787 -1304
631 -1304 2300 456 -9965 -19695 -9762 10609 9975 -6589 -10797 -4658 -1281 4766 7495 -903 -3969
646 -3969 9042 16653 9765 3046 2051 5729 18088 26120 13151 -800 7850 23024 22452 10077
660 10077 -419 2481 19726 28109 10072 -8843 -3597 7377 7259 4332 -283 -7209 -3999 3868
674 3868 -6274 -22809 -18608 -4504 -2215 -4656 -7755 -20824 -31233 -20579 -2364 889 -10327
687 -10327 -19951 -15841 -3684 -6563 -22259 -19845 3881 14956 3743 -9094 -16808 -16487 1561
700 1561 20781 13240 -3679 -1389 5932 509 -1337 5612 6927 7803 16306 15877 -3143 -17479 -8162
715 -8162 15650 28454 13522 -11405 -14647 3227 10703 2826 -2928 -1607 5502 14970 5895 -20345
729 -20345 -21522 10732 27270 8018 -9515 -9129 -5146 2182 13143 9213 -5974 -5580 8800 11442
743 11442 -1043 -10257 -4638 11755 18784 5423 -12159 -13389 -994 13346 17531 -479 -20480
756 -20480 -9310 15656 8701 -15473 -11836 7990 8486 -3464 -10065 -13050 -9023 6633 13093 -1730
770 -1730 -15843 -12190 -2153 2835 3300 345 -2555 -3075 -2942 -55 1237 -3970 -5037 10856 19056
785 19056 -1936 -19982 -5462 14310 12515 5347 3514 -1604 -3376 6074 8119 -912 -230 10947
799 10947 10985 1059 -5150 -4044 641 6286 9546 7627 -366 -10975 -9454 7532 13322 -3640 -11798
814 -11798 3646 10525 -4133 -12524 -5807 880 5537 8722 -2702 -17924 -11668 7359 9042 -4020
828 -4020 -10576 -5585 2193 2067 -6095 -10551 -4282 2134 2475 1166 -6608 -15586 -6716 11246 7093
843 7093 -11497 -11302 1902 3300 -1425 -2730 -6734 -7397 6089 12447 -2915 -16903 -7526 9682
857 9682 11408 -900 -9158 -2894 6820 4972 -2070 -2334 -532 1423 8371 9272 -5430 -12392 4717
872 4717 15496 2931 -5059 2716 3219 -1922 3505 7994 -1246 -5320 6358 12514 1624 -8406
886 -8406 -4283 6661 9864 3709 -475 210 -2565 -2251 7318 9102 -3223 -5331 9860 9161 -8469
901 -8469 -9312 6525 8558 1972 4807 2476 -10280 -9333 7537 12781 1385 -5324 -1295 907 -2138
916 -2138 -3375 435 2717 999 2216 3926 -5745 -18043 -5985 16589 12269 -9057 -11044 -1581
930 -1581 -3658 -5663 2710 3087 -4187 -16 4900 -8256 -18727 -5403 11476 9291 -1459 -6062
944 -6062 -8126 -10027 -6768 4948 11773 1524 -9700 -4400 2956 -6232 -11162 4055 15235 5677
958 5677 -4252 -5399 -9456 -7598 10020 17820 2892 -7246 -491 1802 -4774 -1422 9526 10344
972 10344 2235 -2355 -130 84 -4122 -1352 10624 14605 743 -10016 -6085 -22 2303 9605
986 9605 9416 -5270 -10381 2439 4750 -7362 -4917 8960 7219 -6164 -8546 -4127 -4178 -1813 6123
1001 6123 7539 -3595 -14995 -12483 1716 8644 1749 -4591 -4124 -5975 -6601 -655 182 -5520 798
1016 798 12235 988 -19287 -15304 4457 11657 6676 2783 -4307 -12027 -7379 4217 8043 3905
1030 3905 1271 2371 2786 -2738 -8548 -4541 8508 15883 12744 2186 -11933 -15464 2731 21422
1044 21422 14393 -1802 -1447 5234 591 -3107 913 5112 9361 15562 9745 -7689 -15194 -2545
1058 -2545 13779 18564 9726 -3324 -7732 -2242 3759 5803 4878 1118 1751 8880 6107 -10818 -15308
1073 -15308 3196 16595 9379 -1857 -8334 -10751 -4753 6959 6795 -5428 -7810 415 2146 -4656
1087 -4656 -10345 -9174 -1182 4953 1408 -8453 -14589 -12966 -3415 6244 2041 -14194 -17529 -3602
1101 -3602 3175 -4048 -10490 -9572 -7031 -602 2208 -7847 -17133 -8495 5460 5489 -5490 -12827 -10900
1116 -10900 -681 7971 4448 -5940 -9572 -3682 5245 8527 615 -8726 -2598 11915 11280 -2699
1130 -2699 -7534 -688 7928 13511 9729 -3390 -7600 5244 14638 8071 -676 674 6466 10913
1144 10913 8240 -43 -3002 5117 12722 12132 5950 -1219 -3937 5507 15045 10399 -316 -140 6029
1159 6029 8936 8515 3639 -2437 1168 13509 13928 1833 -4575 -334 6209 9285 8447 1562 -2958
1174 -2958 -580 3762 4352 2762 -1325 -4088 1398 6929 438 -9682 -9242 -2506 3208 3920 -3750
1189 -3750 -15138 -13070 -392 1789 -7567 -11547 -6579 -3369 -4849 -9958 -14488 -11266 -1386 1652
1203 1652 -5034 -12151 -15078 -10971 -1609 2286 -5029 -10748 -6487 -2320 -4317 -6643 -8694 -7024 2863
1218 2863 9402 -1066 -15772 -13650 214 7697 6140 -298 -5873 -4657 -151 -239 -2237 1682 4729
1233 4729 4393 3263 546 -4894 -4771 3452 9899 10611 7938 809 -6207 -1325 9671 11559 7287
1248 7287 7311 7497 4891 4024 4201 4583 9399 15148 13141 6199 2703 2207 4972 11449 13644 8604 4380
1265 4380 5642 6201 4364 4040 2494 3198 9774 11342 -159 -9917 -3707 6739 7875 1409 -6400
1280 -6400 -8168 -1081 4696 -342 -9005 -9218 -4185 200 -42 -5853 -11396 -7890 -1118 -2365 -7680
1295 -7680 -8291 -6921 -4240 684 -376 -9716 -13512 -6186 -107 -674 -1605 -2970 -6004 -7025 -5257 -4838
1311 -4838 -2769 1336 2247 -1227 -4703 -7788 -7565 -1925 2789 3053 2090 131 -6463 -9225 -2080 3991
1327 3991 1872 1624 5208 2448 -5346 -7027 -4147 923 9478 13321 3886 -8257 -9199 -500 6989
1342 6989 9021 4570 1027 2366 3803 25 -3520 -1487 3746 10946 13752 3633 -10450 -8664
1356 -8664 4543 9804 6900 4399 1056 -1714 419 2237 -1662 -2182 5609 9478 3628 -3401 -5442
1371 -5442 -2506 3017 4522 2405 1306 1023 -639 -2170 -1065 -1731 -1013 4486 5701 -1384 -5710 -2182
1387 -2182 -553 -868 2184 2520 -3207 -4228 1172 1698 -2268 -4125 -2402 -833 1357 2407 -965 -4987
1403 -4987 -6049 -2576 2518 3692 -2423 -6106 -1672 2502 -258 -3042 -3534 -3708 471 6968 3816
1418 3816 -6998 -8186 341 5170 2365 -17 -851 -531 1447 1698 -2369 -3128 1848 6040 4906 46
1434 46 -4524 -2729 3834 4742 802 -153 2558 1738 739 330 -2742 -2777 4429 8734 1667 -5600 -3923
1451 -3923 527 2073 3073 1954 -2232 -2244 1159 1076 -1723 -3242 -1867 1484 3308 230 -4781 -4189
1467 -4189 -1988 -1082 602 1882 -1727 -5782 -2826 -524 -2302 -2199 380 -1592 -3527 -918 -413 -4865
1483 -4865 -4919 70 2052 -47 -2793 -3887 -2825 205 551 -1284 -749 785 200 -669 -1211 -2576 -354
1500 -354 5427 4659 -1510 -2480 833 1701 2670 4544 2713 -392 2694 5848 2204 -1152 1331 5450
1516 5450 7127 6301 2403 -2003 690 5756 7185 4793 2560 2016 3543 4451 940 -727 3686 6654
1532 6654 3335 576 778 -406 -1940 1415 2982 -105 -398 621 -2488 -5150 -3159 -1292 -1964 -1407
1548 -1407 -1193 -3580 -6286 -5979 -4569 -3357 -2195 -3559 -4551 -3182 -3768 -6480 -5506 -2444 -1907 -2037 -641
1565 -641 -2526 -5722 -4068 -1378 -1688 -439 3132 947 -3167 -2159 547 -504 -696 2164 3893 2928
1581 2928 778 -974 -2008 311 3112 3499 3621 3023 375 -978 94 -637 628 4612 5174 1581
1597 1581 -193 150 -1815 -1301 3576 6255 2510 1091 2044 1 -2049 379 3463 4466 4721 3308
1613 3308 -32 -1697 -407 675 2954 4518 3047 930 -121 -1972 -3791 -624 2840 1442 238
1628 238 528 -2691 -6580 -4750 -329 -960 -2622 -1409 -1547 -5062 -5749 -5716 -4708 -1716 502 -1209 -3981
1645 -3981 -4361 -4349 -4018 -1419 -125 223 2062 1548 -2001 -1903 1313 1466 1113 5291 7867 3729 359
1662 359 1375 2928 3411 5392 6627 6348 5068 3583 -468 -348 3426 5748 4757 3406 1256 -341
1678 -341 -47 -1794 -3247 375 4927 1926 -3867 -4248 -3380 -4972 -4276 239 1494 -621 -2966 -5583
1694 -5583 -6911 -3452 555 -114 -991 -413 -732 -2582 -3861 -3426 -47 3724 2256 -608 143 -273 -4482
1711 -4482 -3115 4227 6522 543 -2930 -1153 -370 -644 -469 -678 -300 2074 2030 -3212 -6305 -2321 1713
1728 1713 918 -2106 -2738 227 980 -3665 -5651 -380 3637 1008 -780 913 14 -1977 1187 4167
1744 4167 1459 509 3353 3295 1808 3044 3718 675 1306 5978 6826 2424 -953 995 4692 4017 84
1761 84 234 3781 3004 -1666 -1767 1247 508 -1963 -1294 -645 -1877 -1018 -815 -5318 -6627 60 2505
1778 2505 -3563 -6512 -2708 -246 -2646 -3835 -2104 -262 -481 -1453 -1594 -662 -779 -749 1656 2316 -153
1795 -153 -128 2808 1825 -185 1667 3357 1345 2073 4729 1465 -3478 239 6589 4124 -2086 -2288
1811 -2288 1447 3078 1027 -1648 -2289 365 2451 1067 -1903 -3698 -2042 1208 2069 -2181 -3460
1826 -3460 594 856 -3407 -3282 1527 1359 -1567 -427 973 -2229 -2225 1278 1732 -553 -351 1525 1246
1843 1246 -679 -2156 -883 1450 2964 1433 -623 -1894 -2571 -265 2626 1059 -1701 349 2558
1858 2558 -1874 -5443 -1469 2677 1952 307 -838 -2564 -2333 -84 -478 -1744 526 3331 2181 -2444
1874 -2444 -4968 -2792 2259 4623 2075 -1152 -1142 -1157 -1088 451 1293 577 1715 4453 427 -5046 -3086
1891 -3086 1892 3665 2398 1777 -475 -2272 -932 12 -1013 427 3000 2798 -532 -3284 -3390 283
1907 283 3447 1241 -1232 -197 1091 -745 -1804 -437 510 1051 3067 1094 -2945 -1885 2595 2607
1923 2607 -329 -391 965 1581 1165 309 -940 278 2681 1607 -453 -954 572 2340 3044 180 -3668
1940 -3668 -1126 3553 2784 -553 -420 323 -23 -204 -320 -1770 -432 3849 3765 -1899 -5223 -3142 460
1957 460 2872 1819 -883 -1822 -300 -1527 -3880 -2693 301 2474 2582 -1213 -6889 -6119 -340 1968
1973 1968 -272 -1027 23 -1979 -4212 -4407 -3394 -314 3572 3393 -1722 -5201 -4238 -899 1228 1645
1989 1645 572 869 1725 -991 -4311 -2289 1966 4840 4552 2035 -2192 -3097 1505 3720 1388 1382 3998
2006 3998 3584 7 -1394 -583 1778 5166 5322 1231 -1909 -52 2626 2091 304 24 2149 3568
2022 3568 1044 -2920 -2027 1404 2543 1124 59 -1836 -2593 357 1974 -902 -2918 142 1153
2037 1153 -1120 -2447 -1750 -659 140 -247 -2593 -3545 -900 1037 -142 -2269 -2746 -1170 1123 -131
2053 -131 -3751 -2175 2240 2693 -1255 -3402 -2231 11 2611 2676 -1103 -2983 404 2808 -1 -1562
2069 -1562 31 2725 3145 935 -1514 -2107 1242 4006 2633 6 -876 403 2134 1830 -944 -1734
2085 -1734 2613 4858 905 -3055 -2728 -11 2806 3314 -202 -3262 -859 2521 1173 -2502 -1586 1087
2101 1087 1928 1101 -1404 -2743 -763 970 459 -417 -35 -94 -971 -1115 -1256 -1524 646 1275 -1544 -3490
2119 -3490 -1819 -65 -1009 -1447 -1369 -1787 -774 75 -2510 -4197 -2166 366 856 -992 -2827 -3402 -644
2136 -644 1531 -714 -2531 420 2953 926 -1838 -2000 -249 3272 5184 1692 -2508 224 4744
2151 4744 4425 1187 283 2435 5087 5342 1092 -1855 151 4571 5880 3673 -158 -2673 -274 3513
2167 3513 2201 -1784 -1079 1934 854 -1768 -2683 -3164 -1723 1386 1131 -2755 -4717 -2864 -1256 -1651
2183 -1651 -2345 -1531 -307 -244 -2664 -4192 -1668 1038 1210 716 424 -1182 -1231 967 1484 -106 1778
2200 1778 3728 1557 -1747 -157 2966 2217 1579 1460 1024 725 1409 829 -1004 -366 1981 3538 1112
2217 1112 -3100 -3641 867 3705 1592 -2708 -2920 -1030 371 1656 235 -3008 -1637 3078 2658 -2921
2233 -2921 -3660 1228 3635 2837 679 -2034 -1703 992 3270 2214 -47 -369 1139 1916 -909 -3008
2249 -3008 -321 3880 2439 -2259 -3529 -2617 -2046 -282 1176 -1553 -4264 -3030 -1624 -4064 -5282
2264 -5282 -2003 -230 -1971 -3233 -4152 -4246 -3962 -2202 -1073 -135 -876 -2718 -3427 -2516 -1356 1167 3760
2281 3760 1791 -2109 -921 2695 2831 773 2563 4400 3123 3353 2935 794 148 5227 7985 4762
2297 4762 184 -145 2721 4675 3732 1601 1730 3257 3169 1349 -90 -861 1495 4933 3730 -1745
2313 -1745 -3526 961 3279 836 -610 78 -113 117 1150 -353 -2070 -724 2775 2212 -1054 -2820
2329 -2820 -1539 853 1863 736 -589 -1089 -1458 -1144 655 -316 -1942 -1092 630 -1844 -4198 -1856
2345 -1856 80 -2210 -3004 -1507 -1720 -3654 -3958 -2578 -2099 -1715 -1214 -3285 -5069 -3818 -1102 -330 -2246
2362 -2246 -3789 -2210 -135 -1068 -3684 -2789 565 887 -68 -550 -1941 -2604 978 4041 1038 -1800
2378 -1800 399 2671 1813 232 358 582 1873 3682 3054 -847 -1359 1504 4093 3609 329 -1015
2394 -1015 1343 3115 1587 -187 824 1462 1710 2450 1700 -1280 -334 3474 2894 271 321 1508 818
2411 818 810 2035 1626 347 1258 1840 1060 628 963 913 1454 1175 765 814 490 -586 99 2030 1715 -1033
2431 -1033 -855 960 306 -183 -233 -920 -1529 -233 1064 -825 -2746 -1789 309 168 -907 -1887 -2830 -1507
2449 -1507 9 -443 -2316 -2585 -1634 -410 153 -2011 -3857 -1632 645 -179 -1963 -2708 -2485 -1138 824
2466 824 -552 -3732 -2547 604 798 -2179 -2353 -544 -483 648 369 -1173 -1701 -189 1106 220 -33
2483 -33 -102 -270 212 978 743 567 600 817 1236 2124 376 -905 1228 3253 1399 26 1182 1528 455
2502 455 891 2094 984 976 1413 474 -304 434 1233 226 90 1206 1144 23 -1395 -971 949 1993
2520 1993 202 -1852 -697 816 -358 -1364 -242 -232 112 450 -55 -2167 -1470 1027 571 -751 -13
2537 -13 373 -758 -1069 161 414 -393 -631 13 707 356 -1147 -1405 878 1697 325 -483 -59 121 438
2556 438 675 140 -858 1002 2051 -156 -1318 897 1264 -19 -44 1365 1263 497 264 -128 561 1050
2574 1050 358 -228 834 1122 45 86 323 -332 356 1463 582 -981 -339 959 -735 -1126 820 616
2592 616 -1030 -605 326 -414 -1384 -1392 -443 329 376 -1461 -1998 -1329 -651 -813 -1066 -777 -1095 -548 -414 -2020
2612 -2020 -2818 -642 789 -935 -1331 -158 -847 -2018 -526 120 -762 -744 -208 235 -743 -864 -703 -246
2630 -246 975 1133 329 -73 -106 20 715 1339 395 -60 2245 2142 -9 -349 1342 814 890 2208 2121
2649 2121 0 -310 1411 1332 337 1133 1736 1010 919 702 -67 337 632 622 1260 1023 -397 -719 581
2668 581 287 -1061 263 1500 29 -985 363 -331 -1743 -40 1474 353 -1217 -598 -374 -480
2684 -480 -648 -139 8 639 227 -612 -673 -485 -549 197 1259 86 -899 -132 289 -1081 -582 981 261
2703 261 -866 -163 609 -907 -1350 99 386 -282 -393 -452 -1191 -515 258 -264 -790 -294 191 14 -821
2722 -821 -1458 -673 902 690 -1384 -1031 322 -288 -374 605 377 -1020 102 1591 49 -465 -53 218
2740 218 -53 677 1006 -879 -906 419 651 16 -638 -685 308 787 -498 -1791 -491 1126 158 -839 -335
2759 -335 -632 -790 465 390 -883 -1082 555 255 -736 73 129 -164 373 1017 697 -607 -407 354 1397
2778 1397 1594 484 -566 1045 1946 1049 -33 462 909 740 1465 800 -476 -189 1431 662 9 676
2796 676 86 -538 127 773 -200 -454 -206 119 -98 207 -662 -974 1 767 -229 -1008 -486 -86 45 377
2816 377 -746 -1884 -299 1337 492 -671 -27 -198 84 599 131 -713 -215 694 819 -275 -503 -1014
2834 -1014 -574 1452 1510 -427 -1193 -505 -341 -208 632 76 -712 273 809 -1096 -2477 -674 882 1002
2852 1002 1152 -88 -1940 -1439 -110 272 564 946 235 -452 -239 -927 -1519 -198 1857 1320 382 -33
2870 -33 -1303 -1981 287 1961 723 -288 457 14 -1283 -792 -242 149 988 1380 -336 -1891 -1545 -831
2888 -831 488 1778 1093 -989 -877 -334 -882 -506 633 7 -706 1021 759 -1592 -1793 608 924 461
2906 461 247 -350 -792 -95 1095 854 -60 -40 181 678 746 -292 -621 297 852 160 400 830 -393 244
2926 244 1740 736 -1327 -337 1095 929 591 552 132 -613 158 1207 303 -177 667 1032 108 -573 -865
2945 -865 -711 1051 1565 1074 114 -943 -1864 -250 1823 837 -689 666 760 -1133 -1792 -259 254 105
2963 105 1581 1077 -1485 -2696 -839 737 797 700 234 -445 -980 -944 -932 -165 201 194 644 471 -1901 -2552
2983 -2552 -153 1323 247 -18 311 -1063 -1909 -467 547 -534 157 1131 314 -882 -1386 -672 -385
3000 -385 544 756 -4 -475 -1331 -1176 352 1060 -457 -747 470 526 -810 -809 242 -105 22 1208 174
3019 174 -1615 -623 1030 546 -178 22 368 56 509 472 -563 -384 56 713 1260 237 -999 -178 1392
3038 1392 867 -489 -201 404 69 241 1572 402 -1256 3 1466 208 -639 115 749 258 225 430
3056 430 -4 527 -78 376 713 202 -689 -214 1114 106 -496 351 312 -580 -109 1077 -20 -1333 568
3075 568 1269 -206 -735 252 342 -147 291 619 20 -701 -372 665 349 -295 -1046 476 1285 -134 -831
3094 -831 -175 326 -340 538 869 -827 -1904 849 1418 -692 -1214 419 252 -508 -102 -402 -809 -378
3112 -378 646 348 -272 -1101 -760 16 193 -570 -382 609 -387 -1259 -409 178 -769 -413 1384 217 -2145
3131 -2145 -1224 353 35 -763 547 808 -369 -1314 -896 -530 -102 516 551 497 -491 -1089 -640 261 -346
3150 -346 48 1628 894 -1687 -1734 684 432 104 1014 1457 -555 -801 126 -30 -367 767 2158 1059
3168 1059 -732 -887 -486 370 1185 1207 1349 475 -204 -411 367 301 236 1379 2264 12 -1492 -224 979
3187 979 334 416 1533 541 -323 150 493 -663 243 1709 1295 -89 -1028 -393 522 455 -596 38 721
3206 721 163 -499 -238 -57 -812 -23 1201 -451 -2063 -226 1419 -1 -1448 -446 -114 -548 64
3223 64 403 -525 -1332 -288 -339 -642 -975 -348 874 986 -905 -1647 -930 260 -187 219 639 -568 -701
3242 -701 42 60 -1185 -399 1952 1742 -456 -1117 -457 -761 127 1441 1215 353 157 205 -457 -413 3 1159
3262 1159 1452 502 -1023 -852 -363 -589 141 1515 1465 -719 -1181 -531 -923 -188 1163 1197 -785 -594 -124
3281 -124 -494 -1120 -443 685 860 511 -504 -1496 -753 22 865 888 764 -602 -514 854 182 -693 -194
3300 -194 1353 921 -33 -398 -1080 -504 1340 1354 -709 -1098 369 816 -236 -831 -634 -63 919 390 -1046
3319 -1046 -878 161 249 89 -50 -616 -660 381 1140 -368 -513 279 218 -151 528 479 26 323 1034 -4
3339 -4 -125 430 845 759 478 487 -119 319 792 -143 -388 773 945 225 -705 -761 -348 759 1050 -430 -761
3360 -761 467 34 -1135 -817 119 317 -181 -719 -947 -701 21 445 -662 -663 -117 205 -379 -166 -542 -493
3380 -493 558 643 312 -183 -240 -575 437 1198 357 -394 -125 808 -13 -483 -153 -363 187 342 -273 -1372
3400 -1372 -212 576 -953 -1251 -284 141 -633 -1015 -1225 -794 -52 254 -1229 -1741 -448 25 -77 -611
3418 -611 -592 -512 120 75 -693 -974 295 578 33 355 475 -285 1 691 428 -195 481 1451 785 -57 -196
3439 -196 -330 1043 1800 1033 -47 -222 736 968 704 -257 21 1027 1956 404 -1281 -431 964 818
3457 818 676 649 -34 -252 305 799 -207 314 1154 628 -206 505 580 146 263 976 951 414 -11 -346 263
3478 263 382 264 -61 942 840 -853 -546 198 -37 -61 321 -228 -1028 -682 -10 -629 -654 87 -45 -1033
3498 -1033 -561 -88 -70 -836 -1400 -873 89 535 -344 -1509 -810 25 -115 -304 -717 -1180 -562 771 -133
3517 -133 -1187 -1008 21 -290 -231 160 -484 -1196 -228 98 -272 -554 -143 292 271 -170 -976 -742 310 338
3537 338 -99 -154 178 51 8 258 -628 -298 1225 1598 -341 -910 -369 298 517 892 776 -60 316 723
3557 723 99 186 319 697 711 362 365 -86 63 119 294 665 1245 148 -231 501 199 -45 762 676 -54 -174
3579 -174 569 456 -172 378 734 732 725 713 61 -149 220 842 288 243 221 327 568 247 -621 9 690 380
3601 380 -512 -17 9 -268 -368 316 -470 -1095 -78 321 -553 -1194 -655 -861 -595 46 -235 -997 -871 -525
3621 -525 -594 -554 -657 -748 -652 558 -371 -964 -577 -76 -146 -278 199 -213 -685 -91 -210 -620 -6 486 291
3642 291 -515 -75 -69 -326 65 160 -61 11 -274 -132 -312 112 -236 -148 642 7 -374 -157 235 -100 12 518
3664 518 329 -192 276 352 -428 123 497 454 -243 302 663 221 330 314 151 519 933 193 -63 419 373
3685 373 165 612 436 -124 -124 622 313 -436 275 280 -319 -8 -32 -303 -468 55 43 -293 -204 -10 -393 34
3707 34 322 -317 -324 22 252 88 -171 162 -181 156 309 -95 -241 160 70 -241 142 206 59 -15 436 20
3729 20 -66 417 550 -44 443 382 86 171 552 467 -21 607 241 -82 351 -14 -82 -170 305 236 -279 -334 172
3752 172 197 -319 -226 -193 -278 -95 140 -57 -220 -296 -400 -461 70 -510 -815 77 -362 -1076 -619 -226 -545 -832
3774 -832 283 -492 -959 -497 -181 -633 -504 -276 -160 -453 -153 -94 -587 -366 -2 -266 107 54 -819 -642
3794 -642 250 328 -208 42 222 -385 -577 493 573 -289 271 658 571 -18 -162 -277 309 464 424 125 -180
3815 -180 -262 134 674 384 -171 378 758 367 -168 240 595 349 948 1090 -72 -810 526 1017 414 132
3835 132 338 1045 507 294 413 44 744 591 448 177 -107 -214 522 608 -171 -639 15 155 -823 -306
3855 -306 100 -522 -757 9 -84 -798 -949 -234 -140 -416 -551 -452 -705 -627 -550 125 -125 -289 -661 121 140 -76
3877 -76 -52 340 -249 -193 713 504 -895 -777 900 1181 -150 -575 -50 -98 116 421 69 -672 -198 458
3897 458 59 -874 -495 52 527 353 -797 -1097 -329 -301 22 204 -325 -1169 -576 871 34 -1371 -213
3916 -213 936 231 -441 -166 -44 -239 487 647 296 -191 -83 742 341 461 465 555 288 27 -178 487 321
3937 321 -311 485 860 -213 -861 267 695 -192 -134 503 -290 -866 -354 468 -234 -443 -234 -260 -32 96
3957 96 -187 -266 -369 292 469 241 -642 -821 322 917 242 -720 385 673 562 711 188 -556 93 1247
3977 1247 627 -688 -423 574 580 394 -370 -280 -137 210 321 103 12 -650 -44 651 -18 -1460 -1010 594
3997 594 764 -856 -481 -319 -628 338 364 -227 -983 59 902 -67 -526 2 290 -187 -227 -193 404 7
4017 7 -596 -401 474 398 -382 -373 -123 55 33 463 80 -616 -126 887 204 -932 -381 372 140 -272 -94
4038 -94 -329 -463 -36 408 -350 -488 -659 93 604 -79 -1132 -466 459 533 -232 -511 -803 -412 985 856
4058 856 -935 -1514 780 1067 -101 -903 -355 247 677 297 -65 -254 -328 240 631 207 57 -159 242
4077 242 552 -156 -82 854 379 -60 552 597 -379 -298 744 396 -166 141 608 106 -240 169 296 202 545
4098 545 -122 4 169 363 87 257 137 117 -130 70 -751 17 869 424 -960 -457 329 646 -117 -364
4118 -364 -25 -167 267 258 -412 -1020 -57 1098 777 -435 -890 -766 339 490 51 -427 -230 -149 308 97
4138 97 -392 -813 276 945 -389 -822 -492 22 -82 164 -12 -697 -669 261 50 -827 -772 252 511 -320
4158 -320 -794 -760 -302 369 534 -136 -44 -414 -549 -70 172 16 73 306 -26 -165 64 157 -237 -255 381 606
4180 606 -132 -168 -242 -21 397 453 80 -657 -440 -217 74 527 -283 -723 58 352 -147 -835 -274 -266 49 441
4202 441 -169 -1048 -306 380 406 -375 -2 -93 444 271 -180 -290 189 1038 283 -246 150 -51 290 1275 559
4223 559 -244 16 747 718 317 302 193 374 676 656 -474 -279 385 604 314 251 117 -412 9 150 114
4244 114 -46 200 -66 -252 -245 151 162 -239 223 -160 -322 148 -15 -358 -98 611 -44 -215 -85 -701 28
4265 28 613 59 -525 -90 123 -104 -327 -265 -168 -97 531 -64 -899 -370 307 214 -89 -209 -415 -427 402 285
4287 285 -634 -606 242 266 -145 -178 -650 -688 263 497 -324 -368 -195 135 -202 -23 -263 -673 34 466 -4 -345
4309 -345 259 129 -145 56 276 -91 119 50 122 -211 313 409 7 308 409 121 191 267 -166 -246 219 307
4331 307 -103 -226 303 261 46 446 202 -553 344 624 -131 -158 74 282 260 199 -142 -259 322 680 -232
4352 -232 -590 -126 99 139 117 -141 -491 27 695 -141 -490 -144 -64 266 520 213 -221 -3 342 265 -115
4373 -115 -116 -7 16 188 187 -96 -26 427 -168 -580 211 175 -70 279 169 -194 41 314 -255 -456 168 -53
4395 -53 -620 -326 193 -313 -73 -99 -93 -212 -82 -154 -367 -162 38 -149 -39 -11 -82 -712 31 -84 -428 -126
4417 -126 101 -190 -126 380 -199 -312 42 398 35 -237 -107 -329 -54 253 -8 -236 -128 96 -272 8
4437 8 -58 -141 159 303 -161 -511 -167 253 -295 176 157 -132 -361 267 -286 -243 -378 522 506 -139 39 -127
4459 -127 -97 10 229 94 268 360 237 144 202 -40 291 503 56 91 -14 129 -192 47 324 262 -137 110
4481 110 392 34 -263 387 256 -213 -143 259 -11 -118 -114 -341 -98 -63 25 -268 49 -69 217 98 78 -287
4503 -287 -73 452 159 -113 458 316 -65 -10 135 -13 -151 46 191 -190 -105 93 -3 -277 -68 -146 156
4524 156 -131 -26 -43 -42 188 -346 -53 -101 -170 -443 317 148 -211 -80 -65 -246 -142 367 -22 -414 178 187 -263
4547 -263 -493 -93 60 167 -262 33 -3 -167 126 240 -137 245 274 49 -1 -252 -453 71 161 2 84 65
4569 65 -66 -144 403 302 -520 141 506 15 -474 -68 5 -52 166 158 110 -109 250 -154 -214 374 528 -98 188
4592 188 222 183 242 178 28 -115 303 4 -231 -183 101 -9 60 167 89 -295 39 318 -9 -11 542 42 53
4615 53 302 358 -67 225 179 105 350 256 60 -4 233 41 -89 172 428 120 249 336 -29 -84 495 31 -328
4638 -328 -8 272 -71 -520 -58 119 -250 -17 -6 102 -201 222 -141 295 23 20 -248 141 -79 -251 155
4659 155 81 -41 168 262 -337 -384 -150 308 -509 -413 295 222 -339 40 113 -48 199 138 100 -218 -49 -405 -151
4682 -151 91 -4 203 -123 53 -419 15 214 -30 -401 143 139 -377 -106 37 58 -268 -195 230 -268 -140 138
4704 138 -182 -132 -61 273 -275 -133 40 277 260 270 61 -64 147 -178 -16 340 472 -168 366 521 235
4725 235 17 254 109 -88 372 296 344 -19 194 95 -317 10 335 395 205 129 -96 404 16 -49 -139 60
4747 60 213 88 106 363 -98 118 492 281 -92 -68 197 53 -72 402 90 -663 3 118 -118 -363 92
4768 92 -24 172 43 -87 -82 -73 -252 -171 -84 -249 -218 104 225 -145 -481 -85 -46 -413 -143 -24 82 -837 139
4791 139 321 -116 44 216 64 -195 19 95 -98 107 -237 -27 205 -148 -334 -61 140 -449 -460 162 302
4812 302 -453 95 233 -4 -530 194 50 -191 -141 -110 -183 134 290 -18 -164 7 -53 -30 -14 -76 36 318
4834 318 54 -90 -146 -89 11 -175 330 164 -180 -184 197 251 -176 -37 155 116 133 389 -36 -17 -86 -193 137
4857 137 184 -156 117 301 47 121 -72 257 -11 74 70 238 60 10 293 183 -213 258 50 -302 -117 169
4879 169 84 -486 65 293 -28 192 120 -145 303 67 113 232 182 -118 195 261 2 -380 316 407 102 -345
4901 -345 143 -267 -171 -119 269 -205 -382 -190 131 218 -200 90 -133 351 -112 -226 -167 -100 81 240 320 -342
4923 -342 -302 32 56 1 -195 302 -23 -125 -75 31 -114 -145 109 48 -347 -13 -160 -177 136 49 -416 287 28
4946 28 -191 45 -292 -208 -85 107 -40 -112 -279 359 215 -170 427 -193 -288 -153 330 247 -104 -71 78 -97
4968 -97 203 100 -227 31 200 43 305 196 -18 -156 59 101 -110 -60 196 59 122 410 278 -63 127
4989 127 424 137 -50 -201 133 104 66 258 229 -33 -18 317 -1 -144 261 186 442 11 -205 8 284 222
5011 222 87 169 -174 -91 392 161 -81 -157 135 73 226 45 103 35 -98 281 112 -126 16 -158 -63 405
5033 405 -155 -327 -16 51 -8 -141 -6 -174 -340 195 22 -340 -30 138 92 -118 -39 4 -319 -114 43 107
5055 107 -98 -60 -46 -45 -178 -226 -308 274 95 -60 -555 -322 -38 -70 60 131 -214 -199 -166 -59 -41 -341 2 -66
5079 -66 288 -31 -300 -221 -117 181 468 -32 -1 -121 -65 220 -57 -274 -35 -285 -112 337 -68 -240 240
5100 240 -15 104 -163 14 70 -48 143 240 -226 128 114 129 -12 69 77 -293 205 36 -122 -92 5 348 189
5123 189 278 -213 -237 -14 130 30 -151 58 14 228 219 307 -54 34 228 121 151 -123 25 51 460 103 49
5146 49 -3 -114 -113 -224 373 226 -376 25 -77 -324 63 86 -155 173 16 62 -389 3 -66 245 -172 -53
5168 -53 -248 -59 -130 -14 -253 327 21 45 -85 -398 -11 -367 47 252 -104 -239 126 -103 30 89 -199
5189 -199 -17 -38 288 -43 -191 -228 -250 246 45 66 -170 -173 -242 223 -13 -43 -243 -177 196 29 -571 227 -54
5212 -54 42 -114 266 -149 -123 -59 23 74 -349 138 61 -127 119 269 193 168 6 -108 260 214 -11 -94 161 -73
5236 -73 154 49 165 284 -8 124 -166 -4 353 210 -104 44 -78 24 17 104 -147 -315 -165 531 190
5257 190 93 -372 0 36 143 -143 -290 93 -187 269 78 355 73 5 163 258 128 180 5 53 28 22 27 5
5281 5 98 214 -228 -249 22 15 142 47 -200 -91 121 298 -53 -148 -158 12 -141 -16 -228 -342 290 22 -115
5304 -115 -383 -226 -195 26 235 86 -35 -30 -53 -297 216 14 172 -224 12 -17 58 -102 -166 -273 381 222
5326 222 -245 -48 -33 -209 -264 106 71 -254 20 153 -48 -284 -8 -148 -98 223 -288 -92 -86 -29 -3 -91 178
5349 178 -105 77 -243 236 -98 -116 276 223 29 50 125 -155 -77 115 179 24 92 149 50 104 361 -86 -113 -167
5373 -167 -12 147 -142 19 382 -104 -27 150 75 137 132 -137 -1 140 -39 -12 212 -139 125 176 -15 -55 53
5396 53 -91 -69 -30 -159 69 246 32 -2 142 -42 -212 -20 12 148 -47 -241 -34 38 79 232 327 -367 47
5419 47 46 114 -7 -255 -332 -125 -111 -130 -99 -253 -73 -142 146 37 52 -35 -83 105 -37 -92 212 -79 -136 87 21
5444 21 -458 109 -147 -63 16 173 68 -266 31 -218 -274 -194 -34 -129 -83 6 -182 -27 -304 132 -309 -270 -30
5467 -30 -148 -35 -6 32 -52 -70 -28 7 -91 -67 -210 -45 -88 92 -68 -83 -305 18 -112 -25 -221 -96 45 240
5491 240 -157 43 206 -71 -56 360 122 -208 -54 287 67 -43 -84 197 -215 -66 297 101 189 432 134
5512 134 -106 284 327 177 58 357 8 30 271 294 22 178 295 130 128 205 -225 -235 70 -122 -173 182 156
5535 156 -177 4 8 -187 -12 -86 -293 40 56 82 -315 -329 88 112 28 -253 -146 -290 -245 -81 10 -29 107 -152
5559 -152 103 219 246 -233 -164 412 -115 79 203 17 -84 86 0 112 4 192 -148 65 -121 72 -8
5580 -8 135 79 -112 -220 -160 -28 150 222 197 -174 81 330 -38 262 -39 41 -106 -159 201 -97 -51 217 2
5603 2 -75 241 220 55 15 -169 115 -27 210 304 -235 -273 165 168 114 -50 156 -7 -115 -72 -66 233 46 -54
5627 -54 -149 222 -85 49 191 -192 -142 -51 122 156 -37 167 340 12 252 -40 161 221 75 309 288 309 -2
5650 -2 289 362 12 -129 13 -66 -303 -118 196 -4 -93 -171 98 -256 11 91 -257 -193 -75 -5 -1 -75 17 -25 33
5675 33 116 -146 226 -107 101 -274 -11 234 -482 141 174 -195 -444 142 -39 -21 70 -235 -96 -126 -204 24
5697 24 -105 195 58 -137 197 -83 -217 -107 309 -162 -164 -243 202 -113 -170 249 101 -104 214 -136 33 74
5719 74 120 249 101 246 -156 199 27 311 74 123 -266 81 119 254 -263 18 214 -347 -173 -12 36 13
5741 13 -185 31 55 47 31 251 9 39 192 187 -99 -279 110 -217 -204 -100 -21 24 147 -161 102 -135 -275 -222
5765 -222 173 45 72 250 -90 141 26 150 136 -115 -321 -66 125 -120 -97 39 -63 -124 132 -84 -195
5786 -195 -139 -86 92 -140 -273 -110 181 16 -228 196 -60 29 -235 42 -125 36 88 97 -23 162 81 -8 53
5809 53 94 -141 -291 -84 19 28 84 208 -188 274 82 -245 108 -203 -283 -138 137 -93 -102 -1 165 167 107 22
5833 22 -222 314 -156 5 -168 -48 30 207 -119 -394 -7 -64 -312 251 -71 47 103 -27 28 275 181 -118
5855 -118 -167 -50 151 137 56 -115 226 -32 -36 -219 -268 1 -99 -31 -45 23 140 -70 -4 -192 -5 19 -260 117
5879 117 394 30 45 -124 5 220 61 99 189 -60 147 -134 273 -22 19 37 -344 159 241 -113 65 195
5901 195 -64 -234 -25 56 -7 268 -155 -19 -123 152 87 146 133 -87 -76 23 -76 -75 -177 290 117 -109 -464
5924 -464 158 -320 191 208 -244 182 100 -195 -408 -136 -232 -352 15 162 -59 -47 9 21 54 -327 46 131 -32
5947 -32 158 217 -60 71 24 -280 135 -106 -160 -107 -56 -226 97 227 41 -194 -166 43 -46 -257 -43 -28 -59
5970 -59 66 158 -31 -52 -44 -231 -110 2 -23 -28 154 -4 84 -480 -87 -33 97 195 -64 -186 -29 350 229 101
5994 101 -264 -144 -93 -11 55 155 168 201 31 72 46 74 -29 63 70 -28 121 211 -166 -45 339 -87 -103 196 56
6019 56 -73 230 120 43 -11 -97 -22 455 182 66 -48 -171 22 -67 -223 -54 10 122 -17 -43 -266 -18 -86
6042 -86 299 -136 -320 -45 -33 32 -189 -134 122 224 -72 -24 114 -64 -160 -193 -40 75 12 -140 -191 12 -106
6065 -106 -10 -222 274 -62 32 -194 80 1 -110 -158 -457 -35 196 -204 -198 -175 3 -271 -375 551 -357 -18
6087 -18 -70 93 110 10 292 94 -152 -172 -57 20 4 -38 151 122 235 -50 59 33 5 42 99 226 282 -230
6111 -230 116 168 48 -258 347 -230 -131 -9 222 148 -144 265 -131 -109 -111 118 -232 -198 112 -43 202 -183
6133 -183 23 -63 159 71 -39 259 16 45 42 42 90 84 -24 15 -106 -183 82 261 -56 -231 -42 -65 323 -2
6157 -2 -61 343 120 -66 37 209 -154 -93 107 -68 6 51 104 -143 157 213 225 -144 -24 -54 -189 164 22
6180 22 167 118 -103 -111 -43 -123 -69 81 -364 -90 -124 -173 325 92 -107 509 -118 -136 -176 -45 -256 -208 32 -174
6204 -174 -9 -107 -129 378 246 -48 280 -188 203 209 267 110 -147 -273 -42 13 -62 -217 -238 -31 -29 124 41 -166
6228 -166 -201 59 104 -199 -158 -133 -73 30 -174 -92 -144 67 9 -263 140 152 -92 102 114 -15 110 309 -138
6251 -138 18 294 210 330 -221 50 234 -26 141 271 -96 -151 -53 87 -184 307 118 183 161 80 277 249
6273 249 195 -66 74 6 96 -197 148 41 -524 74 342 156 -177 -226 209 -177 82 111 90 47 -152 133
6295 133 -10 -95 -99 51 26 175 73 248 91 -233 123 180 109 -84 -115 -15 -158 -233 344 96 164 -199 99
6318 99 -255 -8 -23 -367 364 26 -54 -210 -250 -98 -81 -561 -179 -126 56 -153 49 -232 -179 166 169 140 219 242
6342 242 128 83 112 1 -345 283 -157 -203 320 -38 74 -32 90 -35 17 -80 171 -284 -210 -196 -24 68 -203
6365 -203 -184 -72 162 -93 -134 -171 -89 -141 250 145 -93 -239 71 -284 -125 238 122 -41 166 -46 32 26 125
6388 125 33 34 10 -270 -290 234 198 204 151 -78 94 -245 152 170 -116 383 53 -154 418 -32 -210 -62 -2 -67
6412 -67 20 61 68 -125 109 162 -79 17 -55 67 -11 -39 364 14 -67 -151 -71 -137 -198 266 53 -167 165 63 -164
6437 -164 153 208 -171 -185 108 108 -291 -260 130 29 343 202 -11 -48 -139 88 -294 158 169 -255 78 -340 -68
6460 -68 80 -50 -200 -132 -29 3 -186 -156 -4 96 -66 112 33 -47 219 -153 15 5 -49 -39 84 43 -156
6483 -156 -24 -56 -3 -154 202 92 165 137 10 -42 -47 -273 19 154 75 122 96 20 -56 186 -46 -49 226 106 128
6508 128 -158 54 245 79 262 173 177 291 33 16 8 148 -31 -30 366 -118 -93 203 -100 -16 48 324 -20 231
6532 231 -13 103 -29 -191 -215 150 -78 327 -330 -181 -66 -33 -71 -23 66 -113 80 234 -260 61 129 -57
6554 -57 -211 173 39 -319 -84 69 -59 -47 -194 11 10 21 168 -48 -72 -48 252 -70 -44 -138 -222 106 59 -42
6578 -42 -260 41 112 -64 69 -25 -64 -103 163 -282 -149 34 -127 -194 -230 192 -107 -121 -65 -12 225 -90 -248
6601 -248 -44 -188 -323 -326 79 -86 -113 -115 329 -81 -36 -51 -35 17 78 201 224 -33 308 -92 147 -4 191 -14
6625 -14 -69 100 190 -53 -138 -63 -150 -56 153 -17 -20 45 -182 -26 -10 -97 84 67 5 -77 -259 -98 -66 -81 -180 157
6651 157 75 -182 -214 96 -54 5 -142 -185 -28 345 -339 363 -79 -160 -93 2 -344 -98 61 446 261 -254
6673 -254 262 64 102 181 137 209 73 -158 -34 -172 9 -36 92 -138 -167 -180 -102 -32 27 68 -62 -201 -144 -54
6697 -54 -290 -87 -151 -16 -74 -193 -92 -47 -107 85 -583 -141 -161 -213 -76 -153 -81 -96 186 -126 -202 -142 52 187
6721 187 4 -83 -202 62 -241 -122 -62 213 -33 -114 143 -106 -44 5 124 -153 46 252 -289 13 25 -1
6743 -1 96 189 -74 98 -84 228 124 120 111 57 170 -63 -254 -240 70 141 -18 44 95 110 -57 366 -8 88 235
6768 235 83 10 109 50 8 97 -10 49 -136 144 157 -69 7 218 257 151 189 12 -17 146 164 -310 226 194
6792 194 123 -81 119 33 -49 274 -178 -435 -179 -114 -63 -209 283 -74 -99 121 -78 -27 -21 -120 -189 -128 104 -13
6816 -13 -248 -85 170 -308 -165 15 -170 -88 -16 -179 -109 -137 -91 79 -139 -261 -126 -190 -2 267 -90 -89 130
6839 130 -31 37 -60 -9 -16 3 -181 -75 -180 -192 -378 44 -190 -94 -291 -37 21 -149 90 -252 -193 -42 231
6862 231 -111 50 241 221 -262 28 -266 75 34 413 87 9 71 124 -58 -228 -34 186 -22 313 317 177
6884 177 139 170 24 91 103 30 -233 378 275 -89 185 324 94 -103 243 199 4 159 44 149 177 261 56
6907 56 -123 -114 -10 95 -199 -91 -103 43 69 -69 150 147 165 32 9 429 -89 -65 -79 -52 -487 -108 35 -18
6931 -18 41 74 -59 66 285 -245 -229 161 294 -201 -178 61 125 22 -113 -365 -267 177 -14 -16 -70 -54 -174 -334
6955 -334 -248 164 -60 -22 62 -63 -111 8 210 119 66 -58 31 113 13 182 281 -123 -122 -80 176 -94 -145 -171 58
6980 58 155 -52 219 144 -17 -39 -11 -239 -253 18 339 236 103 251 55 -92 161 16 177 -160 164 305
7002 305 33 139 -37 84 313 -93 -213 -13 199 -222 -335 246 -92 250 108 68 143 -119 169 65 -44
7023 -44 274 -103 107 -34 -26 -288 251 2 -70 83 4 -4 -424 -51 407 -40 194 88 211 -135 13 71 -106
7046 -106 352 213 231 2 94 161 -119 182 175 -129 311 13 15 151 -11 -139 101 -273 84 -135 0 -71 -373
7069 -373 -31 33 -114 -234 40 -23 -117 188 -28 170 -80 -110 -25 109 40 -115 -67 -48 -177 -121 82 82 162 -182
7093 -182 -186 163 -42 -53 100 -252 -483 186 -82 -351 -262 223 146 -183 -247 112 -90 45 -89 56 133 234
7115 234 -163 -91 105 -73 68 131 -7 -281 -85 146 -76 -132 -54 104 -106 30 357 10 -12 44 -255 -111
7137 -111 410 3 8 -34 84 -49 -135 398 179 156 35 -85 85 -67 80 90 -98 16 -41 197 142 104 115
7160 115 -51 207 -224 -264 -288 232 122 21 147 68 -110 41 102 -45 -39 121 -32 56 50 -251 90 240 -88
7183 -88 -132 -115 -19 -170 114 -7 -70 101 35 18 -370 -21 180 -128 -357 -67 240 -50 176 -8 -546 98
7205 98 -75 -80 -31 59 -140 -187 24 6 -39 -98 169 93 15 -9 30 -391 173 -163 87 115 58 107 -323 52 119 -75
7231 -75 -185 -285 -18 187 64 -132 -6 60 -54 -239 450 1 -52 -226 -15 -90 -28 241 -13 -242 157 55
7253 55 -189 83 100 -257 37 -210 11 -44 -13 121 -69 -158 -153 151 -47 273 20 -68 65 34 99 65 252 57
7277 57 -273 109 386 196 128 176 -93 -60 -67 37 102 241 102 241 44 -99 -65 30 185 -71 287 288 -56 99
7301 99 -55 147 -26 -12 158 2 -99 79 197 -45 -194 173 -113 -138 326 198 176 -85 445 -16 -25 -309
7323 -309 -180 -91 -2 74 144 50 6 -154 -24 191 122 -428 -76 -66 -55 97 -134 -151 -290 -270 246 -270 78 -7
7347 -7 -84 -63 82 -56 -45 152 159 -60 120 40 -352 -299 158 -93 -133 67 -202 53 43 -56 -376 -206 123 -19
7371 -19 -84 -189 14 -52 -175 95 -83 -182 194 -12 -136 109 24 -2 54 222 -77 -231 232 -41 -289 86
7393 86 148 -196 -33 62 194 24 144 183 -79 -134 -137 -88 -67 -98 72 200 -94 -44 24 -34 34 112 103 200 49 -87
7419 -87 -42 21 48 -93 335 61 -144 206 -149 226 116 -68 -121 195 186 246 35 274 127 93 173 306 -105
7442 -105 -81 468 230 210 -70 104 -90 190 166 -315 -205 -35 8 -316 -12 253 -170 -336 211 -251 -65
7463 -65 145 -77 -199 32 -54 176 -118 -274 -31 -17 -55 40 -265 -264 -257 -255 101 14 40 -182 -50 20 -353 7 277
7488 277 37 354 -46 -21 214 82 -425 -201 119 120 78 141 105 -269 20 48 111 -24 -52 29 16 -166 2 106
7512 106 -92 382 321 -111 -180 85 -135 -22 29 166 -34 191 67 103 -53 316 110 -6 221 -78 -35 -89
7534 -89 340 -81 -37 21 -4 78 181 68 -71 -109 176 165 -7 -296 157 232 137 -173 -298 -211 301 35 -165
7557 -165 75 -15 -115 211 11 69 -121 43 -57 -156 206 158 80 59 178 115 -145 274 149 222 101 -137 -19
7580 -19 -133 100 -201 68 177 139 -337 98 141 -137 78 164 -131 -74 -85 -87 -264 -229 118 -181 -77 98 15
7603 15 -58 -106 61 -152 -126 88 -5 -100 135 -166 -120 -51 -74 -281 -77 124 228 -29 -84 161 -233 -168 38 -128
7627 -128 -223 101 37 77 51 101 -101 137 -11 -189 83 132 283 151 265 179 33 -27 72 22 91 -33 99 -143
7651 -143 235 321 164 -16 61 6 -79 23 -32 -6 297 204 88 -78 411 172 213 191 36 32 199 227 -13 -95
7675 -95 77 -300 255 -55 -73 -271 33 62 103 84 230 251 -101 -51 95 -141 -295 -6 3 -87 127 -153 -111 -111
7699 -111 29 106 -10 233 -43 -55 152 150 26 -118 299 -90 58 65 -24 -163 11 -68 195 17 188 54 -306
7722 -306 53 -128 -231 -286 -77 -46 22 279 -98 -119 5 -229 -19 27 85 221 -73 -50 -112 22 -173 101 255
7745 255 152 -41 236 -141 -24 -8 166 -72 -126 56 249 -79 -60 -392 146 223 -423 304 -25 -98 296 145
7767 145 -12 -16 -78 133 -124 85 -21 -142 -109 17 197 -91 147 34 18 97 13 85 161 248 42 56 226 358
7791 358 -38 -157 -48 289 -34 178 -93 -237 28 -53 247 181 222 132 -64 -89 -34 74 -116 99 -215 -276
7813 -276 5 154 -17 199 92 -90 78 -130 21 187 118 150 2 76 -107 -157 231 -130 -43 -50 -326 -19
7835 -19 47 467 -198 -82 139 -54 -195 72 37 -25 -173 125 90 -26 -173 -204 194 54 10 130 -246 19
7857 19 113 9 -40 76 -39 -296 77 -112 15 135 100 -45 275 -110 145 -261 -188 130 15 204 -267 9
7879 9 -152 -149 28 -96 -378 253 -7 177 115 -190 -138 -34 220 -241 120 38 155 -209 -2 -115 -6 229
7901 229 -12 -134 288 217 110 -364 249 0 -202 43 259 -22 10 129 94 -157 31 55 -67 -40 264 307
7923 307 -8 268 -78 5 249 231 -39 105 90 -227 206 190 -234 58 216 135 -7 -92 9 352 -18 -81
7945 -81 117 -17 195 -170 106 -178 -333 121 240 -35 179 2 140 -76 -99 124 37 -18 -112 210 -106 -42
7967 -42 -171 -118 -25 135 -16 85 -38 -4 -22 -361 -72 -175 -301 2 -154 101 -206 -96 -21 -49 -44 -324 -196
7990 -196 -96 55 29 -250 196 -138 -48 -104 -50 7 248 -474 -118 -90 216 206 15 162 22 139 -43 -12 -39
8013 -39 95 25 50 223 46 136 -143 34 26 106 -86 25 247 -80 -26 -64 -209 -120 -141 185 381 184 187 81
8037 81 245 -72 115 72 -64 -64 -455 177 192 103 -30 -217 41 -130 59 153 -103 -152 117 -33 193 293 64
8060 64 -108 -246 57 82 78 -127 -13 -79 133 58 3 -264 72 -162 104 -267 72 335 145 332 -27 -259
8082 -259 -421 -234 -45 -262 27 -7 27 9 -174 -158 67 165 -77 -25 -22 -7 -139 -370 -104 -169 -116 211 -219 -125
8106 -125 -283 -99 190 168 -191 -168 247 -44 97 151 159 183 137 -222 -68 120 -206 141 -62 -8 -56 152 -27
8129 -27 -264 -23 -44 212 -184 -137 -76 257 -55 59 90 -117 81 -67 -29 -97 -120 72 -383 -185 -213 92 -50
8152 -50 -16 166 138 110 -201 266 -115 142 -139 -73 -10 28 -7 95 -57 -48 32 -41 72 -86 187 54 46 109 68
8177 68 92 -220 148 3 -365 -3 222 -195 -277 148 -225 -84 -4 119
8191A19
$$ Imaginary data points
##PAGE= N=2
##DATA TABLE= (X++(I..I)), XYDATA
0 0 0 0 0 -8 8 -8 16 -19 24 -27 40 -48 57 -72 89 -105 129 -153 179 -210 248 -285 333 -383 439 -503 574
27 574 -651 738 -834 939 -1053 1183 -1324 1473 -1642 1829 -2030 2249 -2495 2762 -3057 3386
43 3386 -3750 4153 -4609 5127 -5710 6385 -7172 8103 -9223 10600 -12349 14649 -17825
56 -17825 22505 -30127 44684 -82505 383654 805015 -108101 -419625 -16754 498353 365831
67 365831 34800 -64167 175663 325393 235877 -10998 -91332 13295 179996 223186 175465
78 175465 54510 -83838 -169803 -39130 202557 215630 -103259 -268750 7208 261451
88 261451 627 -374072 -245500 204133 304741 -50223 -365522 -261333 85827 226937
98 226937 -3831 -258508 -174527 93650 135778 -66940 -181932 -80966 26382 10494 -6859
109 -6859 32128 -25429 -182475 -156559 107763 210259 -60441 -313868 -172367 144827 204042
120 204042 -43533 -282419 -229068 57059 200455 -5057 -252738 -168762 87724 106428
130 106428 -103896 -189997 -46686 83054 44337 -38593 -41257 -33237 -63545 -21894 103990
141 103990 118556 -26844 -92643 38186 150139 67903 -79695 -70170 122908 274046 144348
152 144348 -151605 -204187 93924 324010 166519 -118166 -127838 95055 198149 55557
162 55557 -108006 -72996 80969 140185 62488 -39162 -90542 -73233 12899 89069 61655
173 61655 -32008 -85563 -66034 -5594 39436 3292 -74315 -53346 54231 59936 -66846 -123849
185 -123849 -19501 84745 50065 -44794 -55434 20412 52915 -10109 -59300 -10570 62514
196 62514 66543 18743 -28585 -44306 -5819 51018 51882 11769 -566 543 -19120 -11698 34725
209 34725 37570 -18509 -38529 7195 42456 15839 -40840 -60530 -14162 46572 44422 -10209
221 -10209 -51997 -52095 -16344 27797 31333 -9717 -31376 -12505 -4011 -10637 -2412 -841 -15088 1356
235 1356 33060 9289 -42500 -34756 13134 25292 2780 -5596 6492 12088 -10107 -42959 -32689
248 -32689 26240 59397 23272 -39507 -65971 -30533 35679 49833 -13140 -54137 -8805 35315
260 35315 4602 -39454 -35658 -7415 20805 38754 13470 -41069 -51749 -6367 30276 22952
272 22952 -2542 -10330 5990 12706 -13856 -32770 72 43929 38172 -2960 -32041 -25134 17212
285 17212 48619 13429 -40676 -21124 42680 46580 -7588 -39198 -23551 14563 43684 27420
297 27420 -23291 -39915 -1339 32377 21064 -13220 -32269 -14368 21574 28200 140 -17275
309 -17275 -15151 -13993 -5314 12873 12418 -973 3196 4583 -19439 -27628 1335 20676 13193 8700
323 8700 6806 -6380 -15019 -10704 -5330 7489 30346 34147 9867 -17549 -30523 -18579 16146
336 16146 39086 30303 18326 9239 -21383 -43761 -10170 43696 51115 20558 -5624 -17215 -12612
349 -12612 469 -1262 -5772 19597 47666 27104 -24240 -52500 -38672 4767 45171 42384 1205
362 1205 -30072 -32678 -23716 -6913 6225 2837 2201 14617 1775 -39486 -52001 -17799 13791
375 13791 20084 9939 -14247 -31630 -21398 -9479 -19024 -18298 10231 26312 4875 -29933 -44339
388 -44339 -22443 14659 22081 -4484 -15456 -1636 1042 -8870 -7845 -6072 -6425 9236 22964
401 22964 7187 -12170 -6120 3064 1241 5798 15046 14455 11804 9322 629 -930 9654 14323
415 14323 11867 15039 16820 11122 11822 10805 -5882 -9257 17777 35347 20467 46 -8599 -10920
429 -10920 260 14762 7200 -5028 5273 13428 -6804 -27586 -22830 -6244 6887 8941 -4536
442 -4536 -18859 -19094 -19027 -23284 -14955 588 3114 -1619 -7604 -24980 -34464 -13672 9243 7190 1611
457 1611 2484 -7962 -16557 -4943 5523 958 6672 23113 19524 461 -8394 -3109 9211 21826
471 21826 22819 15605 13067 8160 -3555 -1981 14406 19234 14634 14403 7319 -6862 -3765 7375
485 7375 1366 -3403 10818 14765 -3164 -14000 -10609 -7654 -1056 9401 4463 -8822 -9251 -4155
499 -4155 -5907 -6283 -2187 103 4453 5184 -5323 -12592 -4411 1748 1405 5732 5291 -7905 -8495 5305
515 5305 952 -13402 -6659 7394 2291 -8258 -10329 -13739 -14199 -3478 344 -11194 -17669 -13922
529 -13922 -12305 -13036 -13600 -16507 -13306 -4977 -8256 -17804 -14656 -8166 -10378 -6539 3475 -113 -8648
544 -8648 -1195 5590 2014 4938 13242 11487 9611 17568 16918 9267 13576 23424 22248 20505 22348
559 22348 17856 13460 17421 18739 15490 16541 16058 9924 9474 10305 -55 -5437 5563 8492 -2296
574 -2296 -6399 -6540 -13643 -15017 -6872 -8059 -15748 -13123 -10119 -16021 -18603 -17044 -18818 -14850 -3083
589 -3083 -3104 -14548 -17646 -13020 -9165 -1963 2074 -4005 -4959 5674 5172 -7165 -7200 4555 11067 13868
605 13868 12076 415 -6721 1816 9463 7414 8077 8134 1623 713 5738 -1477 -11048 -2074 11956
620 11956 10624 237 -9520 -15085 -5934 9825 8075 -6552 -6967 3026 5476 680 -5580 -8632
634 -8632 3073 20257 15027 -4205 -6417 5712 11300 11901 11776 4444 1432 12257 17210 5905
648 5905 -1782 1085 6348 12877 13989 -863 -13760 -3474 10391 4313 -11321 -17313 -9981 3398
662 3398 5259 -15409 -31225 -19917 -4121 -5824 -13313 -15957 -18944 -15663 -7593 -14022 -25942 -16514
676 -16514 1177 1573 -7292 -10869 -16273 -17717 -2495 15156 12599 -2474 -9047 -907 10722 8690
690 8690 -3136 1185 22488 27255 7600 -6318 -4279 4261 19700 30282 15890 -4515 -1780
703 -1780 9900 5993 2026 8927 10895 6553 8045 4946 -10760 -17388 -832 20250 21292 -851
717 -851 -22709 -17531 5316 12078 -134 -6582 -2664 3221 6088 -2338 -19868 -14377 16875 26492
731 26492 -828 -20224 -11278 614 6142 10562 4065 -10030 -7876 6475 7302 -5999 -11816 -2191
745 -2191 11118 11223 -5553 -19216 -12315 4571 13016 7857 -9847 -22417 -7791 15910 7243
758 7243 -17700 -11980 10266 8566 -8295 -12109 -6231 540 11148 12554 -4362 -16296 -6334 7964
772 7964 10316 6214 1371 -1236 -577 1715 3559 4765 1836 1271 11426 14249 -5228 -18650 38
787 38 20941 12829 -2177 -3573 -3651 -3589 4272 6527 -3092 -4006 5481 4542 -7134 -10900 -4934 984
803 984 4359 3274 -2202 -9150 -13845 -7982 6739 9081 -8194 -16052 215 7764 -7852 -15337
817 -15337 -3423 5370 4747 2045 -7433 -16867 -6639 11911 9961 -6510 -11340 -2173 5440 3319
831 3319 -4291 -6227 1656 7532 4288 -183 -5144 -8066 962 15641 9195 -9946 -8186 8290
845 8290 9495 259 -1302 -546 289 9466 12353 -3025 -13522 -210 16520 12792 -2432 -8333
859 -8333 1002 10353 6405 -2156 -2055 3361 4613 6341 5913 -5549 -10050 7183 17063 1199 -9067
874 -9067 558 4805 -1389 915 6166 -1502 -5955 4767 9123 -2876 -10925 -3187 8101 7921 -1239
889 -1239 -5952 -3574 -2283 -1703 4540 5615 -6064 -8569 4778 5537 -11082 -11137 6646 8640 -3268
904 -3268 -4150 -2720 -10657 -7507 8397 10411 -4478 -11239 -4056 449 -2468 -3301 22 2092 -889
919 -889 -2341 -1909 -7071 -12699 -755 17671 9126 -15164 -14891 1022 2271 -2005 3606 4749 -3851
934 -3851 -2657 2769 -6039 -12428 2767 17490 9104 -6229 -9258 -4460 -2145 2407 11261 12181 -208
949 -208 -10478 -3552 6888 1070 -4073 8713 17163 2762 -9760 -5864 -1572 1659 13554 16289
963 16289 -1496 -12675 -2161 4763 -767 742 9230 7522 -3936 -7514 -2614 222 -1920 504
977 504 8325 7558 -7251 -15581 -5706 4007 3900 4941 2240 -10177 -13383 1373 6021 -6031 -6121
992 -6121 6929 4231 -10339 -10901 -1073 1340 1293 5433 3511 -7091 -13747 -5326 9121 12300 1022
1007 1022 -7147 -3953 -1147 -854 3934 5419 164 2312 9804 387 -15679 -6964 15651 18111 4762
1022 4762 -2584 -5295 -6911 535 12163 12830 3946 -816 1073 1748 -1469 -3450 2839 13569 14234
1037 14234 3613 -7388 -12621 -8092 10085 22498 8917 -11042 -8803 2093 -48 -4530 1076
1050 1076 6142 5525 4846 -2498 -15300 -15575 1524 15723 11245 -3607 -14793 -13745 -3507 3296
1064 3296 2476 -1271 -4398 -4611 -685 -3051 -15164 -14739 4360 14185 33 -14502 -15034 -10299 -2450
1079 -2450 6230 2663 -10197 -11503 -1810 187 -6944 -10098 -5491 2278 5051 -1446 -10630 -11916 -4469
1094 -4469 4203 8992 2248 -11449 -11456 5090 11210 966 -5757 -1000 3571 7139 7255 -1197 -6366
1109 -6366 3502 16544 12158 -1129 -5386 1754 12075 16289 8725 -2110 -1917 6835 13714 12510
1123 12510 3640 -3243 4119 16434 12596 -2642 -4929 6066 13656 12307 5075 -5454 -5641 7882
1137 7882 15142 5017 -4517 -1537 5865 7400 2370 -4453 -4611 4402 9990 4782 -3364 -7587 -5424
1152 -5424 3487 9926 2330 -8747 -7354 1511 3004 -550 -4709 -8243 -3660 5485 3420 -10095
1166 -10095 -14384 -5598 1649 917 -3217 -9598 -12272 -7217 -2788 -3540 -6655 -9511 -10486 -4873 -1286
1181 -1286 -7596 -15681 -11472 -2093 986 -2733 -10049 -16692 -10522 2630 3854 -7616 -10373 -3311
1195 -3311 436 -2046 -5862 -6278 -1305 7086 6893 -1934 -7508 -4932 2005 9597 9981 1346 -3588 1850
1211 1850 7087 4873 2059 2684 5336 11435 13214 2043 -9262 -2103 13723 17765 9625 1279
1225 1279 -1525 1729 7866 7641 5458 7862 9840 6966 3995 2722 607 2529 11259 14874 9551
1240 9551 3628 -1714 -3593 3714 13567 12203 3671 1659 2378 685 -78 1828 2615 5289 7384 2213
1256 2213 -5504 -7308 -3801 75 3773 3341 -4402 -8794 -6388 -4222 -5938 -6185 -5910 -5458 -2280 -2647
1272 -2647 -12679 -18324 -8672 2116 -162 -9604 -14019 -12005 -4275 328 -5669 -13085 -10445 -2749
1286 -2749 228 -2070 -7077 -10404 -4587 2274 426 -5668 -5052 -1393 921 3108 1080 -6190 -7316
1301 -7316 2573 8431 4284 618 -536 -1928 -1460 2179 3759 4106 5864 5230 735 -2590 -1621 1233
1317 1233 6616 9144 6718 1991 199 -2715 -2834 5311 10955 6432 2839 4445 2141 -4243 -2565
1332 -2565 4015 8496 11546 9692 -1145 -10196 -5666 6213 11660 8476 1963 -2327 -622 1781
1346 1781 -725 -2702 948 5816 8196 5680 -4884 -14101 -7236 7845 10918 2526 -3007 -4341
1360 -4341 -5228 -2111 722 -1582 -2188 3793 5030 -2948 -8790 -7276 -1461 3625 3457 -1100 -3557 -2946
1376 -2946 -3274 -3620 -2005 -1267 -812 2464 2306 -5174 -8313 -2633 1150 -628 763 509 -3955 -4839 393
1393 393 1774 -3086 -3850 -732 1111 1824 1332 -2331 -4829 -3332 1651 4831 3706 -2428 -5126 697
1409 697 4738 1133 -2380 -802 1045 3342 6723 2607 -7288 -5532 4900 8330 2909 -749 -659
1424 -659 -104 1889 1943 -1181 -1458 3314 5801 2158 -3191 -5240 -1591 4675 4538 -1077 -2094 894
1440 894 389 -1638 -1514 -2157 -1818 3472 5579 -2189 -8833 -4344 2069 2522 1103 -1104 -3875 -3636 409
1457 409 346 -2843 -3215 -657 1492 1684 -2003 -6081 -3799 417 1118 985 971 -2210 -4745 -1224 2471
1474 2471 241 -875 1804 486 -1368 681 2025 -1458 -1088 4252 5393 1278 -1342 -467 1492
1489 1492 4326 4084 1645 1571 3012 2498 1331 1688 1399 3539 6685 5108 -1382 -2154 3376 4835 3411
1506 3411 3718 2058 -461 1763 4494 899 -2358 1124 4601 4238 1098 -2708 -4830 -1152 3910
1521 3910 3094 -1002 -3584 -3139 -1869 -1117 -3337 -4611 -1242 1174 -3285 -7268 -5455 -4803 -5121 -2231
1537 -2231 -914 -4395 -6073 -4317 -5317 -7018 -4057 -1297 -2244 -2807 -2646 -4382 -5571 -3402 -803 594
1553 594 725 -589 -1793 -516 -22 -1490 120 3754 3989 2139 2663 1269 -650 1655 5080 4232
1569 4232 3949 5633 3689 -854 600 4460 3806 2458 4269 5208 2665 324 -902 -180 2542 4858
1585 4858 3569 2001 778 -1434 -1732 270 1458 1682 3727 3300 -1228 -2979 -912 -805 -321 3859
1601 3859 4873 -289 -2798 -1018 -1339 -2647 443 2868 2257 137 -1755 -4239 -4562 -1702 369 718
1617 718 913 -1931 -4596 -4767 -4334 -4182 -1734 995 -1322 -4195 -3126 -4417 -6930 -3270 1779 840
1633 840 -2082 -1389 -715 -3074 -3147 -895 1168 3022 4480 1910 -931 -88 1544 3368 5036 5810 4895
1650 4895 4759 4085 1093 1161 4819 5553 3882 5795 6571 1224 -2357 400 2770 2487 2686 2448 363
1667 363 -1308 -3062 -5048 -4012 702 1578 -1350 -3992 -5331 -5848 -4660 -4365 -4172 -1153 1686 -2377
1683 -2377 -7708 -6473 -2747 -3025 -1926 1882 2008 -1699 -3713 -4068 -3009 1302 4585 2969 153 482
1699 482 391 -883 -1295 800 3814 5908 2544 -1324 -1365 95 -1686 -835 5636 5832 -1492 -5077 -1863
1716 -1863 570 68 322 399 270 1562 865 -3238 -4628 435 4713 2781 -980 -950 2027 2519 -545
1733 -545 -1528 3534 7008 3146 -257 1826 2418 834 3246 5386 2563 671 2687 3091 562 643
1749 643 1846 -298 -458 3312 3169 -2593 -5189 -1906 1539 -361 -4270 -4221 -230 -675 -5387 -5460 -1658
1766 -1658 -1438 -4074 -3277 -1555 -2778 -2171 -1600 -4165 -4102 1750 3943 -2201 -5025 260 3303 411
1782 411 -860 1593 3267 2479 988 1129 2101 2031 1961 3186 3406 827 319 2687 2195 -87 757 2990
1800 2990 847 -315 1806 -253 -4309 -848 4830 1034 -5232 -4372 689 1559 -1512 -3621 -2905 -341
1816 -341 1131 -1101 -3606 -3481 -1339 1759 1917 -2117 -2948 1112 1740 -2536 -2238 3035 2815 -1309 -662
1833 -662 1284 -964 -1056 2398 2756 -436 -264 1116 560 -1235 -1479 90 2434 2359 93 -2616 -2561 -1603
1851 -1603 351 2616 1039 -2458 -641 1704 -2133 -4489 184 4217 2217 -912 -1834 -2098 -1125 1595
1867 1595 1429 -70 1250 3197 930 -3289 -3474 800 5041 5210 1017 -2496 -1639 -18 336 1590
1883 1590 2330 909 849 1927 -1031 -5047 -1759 4137 4233 753 -676 -2032 -2695 -797 875 535 815
1900 815 2380 1020 -2275 -3660 -1790 2362 3981 1154 -1781 -516 1044 -412 -1287 921 1580 1517
1916 1517 1848 -11 -3252 -1625 2951 2615 -889 -1182 608 1239 265 -700 -1273 -191 1607 432 -2030
1933 -2030 -1293 289 1598 803 -2183 -4383 -1133 3414 1618 -2425 -2706 -623 -840 -949 -795 -1714 -689
1950 -689 2347 927 -4276 -5717 -1576 2175 2734 -83 -2968 -2899 -1228 -1199 -2425 -871 2074 2096 657
1967 657 -2635 -6248 -3050 3116 4936 736 -1043 61 -809 -2276 -978 1367 3392 5008 3144
1982 3144 -2297 -4268 -93 3998 4464 3700 2052 1176 1100 -39 -1323 1046 5578 6110 3157 -358
1998 -358 -3002 -1813 3250 4907 1476 217 2172 1427 -2247 -3094 -37 2298 3549 1946 -2807 -4145
2014 -4145 -1652 1678 418 -1404 -1860 -219 462 -1977 -4774 -3040 1447 1706 -930 -2933 -3020 -2526
2030 -2526 -350 1448 -1625 -3846 -676 1249 -1370 -2709 -714 645 359 -437 -1605 -1636 798 2316
2046 2316 225 -1771 -939 955 2352 1283 -1527 -739 3768 3759 -1000 -2562 393 3232 3748 2417
2062 2417 -1132 -2339 1345 3863 1099 -1310 735 2882 1902 -381 -2219 -1508 1949 3676 888
2077 888 -2250 -1954 -154 1267 281 -2144 -2044 1720 2880 -1283 -4708 -2890 1071 2411 1276 -2157
2093 -2157 -4174 -1362 2250 419 -3042 -1833 1337 1463 -561 -2959 -2760 -716 1683 672 -1358
2108 -1358 -875 -631 -1541 -962 -515 -488 514 931 -1856 -3237 -1070 1193 -38 -430 -327 -287 341 888
2126 888 -424 -1832 750 3232 2674 20 -808 -184 2533 3782 1595 -198 2903 5001 1994 -591
2142 -591 501 3112 5001 4752 666 -2828 279 4825 3357 -50 -1530 1151 3144 1258 -2583
2157 -2583 -4561 -1246 2768 2261 -1686 -4616 -5491 -2083 1564 -311 -4661 -3622 -488 -1101 -3890 -3952
2173 -3952 -2453 -841 959 165 -3258 -4396 -802 1417 757 -57 719 1499 1430 -707 -1030 1730 4254
2190 4254 3110 1307 766 276 770 2640 2585 1072 1680 3132 635 -2201 -256 3002 1748 -319
2206 -319 -122 -374 -785 -159 -396 -1582 -1319 987 1087 -1526 -4268 -3298 1070 3593 -156 -3868 -2858
2223 -2858 330 1451 1341 -88 -2543 -1162 3003 2267 -2947 -2855 2403 4029 718 -2048 -2728 -1626
2239 -1626 1128 2600 270 -2646 -2337 -715 -240 -2113 -3546 -995 2281 -676 -5043 -5089 -2050 -721
2255 -721 239 523 -2207 -4332 -2082 361 -1243 -2101 1392 2908 549 -1157 -612 759 1698 3039
2271 3039 4032 3745 2447 1128 1544 3211 4688 5457 6166 3474 -5 1616 5358 4968 2157 3373
2287 3373 4530 2622 1081 936 -77 237 3939 5097 437 -4127 -2827 937 2149 135 -2390
2302 -2390 -1827 -304 -1192 -2572 -3337 -2482 -756 1513 -332 -5607 -5809 -210 2326 -1539 -3286 -1818
2318 -1818 -1457 -1855 -823 -2086 -3135 -1678 1359 -45 -3588 -4229 -1893 686 183 -1303 -3096 -2838
2334 -2838 -2511 -1623 -402 -1283 -2486 -2061 -445 -2013 -4082 -1380 1014 -1489 -2633 -950 -359 -2231
2350 -2231 -2036 437 858 844 536 -561 -1195 312 3135 2940 948 150 1879 3716 2464 -130 1504
2367 1504 4854 4217 2110 1516 1308 1084 3853 5474 2261 -807 1803 4107 2492 531 1382 1790
2383 1790 2466 2944 1018 -1641 -1051 2253 3905 1830 -1455 -1990 972 2457 454 -1590 -406 877
2399 877 425 586 -406 -2133 -634 2353 1504 -1434 -1587 50 -216 -961 292 28 -1424 -843 -26 -1082
2417 -1082 -1349 -1124 -740 -470 -577 -1341 -1494 -1531 -1950 -1393 158 -491 -2723 -3122 -428 -1030 -2139 -1649 -1638
2436 -1638 -2291 -1182 487 -2017 -3659 -1413 482 -382 -1744 -2184 -1862 -812 1044 -88 -2037 -1837
2452 -1837 -227 1078 461 -1277 -1904 -152 2309 1082 -886 -998 245 1629 2526 985 -1447 -308
2468 -308 3277 2576 -781 -575 1813 2584 1887 1351 32 331 2139 3211 1406 656 908 1162 1635 2002
2486 2002 1144 1061 902 1301 1321 1435 172 -806 1036 2380 788 -1567 -364 906 -319 -228 546 -116
2504 -116 -683 -197 -462 -1263 -728 278 -598 -1264 -318 -82 -1659 -1983 -802 481 991 -890 -2210 -902
2522 -902 1022 -116 -1397 -523 563 279 537 -461 -1809 -693 1576 1104 -935 -102 559 -328 -649
2539 -649 798 939 -322 -73 477 872 272 -793 -438 1249 1793 -36 -938 13 534 497 729 69 -463
2558 -463 406 1553 -275 -1496 571 1336 -311 -902 740 701 28 -764 -367 17 492 -199 -929 -97
2576 -97 174 -578 -1329 -966 -470 -636 553 -672 -2103 -1132 256 -1146 -1745 26 125 -1568 -1349 -21
2594 -21 -645 -1632 -739 320 385 -216 -1549 -1556 -553 518 -437 -455 139 -230 -13 612 -809 -1059 1197 2334
2614 2334 692 -392 822 680 -305 921 1754 961 334 1211 1261 666 396 1187 1625 1994 1764 434
2632 434 285 560 843 1661 1895 686 373 1631 1535 -411 -545 1379 1072 305 1128 834 -1219 -1012 605
2651 605 637 -286 -86 127 -130 -808 -955 -1064 -491 -430 -624 -237 -432 -1716 -1596 139 -313 -1570 -470
2670 -470 662 -800 -1925 -597 -446 -1218 -137 1431 -204 -1776 -966 -119 -82 -317 -149 -192 75 162
2688 162 -614 -625 -98 88 465 945 -118 -1078 -442 182 -881 -715 817 41 -1186 -663 325 -949 -1128
2707 -1128 737 444 -325 -434 -303 -685 -288 626 175 -350 349 754 26 -437 -731 308 1667 1063 -536
2726 -536 -417 1080 459 -172 818 754 -532 123 1212 390 -904 -92 709 299 495 538 -778 -989 399
2745 399 665 -198 -536 -451 -28 999 -667 -1386 -221 1246 440 -554 -46 182 -34 1165 840 -444
2763 -444 -138 1298 1270 -233 349 938 521 1052 1494 639 -352 -15 1012 1617 1053 -13 -790 439 1143
2782 1143 299 -849 -135 491 39 338 -534 -1579 -1028 707 -19 -1066 -592 -438 -1147 -491 -22 -716
2800 -716 -1438 140 38 -529 -522 -686 -1116 -418 668 -236 -1079 -293 314 82 146 -406 -954 47 1682 417
2820 417 -812 -421 63 -28 434 297 -413 -241 975 521 -915 -924 -304 166 1150 1085 -1170 -2056 -594 276
2840 276 -212 289 43 -963 28 454 -1124 -1703 343 1589 1000 313 -633 -1606 -661 717 1271 487
2858 487 674 -190 -786 -314 -51 -438 605 2257 695 -1099 -756 -1129 -977 1490 2472 640 -1097 -340
2876 -340 -188 -848 -513 612 818 808 552 -735 -1704 -1087 323 1181 1770 508 -1651 -689 180 -10 705
2895 705 1179 551 -243 368 767 -1188 -909 1670 2232 394 -296 -351 -804 155 1501 672 -146 -289 676
2914 676 662 373 -56 -431 752 1141 114 -349 126 -517 -276 993 341 -1469 -706 1163 742 -501
2932 -501 -194 -470 -1150 -272 1047 266 -524 -6 184 -520 -1154 -1085 63 1244 922 -140 -1121 -1436 -1582
2951 -1582 18 1797 506 -1105 -723 -85 -1501 -1488 153 653 416 400 118 -2075 -2657 -13 1776
2968 1776 1053 116 -554 -897 -1039 -445 24 683 682 540 -85 -392 -1659 -1555 697 2293 616 -307 -317
2987 -317 -930 -1466 510 1757 -42 -196 537 166 -1094 -519 464 851 1047 1271 -136 -1044 -809 9
3005 9 812 1413 9 -648 193 529 -576 -251 734 504 342 1269 595 -1607 -431 1579 1069 -153 94
3024 94 680 103 650 610 -268 -352 467 778 642 220 -641 88 1506 1033 -672 -444 455 255 -209 744
3044 744 -100 -1029 -36 1440 -54 -1089 316 678 30 -338 5 0 161 -81 -135 50 -221 -809 -274 928
3064 928 212 -908 -291 511 -584 -478 617 -108 -1184 -137 966 -244 -860 32 145 -653 -202 501
3082 501 -331 -737 35 424 154 -190 -668 152 1011 -226 -1352 -225 518 -26 97 635 -1152 -1425 518
3101 518 1411 -750 -1321 106 504 -357 -472 -163 -620 -173 644 133 -923 -716 -515 357 586 -603 -493
3120 -493 734 -45 -1418 -243 963 126 71 1043 257 -1761 -729 1484 897 -253 453 927 -323
3137 -323 -856 208 586 568 953 827 14 -629 -397 346 1084 655 409 1470 653 -1473 -1204 1330 1659
3156 1659 33 748 984 -367 -1078 519 896 289 1015 1752 66 -1475 -1302 453 1050 1103 455 62
3174 62 -357 -864 -584 449 644 371 697 842 -1210 -2196 -196 1460 55 -58 567 -421 -1347 -635 244
3193 244 -605 -421 896 306 -1503 -1570 -617 258 159 -792 -483 195 -389 -993 -631 0 -589 -406 691 -596
3213 -596 -1778 -559 1420 -319 -1834 -618 385 -119 -222 296 -661 -745 70 449 -248 -525 557 1050
3231 1050 678 -750 -1515 150 1502 650 657 787 -96 -856 140 1044 22 526 2352 1394 -1220 -1349
3249 -1349 327 617 934 1771 937 -460 -790 -211 -356 127 578 1009 526 -177 -1711 -1008 210 105
3267 105 59 1243 678 -1271 -1790 -326 169 141 1546 949 -1441 -1296 152 -28 -465 340 1104 493 202
3286 202 -869 -816 -87 986 1312 669 -60 -735 -395 662 409 -844 75 1337 359 -1143 -722 -564
3304 -564 116 1236 939 -941 -1450 352 940 -555 -1163 -254 328 663 259 -831 -1089 611 734 426
3322 426 60 -299 -202 545 655 132 -321 421 543 274 624 755 57 -46 454 287 -767 138 795 -92
3342 -92 -322 -530 -323 88 295 -115 -566 35 579 -558 -558 -871 -386 -48 339 -918 -1328 12 213 -800
3362 -800 -689 416 103 -325 -627 -723 11 651 649 -377 -574 665 289 -320 -86 -56 159 604 772 -187
3382 -187 -896 -170 -10 61 419 45 -948 -348 384 -92 -868 -514 -254 -560 -111 -492 -1297 -174 661 -475
3402 -475 -1057 277 607 -441 -592 -594 120 941 837 -423 -835 370 1298 399 340 741 701 873 673 159
3422 159 72 1168 1492 305 654 883 221 -163 981 1053 145 802 1218 421 -384 -164 400 1105 1449 278
3442 278 -1160 -726 595 800 -219 -584 -587 751 1068 -137 -1691 -687 1111 696 256 -261 -618 -678
3460 -678 271 279 -319 -168 513 -335 -1027 -325 132 -378 -488 584 -228 -738 -817 -955 -490 70 -512 -917 127
3481 127 -443 -1541 -1140 -170 -206 -503 -164 -612 -1160 -925 -425 -636 -1097 124 -439 -914 -556 273 225 -755
3501 -755 -891 -198 840 881 -348 -1223 -396 939 373 94 -381 -425 317 1355 289 -1110 -168 910
3519 910 331 558 255 -18 -266 433 1028 345 -150 661 916 593 174 -295 83 1040 1132 404 116 359
3539 359 559 488 681 -139 327 1448 1232 -455 -580 472 738 583 723 431 -579 -311 308 243 -136
3558 -136 185 428 277 104 -141 -401 -465 69 434 565 631 -553 -1221 70 193 -390 419 457 -562 -662
3578 -662 -129 201 -250 -212 470 83 -147 -182 -447 -948 -134 408 -523 -634 -474 -639 -423 -539 -1152 -802 368
3599 368 -160 -1227 -966 -611 -449 -524 -523 -542 -1133 -337 180 -1173 -1355 -691 -276 -210 362 -91 -994 -603 272
3620 272 228 531 10 -124 264 303 -5 -572 263 736 411 159 470 146 -20 465 352 -8 459 649 207
3641 207 -86 384 543 222 202 369 314 600 267 63 -17 561 255 -57 574 360 -56 103 700 55 -23
3662 -23 856 403 71 389 553 186 -305 730 381 -51 184 225 -96 -267 191 105 272 469 69 -405 -323
3683 -323 78 -319 -126 99 -417 -761 316 -322 -757 -419 -71 -416 -542 85 -326 -504 -191 -233 -416 145
3703 145 83 -207 -297 140 72 -197 522 446 -395 97 282 54 188 439 309 -164 394 197 -31 -56 310 267
3725 267 -66 171 -323 -240 193 318 -324 -403 82 -239 -224 114 -371 -523 -157 8 -156 -550 -29 -490 -685
3746 -685 -78 112 -644 -620 20 -501 -306 -567 -428 -395 -64 -347 -314 -366 -206 -265 -327 -251 -160 -287 -10 243 -538
3769 -538 -551 420 298 -210 224 313 29 19 764 288 203 609 168 253 214 220 233 626 886 392 702 501 167
3792 167 289 795 909 635 412 404 -258 43 645 770 -496 176 1156 304 -292 74 230 433 732 694 -183
3813 -183 -394 -63 347 566 712 -159 185 676 484 -793 125 501 471 364 655 -70 -786 726 1114 -85
3833 -85 -779 -273 128 -311 -355 -677 -468 -59 29 -628 -870 -658 -843 -25 73 -1096 -1327 -580 -199 -857 -671
3854 -671 -150 -399 -1020 -30 -133 -816 -564 238 72 -359 -87 112 -308 -74 271 393 260 -126 -14 80
3874 80 403 136 272 386 -66 -487 411 570 -545 -312 1000 881 -608 -594 57 307 -74 334 -44 -775
3894 -775 -432 134 -126 -421 -376 156 663 -209 -942 -795 273 791 265 440 -218 -813 190 1655 602
3913 602 -736 293 1431 1035 -278 92 285 476 681 1188 69 -787 243 640 394 -169 135 287
3931 287 479 -290 -677 296 144 -500 -188 564 -333 -1035 68 503 -439 -335 245 -91 -972 -468 734
3950 734 -110 -208 116 278 201 183 22 -123 103 252 425 338 -620 -643 713 1370 -393 -963 -151 703 -37
3971 -37 142 146 -500 -228 755 313 -1115 -1143 234 516 -175 -642 -593 -371 71 -127 -514 -466 -317 -330 268 -159
3993 -159 -1002 -731 688 418 -620 -499 -166 40 -41 427 -220 -883 37 948 38 -577 -33 463 99 -165
4013 -165 -82 175 321 -342 -168 492 637 -392 -364 -178 261 23 242 -221 -622 -232 813 -110 -1064 -248
4033 -248 709 333 -181 -304 -173 -186 122 227 230 -359 -60 575 631 52 -852 -65 1167 929 -299 -430 -39
4054 -39 -2 707 849 -746 -1064 1151 1442 -6 -635 -169 429 772 448 205 -189 70 710 629 182 -202
4074 -202 -417 147 485 -130 -336 503 182 87 495 532 -351 -423 575 482 -524 -494 290 -15 -385 -278 94
4095 94 165 -269 -579 -260 0 -221 -381 -3 -4 -237 -389 -338 -582 -46 642 173 -985 -1018 602 712 -428
4116 -428 -464 -179 204 271 305 -484 -666 64 1463 572 -603 -1110 -417 637 577 -81 -574 -418 -92 112
4136 112 166 -445 -615 310 1012 14 -1426 -231 462 -9 90 -142 -452 -501 406 33 -430 -12 699 430
4156 430 28 -334 -622 -91 813 491 109 60 297 -267 306 693 216 -112 264 62 -137 40 315 117
4176 117 -66 453 235 -220 -444 -274 -409 406 508 -343 -847 -497 -99 526 300 -274 -316 193 511 -141
4196 -141 -652 60 649 450 218 -220 -457 301 728 380 -315 7 279 496 549 133 -117 288 570 437
4216 437 -545 -595 362 596 760 358 -369 -425 472 504 -122 87 -144 -140 -42 -250 -267 -743 289 258 -143 -276
4238 -276 -462 -851 -258 98 -20 23 -210 -334 -603 -356 200 116 -257 190 -87 -579 85 11 -622 154 300
4259 300 -39 -215 -604 -448 -95 342 145 -665 -612 -65 190 -168 -202 -203 112 280 -96 -679 -338 691 209
4280 209 -181 -315 -17 46 289 -61 -320 -198 330 478 -48 -393 -359 106 285 713 -388 -321 351 278 37
4301 37 227 63 -350 218 593 -35 -528 325 505 294 -111 45 179 183 240 -66 -23 721 401 335 -198 -11
4323 -11 207 -77 428 34 -177 246 266 -94 -313 138 99 78 -171 -122 -217 137 160 -501 -280 230 429 -186
4345 -186 13 -268 -502 138 225 -258 -455 -64 91 43 -136 -435 -378 274 592 -343 -611 -55 398 162 219
4366 219 72 -460 -128 520 112 -482 59 84 -276 172 -277 -449 -331 -149 -260 -626 -177 183 -209 3
4386 3 -189 -339 -463 223 -337 -386 -348 154 -539 -351 -85 -208 -241 135 110 -417 226 191 42 -10 52 -57 103
4409 103 193 -91 -176 165 389 100 249 49 144 153 222 268 -193 413 508 -70 -317 13 111 181 136 391 -161 44
4433 44 12 -130 -386 -113 -9 17 4 78 -243 -75 525 123 -130 226 -170 -17 268 360 -175 111 796 445
4455 445 -352 12 117 289 119 5 285 -147 95 29 -52 299 90 32 83 207 -206 -101 180 16 -74 222
4477 222 85 -270 71 360 -11 -358 327 63 -240 -299 -77 15 -61 5 160 -90 -108 172 -70 -32 250 80
4499 80 347 -13 -238 38 292 135 -491 -53 296 -286 -355 62 100 -318 -230 66 -352 -291 171 152 -315 -122
4521 -122 -66 -392 -325 97 -95 44 -26 -24 -225 54 -108 -353 287 39 -327 -250 19 -177 -294 29 -96 -406
4543 -406 170 137 -204 -444 89 292 181 -44 -18 -135 -24 328 -236 110 181 162 -175 125 250 -93 -92 228
4565 228 523 -177 218 2 -560 147 221 17 -125 91 282 -299 310 518 149 150 257 84 -152 490 320
4586 320 -37 577 186 -22 133 330 -215 264 412 -186 -94 407 470 -346 -95 428 -2 -47 152 -58 -219
4607 -219 38 598 -177 48 180 116 -265 -226 26 -292 -141 81 -26 -148 -33 -114 -277 -104 -157 -327 -163
4628 -163 100 -176 -389 54 77 -161 -4 -160 -586 240 -200 -22 -549 -153 195 -106 -216 287 -201 -470
4648 -470 -193 248 -131 -30 -213 -69 113 109 -241 -277 169 57 34 318 42 -14 -138 56 159 -304 240 173
4670 173 -155 -237 298 233 163 182 -61 -344 90 169 -118 163 -162 -265 47 -8 -137 217 336 224 -194 -26
4692 -26 222 -180 -2 407 242 114 126 202 156 136 370 429 -90 349 320 54 177 46 218 350 74 235
4714 235 350 392 35 7 337 41 -24 161 250 33 -177 165 -118 -360 -87 501 -126 -206 175 384 -31 -90
4736 -90 -44 17 54 67 21 43 319 -330 -137 154 -280 -335 -116 7 -81 -432 341 -72 -719 159 266 48 -109
4759 -109 92 128 -535 -235 122 24 -64 -216 -49 75 94 -99 -208 129 -39 -160 87 322 -184 -90 -111 3
4781 3 -283 -119 138 -363 -331 -142 250 -297 -2 133 163 43 -57 289 -19 -33 296 133 -85 306 332 299
4803 299 12 -173 -22 379 -78 -44 -97 162 -104 -109 194 -173 -277 274 419 -124 -167 268 247 74 158 350
4825 350 28 -232 17 -46 56 -9 31 398 461 -88 -195 109 223 -117 57 5 8 121 307 264 -273 -131 482
4848 482 134 -98 105 163 -402 -152 177 -50 -19 113 76 364 198 -156 -40 364 -127 143 464 -31 -447
4869 -447 -103 187 38 -376 -22 454 -60 -339 -91 238 -57 -130 -46 -71 -202 -115 -36 91 62 -385 96 250
4891 250 -133 -277 15 25 -253 102 -60 -3 -472 366 227 29 1 108 -143 -542 43 101 -18 -85 140 160
4913 160 127 -316 -301 -21 -107 -328 51 16 -67 -84 1 392 -172 56 688 16 -28 33 68 -124 -42 216 382 -310
4937 -310 -200 231 -85 -74 171 -25 76 80 -9 -142 185 77 80 214 60 -134 -111 404 86 -12 238 265 -169
4960 -169 71 230 17 -84 29 248 232 -3 253 -159 -116 96 255 156 74 -224 227 561 23 -301 -62
4981 -62 -78 -11 -337 -142 7 -242 69 320 -209 -74 202 382 10 -125 -56 -213 -43 272 -48 -170 -204 35
5003 35 65 23 -235 -273 178 31 36 46 175 -174 -135 34 37 -113 -241 -208 462 -162 -150 -78 -232 -124 460 -169
5027 -169 -146 -218 -78 184 139 -219 -204 -18 91 -113 103 -23 -228 -7 98 67 -275 -96 224 92 -258 256
5049 256 -200 -103 -177 60 256 -19 -4 48 93 -10 -457 166 375 640 -326 -552 -28 -44 154 218 -27 -129
5071 -129 -166 205 72 19 181 -206 255 -70 124 -84 -100 -52 73 224 107 -221 -221 237 91 105 69 -22 64
5094 64 -64 -16 199 -106 184 174 409 -128 43 -194 149 217 161 -43 138 282 286 34 -204 -209 234 191 147 125
5118 125 -117 -128 163 -38 -18 -286 -253 -86 62 -469 -134 89 44 -103 -21 -55 -210 -65 9 130 -524 5
5140 5 30 52 301 12 -300 -367 -209 30 260 250 -42 132 -78 -66 -486 -148 -164 -284 -132 13 221 -118 -249
5163 -249 -91 50 -116 37 -171 -11 173 -59 116 -112 -32 -136 -66 -240 -68 -150 95 276 -67 -270 -85
5184 -85 -25 83 44 -286 -515 14 220 223 -182 -315 75 337 146 50 -135 -154 45 213 -118 -3 -114 183
5206 183 146 209 -70 -155 276 193 224 -129 -212 -89 290 69 149 20 216 80 -229 -45 -123 -126 -128 167 43 62
5230 62 110 -18 4 129 121 -180 -66 35 274 -123 106 -251 -319 -49 71 -208 -178 116 64 81 74 -6 -79 45
5254 45 280 69 -372 22 42 202 102 106 -341 -159 31 396 -105 -5 -41 -125 160 101 -124 -117 239 -94 56
5277 56 -7 -197 -70 199 128 -154 49 -184 -87 -53 -20 -245 -32 246 194 -109 -86 -159 -112 -133 150 -166 23 129
5301 129 -282 48 -345 53 -170 78 194 -163 -157 -184 -193 153 68 -42 -196 -316 -57 -109 102 85 -63 41 160
5324 160 68 -81 -301 -221 45 24 97 -126 -164 -94 58 12 -30 180 -166 402 179 -84 37 -123 338 129 65
5347 65 13 41 -7 290 -275 -210 -128 211 69 -70 22 431 -90 223 367 12 133 243 163 -49 135 92 -93
5370 -93 75 -55 -45 141 89 287 61 -50 -221 -82 -217 3 -149 -123 -197 40 -128 -20 -29 -116 -124 -128 57 40
5394 40 -112 -31 -153 -112 -127 -100 -188 164 -9 149 86 33 -126 -285 106 -241 -20 -327 41 -276 -277 210 56
5417 56 -213 12 271 31 11 -262 92 119 34 -88 11 -25 71 -34 178 -201 75 151 244 -78 -60 -38 -68 -114
5441 -114 -106 93 -160 167 180 134 4 83 39 -87 29 114 62 -30 319 51 114 110 -109 36 -76 155 49 9
5465 9 -178 76 202 10 46 -51 2 19 -35 191 19 -117 171 -34 115 -141 -163 158 571 -118 -39 -238 34
5488 34 33 194 -37 -194 482 -144 252 207 177 -29 181 300 241 305 -32 100 -262 149 86 -34 20 300 168
5511 168 -94 132 86 -43 -90 11 52 -95 -77 -48 38 322 -213 269 -43 -137 -199 -171 -212 -193 10 8 43 -203 -78
5536 -78 -37 -105 -148 -67 -63 54 318 -143 7 -48 82 -156 -70 48 81 -10 67 25 33 -227 131 234 -80 287 -88
5561 -88 -26 99 57 -39 83 69 58 -172 326 -56 -214 -120 -75 314 -22 -60 222 -178 226 219 103 14 -154 185
5585 185 -8 -259 -181 82 -165 118 -88 272 278 -95 -203 -181 304 -151 233 91 69 201 253 -19 -59 118
5607 118 -78 -203 -127 173 -42 -37 -19 -95 133 142 204 122 -73 98 -48 -285 304 122 255 -78 49 154 -94
5630 -94 163 -170 -61 -103 243 -130 -157 -94 -70 -1 -83 94 73 63 -200 -42 116 -151 -114 -75 -219 -188 -76 43
5654 43 211 -35 184 51 161 -320 176 217 85 -44 14 17 -132 -139 -180 -70 171 -287 40 332 85 219 -193
5677 -193 -42 -16 -121 11 29 -35 -96 79 -174 -281 274 118 -257 -75 222 13 -17 19 -282 -355 166 -139
5699 -139 87 382 124 128 271 78 71 22 358 162 -96 58 50 -5 67 242 -259 79 247 35 -137 -27 -40
5722 -40 58 293 124 184 128 265 66 -251 216 -221 -51 31 192 80 61 -33 349 -115 4 150 -92 -10 12
5745 12 21 -74 -87 183 268 -206 155 -22 178 60 143 140 -252 -50 -69 111 105 122 -459 86 219 -308 -13 -63 125
5770 125 122 89 67 -241 381 -205 -463 -51 150 -65 -82 114 180 117 65 -211 -28 60 120 -12 -133 -59 229 216
5794 216 311 -37 -71 241 180 -111 -31 346 -20 212 130 152 -19 196 8 -9 -78 101 123 -135 162 113 -192
5817 -192 272 95 264 -52 99 156 -180 56 249 -141 67 -171 -293 19 -86 299 302 131 -12 277 76
5838 76 141 17 -41 -34 -30 -192 46 -47 -162 123 -147 82 50 247 -166 -61 -187 228 258 -210 65 25 218 124
5862 124 202 147 -160 104 -85 -213 35 -156 -25 -290 42 -27 -131 -234 -193 -2 -315 301 -144 27 284
5883 284 280 -64 -179 123 55 -120 171 170 182 189 210 112 90 116 -317 186 173 -271 137 -187 -301 -137 11 4 17
5908 17 -85 -2 -61 -303 85 44 -274 118 122 -123 -63 194 -11 -62 -125 -123 151 4 -224 -220 -149 113 -16 -165 28
5933 28 18 70 -262 65 77 -214 242 93 -83 -69 23 -272 -118 209 -74 55 26 -106 -341 80 40 -219 -75
5956 -75 109 -279 225 -143 -211 -281 7 304 198 -28 -153 -98 -138 322 109 68 140 179 -236 -37 78 -3 120
5979 120 117 -65 177 92 -53 62 -12 -41 173 -157 31 -53 -70 103 -114 -10 85 -146 -16 11 60 199 134 18
6003 18 157 136 -192 -320 303 -95 87 -230 5 15 147 47 -28 169 210 44 61 67 -113 -2 158 120 148
6026 148 -142 9 47 -9 169 -145 -24 107 20 -89 10 -27 80 -252 165 -212 189 93 -43 -204 141 61
6048 61 -150 -55 118 115 -17 211 173 -49 -58 -144 -241 -49 4 37 -103 -8 184 -25 -81 -76 -65 44 -275 3 -207
6073 -207 75 -285 -154 187 -73 -185 9 -26 161 -75 -279 45 54 51 153 -76 98 71 103 19 -7 30 -181
6096 -181 -105 159 -104 76 359 86 -207 -142 -55 -392 -47 128 -337 -291 -152 172 -22 -284 87 45 -88 -40
6118 -40 47 -144 -239 58 -33 -6 -311 -48 146 -185 -260 -88 -55 167 123 1 314 197 -254 126 43 -468 -57
6141 -57 -27 137 -94 -72 -83 -10 272 259 1 -114 166 -212 198 53 -299 -255 -80 -55 320 -198 -96 -108 -273
6164 -273 381 44 -73 40 56 77 -69 244 -119 73 -350 -93 -152 65 -282 -81 -175 -319 109 15 46 385
6186 385 21 -250 365 -100 78 39 -182 -135 87 154 72 -42 -22 -83 58 61 -1 -207 -348 -159 13 10 -83 -3
6210 -3 216 92 -185 -105 28 -9 60 87 139 92 -358 -137 201 -216 -70 169 -38 -128 192 195 63 77 194 -152
6234 -152 147 252 -88 -87 -157 402 184 -44 -144 21 170 369 86 199 265 60 206 123 106 -144 258 -79
6256 -79 -40 -325 -4 355 22 -170 -55 102 -264 238 99 78 -75 -179 -135 -234 25 -121 -69 122 -75 67
6278 67 231 -76 -141 -11 96 249 -368 -241 -48 -160 30 -38 -49 71 140 123 161 -376 127 -1 122 111 -48
6301 -48 -35 317 -128 185 226 -103 28 -50 -394 21 -358 -43 123 -222 67 -24 -168 21 -51 -140 -466 311
6323 311 246 -150 -140 -191 61 85 23 217 -7 44 147 120 187 288 152 -62 180 -99 101 84 -9 18 -125 362
6347 362 -36 -336 102 -27 -242 -140 292 -149 -214 28 149 -144 70 -100 -130 228 235 221 12 -18 -30 179
6369 179 57 165 52 -33 29 -5 -265 52 92 -7 16 -148 -162 -20 132 -27 209 -60 -22 129 -99 163 -260
6392 -260 -244 17 -105 -201 -231 -149 -9 16 25 -131 6 -230 179 -194 -2 257 -276 -78 134 -38 86 212
6414 212 -130 -108 320 14 -17 -131 -87 184 32 -21 -2 21 -17 -230 83 102 311 38 -377 350 -108 -59 255
6437 255 -57 125 -449 97 80 -178 -104 257 -102 -117 -241 -226 -297 -151 -150 65 -384 222 -134 223 273 10 -53
6460 -53 216 -15 42 100 88 -114 -196 150 -4 381 239 119 63 -95 187 116 -348 3 -160 297 317 15 -102
6483 -102 310 162 214 -187 121 241 -81 115 161 -123 92 311 23 -57 -27 135 -98 -23 39 -386 -164 -109
6505 -109 207 -263 -54 -35 43 134 -106 25 -218 16 -8 -179 400 -284 -76 74 329 -141 -80 -142 -28 -311
6527 -311 -5 -113 -136 -205 -92 29 -142 -80 116 172 104 -262 206 -31 -140 -141 12 -35 -289 110 -108 -71 95
6550 95 189 -93 4 -266 -140 173 -323 -85 146 47 -157 42 35 -39 216 99 -145 -81 -135 60 43 -96 18
6573 18 -203 252 180 -175 -179 67 85 -145 79 -89 -16 -234 406 -170 79 -4 -101 17 21 72 11 13 -61 -67 -12 76
6599 76 28 87 350 207 -241 108 168 132 -74 32 -238 -23 -94 -31 174 -16 215 362 -53 -16 179 165 -67
6622 -67 403 78 368 -75 6 31 119 -39 190 -29 575 27 -37 117 -354 -230 -26 2 -216 -175 -55 -7 -389
6645 -389 213 -16 55 6 160 -18 23 22 -256 0 18 -69 -233 138 -69 10 152 28 -27 -124 355 -220 108
6668 108 49 -200 -5 -424 105 57 21 -17 -249 -414 -209 49 -204 -143 -30 105 -100 -346 -152 -118 -57 -224
6690 -224 -95 -436 -36 232 79 -39 325 -157 67 283 148 -254 -89 46 -160 -154 -116 -75 125 -140 57
6711 57 -378 111 203 -142 84 -177 -156 266 181 -123 -10 78 64 -17 -56 190 -210 206 140 310 -189 -236 130
6734 130 271 168 321 349 243 528 10 29 -62 231 -57 77 153 -129 -191 147 188 238 335 157 -80 112 403
6757 403 -87 33 -168 175 -96 29 234 40 3 -6 -113 -386 -71 -93 -212 -99 -23 24 -57 188 -199 -373
6779 -373 93 -107 44 -201 -42 56 -134 47 -91 90 -213 270 -82 -87 -290 -52 194 439 -72 -183 188
6800 188 -1 -310 -139 -232 -29 -378 -24 -144 -273 -122 152 -128 -172 183 -495 66 -143 256 1 -89 -1
6821 -1 -273 -56 110 63 -104 -56 -245 -80 -79 55 -323 -103 -75 71 175 -6 123 31 79 204 35 -120 118
6844 118 179 -209 9 34 -187 162 289 -2 201 -43 -33 -178 225 61 -107 90 22 374 167 71 -138 -154
6866 -154 69 2 -10 -167 204 176 124 -63 312 -14 263 3 -192 -148 97 168 -156 136 -205 51 168 20
6888 20 55 -267 34 34 -138 -240 -114 -154 55 -96 55 -100 -36 70 -79 133 59 -33 -308 -217 -246 -187 33 -168
6912 -168 -124 -170 274 -211 -282 48 -82 -87 -11 235 -74 -162 -88 -7 -84 61 -56 -94 90 116 42 11 23 289 182
6937 182 -159 -13 37 -65 110 -173 -388 -36 -178 252 -75 190 17 -123 169 211 -362 90 128 177 -170
6958 -170 260 -177 -114 -53 -151 -208 189 182 -51 -110 6 59 222 500 -33 -76 -81 199 -137 65 238 -21 170 113
6982 113 107 100 -104 390 -62 -32 132 -84 74 -53 24 178 -89 -86 -51 -74 225 -146 -80 249 374 0 114 167
7006 167 104 44 293 -360 -98 262 252 -379 271 -137 -82 -130 -121 127 147 -117 44 -62 31 137 75 93 -98 299
7030 299 12 74 35 -18 -43 397 303 -91 165 49 68 -89 6 -45 -186 -42 95 136 -220 117 171 -87 -117 -116
7054 -116 -8 4 8 131 62 -168 64 -165 117 -66 -285 29 -7 -187 -19 287 -9 -102 -1 -22 -81 155 -112
7077 -112 -162 -30 -257 -100 -286 67 -53 -358 -123 87 72 -210 -221 -318 80 -88 112 -127 74 132 -81 -116
7099 -116 -46 1 36 51 -152 -30 -198 100 -60 45 -5 172 -35 -172 246 -24 44 195 -49 -126 288 32
7121 32 13 -80 193 99 -81 109 -24 30 -87 388 -303 -22 271 -4 37 -30 210 239 117 -158 43 162 132
7144 132 68 -12 292 -194 -56 -50 228 -28 -141 -67 23 -69 25 -68 -305 144 76 -181 -375 -110 -218 30 56 -90
7168 -90 144 -9 -20 102 -348 193 73 -75 -293 57 -162 -312 14 -76 -12 126 25 -34 -261 131 92 -182
7190 -182 -213 -17 -20 306 41 69 -56 -60 -227 11 -70 -173 -231 32 -114 -271 179 -116 83 40 -4 -137 -143 -178
7214 -178 92 -210 -123 95 122 -240 -94 -10 -110 451 89 135 -294 231 7 -20 355 -153 157 1 124 -339
7236 -339 3 70 141 178 277 -102 -89 -168 173 221 75 319 270 77 -1 130 -67 0 443 155 -306 -47 121
7259 121 -89 93 254 177 -32 -1 -247 203 220 253 184 31 284 -14 197 88 -221 -142 176 53 -229 -267
7281 -267 52 -161 -178 -74 220 -215 51 107 100 -37 -244 -97 56 176 -113 -59 -254 259 54 56 0 6 186
7304 186 191 -6 -253 53 -108 110 -207 -124 -13 93 30 200 136 -366 93 128 -167 -106 -136 -36 58 151 -225
7327 -225 -310 184 -376 14 240 -22 13 -54 218 -195 -297 220 164 -322 -97 -209 245 -143 95 183 -43 15
7349 15 184 125 140 -513 43 -167 -284 -205 -134 -70 -116 -228 -61 50 -358 -162 247 -137 -201 217 62 -193 238
7372 238 248 -26 63 110 60 -40 -13 88 -8 -99 -224 318 121 -203 -59 -10 278 276 77 210 210 -97 83 -157
7396 -157 99 -36 -45 189 -427 148 96 61 68 177 136 203 90 113 -73 -32 -28 -104 -61 20 158 -137 -202 232 -75
7421 -75 -194 -96 25 -311 67 240 -46 -280 200 -67 -118 159 137 -171 54 93 -89 54 -85 -161 -131 -38 81
7444 81 59 -262 99 14 -276 19 -88 -299 153 -139 -231 -94 -214 -67 -159 38 180 -127 -53 94 -161 31
7466 31 -77 -41 222 72 36 -89 9 48 -16 -260 -194 42 -211 627 -28 -248 79 22 -74 -38 -94 351 -70 58
7490 58 -65 101 188 143 -69 -113 11 -14 -150 -52 43 56 316 -144 -230 75 230 104 -14 -47 82 270 289 143
7514 143 -133 -241 276 104 -20 117 100 78 34 46 -27 -88 -131 -27 -34 127 263 -20 9 221 87 -178 75
7537 75 -3 170 -176 -243 35 -126 254 -72 -129 -62 -122 -28 30 -196 -33 112 200 -57 46 -85 -32 -214 112
7560 112 253 -382 -56 49 229 119 -31 146 -129 -22 -443 361 207 -230 -92 -141 -23 125 -56 -199
7580 -199 290 57 -32 -15 -90 -47 -10 -195 -258 -48 103 -45 -332 33 173 -65 213 154 -11 -131 198 36
7602 36 5 -182 -120 -167 346 154 -299 -28 -141 170 99 -4 178 -125 -182 -128 -37 273 128 289 -228 -80 13
7625 13 100 -283 22 149 -126 -103 162 10 50 282 112 -89 190 -20 -222 43 -56 172 -230 213 -162 -174
7647 -174 146 67 -136 37 203 108 206 -106 193 -379 129 429 125 -160 134 242 49 19 241 -60 45
7668 45 -102 -179 65 37 -10 -156 162 -43 -13 35 290 25 -224 -109 31 -276 -32 58 58 70 -18 -81 -228 -210
7692 -210 -128 -81 91 -124 -191 380 133 -327 -34 -416 -200 179 87 -195 -255 -86 181 104 -163 14 39 -115
7714 -115 47 304 58 -302 101 52 -40 -56 372 42 -75 -36 -108 -7 272 151 43 78 119 26 -216 238 -11
7737 -11 -112 17 -392 -259 -6 168 -24 1 55 42 -108 142 50 281 191 34 361 111 190 93 95 279 230 -113
7761 -113 233 7 -245 -58 196 151 -434 62 -132 -378 -126 -172 180 -378 23 54 -123 -2 -2 -173 -114 -67
7783 -67 14 141 106 -131 295 185 179 -291 119 188 29 -173 209 124 -332 -124 185 -146 72 208 -107 -146 -211
7806 -211 80 -174 86 -81 202 162 -13 -49 -34 21 19 -116 -22 339 109 -199 -136 119 334 -171 -44 -101 60
7829 60 76 -314 -165 15 30 279 133 -180 -77 -248 -22 7 66 189 -25 7 -163 12 -405 -261 112 -205
7851 -205 -156 128 17 -132 -172 -125 152 -212 72 134 -25 -276 4 65 50 192 -17 -85 56 -161 -12 58 -9
7874 -9 -44 105 382 6 40 8 273 81 -105 34 82 -8 257 102 -71 168 -79 234 291 -139 -81 80 -9
7897 -9 -41 218 109 127 236 349 224 165 -53 480 163 -34 -114 109 -212 -47 159 -77 22 -38 361 473 293
7920 293 263 185 279 -51 16 -111 42 -70 -225 127 -95 104 -44 67 105 62 -49 -40 -37 -85 59 -138 -201 258
7944 258 -26 -118 -164 68 -77 -63 268 -24 -165 53 -149 52 -208 8 -50 -224 213 -198 93 224 -5
7965 -5 -27 206 -90 140 16 90 -39 -72 260 144 -85 -256 34 102 226 -123 127 89 16 -296 157 161 -281
7988 -281 -167 -209 312 166 -36 32 108 -15 56 107 91 5 189 -17 -16 159 -8 -221 100 230 298 333 5 -90
8012 -90 89 91 37 101 -84 -31 60 -293 10 172 21 23 14 -29 16 44 230 28 -86 79 80 -27 19 -105 -6 -10 163
8039 163 -162 46 123 -48 86 17 -115 -31 -69 -109 -302 67 221 73 -94 5 -49 -40 15 174 -108 169 195 -197
8063 -197 -58 -126 86 6 -235 24 280 -105 44 120 -22 182 -294 65 -201 46 -14 -10 148 -383 35 -205
8085 -205 74 83 19 114 151 -76 -57 228 174 -175 350 18 38 71 103 -94 133 -123 90 213 -158 21 68 205
8109 205 -94 58 185 43 307 55 -124 -49 -211 -147 225 147 -205 1 299 15 -257 35 -26 103 139 96
8131 96 172 134 -387 -449 -36 -5 -126 130 213 -139 29 107 -100 203 48 299 -277 213 177 75 67 4 84 131
8155 131 85 348 -276 -7 265 -200 -64 -46 -190 -57 -57 44 -129 250 11 199 -137 -145 -148 -21 32 38 -169 -75
8179 -75 -35 -233 88 -43 42 235 204 213 190 123 253 -236
8191b36
##END NTUPLES=NMR FID
##END=
