##TITLE=1H_CA-8712-5
 CDCl3, 8 sc, 
 9.6.2020
##JCAMPDX= 6.0         $$ Bruker NMR JCAMP-DX V2.0
##DATA TYPE= NMR FID
##DATA CLASS= NTUPLES
##ORIGIN= UXNMR, Bruker Analytische Messtechnik GmbH
##OWNER= root
$$ XWIN-NMR		Version 3.5
$$ Tue Jun  9 10:58:52 2020 Russian Standard Time (UT+4h)  she@DPX200
##.OBSERVE FREQUENCY= 200.1315
##.OBSERVE NUCLEUS= ^1H
##.DELAY= (6, 6)
##.ACQUISITION MODE= SIMULTANEOUS
##.ACQUISITION SCHEME= undefined
##.AVERAGES= 8
##.DIGITISER RES= 18
##SPECTROMETER/DATA SYSTEM= spect
##.PULSE SEQUENCE= zg30
##.SOLVENT NAME= CDCl3
##.SHIFT REFERENCE= (INTERNAL, CDCl3, 0, 15.7039)
##AUDIT TRAIL= $$ (NUMBER, WHEN, WHO, WHERE, WHAT)
$$ ##TITLE= Audit trail, XWIN-NMR		Version 3.5
$$ ##JCAMPDX= 5.01
$$ ##ORIGIN= Bruker BioSpin GmbH
$$ ##OWNER= she
$$ F:/spectra/data/she/nmr/H-F/1/audita.txt
$$ ##AUDIT TRAIL=  $$ (NUMBER, WHEN, WHO, WHERE, WHAT)
(   1,<2020-06-09 10:57:45.81 +0400>,<she>,<DPX200>,
      <created by zg, POWCHK disabled, PULCHK disabled
       configuration hash MD5:
       00 E9 B6 7A A2 85 ED C7 34 08 36 98 17 FE 4E 26
       data hash MD5: 16K
       31 3C 73 F4 AB 17 98 66 DF C3 00 64 7A B6 67 66>)
$$ ##END=
$$ 
$$ hash MD5
$$ 86 60 CC A2 E9 FC E1 A4 34 50 B6 DB 5A 89 F8 1B
##$RELAX= 
##$RELAX= 
##$RELAX= 
##$RELAX= 
##$RELAX= 
##$RELAX= 
$$ Bruker specific parameters
$$ --------------------------
##$DU= <F:/spectra>
##$EXPNO= 1
##$NAME= <H-F>
##$PROCNO= 1
##$TYPE= <nmr>
##$USER= <she>
##$AMP= (0..31)
100 100 100 100 100 100 100 100 100 100 100 100 100 100 100 100 100 100 
100 100 100 100 100 100 100 100 100 100 100 100 100 100 
##$AQSEQ= 0
##$AQ_mod= 1
##$AUNM= <au_zg>
##$AUTOPOS= <>
##$BF1= 200.13
##$BF2= 200.13
##$BF3= 200.13
##$BF4= 200.13
##$BF5= 200.13
##$BF6= 200.13
##$BF7= 200.13
##$BF8= 200.13
##$BYTORDA= 1
##$CFDGTYP= 0
##$CFRGTYP= 5
##$CHEMSTR= <none>
##$CNST= (0..31)
1 1 145 1 1 1 1 1 1 1 1 1 1 1 1 1 1 1 1 1 1 1 1 1 1 1 1 1 1 1 1 1 
##$CPDPRG= <>
##$CPDPRG1= <>
##$CPDPRG2= <>
##$CPDPRG3= <>
##$CPDPRG4= <mlev>
##$CPDPRG5= <mlev>
##$CPDPRG6= <mlev>
##$CPDPRG7= <mlev>
##$CPDPRG8= <mlev>
##$CPDPRGB= <>
##$CPDPRGT= <>
##$D= (0..31)
0 1.2 0 0 0 0 0 0 0 0.06 0 0.03 0 0 0 0 0.0002 0 0 0 0 0 0 0 0 0 0 0 0 
0 0 0 
##$DATE= 1591685865
##$DBL= (0..7)
120 120 120 120 120 120 120 120 
##$DBP= (0..7)
150 150 150 150 150 150 150 150 
##$DBP07= 0
##$DBPNAM0= <>
##$DBPNAM1= <>
##$DBPNAM2= <>
##$DBPNAM3= <>
##$DBPNAM4= <>
##$DBPNAM5= <>
##$DBPNAM6= <>
##$DBPNAM7= <>
##$DBPOAL= (0..7)
0.5 0.5 0.5 0.5 0.5 0.5 0.5 0.5 
##$DBPOFFS= (0..7)
0 0 0 0 0 0 0 0 
##$DE= 6
##$DECBNUC= <off>
##$DECIM= 24
##$DECNUC= <off>
##$DECSTAT= 4
##$DIGMOD= 1
##$DIGTYP= 9
##$DL= (0..7)
0 120 120 120 120 120 120 120 
##$DP= (0..7)
150 150 150 150 150 150 150 150 
##$DP07= 0
##$DPNAME0= <>
##$DPNAME1= <>
##$DPNAME2= <>
##$DPNAME3= <>
##$DPNAME4= <>
##$DPNAME5= <>
##$DPNAME6= <>
##$DPNAME7= <>
##$DPOAL= (0..7)
0.5 0.5 0.5 0.5 0.5 0.5 0.5 0.5 
##$DPOFFS= (0..7)
0 0 0 0 0 0 0 0 
##$DQDMODE= 0
##$DR= 18
##$DS= 0
##$DSLIST= <SSSSSSSSSSSSSSS>
$$ [...]
##$SUBNAM2= <"">
##$SUBNAM3= <"">
##$SUBNAM4= <"">
##$SUBNAM5= <"">
##$SUBNAM6= <"">
##$SUBNAM7= <"">
##$SUBNAM8= <"">
##$SUBNAM9= <"">
##$SW= 24.9337058887773
##$SWIBOX= (0..15)
0 0 2 0 0 0 0 0 0 0 0 0 0 0 0 0 
##$SW_h= 4990.01996007984
##$TD= 16384
##$TD0= 1
##$TE= 0
##$TE2= 300
##$TE3= 300
##$TEG= 300
##$TL= (0..7)
0 120 120 120 120 120 120 120 
##$TP= (0..7)
150 150 150 150 150 150 150 150 
##$TP07= 0
##$TPNAME0= <>
##$TPNAME1= <>
##$TPNAME2= <>
##$TPNAME3= <>
##$TPNAME4= <>
##$TPNAME5= <>
##$TPNAME6= <>
##$TPNAME7= <>
##$TPOAL= (0..7)
0.5 0.5 0.5 0.5 0.5 0.5 0.5 0.5 
##$TPOFFS= (0..7)
0 0 0 0 0 0 0 0 
##$TUNHIN= 0
##$TUNHOUT= 0
##$TUNXOUT= 0
##$USERA1= <user>
##$USERA2= <user>
##$USERA3= <user>
##$USERA4= <user>
##$USERA5= <user>
##$V9= 5
##$VALIST= <valist>
##$VCLIST= <CCCCCCCCCCCCCCC>
##$VD= 0
##$VDLIST= <DDDDDDDDDDDDDDD>
##$VPLIST= <PPPPPPPPPPPPPPP>
##$VTLIST= <TTTTTTTTTTTTTTT>
##$WBST= 1024
##$WBSW= 4
##$XGAIN= (0..3)
0 0 0 0 
##$XL= 0
##$YL= 0
##$YMAX_a= 921691
##$YMIN_a= -590128
##$ZGOPTNS= <>
##$ZL1= 120
##$ZL2= 120
##$ZL3= 120
##$ZL4= 120
##$ABSF1= 10
##$ABSF2= 0
##$ABSG= 5
##$ABSL= 3
##$ALPHA= 0
##$AQORDER= 0
##$ASSFAC= 0
##$ASSFACI= 0
##$ASSFACX= 0
##$ASSWID= 0
##$AUNMP= <proc_1d>
##$AZFE= 0.1
##$AZFW= 0.1
##$BCFW= 1
##$BC_mod= 2
##$BYTORDP= 1
##$COROFFS= 0
##$CY= 11.3945322036743
##$DATMOD= 1
##$DC= 2
##$DFILT= <>
##$DTYPP= 0
##$F1P= 16.9975609425685
##$F2P= -3.02152046262296
##$FCOR= 0.5
##$FTSIZE= 0
##$FT_mod= 4
##$GAMMA= 1
##$GB= 0.15
##$INTBC= 1
##$INTSCL= 1
##$ISEN= 128
##$LB= 0.24
##$LEV0= 0
##$LPBIN= 0
##$MAXI= 10000
##$MC2= 0
##$MEAN= 0
##$ME_mod= 0
##$MI= 1.114404
##$NCOEF= 0
##$NC_proc= 0
##$NLEV= 6
##$NOISF1= 3.799351
##$NOISF2= 2.8
##$NSP= 1
##$NTH_PI= 0
##$NZP= 0
##$OFFSET= 15.70392
##$PC= 1
##$PHC0= -9791.926
##$PHC1= 11.60088
##$PH_mod= 1
##$PKNL= yes
##$PPARMOD= 0
##$PSCAL= 0
##$PSIGN= 0
##$REVERSE= no
##$SF= 200.130013532006
##$SI= 16384
##$SIGF1= 3
##$SIGF2= 2
##$SINO= 400
##$SIOLD= 16384
##$SREGLST= <1H.CDCl3>
##$SSB= 0
##$STSI= 0
##$STSR= 0
##$SW_p= 3612.71676300578
##$SYMM= 0
##$S_DEV= 0
##$TDeff= 0
##$TDoff= 0
##$TI= <>
##$TILT= no
##$TM1= 0
##$TM2= 0
##$TOPLEV= 0
##$USERP1= <user>
##$USERP2= <user>
##$USERP3= <user>
##$USERP4= <user>
##$USERP5= <user>
##$WDW= 1
##$XDIM= 8192
##$YMAX_p= 0
##$YMIN_p= 0
$$ End of Bruker specific parameters
$$ ---------------------------------
##NTUPLES= NMR FID
##VAR_NAME=  TIME,          FID/REAL,        FID/IMAG
##SYMBOL=    X,             R,               I
##VAR_TYPE=  INDEPENDENT,   DEPENDENT,       DEPENDENT
##VAR_FORM=  AFFN,          ASDF,            ASDF
##VAR_DIM=   8192,          8192,            8192
##UNITS=     SECONDS,       ARBITRARY UNITS, ARBITRARY UNITS
##FACTOR=    0.0002004,     1,               1
##FIRST=     0,             0,               0
##LAST=      1.6414764,     0,               0
##MIN=       0,             -590128,         0
##MAX=       1.6414764,     921691,          0
$$ Real data points
##PAGE= N=1
##DATA TABLE= (X++(R..R)), XYDATA
0 0 0 0 0 0 -8 8 -5 8 -16 16 -24 32 -38 46 -57 71 -80 102 -119 139 -164 192 -222 260 -296 339 -390 445
28 445 -501 571 -645 723 -809 909 -1017 1130 -1260 1403 -1555 1725 -1914 2117 -2342 2595
44 2595 -2874 3184 -3535 3933 -4387 4909 -5522 6250 -7134 8230 -9627 11496 -14112 18070
58 18070 -24801 39057 -127308 488090 746332 -193777 -590128 -156493 301487 161565 -60770
69 -60770 -90007 43921 185076 287653 146137 -102449 -132082 127839 299534 268836 193006
80 193006 102680 -89727 -90612 254271 439784 62378 -256281 84344 504837 214506 -334536
91 -334536 -267542 262782 457957 143834 -213104 -232778 50129 294377 171958 -165079
101 -165079 -216030 97299 265988 42303 -167133 -57189 78195 642 -15969 159340
111 159340 135910 -189513 -257983 142677 375959 44554 -321676 -199367 154632 273361
121 273361 93369 -178547 -274648 -41808 249076 147120 -221182 -266856 66438 197443
131 197443 -79398 -279184 -117171 64139 -3080 -91030 -34407 -51553 -203696 -182741 49042
142 49042 100917 -121955 -223422 -42232 100719 -1988 -180617 -210470 -31713 209545
152 209545 203857 -127921 -353996 -103749 281158 241324 -111086 -212629 41885 221381
162 221381 93933 -91814 -86643 36858 124241 147775 91047 -49124 -120498 -4323 140317
173 140317 123602 22898 -19879 -29411 -18647 48915 69757 -39702 -95100 41775 142228
184 142228 105 -166513 -89271 87377 81916 -57945 -85234 15982 50708 -26896 -73935
195 -73935 -35877 6984 31259 50614 11843 -70942 -66502 28482 58669 10815 11254 32188 -19515
208 -19515 -51123 32104 93098 15079 -66784 -9946 87925 75641 -19275 -66316 -22055 46120
220 46120 72864 47287 -12941 -59035 -31310 40522 51827 -1201 -15761 10772 1035 -16703
232 -16703 12095 15146 -36197 -23220 63228 59620 -46040 -71917 14119 52779 -1798 -27007
244 -27007 21080 50816 7096 -47160 -41795 6842 49286 62099 24501 -53101 -75064 13436
256 13436 85219 20961 -63760 -22790 52456 29897 -30145 -37714 -23798 -9095 31428 49410
268 49410 -9011 -69985 -44928 16096 21513 -16015 -23263 6018 12998 -23838 -48619 -25581 8056
281 8056 19632 13608 -16937 -53477 -27781 41087 34498 -48221 -62783 16510 56340 11699 -34719
294 -34719 -38829 -16157 21874 40355 2191 -44200 -25844 29381 40080 -3846 -39222 -25340
306 -25340 9147 20117 14435 14562 -2409 -36782 -32108 13158 21576 -6440 2400 25677 -5363
319 -5363 -46635 -26568 10490 8637 2481 16372 12764 -15670 -33711 -29138 -11888 12285 32998
332 32998 31942 3372 -36230 -47335 -16770 13979 20805 33053 44227 2572 -61756 -53907 14751
345 14751 51180 38417 18535 3340 -5987 -1263 -2406 -17428 -1227 53405 76951 33321 -29273
358 -29273 -52010 -19894 36908 67038 48686 12780 -8772 -10604 3514 12762 4553 11523 47606
371 47606 53112 -327 -40090 -20950 9915 22997 32799 26130 -4249 -15669 1615 -479 -24994
384 -24994 -15907 27795 44496 4386 -46895 -45138 2485 22494 -6698 -23709 -5299 1392 -14297
397 -14297 -16831 -14536 -28225 -26561 434 6936 -14387 -24102 -20149 -23510 -25332 -15597 -9942 -9369
411 -9369 -7185 -11241 -20479 -21914 -19426 -17430 -8868 -1869 -2461 2408 5246 -17316 -37511 -15062 21370
426 21370 25477 12045 3385 -7404 -9664 6050 12522 4472 15105 38898 31019 -1710 -15165
439 -15165 -1682 17476 29385 28867 20466 14303 5999 -7096 -7655 6195 17144 25049 26753 1859
453 1859 -30078 -22973 5763 6270 -2876 7945 8045 -17145 -26601 -12556 -12703 -19187 -3032 15623
467 15623 4245 -21883 -31445 -19820 -3745 1145 21 6640 6923 -10143 -20768 -6412 5682
480 5682 7057 15405 18829 -27 -7866 8963 11339 -4243 5012 29497 24289 2232 -2527 251
494 251 1064 10459 19803 12054 573 1265 4202 1352 -4148 -3197 7837 15411 4145 -9003 -3974
509 -3974 921 -4666 3735 17602 5147 -11511 5182 19983 -838 -12125 12277 26310 11033
522 11033 2376 8625 7374 4887 12619 19119 13460 3860 3259 11202 12052 -1208 -6185 7311 11319
537 11319 -5637 -12340 -4648 -9915 -19997 -11182 -5454 -19686 -26497 -19600 -23921 -32236 -24350 -19663
551 -19663 -29824 -30551 -20991 -24377 -35108 -30981 -19766 -16729 -18155 -18161 -15728 -12876 -14332 -13045 -908
566 -908 6608 -2642 -2009 15653 15544 -3988 211 24226 26626 15866 19968 22380 11975 12123 23829
581 23829 24938 18213 18723 21374 18764 12454 4691 2956 12667 20368 14223 5340 -1669 -9417 -4540
596 -4540 9565 5911 -10391 -4554 10384 590 -18016 -15331 -3741 2762 8581 7965 -5540 -13486
610 -13486 -5919 3037 6377 8744 4245 877 8711 11668 -1691 -9500 3442 17826 20337 11506
624 11506 -6498 -14716 1208 16976 6688 -8090 -5656 1161 2520 -996 -13871 -24470 -9919
637 -9919 10740 2691 -19626 -22873 -12569 -6713 -5399 -9238 -17670 -13789 34 2868 -5883 -11910
651 -11910 -13691 -7464 10585 17968 222 -11629 3081 19341 15697 1332 -4742 8468 30634
664 30634 32198 6859 -8372 3322 15502 18748 20584 13164 445 4399 14670 1746 -14425
677 -14425 -2736 14512 10624 473 -5861 -19359 -30194 -15191 11572 14235 -13709 -36670 -24057
690 -24057 31 -7566 -32013 -23511 6755 8854 -13615 -26099 -29859 -24712 1919 23692 5742
703 5742 -23652 -20001 -2631 -1048 -1711 4102 2785 1317 11862 12508 -9595 -25281 -4130 33405
717 33405 39447 3223 -27666 -14181 16089 21144 9124 299 -3604 4020 20985 11256 -23000
730 -23000 -20399 25149 39953 3397 -21536 -10523 3771 12153 20611 11673 -11042 -12028 12171
743 12171 22548 4578 -11791 -951 20989 21330 1589 -10084 -6049 6579 24100 29355 -478
756 -478 -31102 -7502 34517 22940 -15461 -10681 15491 9946 -7310 -5372 -2544 -5497 5869
769 5869 17843 622 -25551 -22212 1412 12212 4279 -5404 -10580 -16520 -15966 1536 10942 -10277
783 -10277 -23926 3026 21161 -11779 -39797 -12064 19956 10950 -4506 -5023 -14084 -19121 3156
796 3156 20356 1322 -17275 -2237 14052 2246 -14014 -8301 6357 7910 5833 9124 263
809 263 -23046 -17917 22295 32715 -9648 -29972 3883 22948 -3253 -18276 -1456 7768 4549
822 4549 8453 1185 -22045 -19492 14312 25844 -2287 -23520 -9292 10225 5240 -8121 -5869
835 -5869 1898 -1513 -697 8032 -2152 -23249 -9452 24509 15961 -20039 -17793 8969 6774 -6676
849 -6676 923 3335 -10063 -3156 18601 7229 -23538 -16321 19154 24150 -6462 -18252 2345
862 2345 12119 -1927 -4270 10259 5214 -9759 4236 21294 -1847 -23545 5437 30942 5397
875 5397 -15726 4204 13018 -6944 -3003 20832 11713 -14547 -4395 22135 11623 -15914 -9416
888 -9416 18124 18029 -2478 -3676 5884 -5066 -10207 15559 25866 -8089 -22947 10866 22614
901 22614 -13257 -20252 15423 20802 -6469 -6851 7276 -9394 -21085 10219 32194 2346 -27870
914 -27870 -11960 12393 2165 -11939 942 11865 -3405 -10892 3440 -2247 -26668 -9973
926 -9973 32968 22500 -28613 -31926 4221 7280 -10241 1368 11372 -9718 -16551 4610 412
939 412 -27585 -16015 25173 24668 -17134 -32032 -8462 1853 -7298 1463 18162 -112 -29868
952 -29868 -15405 14454 -333 -24071 -165 27702 4059 -26279 -14812 -1296 -4355 9285
964 9285 25495 846 -30406 -12669 18689 9037 -10785 2603 20250 4894 -14254 -3373
976 -3373 11655 2165 -2199 19253 25308 -8557 -24688 6548 27637 10094 2015 13411 2751
989 2751 -14525 5892 27678 6250 -11844 13541 28079 -3959 -24158 1922 26481 15177
1001 15177 1139 4371 -382 -16764 -9711 21355 27169 -2738 -15960 1248 2755 -14042 -5787
1014 -5787 17077 9533 -6954 563 -148 -26820 -25013 16433 31691 292 -22284 -14516 -9044
1027 -9044 -12417 -2303 12112 6574 -8823 -10426 -5218 -14376 -22325 -4089 21411 14240 -11096
1040 -11096 -18114 -16110 -20072 -5751 24032 19313 -16449 -22857 409 1104 -16750 -7649 15904
1053 15904 14920 -138 -6989 -12566 -17840 -4560 21076 25427 1258 -17835 -10568 4546 4422 2865
1067 2865 11427 10515 -1499 690 10784 -1845 -15637 7889 34046 16418 -12794 -8547 6694
1080 6694 6372 8715 17408 9007 -6971 -1481 15313 12049 -4445 -4229 12941 17894 2396 -8017
1094 -8017 -1530 3728 3338 11210 12939 -8760 -23153 192 22060 6336 -14700 -9310 42 -2657
1108 -2657 -1829 -1653 -11941 -13633 4404 10888 -10772 -29373 -17710 6475 11304 -4686 -17868
1121 -17868 -17078 -11851 -5470 3629 975 -17029 -19049 4667 11323 -14095 -26858 -5093 12893
1134 12893 7944 -1812 -10668 -16993 -6760 13429 13788 -6029 -12264 1658 12331 3828 -9540
1147 -9540 -7731 7138 15407 9232 395 -6216 -9562 1249 19741 17005 -5226 -10085 5428 11135
1161 11135 4496 1968 472 -1552 8951 20065 6414 -14776 -9655 13027 22412 11279 -2349
1174 -2349 -4674 1994 8691 10870 9985 4089 -1411 6966 19721 10246 -10563 -6815 14737 21469
1188 21469 12405 2935 -7435 -10557 7336 23746 10438 -11082 -6213 11519 10336 -7219 -14867
1201 -14867 -3209 13110 13750 -1504 -15891 -17791 -8704 6146 11747 -3956 -19219 -11286 2303
1214 2303 -5079 -16555 -12382 -4162 178 4495 -2476 -25288 -32262 -6696 16790 8935 -13524 -22031
1228 -22031 -13374 -4131 -5185 -9853 -6705 -862 -1484 -4904 -8680 -16682 -18170 -2643 10771 4249
1242 4249 -7693 -12193 -15597 -13937 714 10203 -1017 -11246 -4899 952 -5009 -9699 -5017 2927
1256 2927 8465 6740 -2200 -8072 -5114 4183 12574 11679 364 -2664 9177 15643 6240 1428 8572
1271 8572 12245 13221 18318 14369 -219 1685 23142 29509 10456 -4105 4654 22018 28250 17109
1285 17109 1264 -2773 8101 19837 20291 9848 15 3694 14357 9633 -5540 -4155 9846
1298 9846 12955 7157 4735 -4795 -18098 -10517 10370 12893 -1408 -6391 -4025 -10407 -16106 -9217
1312 -9217 802 3728 954 -4331 -11595 -20143 -21037 -6431 8143 3533 -8805 -10014 -10310 -21227
1326 -21227 -20344 -662 6087 -5989 -7681 -1808 -13314 -28861 -18671 2520 8028 2913 -4463
1339 -4463 -17264 -26370 -15426 4500 8608 -4569 -12085 -3542 1992 -9502 -18924 -8218 6152
1352 6152 7784 6898 3142 -13905 -22651 -1125 20107 9354 -6913 -72 7304 -705 -4365 2445
1366 2445 4402 3526 10136 13523 2492 -7657 -839 12696 12179 1230 1313 12460 11928 366 -489
1381 -489 6971 5487 4031 13622 13956 -1292 -3147 11342 11371 -982 1818 11877 7473 2402 8668
1396 8668 10103 -1893 -6470 4653 15181 11388 2446 489 -34 -2698 -52 10433 10601 -3625
1410 -3625 -5807 8827 8875 -8619 -11749 2529 7515 3794 5238 -128 -14992 -14289 5199 10722
1424 10722 -2209 -8058 -1621 320 -5862 -9770 -6614 -1137 1712 2182 -1315 -10226 -15095 -5840 5811
1439 5811 -224 -10381 -3428 4807 -5374 -14603 -7356 -999 -3278 1108 6035 -5839 -17784 -8861
1453 -8861 5171 2945 -4850 -4287 -894 -1722 -4422 -3589 -2138 -3043 -1957 4253 5963 -3617 -10571 -2789
1469 -2789 4344 1352 1970 6460 -586 -9541 -931 9649 2816 -3625 3028 6259 -40 -464 3347
1484 3347 284 -2368 5027 11320 4946 -5951 -4921 4982 8446 1828 -1932 4118 5615 -1197 -2433
1499 -2433 1454 -625 372 9204 7045 -8339 -10391 3072 6762 -1027 -2498 512 -1298 -2103 1176
1514 1176 -2236 -8371 -4380 5155 6894 -2283 -11096 -9422 -37 3521 441 -1424 -2246 -4618 -2419
1529 -2419 2242 -2172 -7680 693 10646 3339 -6004 -1755 2738 34 2236 9217 7284 1903 3326
1544 3326 5215 3032 2774 6771 10024 10491 8123 4814 4046 4053 4587 8426 12333 8285 2662 4950 6963
1561 6963 727 -1540 4672 7339 4775 4513 2049 -6291 -7890 683 3070 -1075 -592 -495 -6188 -9119
1577 -9119 -7131 -5452 -5776 -3904 -936 -1566 -6863 -14092 -14692 -5454 141 -2753 -5475 -4258 -7524 -10924
1593 -10924 -9413 -7208 -6006 -219 3079 -4735 -12467 -10364 -7290 -7188 -2491 2541 -1979 -8140 -7113
1608 -7113 -6521 -9011 -8002 -2293 2037 1725 -4022 -9423 -9072 -4997 -2380 276 4428 2702 -2399 -1631
1624 -1631 -165 -3191 -421 9217 11335 6467 5595 6479 2403 2970 11137 14851 11637 11989 14341 11283
1640 11283 5986 4929 9790 16609 18546 13361 8290 6333 4770 4486 8602 9718 7154 7868 9478
1655 9478 384 -8478 -4003 2973 772 799 4058 -193 -11004 -13490 -7405 -3869 -3370 -2018 -1849 -4724
1671 -4724 -10145 -14309 -11394 -3261 644 177 -1229 -5353 -9305 -6794 -2861 -4672 -924 9095 8036
1686 8036 -5979 -10282 -1769 1178 -767 3952 9325 3285 -4100 -5932 -3897 -460 2773 4558 1807
1701 1807 -2182 -3417 -2106 -3874 -8493 -5125 6826 7303 -6962 -11854 -2363 -969 -7603 -1985 7981
1716 7981 1210 -9238 -3859 3717 -707 -4890 860 5254 3716 2376 1780 -1274 -1676 4325 8808
1731 8808 4200 -2325 3258 11922 3685 -10278 -2840 13467 8880 -6195 -3641 5551 32 -5935
1745 -5935 -638 -282 -7420 -3578 4794 -1238 -12534 -9871 -1533 -3535 -6873 -2182 1029 -6739 -13169
1760 -13169 -5797 3283 -2649 -10204 -544 8516 -1375 -10083 -409 7043 -69 -956 9021 8651 211
1775 211 1541 5707 2542 4364 14959 13708 -713 -2065 11003 13825 2323 -841 10026 15393
1789 15393 4126 -4009 2466 8071 2865 1065 6382 3299 -4013 195 5702 -2956 -8346 3967
1803 3967 9229 -3108 -9093 -1575 168 -5127 -237 6004 -1773 -10227 -3279 6726 1284 -9265
1817 -9265 -5354 6624 6529 -3916 -6427 -1724 -1138 -917 5275 3943 -6817 -5767 5455 1561 -10918
1832 -10918 -4136 10514 3954 -10714 -8069 1124 -1520 -6870 -2246 1609 -2565 -6153 -4240 -3869
1846 -3869 -8284 -7397 2094 5268 -4436 -11181 -5434 -1465 -5715 -3389 4454 1715 -5803 -3142 -163
1861 -163 -6181 -6093 5900 9763 -1104 -6634 -1102 1913 -1027 -1393 2422 5619 4986 1262 -3059 -6056
1877 -6056 -2361 6935 12147 2705 -7192 -2508 6415 1451 -4476 1617 7808 3709 129 1191 -2595
1892 -2595 -4813 3778 10828 4004 -3883 -164 5174 2311 -1665 639 5646 6278 3274 871 686
1907 686 788 3265 7988 4817 -3177 -1422 9296 8452 -2530 -3481 5295 5311 -511 1080 3848 1024
1923 1024 1235 4866 41 -6939 -2451 7293 7807 -971 -6187 -1656 2029 -2204 -5405 501 5801
1938 5801 2399 -3037 -5376 -8132 -7336 2971 9026 -276 -8917 -4464 -539 -6479 -8069 -846 4731
1953 4731 3178 -1503 -7703 -12292 -8937 605 6525 2737 -4812 -6862 -3245 -4511 -8944 -3795 7227
1968 7227 7432 -1922 -6469 -6743 -7301 -1575 8110 7178 -1399 -1984 1723 -2100 -7090 -1102 8966 10534
1984 10534 3945 -3087 -5052 -1422 3909 5427 4359 2764 1864 3215 926 -5181 -3988 6995 11256
1999 11256 2079 -4911 -2353 -188 404 2746 2304 -2873 -2046 3828 1070 -7059 -6202 3024 5439 -771
2015 -771 -6612 -5366 -379 2058 -338 -3674 -4793 -3715 837 2946 -3406 -7890 -894 6334 -158
2030 -158 -9011 -4342 4387 3633 641 -306 -2936 -3742 1529 5119 1788 -419 2908 4413 456 -2968
2046 -2968 -583 6804 9155 4595 89 791 2570 2810 4950 5304 2560 4764 9242 3862 -5883 -2275
2062 -2275 9816 12011 4364 -299 -102 1257 3364 3642 1240 1321 5022 5511 -210 -5953 -4738 3326
2078 3326 7687 1938 -5605 -3963 1236 -683 -3651 -3077 -1745 -338 2339 -643 -9563 -10649 -842
2093 -842 4531 -957 -7012 -6988 -4544 -2746 -2675 -5186 -6903 -4021 -442 -1936 -7405 -10691 -6278 406
2109 406 -745 -7580 -7508 -1418 -3303 -9521 -6794 -719 -858 -3191 -3802 -5314 -5890 -1545 2417 -1376
2125 -1376 -4810 -1024 3639 1982 -2420 -2845 2543 7275 5488 1368 1425 2809 3754 7010 8618 3770
2141 3770 2660 9674 11082 1319 -1861 7695 13822 9050 3061 1178 1953 5359 9232 5834 -1335
2156 -1335 -1345 6453 9155 248 -9048 -4043 8500 8754 -2340 -7061 -3488 -1257 -421 2649 111
2171 111 -6026 -3930 3679 484 -7632 -4625 3223 3627 -1380 -2313 -1095 -1461 -277 2569 2755 188
2187 188 -1000 1792 2554 -1933 -2763 4511 6620 -1223 -5046 253 2159 -2463 -951 2764 -717 -4860
2203 -4860 -1771 -873 -5279 -3773 3272 291 -8965 -8956 -188 2271 -4121 -7255 -2984 838 -1881 -4813
2219 -4813 -4039 -3665 -1797 4892 5933 -5275 -12202 -1388 10029 4854 -2996 -745 2218 -213 1131
2234 1131 2947 -1035 -2370 5978 9622 -611 -10481 -4569 6628 6515 -795 -3183 -1260 -2310 -4564
2249 -4564 -2116 -60 -3191 -1959 3615 -447 -12505 -11097 2595 5778 -2539 -4315 -863 -3445
2263 -3445 -5422 -318 3565 424 180 4552 4025 -2051 -2343 4582 8080 5100 3882 7231 6110 -799
2279 -799 303 10225 12158 5505 3532 5406 2011 1091 8457 9717 677 -1358 6891 7355 -2627 -5634
2295 -5634 2248 6179 2622 -1489 -3004 -4725 -3849 1247 3730 -2765 -9039 -4418 3306 -1373 -9754
2310 -9754 -5530 2336 954 -4102 -4317 -4877 -5947 1041 6843 -1216 -10397 -4881 4810 2341 -4019
2325 -4019 -3356 1140 1224 -819 -1596 -2936 -4015 -871 4520 3126 -5393 -7860 -437 2507 -2482 -2844
2341 -2844 2144 -790 -6519 -3172 2260 -1950 -4534 1240 3244 -2590 -5009 -312 1341 -1199 640
2356 640 4305 2290 -2866 -2896 2644 4754 2840 1811 3158 2163 490 3260 5138 187 -126 7277
2372 7277 8698 -1229 -4747 2929 7349 3220 909 1431 -828 -144 3590 3235 -3118 -3640 2439 4934
2388 4934 -862 -6148 -3644 2009 2231 -1054 -1770 -2648 -4114 -1379 2874 -447 -6503 -3070 3364 675
2404 675 -5017 -3091 190 -113 -119 993 -1287 -3706 -708 2832 658 -2515 -840 1318 780 -1719
2420 -1719 -1511 889 1230 -1288 -398 1457 74 -2729 239 2334 -189 -1456 1345 622 -2832 -460
2436 -460 3143 1445 -2239 -1308 1774 1488 276 -644 -1372 677 2803 1704 -1011 -1640 165 2601
2452 2601 2829 179 -1927 299 2677 1532 -108 -184 -120 1127 3703 2141 -2480 -2153 2339 3473
2468 3473 1260 -135 -619 -348 1736 2439 -370 -1953 1144 3165 1661 -529 -1594 -584 2256 2929
2484 2929 210 -1695 -267 960 -31 -204 -367 -209 729 118 -1483 -1324 51 -791 -2095 432 1360
2501 1360 -2500 -4196 -1374 -201 -1125 -1263 -1566 -2774 -2565 -1191 -2013 -3256 -2228 -1029 -1154 -2181
2517 -2181 -2530 -2709 -1996 -1609 -495 -54 -787 -3579 -3040 1402 1787 -2838 -3186 1037 2071 -424 -1525
2534 -1525 -1155 -1573 1715 3657 -212 -2765 167 3599 2268 -734 -911 1750 3038 1444 431 1521
2550 1521 1958 734 1131 3888 2710 -755 1367 4278 2941 227 1218 2189 1852 3278 3994 1040
2566 1040 -698 2596 4370 1424 -259 2169 3979 2787 -150 -382 1608 2157 781 1036 2433 832
2582 832 -1806 -585 1424 -365 -950 974 190 -2471 -1566 287 -1892 -3446 -138 1672 -1635 -4126
2598 -4126 -3008 -816 -1098 -3001 -2701 -628 -713 -3354 -3552 -1913 -2168 -2351 -1132 -237 -2765 -3481 -1311
2615 -1311 -1651 -2752 -807 754 -2150 -2909 551 266 -3056 -2633 1095 1745 -301 -966 -64 398 132
2632 132 -373 863 1835 880 600 2053 717 -1622 511 4139 1939 -804 1655 2777 -430 -1034
2648 -1034 2377 2312 -173 1044 2638 761 -1938 -232 2110 2012 224 -95 697 413 -1243 -403 850
2665 850 -83 -1137 1074 2122 -2245 -3897 -85 1871 -933 -684 1205 -518 -2900 -474 1597 -858
2681 -858 -1688 946 2070 -506 -2293 -1064 808 1194 108 601 972 26 -746 1198 1324 -745 -329
2698 -329 2717 1935 -1356 -563 1928 182 -186 2247 1634 -1661 -582 1984 1420 -1223 -724 1541 1711
2715 1711 594 108 -31 -22 303 1220 1631 417 -1173 316 2371 332 -967 1280 1857 -1108 -221
2732 -221 2582 1509 -2021 -668 2231 1070 -974 -209 729 -355 -497 -130 -612 -850 -386 -451 -1094 -2047
2750 -2047 -2378 -766 -374 -2072 -3231 -1014 -977 -3177 -2313 67 -2286 -4156 -1329 303 -2128 -3624
2766 -3624 -1410 -651 -978 -778 -847 -1891 -1284 -59 237 -619 -1408 -685 1199 1258 -713 -1143 937 1645
2784 1645 -54 368 1859 469 -869 675 2220 820 361 1123 433 -50 1063 572 -252 641 1507
2801 1507 1003 264 -77 94 499 911 730 682 1825 906 -870 -214 1407 948 816 2593 2262 51
2819 51 -621 517 1537 1920 3286 1756 -402 -47 1311 1440 927 1394 1413 2453 1451 -824 -1805 548
2837 548 1938 1560 1941 733 -2157 -2365 449 1191 -395 -185 1232 -334 -1888 -1089 -1450 -2110 198
2854 198 2214 920 -2533 -3858 -1994 208 545 -559 -366 178 -1347 -2562 -894 -101 -1373 -19
2870 -19 2328 -104 -3574 -2402 596 175 -912 499 -69 -2282 -1601 667 -156 -1828 -1590 388 1108
2887 1108 -939 -2369 -1541 -55 -572 -714 -226 -1410 -2740 -312 2186 -801 -3492 -868 1256 -131
2903 -131 -571 1092 -19 -2494 -442 2017 52 -1417 813 2963 1570 -1238 -2164 -305 1584 1904
2919 1904 2172 2092 -378 -1973 398 2103 362 183 2912 3103 -833 -1718 -244 54 688 4296 4005
2936 4005 -643 -2430 -305 1043 904 1155 2192 1700 420 -580 -637 -901 -64 2119 4572 2279 -2607
2953 -2607 -2705 757 1139 308 2018 2873 -680 -1934 445 295 -1940 5 3691 2520 -1634 -2286 -660
2970 -660 -71 815 1534 1457 -578 -1813 -661 897 -155 -2164 161 2189 -85 -2506 -875 403
2986 403 -1428 -872 2029 285 -3219 -1514 1533 185 -2240 -1085 338 -337 -1283 -334 -126 -1417
3002 -1417 -1774 -85 1032 -1085 -2688 -567 1924 -396 -2398 -861 -245 -2198 -677 1892 -372
3017 -372 -3046 -1174 1278 -785 -1882 62 763 -544 -1046 -451 -1143 -1362 -179 1789 968 -1778 -2561
3034 -2561 352 1737 -583 -993 1321 1146 -1260 7 1584 -907 -1827 2012 3538 -568 -2146 667
3050 667 1556 -312 262 2189 1181 -722 -73 1916 1042 -1042 111 3067 2015 -1254 -722 2150
3066 2150 818 -1039 1112 3162 205 -1918 1589 2446 -800 -628 2382 1670 -877 73 1739 127
3082 127 -1307 1040 3165 684 -1831 -529 1953 1123 -1159 30 2460 796 -1336 956 1460 -2037
3098 -2037 -1394 3379 2726 -2420 -2494 934 399 -1271 347 1693 -840 -2083 368 666 -1680 -2110 896
3115 896 2524 -189 -2765 -1249 145 -1152 -1311 1284 859 -2826 -1809 517 -1450 -3488 353 3162
3131 3162 -582 -3172 -862 123 -2332 -2118 1580 1696 -1572 -1854 -762 -765 -1866 -657 1894 1157 -1925
3148 -1925 -1794 184 -489 -2420 158 2840 -161 -2460 -350 224 -2175 -1065 2513 1290 -2346 -1057
3164 -1057 1931 223 -2324 -334 2178 1201 -508 -381 296 -83 -381 1625 1923 -518 -1717 1942
3180 1942 2894 -1375 -1466 2330 2642 -1269 -374 2740 946 -1150 1364 2666 -990 -1561 2135 3340
3196 3340 257 -978 551 1018 -244 -156 1625 1912 70 -198 964 -310 -2188 290 3743 1441
3212 1441 -1784 -521 1386 -1232 -1892 1641 2768 -92 -1043 255 -1233 -2359 12 2297 1176
3227 1176 -1370 -972 310 -1385 -2376 222 2798 1407 -1466 -1373 -241 -1865 -1612 1725 2356 -1100
3243 -1100 -1475 798 -685 -2926 -873 2797 1782 -609 -643 -629 -1524 -727 1403 1436 -73 -168 479 -187
3261 -187 -1582 -1423 1319 2186 -310 -1473 -166 -149 -1431 -416 1097 -118 -1830 270 521 -2694
3277 -2694 -2654 600 1584 -727 -2007 -1037 -205 -268 -632 -852 -1104 -1110 -253 537 -529 -1799 -977 1138 233
3296 233 -1874 -1147 1026 208 -652 400 -89 -1240 -256 1746 607 -622 298 1120 -177 -760 9
3313 9 899 1312 724 27 -488 -584 -275 879 1619 328 -755 465 1149 -167 -596 1212 1742 585 437
3332 437 1082 77 77 815 1645 1476 1761 1268 -490 -432 1215 2392 2165 1168 292 865 1892 1115 -67
3351 -67 244 2068 2092 885 614 -356 -758 914 1677 394 -894 168 -106 -379 -505 -857 -782 109 538
3370 538 -649 -2387 -1592 -536 220 -85 -1992 -2345 -600 1027 -766 -2767 -1632 -215 -52 -285 -1751
3387 -1751 -2431 -631 630 75 -1300 -1418 -907 -904 -140 -215 -1203 -882 56 -117 -848 -946 -1313 -1423 -160 331
3407 331 -641 -1503 -898 -683 -745 -703 -512 -442 -441 -312 -1121 -1071 -493 -163 -547 46 269 -131 -59 17 17 546 1103
3430 1103 444 -402 1095 2059 444 -503 765 2307 2374 866 -438 -390 1646 2813 1735 125 141
3447 141 1229 1345 1516 374 -222 1270 2230 1509 335 349 19 255 1846 1701 -334 -556 1255 1657
3465 1657 131 -595 131 600 700 940 -369 -756 518 1252 343 -262 -657 401 1173 315 -1620 -1164
3483 -1164 1051 492 -988 -177 235 -681 -1146 -80 -306 -1347 -928 268 -481 -837 -1222 -1436 -1592 -469
3501 -469 181 -387 -668 -1331 -1672 -967 -862 -994 -477 15 -1395 -1495 -590 -9 -1601 -1262 321 331 -554
3520 -554 -1011 -1272 -1239 -104 969 -278 -981 -525 293 -331 -799 -135 791 1448 400 -796 -470 327 116
3539 116 76 658 903 -34 673 602 -323 -429 1029 1509 912 436 795 -242 -252 1594 1342 106 234 890
3559 890 954 227 -45 224 993 846 204 148 858 41 -606 40 525 -20 338 490 -434 -1037 401 927
3579 927 -107 -741 358 652 -40 -171 -115 -192 53 815 465 -35 -280 -297 520 306 90 -37 882 845 -153
3600 -153 -28 132 23 117 957 907 -548 -366 1070 610 -653 -419 496 827 241 -22 -884 -120 234 228
3620 228 42 -343 -557 -255 87 -408 -1060 -545 126 -356 -747 -168 -345 -1324 -538 674 -129 -762 157 -302
3640 -302 -988 -527 264 -128 -384 93 294 -140 -590 -355 -249 -33 -45 -404 157 89 -968 -536 40 -332
3660 -332 -887 -646 163 -517 -901 -282 -81 -713 -50 142 -472 -72 27 -239 -226 -391 6 453 289 216 -346
3681 -346 84 285 173 487 969 261 -265 482 997 375 214 863 755 222 377 851 320 172 1143 608
3701 608 238 297 820 443 565 63 -120 620 567 -78 -385 363 554 -340 296 759 -246 -82 450 -1
3721 -1 -109 -107 530 -210 -290 264 -107 -426 205 222 -55 -252 214 -15 -136 80 -248 -191 462 307 -446 -195
3743 -195 300 -277 -19 501 -275 -795 -25 387 -456 -380 201 113 114 -101 -112 -498 -240 310 289 61 -91 -566
3765 -566 -233 386 -152 -588 283 98 -715 -875 -50 -656 -563 349 -386 -931 -741 256 -116 -746 -485 -164
3785 -164 -172 -356 -621 -309 -8 -687 -434 406 393 -763 -730 156 13 -490 403 638 -730 -1032 65 867
3805 867 -358 -383 408 292 -255 -17 177 -4 -99 307 509 -28 -797 -346 716 702 -225 -575 374 122
3825 122 -113 310 470 -460 -36 1376 868 -964 -131 1809 1135 -349 252 498 311 483 702 1149 323
3844 323 504 746 1122 191 -519 712 2054 769 -162 405 455 27 427 1147 390 -1074 -260 655 -314
3863 -314 -610 309 629 -593 -1028 -21 -58 -1041 -1002 37 196 -482 -876 -570 -162 -689 -152 854 -515
3882 -515 -1573 -375 1094 -264 -1434 107 976 -406 -954 121 -5 -475 254 1121 -18 -1465 -725
3899 -725 763 685 -580 -692 708 666 -467 -818 -228 -564 -341 696 769 -1529 -2138 593 1059 -1192
3917 -1192 -1035 52 -140 -942 -547 469 -468 -869 446 1007 -330 -1215 -253 1073 484 -599 -112 503
3935 503 126 -605 675 1164 -247 -271 1135 636 -1015 -281 1312 471 -684 137 861 -469 -832 517
3953 517 900 306 -484 -77 -136 34 63 333 188 -583 -30 827 183 -1198 -260 1467 818 -675 -490 409
3973 409 -100 -14 1405 666 -948 -220 1463 988 -518 -725 556 1010 470 -133 -256 1 437 1111 718
3992 718 -273 -850 836 1424 -360 -1153 5 1375 58 -836 -241 -179 -646 -5 953 -315 -1211 -38
4010 -38 445 -64 -352 -21 164 -452 -652 495 569 -749 -1018 412 598 -566 -875 213 141 -911 -407
4029 -407 858 -60 -1423 -445 776 -99 -738 -579 186 -112 -308 14 -475 -684 39 977 91 -1466 -1008
4048 -1008 810 755 -1070 -1489 465 391 -70 -47 -294 -1164 -74 1355 609 -1427 -1392 653 778 -322
4066 -322 -205 -118 -227 -188 660 512 -450 -817 187 1555 129 -1494 -617 848 673 -231 -204 624 -70
4085 -70 -64 890 212 -880 537 1217 207 -604 303 1189 249 117 755 737 -61 -539 522 1122 649 199
4105 199 664 938 37 -121 363 194 -304 529 1596 117 -1355 -140 1108 488 -4 168 26 -850
4123 -850 -96 792 547 -847 -626 534 819 -528 -1557 -773 774 585 9 -595 -868 -714 519 708
4141 708 -740 -1072 533 897 -878 -1203 68 238 -159 12 12 -421 -824 219 116 -631 -672 -229 250
4160 250 -73 -704 -838 -69 -4 -501 -512 -519 -1042 -994 482 224 -840 -927 161 -350 -421 266 569 -37 -507
4181 -507 -42 265 198 195 -112 329 396 393 63 -643 -136 252 1369 833 -297 -588 695 573 239 84 495
4202 495 -113 185 569 144 -494 126 664 752 -9 -758 -320 679 490 32 13 96 154 -42 -142 -250 -257 167
4224 167 911 114 -753 -326 496 504 448 184 -218 -335 350 297 184 -221 414 404 427 472 -122 -34 459 604 -10
4247 -10 189 171 -265 -357 199 255 -67 -64 453 -332 -212 486 -37 -443 -357 249 289 47 -168 -245 -69 198 -56
4270 -56 -627 -480 -86 85 201 -297 -374 -502 292 -117 -711 -489 -189 -215 35 -256 -967 -392 166 -78 -384
4291 -384 -672 -277 -20 67 -93 -305 -438 -185 324 -589 -628 -527 -263 -9 226 -418 -646 -301 78 9 -231
4312 -231 -27 -155 -283 -105 -60 -252 273 207 -55 -256 37 219 -3 -8 20 203 133 226 -92 -162 338 257 198
4335 198 310 387 256 336 97 -361 210 730 474 327 -25 300 357 563 458 176 -25 144 503 99 172
4356 172 204 145 687 520 -567 -399 -4 411 59 110 -72 -226 216 154 -17 -377 221 197 -105 -394 -47
4377 -47 -225 -190 72 205 -317 323 130 -434 167 -62 -85 327 425 -205 -247 -150 274 -125 -52 9 -41 -332 -163
4400 -163 -241 -312 -308 170 -70 -188 -1 -502 -186 -233 -289 -226 8 -117 -326 -472 -1 -358 -327 -29 -84 -461 -347
4423 -347 129 -134 -511 -34 147 -180 121 -10 -94 -84 306 172 -168 -145 172 93 194 -414 -216 287 481
4444 481 28 -375 -116 306 64 223 12 -354 -143 91 243 -44 -148 301 -11 19 -59 -47 -95 89 -228
4465 -228 -244 -346 206 308 66 580 -182 -27 324 190 -229 395 345 -200 -28 329 9 119 665 540 64
4486 64 193 586 261 -150 95 647 140 -87 -213 -189 242 77 57 495 510 354 -109 -155 324 -469 -21 437
4508 437 -216 -163 -29 7 -262 88 527 32 -242 -18 114 -98 -234 166 166 52 -159 125 -429 -175 -424
4529 -424 -39 -58 22 -298 -451 279 -473 -476 -161 213 -276 -376 -121 -278 -401 -11 -111 -157 -429 -12 -373 -14
4551 -14 -214 -202 239 147 -179 -107 -297 -102 91 -27 -117 -198 8 -124 -329 -272 -12 165 -325 -210 65 290
4573 290 -123 41 -7 -94 85 319 48 -167 27 157 63 -16 207 79 288 149 226 -59 194 244 -101 261
4595 261 344 111 151 100 62 261 105 311 250 136 398 29 327 486 420 124 141 509 67 205 351 248
4617 248 38 681 87 -112 150 456 442 -371 -20 503 39 327 161 101 151 406 -6 -277 39 -439 121
4638 121 349 170 -107 -1 39 -203 -447 106 -168 -257 -174 226 224 -253 101 -65 -154 -108 -14 -2 15 -166 -647
4661 -647 -173 -69 -423 -219 -37 -192 -375 -46 -45 -116 -317 134 -15 -578 -213 73 -395 -56 57 62 -458 -383
4683 -383 -91 50 -296 80 -244 259 -120 -191 -74 -185 -87 -175 534 -126 -236 -195 235 -29 -342 234 285 -162
4705 -162 -44 376 331 -121 83 -74 -39 3 -70 201 208 -28 93 428 328 -212 177 316 -87 -353 332 711
4727 711 41 14 446 419 -281 -242 329 426 -161 150 532 334 -139 97 29 225 -49 174 455 244 -267 315
4749 315 341 326 -180 194 524 -338 -322 381 296 -350 55 55 -153 -290 -199 257 80 -460 125 -51 -171 -94 -28
4772 -28 200 -169 39 -22 75 -270 -541 116 173 -403 -556 262 -93 -152 -106 302 -232 -402 209 336 -291 -336
4794 -336 230 178 -308 -251 414 -8 -407 116 -38 108 -148 -315 169 36 -258 -326 418 -155 -355 295 186
4815 186 -462 -341 406 97 -480 -76 280 209 -278 -141 202 -258 -202 68 222 269 -279 30 282 -179 -176 133
4837 133 462 -242 -46 489 235 -71 -133 755 -23 -178 358 429 -316 -219 253 335 208 -82 530 214 142 160
4859 160 488 547 -197 220 517 57 -270 -273 406 305 -331 82 440 -238 -439 650 221 -118 -35 207 261
4880 261 2 -261 201 61 -260 -128 455 100 -396 -296 -108 89 -332 302 31 -144 -373 348 146 -616
4900 -616 -95 499 90 -468 -218 200 32 -348 -163 91 -414 -128 8 162 -471 -402 -295 92 -89 -441
4920 -441 45 197 -402 -437 352 -21 -503 56 368 -265 -118 131 169 -408 -281 -4 -56 -229 -299 223 -89
4941 -89 -358 -29 282 96 -111 18 -35 205 -184 61 276 105 -100 24 400 -215 -474 302 631 -222 -209
4962 -209 343 -98 -202 156 71 168 -321 -3 541 194 -156 168 367 445 227 452 396 -192 -181 30 492 -160
4984 -160 -174 520 263 -81 332 198 -180 -119 133 310 -298 209 295 383 143 -277 -73 143 193 66 21 133
5006 133 -21 34 36 325 -43 70 -4 1 -90 161 -62 28 236 -26 -187 -333 -218 193 135 -101 -2 -193 -39
5029 -39 -178 -233 -384 -149 -304 16 70 -268 -218 -107 64 151 -80 7 -177 -369 -135 291 -42 -402 -86 109
5051 109 42 -176 -333 -190 -104 96 -35 -444 91 -176 -269 377 -305 -299 -2 157 -23 -441 125 -24 -71 -103
5073 -103 -41 90 -398 259 385 142 -143 -149 6 220 113 -59 213 -66 -213 209 310 -22 -18 124 426 113
5095 113 -39 311 -87 -135 313 331 -129 -358 103 182 50 202 -33 -44 115 21 55 59 -131 305 229 197 64
5118 64 8 47 206 -110 -127 267 259 -52 130 349 -263 75 211 89 -161 -228 -59 -70 240 292 -137 -224 -275 81
5142 81 174 -201 270 181 270 170 -497 -526 -73 127 205 292 -266 -177 -385 347 139 151 166 165 -275 -303 14 -293
5166 -293 65 -297 -99 -64 -20 -338 -211 -43 -178 -27 -122 -276 -118 -373 19 -278 -146 94 -57 141 -392
5187 -392 17 137 218 5 -45 -78 -92 254 186 -71 -433 -52 136 505 186 -460 -38 143 221 15 -208 -264
5209 -264 -136 588 472 93 -33 -113 208 233 61 431 -295 37 49 103 -180 219 57 240 -39 130 154 55
5231 55 -169 67 141 322 221 135 -17 236 -182 135 457 330 -20 -35 108 -169 69 129 179 147 61 27 386
5254 386 149 68 -329 256 456 392 71 -383 -226 -47 298 34 -313 -266 114 -38 33 9 228 -104 -85 301
5276 301 56 -189 -190 25 110 -341 -41 -100 -31 -43 -223 97 10 137 -21 301 -169 -238 141 154 114 -432 -230
5299 -230 -166 -113 -46 -360 -281 -381 33 29 -366 -100 -39 214 -144 176 -92 -422 28 275 172 -413 -359 -224 182
5322 182 118 -243 -77 -122 32 -146 147 -97 -214 -218 14 453 199 -139 -85 -94 -125 242 175 -55 2 433 171
5345 171 76 -157 -168 307 409 3 143 -22 115 306 338 11 231 175 435 -4 -346 -63 93 185 26 176
5367 176 16 -48 13 187 47 -295 -35 227 162 229 -10 -30 -200 22 67 204 270 -11 59 350 -64 -318 86
5390 86 28 238 140 137 282 55 106 9 -88 -21 15 -289 -12 126 18 -112 -216 -128 13 -303 -62 -196 -53 59
5414 59 -301 22 -327 -272 90 22 94 23 -305 -75 -75 -200 -335 -444 -48 80 -167 -340 -248 181 -212 -209 14
5437 14 -337 -473 -75 -26 -243 -146 -18 121 -276 -252 -75 -42 65 256 -58 -40 -78 58 95 -30 119 -262 46
5460 46 158 287 -145 160 253 20 265 -65 186 -133 313 340 358 190 34 236 -59 109 14 43 196 214
5482 214 169 93 91 -22 293 193 56 261 149 50 27 341 270 -182 6 165 32 189 137 572 127 353 212
5505 212 -341 -227 322 7 45 85 98 -81 63 -29 -122 41 -187 281 14 -157 -15 -223 35 14 124 -192
5527 -192 -200 -55 -201 55 11 -230 -99 -13 -191 -260 -106 -298 -309 186 213 -111 -305 10 5 -44 -20 15 -343 -394
5551 -394 -190 -70 -41 -162 -71 -25 -169 -157 8 20 -126 -362 -10 100 -276 -426 -37 -215 -467 -237 -45 -117
5573 -117 -122 86 105 -63 -215 290 324 -188 -132 61 272 183 -357 -247 302 194 -77 -115 80 -68 3 457 42
5596 42 -169 222 395 236 -12 199 185 25 -37 298 -54 -108 -47 304 264 -302 -241 -6 516 -93 91 541
5618 541 120 -429 218 174 159 -10 62 452 72 61 447 258 31 42 332 171 82 -46 309 85 55 131 113
5641 113 -69 -72 43 -25 -223 -265 44 246 -164 -93 46 -71 -3 -136 230 -210 -124 222 -176 -92 -270 167 -23
5664 -23 -62 -122 58 40 -99 -215 -91 -200 -234 -218 -289 39 -275 -241 101 316 -211 -84 -287 -269 -231 -115 -99 63
5688 63 -217 -258 -6 -184 -31 94 -262 -329 -335 91 49 -255 -149 109 46 -61 -12 -57 -170 -125 193 60 -65
5711 -65 -238 -179 32 -444 -352 81 75 -152 22 342 -254 -129 -120 211 -48 -99 47 83 302 -67 -61 293 41 -108
5735 -108 207 65 129 283 412 184 92 121 474 82 -239 259 259 193 165 302 368 -44 4 131 197 -133 219
5758 219 488 279 69 66 136 319 -207 282 324 219 -73 234 211 -416 -264 18 -10 -408 -252 -208 -147 -526 -195
5781 -195 53 -86 -424 91 -263 -103 -141 -179 -17 -150 -224 -204 -19 -374 -114 -73 -92 -431 -114 237 -248 -269
5803 -269 -78 30 -375 -196 -120 -85 -111 -276 -40 -296 -206 -253 -339 -139 -476 -225 7 -49 -318 -377 208 53 -95
5826 -95 -32 -98 112 193 333 233 -114 53 -27 42 174 -5 74 171 191 167 302 49 20 -42 251 41 -44 206
5850 206 209 -245 16 184 -47 -178 -203 616 170 24 394 -22 54 -125 247 200 -48 -65 245 225 131 -34 187
5873 187 -135 15 -83 -30 241 140 162 99 -183 -357 121 270 544 -100 -50 59 35 127 -238 -67 -278 -274 -18
5896 -18 -29 -221 -51 14 41 -162 -356 -84 -73 -185 -132 -32 -33 -230 -52 50 122 -394 7 59 88 -226 257 -260
5920 -260 -88 33 -233 -145 -136 202 119 -170 -353 272 -123 -144 -363 -186 -137 33 40 -58 25 -130 -157 83 -190 -104
5944 -104 7 45 -332 -177 -186 65 -383 -276 16 -9 152 -55 -277 169 155 -137 -5 60 -43 -277 17 -18
5966 -18 -233 -153 217 111 -315 113 -7 -118 181 307 110 116 190 161 49 213 363 178 18 -44 181 187 439
5989 439 308 -311 203 207 -211 144 171 -174 -21 140 415 171 -101 6 -73 -113 48 310 -241 -3 187 164
6011 164 -103 -108 37 333 269 177 51 320 -106 26 22 122 -264 -161 426 82 -340 -210 251 -46 -340 78
6033 78 -28 -153 -130 270 167 -273 43 30 -303 -109 -148 -99 -98 61 -155 -363 -118 -417 -248 342 181 -297
6055 -297 -365 -252 -345 -118 39 -103 -506 -347 42 -189 -108 -268 -298 -129 47 -93 -97 -74 -54 139 95 71 -192
6078 -192 56 105 -39 -338 -4 125 -192 -84 28 -223 -95 381 -77 -280 -404 165 205 82 133 15 13 -82
6100 -82 137 369 185 1 147 336 426 -133 272 296 442 52 227 -14 -174 -168 102 151 16 227 68 147
6122 147 125 193 112 90 -3 -2 87 235 -70 -313 34 576 -12 -418 -126 10 -166 -134 315 -119 117 270 73
6145 73 -419 43 52 223 -196 -484 -157 -197 -26 215 -163 -149 -174 -59 49 -426 -561 -398 199 242 125 -9
6167 -9 -106 -273 -200 -214 171 -528 -56 182 72 -138 -195 159 -165 -112 -181 -15 -65 -228 -72 -308 169 -59 -241
6190 -241 -225 -422 -225 -21 275 -254 -169 147 49 -97 -143 169 -111 -201 52 116 -225 25 -19 -285 -172 -113 -25
6213 -25 -99 -192 -277 83 181 24 98 -51 -63 102 291 380 -207 -267 310 317 90 -91 30 222 295 241 48 -320
6237 -320 -183 -62 121 -44 -62 181 259 41 304 -31 208 -94 125 377 329 -272 -27 439 70 -175 198
6258 198 328 292 67 -76 -25 131 146 456 93 -449 -163 88 42 228 -149 108 32 181 44 -37 37 -330
6280 -330 -93 197 -253 -442 130 3 -188 -54 182 -298 -542 -68 235 -77 -155 -195 -355 120 108 76 -289
6301 -289 -75 -25 279 -180 -58 -232 -39 -13 -73 -127 -279 15 -281 -294 45 -192 -162 2 -45 -370 -360 134 -232
6324 -232 150 -20 -7 -318 393 86 -128 -265 -139 52 92 110 409 22 380 133 51 492 68 -254 145
6345 145 153 227 43 -145 -198 65 114 264 -335 156 -291 283 100 56 -73 -138 -88 49 54 -179 -113 44 -41 -22
6369 -22 25 -261 -16 327 133 144 396 -196 103 172 249 159 142 132 200 -1 -149 416 -52 419 -56 83 60
6392 60 22 645 290 -98 99 270 163 202 61 -201 11 278 -95 162 -156 27 -239 138 51 -246 -225 -126
6414 -126 117 62 104 187 -362 31 79 -245 -59 56 -52 -277 -188 -73 -205 226 -140 -29 72 36 -119 68
6436 68 31 -187 -317 -239 62 -188 -165 -166 -517 -366 -2 -200 -38 -231 125 -216 -243 -126 -15 -218 -163 -196 165
6459 165 -24 66 -324 -64 270 -35 -435 -157 391 -47 -139 56 231 -203 241 262 145 -87 18 18 41 101
6481 101 126 -118 203 -39 136 218 319 -274 -11 429 -51 63 115 154 -124 8 565 7 -60 601 281 -146
6503 -146 56 496 184 140 -9 -74 -61 167 274 113 271 -54 -5 293 398 86 -256 367 384 -78 73 56
6525 56 -39 -260 242 201 -61 -361 268 -155 22 51 29 75 15 81 57 -179 -220 -38 -160 8 -415 -200 161
6548 161 -70 -247 -56 107 20 134 -172 -152 -401 22 267 -257 -244 33 97 -280 270 39 117 -278 -98 104
6570 104 -97 -193 -68 -127 126 67 -110 307 -61 -600 -61 -42 -181 -330 67 195 -325 30 94 -33 -235 306
6592 306 -142 -126 -321 -106 263 266 -304 -180 234 -71 -111 55 194 -108 -76 63 173 143 0 400 200 -187
6614 -187 -45 170 77 -215 246 48 -334 -111 323 227 40 189 -118 299 120 -153 166 -28 35 142 164
6635 164 56 -253 218 410 -94 32 100 161 -300 35 108 336 1 112 -113 -22 80 -105 -30 -141 277 -195
6657 -195 210 64 60 -170 -27 295 -245 -278 -14 -107 -25 -135 91 -355 -266 -53 54 19 -167 -70 -237 34 -85
6680 -85 -273 -58 -12 -156 -257 -183 -137 -247 107 -168 -278 -110 23 -73 -152 68 12 41 -118 278 232 -3 -55
6703 -55 188 177 -272 74 -91 -183 -62 -195 151 -236 239 -76 69 -2 -319 47 43 80 40 197 219 -66 43
6726 43 54 -103 -14 -167 238 -53 -266 432 60 -79 51 257 -15 69 -216 26 369 -89 68 174 272 147
6748 147 -125 390 252 -273 -59 92 -4 99 415 89 12 -144 147 -68 169 -181 -75 -355 -303 -90 485
6769 485 10 5 18 20 -17 -140 77 300 -61 -58 184 264 -81 -68 -110 -264 -299 112 202 -271 20 -170 61 -355
6793 -355 -194 155 -200 -87 150 65 92 -163 -351 57 61 -226 -142 -305 16 -174 -156 87 -163 -160 138 328 -315
6816 -315 -259 151 186 -110 -128 1 -233 -75 -202 66 93 -34 -386 -259 198 -70 -235 28 -70 -171 -184 -123
6838 -123 -134 -59 217 388 -80 -249 293 141 45 63 -121 -308 79 -94 -41 149 -262 165 -1 25 -143 -127
6860 -127 13 27 -128 -4 253 -277 -205 7 -64 -172 -178 296 232 -380 210 133 -150 -212 259 -52 72 -38 180
6883 180 -74 177 48 -56 113 208 84 233 118 -347 377 463 -67 -175 334 556 97 -278 379 156 164
6904 164 -38 345 -56 -8 92 228 197 278 -198 282 132 25 -56 160 -70 -131 272 219 -68 -172 12 -12
6926 -12 -285 -321 118 16 20 162 10 -466 -144 117 32 -196 -283 68 -219 46 -250 27 332 -240 -201 -61
6948 -61 109 -411 -189 18 -73 -275 -189 88 -347 -392 -246 217 -345 -549 -292 -261 -252 -176 0 31 -107 -14 -167
6971 -167 31 -229 -309 -198 -54 0 -68 282 77 -245 0 155 -487 -608 195 83 -283 25 145 165 -40
6992 -40 216 104 -57 -32 -86 390 -96 -98 -95 141 78 -19 240 71 -83 -60 273 94 -39 -69 137 246 -451 115
7016 115 406 35 29 236 181 311 120 248 285 -116 180 -17 358 198 147 138 547 62 -259 406 26 -106
7038 -106 -45 144 -252 -526 38 38 -72 -18 237 187 -252 -128 -96 102 83 -54 36 -14 -66 -120 -288 -127 -88 -186
7062 -186 74 -309 -386 -50 260 -334 -457 122 6 -393 -131 -48 -187 -404 -329 20 -253 -280 -250 -239 -325 -97
7084 -97 -5 -167 -67 -127 -195 145 -51 -96 23 -15 -353 -31 371 -348 -149 292 -71 -198 -315 189 46 -26
7106 -26 51 204 -206 -198 -86 3 -71 -107 26 258 3 111 161 194 149 -35 255 404 269 -97 211 37 -214
7129 -214 -56 474 -40 8 130 109 -210 76 -181 235 346 230 297 233 -193 35 10 469 307 -4 -123 340
7151 340 245 233 -42 334 76 273 207 72 180 -89 296 -139 32 228 175 -321 156 168 139 114 111 202 53
7174 53 52 169 12 9 -20 84 185 -65 0 -106 165 -45 -430 -19 117 -176 163 -28 -175 -378 94 59 -208
7197 -208 -56 -132 -234 -131 -112 -57 72 -193 -244 62 137 -59 108 194 137 -335 -248 -176 -7 -421 88 -163 -180
7220 -180 -84 -219 -180 -168 46 -65 -32 -484 145 132 74 100 -120 -33 147 -81 -35 239 192 -61 -50 161 -120 -366
7244 -366 213 7 -566 -62 -110 -56 -28 43 1 -256 100 404 54 178 -118 97 -181 -30 38 -151 -114 303
7266 303 -27 133 259 125 -40 142 276 47 420 282 15 -177 102 250 149 153 339 376 66 164 211 35
7288 35 321 202 113 123 120 99 -47 141 213 -105 243 22 -122 178 -13 -114 -279 362 -127 -305 240 -13
7310 -13 42 -156 149 -49 -58 -197 -8 -120 -290 113 -89 -134 6 -91 -278 -113 -348 -305 4 -545 -395 -41
7332 -41 -54 -307 -219 -193 64 -157 72 -146 -226 -269 -166 45 -694 10 -277 -127 -104 -21 54 -62 -184 25 -84
7355 -84 71 7 -195 43 286 78 52 -77 -112 36 -167 294 -123 230 111 92 -127 217 180 181 203 102 113
7378 113 -114 266 152 11 32 174 315 342 38 -288 241 236 147 22 242 245 245 207 441 100 63 164 -77 287
7402 287 -11 369 55 191 452 123 289 -247 -37 111 30 91 230 -239 82 137 -172 -111 -205 -512 -109 103
7424 103 -180 -218 104 120 -173 110 74 -87 -51 -172 -157 -304 -226 138 91 -185 -91 -113 -262 307 150 -206 -187
7447 -187 89 -306 58 118 -391 -200 60 293 -173 86 258 -284 -8 233 -43 -308 80 115 -183 -125 42
7468 42 -371 -227 -132 -14 96 132 -53 -518 -210 -39 -131 -287 114 98 -323 171 -33 -272 14 -118 186 -98
7490 -98 169 92 17 -170 -43 -188 238 -69 -160 -46 -210 56 -61 385 -79 -93 53 176 388 -74 -213 -8
7512 -8 -16 102 247 157 -84 211 226 1 337 241 34 134 26 87 -39 157 292 161 299 173 -8 220 380
7535 380 -20 363 120 129 307 -117 164 46 -198 283 24 146 -260 120 291 106 266 37 -7 156 0
7556 0 1 -186 162 -115 -149 181 -213 -148 -8 -64 -163 121 -66 -392 -353 172 159 -270 -334 -5 0 -272 -157 -239 84
7581 84 -89 -242 27 279 -128 -368 -111 213 -237 -301 280 -96 -146 -182 124 -3 -309 -126 327 -8 -468
7602 -468 130 -113 -124 -37 -217 -26 -103 -109 -128 -179 -138 -222 -177 85 -239 8 271 -67 -324 114 10 64 -152 409
7626 409 -18 -366 130 39 205 225 33 275 10 -44 301 3 -4 16 285 118 73 198 173 285 132 3 288
7649 288 235 -91 -13 305 184 26 -37 506 137 125 165 1 20 -292 225 147 295 -46 19 89 -140 -51 202
7672 202 556 -75 -33 192 30 13 150 168 -257 -140 -148 278 -125 -190 23 250 15 -6 237 -25 -89 330 100
7695 100 3 205 -132 -138 88 -32 -44 -191 -88 -178 22 74 -156 -252 151 -62 -457 -349 -40 -92 -390 169 -45
7718 -45 -127 -191 293 -239 -199 -58 -35 61 -2 -244 136 5 -15 39 65 233 -167 -375 462 -372 -506 -12 52 -255
7742 -255 -414 216 -84 -237 -2 257 82 -290 -173 103 -162 -36 31 9 78 -282 213 231 94 74 122 515
7764 515 -258 -129 563 68 -93 251 184 -6 -145 101 380 143 -77 115 234 32 430 350 97 -99 53
7785 53 301 274 35 46 427 458 -228 143 327 394 -171 -56 225 104 -211 85 488 308 -201 187 77 53
7807 53 -75 266 226 -55 -192 33 -205 119 14 507 278 -396 -159 223 -148 -130 262 202 -317 14 15 -21
7829 -21 -180 -166 -14 -8 -121 -109 64 -345 -300 -144 -57 -61 -323 -73 -119 -122 -151 -311 59 -200 -474 -224 -37 -495
7853 -495 -255 -107 87 -611 97 375 -111 -390 -227 216 -95 -62 -7 47 195 70 117 282 -116 -118 152 86
7875 86 24 -107 239 255 -162 62 560 219 -316 378 750 -221 12 463 121 -171 -32 487 -53 -266 71
7896 71 334 285 -65 192 -15 -187 -52 230 387 308 -108 111 365 -23 32 448 82 -167 -11 47 -1 7 69
7919 69 120 -207 -42 283 16 -226 79 389 85 81 -118 -101 292 -146 -126 59 80 -376 -23 173 131 13 -148
7942 -148 188 -10 -149 136 48 -293 37 175 -48 -67 -45 -166 -152 -259 -15 -194 40 -219 -198 -131 -137 -389 -221
7965 -221 -273 -125 -214 200 -296 -396 -477 81 -118 -51 -138 210 -231 -156 103 203 -317 -108 -128 -228 105 112 -207
7988 -207 -34 -177 -423 143 537 -232 -259 216 298 66 -12 353 -163 -500 -132 285 -56 190 208 372 -129
8009 -129 -54 26 157 -155 -106 72 341 32 -89 -81 62 160 -62 320 189 11 -55 47 -22 -85 375 80 -193
8032 -193 380 409 175 -155 -22 213 -76 -98 104 -92 -15 54 1 186 -71 -68 -121 192 172 119 -20 -23 -124 -408
8056 -408 221 -82 -251 -316 172 14 -334 161 154 -200 -30 133 -218 20 -151 -207 -362 -95 12 54 83 -344
8078 -344 -194 198 230 -269 -197 248 93 -504 275 -5 -5 -217 5 -89 -52 210 -52 -22 -187 277 -4 -51 51
8101 51 -31 -85 38 220 -20 -110 24 -28 11 220 -104 -303 187 -204 -78 -159 40 21 -152 123 -176 -125 -161
8124 -161 -40 7 -54 -98 28 -15 34 -237 -200 -83 -22 -66 -7 -172 -101 15 -134 29 -199 -60 40 -29 -50 38
8148 38 -51 -77 -14 22 -33 -51 167 139 5 363 3 -203 -115 213 218 -72 -101 66 -170 317 -21 86 219 47
8172 47 16 61 151 218 155 -4 352 -50 -197 274 -230 107 -86 172 -186 125 227 -126 96
8191I6
$$ Imaginary data points
##PAGE= N=2
##DATA TABLE= (X++(I..I)), XYDATA
0 0 0 0 0 -8 10 -8 16 -24 24 -32 48 -56 72 -87 104 -124 151 -178 210 -247 293 -337 393 -452 518 -593
26 -593 678 -766 869 -984 1107 -1239 1392 -1559 1736 -1934 2154 -2389 2649 -2939 3254 -3600
42 -3600 3988 -4415 4891 -5428 6038 -6726 7519 -8448 9545 -10865 12496 -14560 17280
55 17280 -21032 26573 -35601 52836 -97534 450442 921691 -248035 -513696 104704 616626
66 616626 313291 2768 15411 212124 275290 262065 72618 -110924 -63422 224759 325669
77 325669 168878 -8633 -68060 -141903 -76614 197872 288652 -97389 -361074 -12530 350802
88 350802 13710 -477069 -286171 278873 341727 -104638 -409707 -263103 78178 230268
98 230268 23340 -281512 -249732 88211 206761 -67699 -268919 -103887 81252 4383
108 4383 -69422 42580 22872 -229521 -238360 139471 286467 -101116 -413825 -176216 204256
119 204256 204799 -83047 -299817 -257352 15315 224713 51861 -292930 -268903 90984 186040
130 186040 -120718 -288281 -60615 146822 43291 -94471 -42316 -9117 -101274 -61436 145796
141 145796 164142 -67505 -143157 65907 192337 49806 -106681 -54909 141308 280152
151 280152 170261 -138035 -248304 65873 391807 243186 -144857 -190040 114819 260387
161 260387 64847 -129015 -66384 96408 143297 83868 -9907 -109147 -116594 25575 145242
172 145242 73702 -65292 -91990 -50039 -18067 25770 31981 -57524 -94648 29920 104529 -40955
184 -40955 -175727 -58298 123836 87396 -72071 -86612 33051 66298 -21125 -59913 3715
195 3715 56282 51619 35291 -3418 -58275 -32229 66449 84444 10139 -12003 15942 -11407
207 -11407 -34198 36683 82120 -2787 -76350 -8109 81303 41963 -60118 -79151 -4689 59544
219 59544 51244 -4162 -56368 -68993 -19530 46870 41825 -24170 -42470 -4314 -559 -21365 -1001
232 -1001 10941 -26846 -19724 49091 36317 -63745 -74211 26188 62661 -5682 -38416 9276
244 9276 32505 -16742 -58914 -30022 28200 49600 25884 -23228 -73160 -62956 26930 77967
256 77967 -396 -83218 -32037 48259 15119 -54824 -46663 -6041 10617 25971 23443 -33231
268 -33231 -75203 -29170 38410 32979 -15978 -24064 6491 11891 -20453 -34352 6 33247 28518
281 28518 4963 -18779 -33554 -2968 52633 36508 -41157 -44262 40002 67834 2353 -44676
293 -44676 -24096 13585 38501 36177 -5742 -40465 -11219 41434 37264 -14940 -40186 -10334
305 -10334 28927 30541 8135 -2850 -12400 -29517 -15492 29198 33423 -3974 -7194 14625 -7661
318 -7661 -39376 -9615 34576 26426 4499 9168 5068 -19187 -24969 -3033 20988 35473 36241
331 36241 17265 -14888 -36969 -24632 18245 47864 37853 24162 17980 -16500 -55117 -23491
343 -23491 52941 72525 28988 -6463 -14773 -13360 -1942 6375 2050 15400 50039 47147 -12096
356 -12096 -62048 -50496 5393 54587 55030 10326 -32347 -40684 -24257 -2900 7965 546 -874
369 -874 17732 10867 -40589 -65742 -25487 16419 17023 5348 -9482 -35635 -40557 -16023 -8837
382 -8837 -26121 -16382 18280 18264 -29220 -65801 -42949 10991 24476 -13301 -33418 -11201 758
395 758 -16714 -21043 -10564 -14037 -11347 11314 14335 -11939 -21699 -8390 -3092 -2721 6972 12520
409 12520 8255 6073 3079 -2622 -213 8106 13380 18645 22505 17433 14129 13953 -137 -9292 17828
424 17828 49355 39597 11247 940 -126 3321 18971 25555 14442 15162 27773 14082 -18682
437 -18682 -22148 3192 21893 21840 9874 -5351 -13168 -16344 -19510 -13170 3344 10190 5023 -4666
451 -4666 -24937 -43842 -25356 9973 10014 -8794 -5971 -3154 -22907 -26977 -4381 3787 -2807 7493
465 7493 19609 3427 -20420 -18664 3741 21184 20857 12444 11459 10183 -2902 -7714 10468 24757
479 24757 19385 16482 14744 -1427 -8835 9302 15635 -144 3988 22417 12942 -13762 -15328 -2557
493 -2557 1593 6140 9876 -777 -12808 -9844 -2745 -4152 -6636 -3680 5273 8261 -3870 -15633
507 -15633 -7188 3614 18 2651 12752 1666 -14773 -11 15752 -3159 -15452 7719 20213
520 20213 -1577 -14588 -4958 -2546 -6929 -2556 792 -8491 -18447 -17112 -9679 -9741 -21066 -24859 -12189
535 -12189 -7989 -25089 -31521 -19083 -17404 -25826 -17371 -8711 -20547 -25984 -13781 -10731 -16380 -7420
549 -7420 1584 -5041 -5768 5853 6415 -1160 6247 20116 21673 17431 17096 19793 22132 22327 23173 30803
565 30803 34548 24102 19502 32535 30910 10931 12934 34789 32324 12331 10253 13795 4748 2569
579 2569 12819 11408 21 -2208 292 -4146 -10169 -13394 -11280 -2001 2606 -7191 -17994 -19051
593 -19051 -18047 -10315 2685 -831 -16172 -11387 4132 -3315 -19750 -11360 6011 9797 7571 3243
607 3243 -7987 -12274 436 10935 9583 6166 1240 -3099 1421 4210 -7231 -12407 2159 12737
621 12737 5692 -8786 -21199 -21183 -3091 9857 -3340 -20053 -14428 -3636 -4845 -10360 -17046 -19046
635 -19046 -3432 14147 2529 -20257 -16755 881 7699 5327 1442 -2811 2155 15055 15529 3438
649 3438 -658 4516 12388 23861 23932 4270 -6314 10122 24207 13996 -2263 -3541 10049 23300
663 23300 15092 -12779 -23281 -4805 10147 5181 -1716 -9393 -19491 -15656 -4642 -12991 -26239
676 -26239 -12762 4682 -4160 -20516 -24026 -25336 -24292 -6096 14924 8119 -21060 -34838 -13437
689 -13437 13160 5911 -15905 -6006 22472 18795 -8651 -16766 -4498 8479 27000 36152 11029
702 11029 -17443 -6618 18435 19404 12359 14687 13433 8534 12788 11511 -5696 -11705 12459 40166
716 40166 29920 -11425 -32498 -6966 26746 24014 1555 -7146 -4444 3074 12809 4438 -21259
729 -21259 -13411 28301 33685 -10457 -32393 -7999 14078 14971 12001 780 -16479 -12060 12489
742 12489 18305 -3445 -17018 -2159 16995 10832 -11562 -19077 -5827 7977 14132 8443 -17928
755 -17928 -36730 -8873 29533 11668 -30727 -23802 8323 3202 -18695 -14862 -4038 -5839 -888
768 -888 5090 -11431 -30967 -18447 9407 14854 -1961 -13982 -14032 -11305 -5981 7584 12961 -6227
782 -6227 -17719 5569 21564 -9030 -31331 2163 34047 15471 -10645 -8464 -5121 -5412 12922
795 12922 24622 2593 -16370 210 17178 3364 -12609 -3103 13253 11718 1886 651 -4198
808 -4198 -16781 -7555 25331 27680 -15836 -32736 5781 26320 -3736 -20932 1254 13944 3508
821 3508 -583 -3944 -17195 -10185 20351 24357 -8561 -25875 -4311 16926 8336 -8271 -4739
834 -4739 6105 3622 -659 5065 -517 -15104 -1251 27176 15188 -21212 -16070 15900 14428
847 14428 -5216 -162 7261 -3097 -261 17034 6421 -19627 -8730 25145 23782 -10129 -19313
860 -19313 5831 17893 976 -5502 8580 6983 -7492 1084 17081 -1892 -20682 6168 29631
873 29631 1802 -22914 -490 14529 -4762 -6687 14536 7517 -18182 -8873 17440 6772 -20255
886 -20255 -11365 16564 13111 -12141 -13946 348 -3365 -9305 9267 16247 -15243 -28482 5885
899 5885 19503 -14991 -23926 12129 18549 -14540 -18579 1492 -5582 -16320 9130 25093 -8053
912 -8053 -36127 -12224 16523 5024 -13335 -2958 9210 -5636 -15581 -1242 576 -16707 -3803
925 -3803 29749 14173 -35415 -32372 13648 19510 -6342 -2486 9777 -7802 -16583 4937 7034
938 7034 -15645 -6033 29445 21580 -22981 -31074 3110 19215 5368 4182 15502 110 -24048
951 -24048 -6896 24577 12338 -13606 5685 30353 4685 -25679 -6911 17458 13086 13116 21359
964 21359 -699 -26114 -3187 30533 18057 -7772 2909 20393 5189 -13502 -280 17842
976 17842 8581 -916 13315 16097 -13019 -23832 10719 30978 6190 -10831 1508 -1008 -15139
989 -15139 2010 22292 529 -20644 1979 16581 -13027 -29695 1159 24519 4769 -16674
1001 -16674 -12533 -8116 -16344 -7751 17164 15202 -17681 -29063 -5978 2820 -12447 -7587 12687
1014 12687 3566 -18038 -12293 -4685 -19858 -15366 21374 27600 -12146 -33958 -14782 1566 -541
1027 -541 4499 13617 3596 -13256 -12415 -2066 -3553 -7307 8958 25849 10763 -17457 -19184 -3573
1041 -3573 1842 11316 28552 17221 -19105 -21646 9375 14745 -3630 2723 23176 16914 -4960
1054 -4960 -10045 -4756 -1705 11468 28081 21689 -6425 -20272 -4383 15337 13653 5809 9157
1067 9157 7576 -4082 -3216 7968 996 -9819 9536 28944 5900 -24160 -13462 9770 8882
1080 8882 3022 5852 -1340 -14690 -7824 8963 4533 -12402 -10896 5579 7370 -10105 -18701 -7720
1094 -7720 1401 -1591 -1087 -1881 -17761 -25626 -1571 17746 -2205 -25130 -15061 559 -2520 -6156
1108 -6156 -5029 -10007 -10530 4315 7720 -12823 -24279 -5884 17652 14735 -6202 -16915 -8248
1121 -8248 3161 8356 10767 5693 -7824 -7109 13962 18738 -5959 -14788 10397 26718 13179
1134 13179 -2747 -5288 -3168 8198 22922 17667 -3558 -7507 9003 17349 6212 -5847 -470
1147 -470 14580 17639 5755 -4841 -5456 -1986 8454 20298 11938 -10279 -11886 7295 13037 2355
1161 2355 -1797 595 882 6857 12336 -911 -17450 -6521 16894 19227 461 -12871 -9051 1664
1175 1664 7402 5586 1040 -4467 -7178 252 8547 -1565 -18458 -11467 10545 11950 -5256 -15542
1189 -15542 -16996 -12895 2336 12993 -4274 -24911 -16237 3349 -97 -17880 -20183 -4754 7735
1202 7735 1478 -16437 -25043 -17309 -3024 7199 5328 -11228 -23114 -11029 4393 -2057 -13588
1215 -13588 -7013 4522 4168 1136 -5644 -19703 -17546 10458 27195 9192 -15962 -17480 -1086
1228 -1086 9661 6641 505 2496 7775 5163 -599 -2425 -3681 -457 13375 21363 8884 -5896
1242 -5896 -5437 -21 5051 16370 21245 6932 -4152 4196 12716 7616 3271 10009 16601 17399 11196
1257 11196 3412 747 7768 16917 20208 14190 3650 1683 13006 17919 6802 943 9368 13611
1271 13611 9622 8810 5355 -5454 -2798 15720 16610 -5695 -16959 -3139 12657 10508 -5877
1284 -5877 -18946 -16449 -1706 6800 427 -12133 -19087 -13146 -2737 -6827 -19967 -17161 -1173
1297 -1173 -706 -11826 -16897 -19405 -23664 -12721 6221 4477 -15398 -20738 -13350 -13402 -15175 -6370 3629
1312 3629 1394 -6752 -12837 -15252 -16594 -10013 3877 13115 2709 -13057 -12486 -6604 -9694 -6547
1326 -6547 11116 14660 -1962 -7888 -493 -5263 -14546 -77 20422 18708 3838 -5311 -10594 -10288
1340 -10288 5089 22197 19507 2235 -5314 4418 11453 1413 -4429 8356 22081 17371 7621
1353 7621 2817 -5831 -7192 14748 31290 14558 -5992 1424 12423 5187 59 8589 11862 7500
1367 7500 9224 10022 -22 -7072 2463 15088 11552 -1350 -1679 8651 7751 -4307 -4825 4974 5339
1382 5339 1268 5876 5227 -7850 -9371 5910 6930 -6638 -5344 5765 1773 -6831 -2119 590
1396 590 -9224 -11640 1422 9059 480 -10035 -10745 -7102 -6059 -3354 3414 1429 -11686 -13426 819
1411 819 1685 -14542 -15658 1619 6633 -3064 -6242 -8309 -16802 -12028 7064 9915 -6811 -13652
1425 -13652 -4473 -613 -6567 -8485 -3043 2484 2809 -570 -5095 -9888 -9556 973 10260 2816 -8458
1440 -8458 -2483 6608 -2307 -10628 -660 8252 3822 2826 5275 -3572 -12047 -264 13905 8785 -2623
1455 -2623 -1374 3476 2739 505 1605 4001 3662 3669 6922 6861 -1565 -6274 2959 11013 6457 2266 4997
1472 4997 487 -6239 2388 12815 4767 -4317 2220 6759 305 -2168 2844 1679 -1297 4152 8082
1487 8082 -357 -8725 -5088 5722 7661 -822 -5356 542 2728 -3738 -5245 67 103 -824 4151
1502 4151 2016 -11208 -10926 4685 8138 -2828 -5762 -299 -674 -3033 35 -1095 -4960 -925 7119
1517 7119 5960 -4396 -9817 -3131 6414 8639 2633 -740 349 146 1575 5850 3565 -1094 5563
1532 5563 13014 5137 -5651 -7 7772 5220 4359 9117 6217 -647 497 3888 2174 1121 4580
1547 4580 5773 3027 -998 -3762 -3711 -2033 -1622 49 1796 -3399 -9346 -7133 -3904 -8264 -9759 -3493
1563 -3493 -1064 -6614 -8737 -9564 -14527 -12529 -3059 -898 -7067 -8273 -6847 -10341 -11597 -6546 -3308
1578 -3308 -3518 -2681 -1298 -3225 -7630 -10558 -6951 2614 6954 1397 -3766 -2396 -2382 -4367 -1192 3017
1594 3017 3787 5946 6480 -1710 -7846 -2446 4514 4788 6432 8893 3216 -3211 -561 3500 3044 4225
1610 4225 9660 11399 7811 1876 -862 2906 9580 11902 11514 12556 9058 3877 5271 8860 8180
1625 8180 9613 16245 15723 7082 4337 6360 4653 5078 11898 12744 6292 3096 4196 859 -3663 -2899
1641 -2899 2594 5912 3996 -4033 -10134 -9671 -8129 -7274 -4118 -3235 -7439 -9092 -8531 -14099 -19490 -11830
1657 -11830 -2557 -4951 -8544 -6663 -9456 -17408 -14781 -4564 10 -1089 -2259 -3111 -5931 -8522 -7908
1672 -7908 -1370 6412 7859 2759 -630 -2859 -4037 -28 5399 4501 4785 10020 5885 -7569 -9570
1687 -9570 2811 7657 2961 3889 6336 -729 -8688 -6098 25 2606 3706 2873 -1458 -4937 -5007 -1787
1703 -1787 -1522 -3363 -74 8375 6620 -7112 -10475 1727 6360 -302 2578 10521 3933 -7132
1717 -7132 -657 8691 4417 -1167 4331 8569 4225 524 698 -359 118 4552 6877 1168 -4898
1732 -4898 -516 5850 -1412 -12750 -5035 10397 4169 -12472 -9339 2451 -1620 -9016 -3308 142
1746 142 -5364 -3656 3757 -1243 -11525 -6294 4813 3628 -1602 2148 5251 -1024 -5029 3649 12087
1761 12087 5666 -1647 6441 14064 4676 -3909 6018 14851 6499 2651 10693 10172 278 467 6768
1776 6768 4619 3502 9889 6844 -6679 -7381 6278 8017 -4778 -8235 2788 6225 -6141 -13146
1790 -13146 -4705 2419 -3399 -6990 -2497 -3539 -10293 -6537 373 -5839 -10922 252 5516 -7166
1804 -7166 -13293 -2723 1639 -3747 -1958 3748 -3011 -10290 -2344 6968 993 -9030 -4194 7283
1818 7283 4988 -6688 -7984 -482 1425 -53 2677 1104 -7892 -7141 3909 1728 -9782 -3957
1832 -3957 9518 2315 -12961 -8697 4041 1884 -4922 -911 3524 -1058 -5170 -2077 481 -1900
1846 -1900 -334 6670 7732 -2484 -7851 416 6761 2860 2287 8169 5320 -3183 -664 5542 1869
1861 1869 965 10506 11606 -486 -5932 2085 6466 3259 2140 5473 6207 3006 -858 -3350 -2263
1876 -2263 2746 9744 10016 -517 -9084 -2397 7716 3815 -3377 1988 8114 2264 -3363 -771 -745
1891 -745 -1839 4929 9972 1327 -6401 -1135 4990 2092 -2435 475 4562 3740 -1038 -3227 -1725
1906 -1725 -260 1278 3101 450 -5704 -3889 5095 3852 -7515 -7986 2158 2549 -4718 -4162 -166
1921 -166 -2490 -3667 -1319 -3954 -8813 -3627 4893 2863 -7241 -10577 -3807 464 -2723 -5641 -440
1936 -440 4002 -1631 -8233 -7625 -5657 -2669 5067 7788 -3180 -12139 -5121 1782 -2380 -4116 3185
1951 3185 6913 1203 -4708 -7143 -6671 -255 8340 10148 2374 -5694 -5293 313 1913 -727 3398
1966 3398 11542 8339 -3123 -6806 -1843 1697 6203 11919 7676 -2543 -3104 2476 1286 -2282 3758
1981 3758 11851 8487 -1456 -6981 -4387 1812 6117 4950 1892 -543 -1530 -1081 -1854 -4961 -2742 6373
1997 6373 7544 -3523 -10063 -4656 493 485 970 135 -4323 -3809 1793 -203 -7169 -4403 4480 5552
2013 5552 -2614 -7021 -2991 2930 4219 426 -2705 -1941 579 3645 4665 -927 -4034 2540 9220
2028 9220 2093 -6101 271 9479 6753 535 -57 358 592 4979 7537 3384 -133 2605 4228 875
2044 875 -1738 2028 7590 7075 375 -3678 -1215 2166 2045 2318 1894 -457 -395 2354 -1848 -9197 -4072
2061 -4072 7422 6080 -4480 -9078 -5795 -2511 -1343 -1508 -3880 -4170 -1243 -1850 -6996 -10508 -6251
2076 -6251 1484 2909 -4347 -11023 -7290 -1121 -2261 -5939 -4209 -2241 -1839 -1289 -3771 -9493 -8304
2091 -8304 2336 6140 -1973 -7993 -5310 -1199 364 -179 -2187 -3313 -9 3201 710 -3721 -4377
2106 -4377 1155 6890 4114 -2541 -2038 4576 3932 -1512 1067 7943 7111 2331 2358 2991 3399 6822 9727
2123 9727 5262 2222 5800 9374 7063 2194 3603 8508 11513 7085 2048 2607 5310 5342 6539 6594
2139 6594 1906 39 5171 5801 -3513 -5585 4119 8318 466 -6682 -5991 -2878 -79 1452 -2471
2154 -2471 -8193 -7116 580 1413 -7355 -13274 -5934 5827 3577 -8711 -12059 -4218 181 -696 279
2169 279 -1743 -6348 -3634 3523 790 -6199 -2700 5297 4177 -2426 -3236 -391 -5 561 2442 1557
2185 1557 -1592 -2364 -85 249 -3025 -3402 2340 3432 -4387 -7764 -1611 1337 -3012 -3218 229 -2675
2201 -2675 -6423 -2876 -173 -3578 -3016 2736 549 -7838 -6110 4038 5818 -1494 -4301 998 4669
2216 4669 1809 -1681 194 2491 3820 6797 5657 -3902 -7727 4386 14227 5995 -4321 -1639
2230 -1639 3207 1178 682 2703 -131 -2130 4165 5473 -4902 -11423 -2386 8143 5643 -4003 -6185
2245 -6185 -1665 -1123 -2782 -459 2192 47 -460 3492 556 -8424 -4230 10001 11682 293 -2786
2260 -2786 2936 2786 783 5585 9044 5015 2724 5663 5344 191 849 7740 9683 4550 972 3109
2276 3109 2630 -2789 -1424 7072 6775 -2239 -5429 -1901 -2619 -3972 1219 1892 -7267 -9212 -833 136
2292 136 -9270 -11075 -1838 1724 -3859 -8671 -7815 -6140 -3982 120 523 -5328 -9827 -3864 3803 -276
2308 -276 -8028 -3601 5137 2632 -4074 -3594 -611 -631 3560 7236 -661 -8808 -1965 8201 4233 -3844
2324 -3844 -2412 3008 2586 -739 -1638 -846 -449 2135 4793 1935 -5257 -5684 2902 5986 -165 -1934
2340 -1934 2697 1482 -3672 -454 5959 2598 -1392 3327 5551 -381 -2142 3469 5449 2407 2571
2355 2571 5334 3064 -1545 -536 5072 6302 2323 626 1628 1439 -354 1821 3174 -850 -1835
2370 -1835 4000 4110 -5505 -8078 1130 5406 -778 -4420 -3045 -3117 -3240 460 -455 -5603 -5217 1020
2386 1020 2498 -3636 -7809 -3031 2566 1738 -2400 -3452 -2056 -2250 -35 3023 -113 -4994 -1398
2401 -1398 4556 1935 -4174 -1591 3271 1985 -136 1179 -133 -2265 1025 4189 1614 -1977 -541
2416 -541 2244 1459 -1214 -714 2198 1809 -489 -131 1645 443 -1995 706 3003 461 -1347 1273
2432 1273 1181 -1648 -71 3734 1669 -2249 -323 2460 1608 -136 -318 -214 1174 2717 1124 -1410
2448 -1410 -1427 942 2880 2145 -934 -2125 424 2622 750 -1672 -698 163 425 1709 76 -3055
2464 -3055 -2803 2354 2650 -996 -2400 -1458 -494 563 932 -1771 -2458 31 1952 -449 -3029 -2313 -559
2481 -559 1207 1285 -2053 -3454 -1220 174 -1300 -1558 -1514 -1281 -937 -1024 -2487 -2092 -547 -932 -2141 -260
2499 -260 1103 -2944 -3894 -883 1137 -311 -1148 -915 -1354 -1336 545 -178 -1198 450 1953 988 -239
2516 -239 -129 278 1117 2091 2330 2144 1206 -527 352 3867 3986 -358 -700 3858 4557 1365 208 1203
2534 1203 1836 3369 4237 737 -1600 1704 5575 2536 -863 179 2829 3328 1327 110 959 2171
2550 2171 574 602 2414 1693 -1078 -18 3082 1169 -2010 -592 1215 613 465 829 -1857 -3058
2566 -3058 119 1607 -1093 -3478 -807 1052 -972 -3665 -3491 -805 33 -2034 -2742 -1533 -2310 -4477
2582 -4477 -2811 -223 -1847 -3299 -1781 -1971 -4127 -3237 -553 -2384 -3494 -894 719 -2268 -4784
2597 -4784 -2432 17 -232 -1695 -1381 340 382 -2069 -1756 507 772 -77 1038 1725 -681 -832 1624
2614 1624 1635 114 1602 2905 205 -382 2655 2915 27 427 3755 4047 1091 -132 1397 2416
2630 2416 1527 1399 2031 2620 1618 482 1720 879 -951 1002 3823 1717 -1520 280 2003 -989
2646 -989 -1615 1558 2109 -1185 -803 1147 -885 -3080 -839 1464 677 -1395 -1538 -479 -753 -1754 -1246
2663 -1246 617 -19 -1504 188 794 -2441 -3626 1094 3071 -189 -1023 1019 -135 -2330 304 2731
2679 2731 307 -1516 1321 1952 -473 -1699 198 2360 1703 -295 -71 954 282 -557 868 1645
2695 1645 -321 -483 1733 1157 -2098 -960 1582 804 -733 1112 671 -1821 -1321 2016 1171 -2024
2711 -2024 -1117 1109 888 -696 -1008 -954 -65 241 419 253 -746 -1992 -362 1565 -375 -2355 -305
2728 -305 1180 -1593 -1825 1054 104 -3372 -2004 1092 -358 -2788 -1995 -771 -1382 -2154 -1224 -1418 -1486
2745 -1486 -1004 -1117 -1694 -2104 -1712 -226 256 -1529 -2188 -241 746 -1321 -789 1617 77 -1872 596
2762 596 2521 164 -1099 1234 2572 1358 1085 1552 965 1172 2377 2471 943 655 1587 2517 2456 439
2780 439 62 2099 2844 934 532 2108 1068 -568 919 2294 1060 -30 790 170 -205 955 1175
2797 1175 -84 396 1577 500 -416 -139 285 652 1128 585 27 609 414 -933 -359 1621 1014 -87
2815 -87 1296 928 -1418 -1591 296 1290 939 1148 -601 -2673 -1766 158 329 -418 -581 -697 -710 -1321 -2958
2834 -2958 -2830 -121 1341 -140 -1419 -2010 -4081 -3187 93 885 -1247 -1252 -581 -1818 -2925 -1315 -805
2851 -805 -1047 587 1694 -458 -3353 -3202 -206 1472 1237 -670 -736 -316 -1252 -2143 -347 1158 437
2868 437 -176 1748 -177 -3072 -1304 2367 1376 -356 206 289 -1448 -721 1522 767 -1148 -722 1736
2885 1736 1571 -461 -1510 -116 1509 1056 307 405 72 -820 1193 3076 -6 -2203 753 3392 1294
2902 1294 -7 1460 1151 -862 950 2968 1137 -588 1723 3322 1439 -1216 -1379 1279 3004
2917 3004 2182 1247 506 -1286 -1578 909 2866 873 -357 1769 1658 -1956 -2401 815 949 1205 2668
2934 2668 1506 -2717 -3873 -139 1875 685 343 667 -298 -1632 -1847 -1327 -246 304 1519 2366 -438
2951 -438 -4471 -3438 963 2097 -574 221 870 -2065 -3430 -313 825 -1546 -468 2880 637 -3496
2967 -3496 -3547 -404 616 348 538 -248 -1902 -2813 -845 309 -203 -2163 -53 1587 -737 -3341 -931
2984 -931 933 -569 -523 1505 529 -3405 -1513 2165 390 -2055 -672 1240 -190 -968 -2 -37 -661
3001 -661 -686 772 1264 -735 -1835 321 2258 122 -2252 157 1214 41 326 2280 437 -2524
3017 -2524 74 2844 796 -1321 749 1762 523 -210 248 387 151 1493 2719 1258 -1624 -1539
3033 -1539 2048 2986 370 -747 1757 1910 -740 29 2054 356 -802 2238 3556 -1023 -2684 1129
3049 1129 2586 159 -127 1657 1074 -791 -419 1351 1013 -994 -44 2554 1443 -2034 -1864 1572
3065 1572 1232 -1270 558 2180 -706 -2704 436 2058 -1256 -1695 1402 930 -2027 -1033 882 -512
3081 -512 -2015 274 1744 -756 -3075 -1222 1559 415 -2129 -924 1406 -429 -2741 -476 476
3096 476 -2007 -1951 2433 1605 -3362 -3324 862 755 -1705 -427 997 -1193 -2531 -237 367 -1770 -2013
3113 -2013 1008 1788 -1239 -3685 -1314 1445 -233 -1242 866 504 -2220 -1957 1214 -43 -2112 813
3129 813 2977 -740 -3561 -148 1616 -492 -691 2071 1753 -1335 -1703 799 929 -222 644 2397
3145 2397 1362 -1686 -1197 1611 1335 -681 1185 3537 211 -2160 299 1833 98 265 3134 1809
3161 1809 -2174 -476 3071 1104 -1219 556 2876 1412 -976 -89 1393 845 579 1597 1785 -524
3177 -524 -1258 2046 2567 -1500 -1680 2367 2307 -1455 -873 1925 1362 -1349 93 1892 -1144 -1813 1374
3194 1374 2349 -785 -2177 -163 593 -441 -774 1096 1003 -1045 -1603 -235 -84 -1673 283 2646 -319
3211 -319 -3403 -1986 954 -1013 -2278 1160 1980 -1686 -2737 -659 -953 -1924 418 2235 153 -2630
3227 -2630 -1746 -169 -694 -1566 689 2596 706 -2777 -2143 -114 -344 -711 2149 1989 -1340 -2117 467
3244 467 137 -1835 381 3281 1165 -1860 -1460 -480 -450 196 1343 1203 -867 -1286 -334 23 -1334 -756
3262 -756 1455 1861 -1229 -2580 -806 253 -1161 -424 1237 228 -1530 -278 916 -2030 -1636 1416
3278 1416 2035 -685 -1651 99 963 464 238 193 172 225 833 1236 343 -769 137 2073 1209 -986 2
3297 2 2298 1343 -214 397 943 -66 492 2126 780 -848 510 1377 419 -298 766 1748 921 346
3315 346 -67 -266 -67 569 1396 1654 311 -741 276 1161 12 -262 1153 2216 372 -104 327 259
3333 259 -234 530 1518 624 554 -23 -1183 -810 665 1567 556 -707 -1075 -311 143 -377 -1775 -935 462
3352 462 -51 -1032 -1991 -1932 -1678 -516 111 -1631 -2449 -1372 -728 -1654 -1510 -1447 -1248 -515 -293 -1604 -2586
3371 -2586 -1349 195 602 -486 -2083 -1854 194 1298 -361 -2238 -610 1260 982 -542 -1295 -1195
3387 -1195 459 1819 929 -1374 -728 328 589 396 443 -572 64 1155 737 -55 -14 89 244 1048
3405 1048 1302 11 -524 135 1008 638 578 1166 737 801 833 504 703 1384 1803 1170 1124 1316 1117 1231 1361
3426 1361 1325 1359 1532 1011 -6 1061 1972 563 -561 1284 2094 1348 -321 -747 86 1226 1865 216
3444 216 -1049 -628 634 729 -180 -854 -1059 282 1036 121 -1291 -1544 -683 -192 590 255 -1787 -1567 194
3463 194 469 -680 -1602 -412 -115 -66 -725 -1409 -1381 -392 260 -840 -1286 -1074 -21 321 -950 -2418 -1723
3482 -1723 575 94 -1397 -1309 -271 -884 -1576 -513 -365 -1393 -945 -30 -452 -1023 -465 -1001 -799 173
3500 173 726 50 -934 -998 -530 131 519 106 194 812 -293 -652 634 1223 -245 148 1552 1652 -180
3519 -180 -448 110 643 1432 1914 911 -240 517 1050 704 234 889 1423 1354 366 -606 -176 1291 1077
3538 1077 616 729 961 58 72 627 323 -116 1332 1481 174 -87 58 -295 76 896 894 -190 -740 17
3558 17 87 -321 -609 67 472 -66 -397 -721 -452 -506 -671 -346 175 -9 -327 136 -412 -1110 150 1053 -201
3579 -201 -966 177 707 -493 -836 159 -220 427 766 193 -401 -574 4 176 160 -204 -214 446 278 -725
3599 -725 -403 367 81 -663 299 125 -1164 -1124 242 166 -1560 -529 525 435 -842 -800 -1205 -848 -183
3618 -183 -121 -349 -429 -506 -308 20 49 -608 -364 460 -121 -867 17 359 -905 -193 787 183 -718 279 337
3639 337 -355 -216 524 320 -295 -56 81 -527 -604 -23 128 483 -53 -341 -23 -39 -274 -210 912 294 -328
3660 -328 -139 921 299 -320 595 837 350 392 793 204 17 835 873 501 405 761 890 682 245 243 739
3681 739 1124 808 352 812 403 -73 310 907 288 0 487 476 -63 191 429 -156 -559 436 270 -499
3701 -499 -157 -245 -184 -260 -401 -49 -145 75 -516 -866 164 53 -457 -297 -188 -409 -797 -262 98 -355 -167
3722 -167 79 -265 -69 -129 -277 -585 155 116 -444 -372 -21 66 98 -6 -267 -282 221 361 -659 -445 97 -58
3744 -58 -126 143 -356 -504 51 500 -291 -575 -7 184 -130 -271 -451 -497 -115 -46 -99 -260 -581 -681 -273 509
3766 509 -377 -802 10 -9 -417 -828 108 111 -175 460 357 -574 -522 701 395 -296 70 552 381 58 233
3787 233 503 258 48 302 736 552 -191 -254 761 848 88 266 605 -69 -501 822 1053 124 -238 826
3807 826 453 -95 288 444 25 239 702 726 287 -461 470 1479 1044 -83 -379 982 765 77 538
3826 538 756 -385 -61 986 415 -837 121 1478 738 -644 -424 471 340 123 439 282 -386 -540
3844 -540 121 370 -590 -860 -49 683 -581 -1689 -691 -296 -459 -489 332 -546 -1976 -968 122 -477 -1171
3863 -1171 198 169 -1194 -1340 -517 -303 -743 -665 -9 368 -883 -940 -76 373 -9 186 841 132 -1017
3882 -1017 -99 1738 293 -963 124 1527 -239 -835 224 461 -256 271 650 -40 -1288 -525 937
3899 937 501 -705 -796 244 550 -897 -564 148 249 -25 340 356 -1196 -1210 1122 1778 -764 -1065 632
3918 632 1016 -438 327 973 256 -192 1196 1237 83 -462 464 1796 777 -462 457 1125 -83 -151
3936 -151 1004 907 -351 -285 935 457 -912 -188 974 276 -1093 -110 612 -645 -913 449 895 -69
3954 -69 -1232 -330 412 -133 171 0 125 -202 189 697 -9 -1178 -274 1442 643 -886 -342 689 106
3973 106 -61 457 101 -1062 -630 1286 753 -1229 -713 629 770 -93 -751 -453 -413 188 227 -48 -1110
3992 -1110 -1082 479 805 -986 -2071 82 1344 -730 -1273 -545 -170 -661 22 604 -709 -1162 -246 471
4010 471 22 -564 -73 121 -362 -544 341 199 -661 -766 476 1176 -504 -1016 471 810 -716 -468 769
4029 769 17 -1316 136 1106 -75 -856 -241 581 7 -2 -52 -390 -375 461 986 205 -863 -565 1205 1240
4049 1240 -654 -1053 611 1391 175 -196 392 123 27 869 865 -1181 -861 836 1395 34 -182 202 250
4068 250 96 579 437 -375 -673 519 1498 379 -1137 -551 1667 1034 -253 -166 573 -70 -296 534 147
4087 147 -461 362 1047 165 -865 207 1139 -31 -244 327 693 -368 -593 297 629 163 -441 -111 426
4106 426 -304 -548 -428 -84 -558 -72 597 -676 -1549 -591 973 111 -820 -292 -276 -947 65 419 -314
4125 -314 -1258 -497 929 433 -1273 -1557 -118 929 612 -636 -809 -247 -317 515 474 -830 -955 553
4143 553 805 -765 -988 264 389 -529 -427 -160 -829 -663 362 58 -262 -453 -299 305 108 -280 -49
4162 -49 593 337 -247 -14 -28 -238 379 759 737 -364 -36 717 726 159 559 1020 311 32 410 870 594
4183 594 471 352 510 747 406 468 -265 241 487 839 435 -1039 -818 472 938 204 -368 -259 -498 -209
4203 -209 240 -61 -347 314 556 57 -795 -792 -218 735 370 -199 -402 -3 475 1 -266 -273 -136 408 541
4224 541 32 -1103 -188 1171 628 157 -32 -282 -268 380 302 -275 -307 262 407 -39 -382 -635 -104 115
4244 115 -111 -195 -269 79 -642 -308 226 -116 -295 -295 -179 -454 -371 154 190 -469 -182 -56 31 -338 -256 -404 -202
4267 -202 164 -506 -582 -341 340 51 100 -75 -362 -150 714 149 -342 -62 410 237 -366 -96 -218 112 649
4288 649 460 -739 -427 289 441 25 -193 -7 -185 331 336 -179 -460 49 695 424 368 -296 -224 441 455
4309 455 -46 129 323 346 399 172 404 220 343 410 507 257 632 58 230 215 528 322 665 530 -216 -15
4331 -15 261 362 336 571 205 413 98 304 -14 49 348 276 -552 89 276 383 6 -74 -189 -241 -2 174
4353 174 -435 -494 -233 15 126 58 -846 -678 86 583 -192 -632 -306 -528 -195 -198 -564 -372 -171 133 75 -195
4375 -195 -260 -2 -22 181 -205 -230 -222 126 -387 -323 -93 175 -110 -349 -215 -504 91 138 -202 -207 114 -243 -447
4398 -447 -66 -41 -16 -563 31 98 -598 13 -234 -277 -79 80 71 349 -90 -348 -257 523 134 6 -55 210 -40
4421 -40 166 608 267 3 797 706 236 -9 210 367 363 516 232 -179 -138 290 202 -17 132 62 333 412 -175
4444 -175 -204 99 345 -44 259 396 -33 -16 150 398 -83 -69 260 370 -54 143 292 71 206 -15 176
4465 176 34 -187 243 70 119 261 224 447 164 261 356 338 -9 -152 110 103 79 -40 100 -407 -541 78 -66
4488 -66 -158 -190 63 -442 -764 -524 28 -363 177 108 101 -105 -555 -306 -138 -61 -262 0 -54 -422 -336 -33 178
4511 178 -384 -147 501 -68 -210 64 -199 197 36 180 -61 30 -132 -347 -186 -210 -143 -15 113 -243 -234 109
4533 109 78 -263 -89 85 320 -348 -343 143 -23 -212 -63 119 -197 -53 -79 -50 -281 178 125 110 -2 52 199
4556 199 -157 123 1 -17 248 -110 405 270 123 -39 167 383 -50 327 234 35 -116 38 292 123 426
4577 426 245 547 209 -12 408 173 123 117 153 241 506 -280 6 203 257 183 121 148 104 -84 -154 -149 -29 25 -29
4602 -29 -227 -113 172 -235 -154 110 -250 -152 107 -87 -30 -76 190 -80 -90 172 -238 -473 -359 49 -132 -354
4624 -354 -93 21 -261 -14 -392 -481 -73 24 -429 -338 -256 -308 -275 97 -131 -501 -294 93 -371 -455 -45 -38 -349
4647 -349 -120 -129 -23 -478 -177 248 -100 -228 -204 -23 -133 99 -224 -276 -92 99 -143 264 -202 -224 254 382
4669 382 -105 -208 470 459 -49 -27 280 491 -18 517 324 50 253 145 24 328 280 20 135 207 80
4690 80 110 265 -276 177 251 94 -393 -75 612 94 -447 -75 700 -66 -371 517 384 79 221 361 45
4711 45 106 106 -73 -334 -25 180 563 -228 66 -94 297 69 -351 79 578 26 -670 267 538 -344 99
4732 99 427 309 -385 167 70 -387 -479 67 -83 21 -303 -13 -94 -61 -392 5 184 -12 -367 27 85 -208
4754 -208 -547 -49 247 -542 -462 164 -294 -537 -9 442 -164 -483 -134 -79 -244 -334 79 262 -154 -18 452
4775 452 288 -115 -450 473 470 -478 -202 281 328 -487 52 692 67 -871 120 9 -270 -179 125 183 -49 -556
4797 -556 -126 121 -60 -57 -35 -50 -539 63 214 269 -330 45 433 -24 -394 210 589 -104 -39 371 306 -324
4819 -324 22 521 390 -3 -28 711 285 -258 373 760 215 62 -19 446 -41 -211 216 461 23 -383 304
4840 304 254 -169 -84 564 -48 -434 216 521 -142 -218 -93 378 -312 98 52 68 -359 -313 309 316 -53 -190 99
4863 99 198 -303 -147 446 43 -329 63 206 -64 -433 491 603 -179 -513 -20 112 -121 -355 149 -116 -218
4884 -218 -193 -308 -333 -621 -167 56 -400 -450 -319 160 -199 -523 5 177 -501 -269 163 -121 -537 -122 424
4905 424 -21 -586 -91 -91 -75 -79 -95 197 -260 -378 200 181 -72 -253 158 222 -34 -228 274 321 -122 227 459
4928 459 -143 -316 257 362 131 81 85 87 -382 -76 426 64 -221 142 197 351 225 -17 299 298 73 1 287
4951 287 218 108 -83 515 -26 -128 400 101 176 -39 406 347 81 106 296 40 -128 231 231 18 -383 -103
4973 -103 202 -123 332 200 308 168 -49 463 248 -304 -435 154 244 -163 -97 87 -240 -87 129 278 -132
4994 -132 -131 242 29 -334 -135 -140 -2 107 -357 -432 -199 22 -195 147 -230 -462 -294 295 -92 -248 -420 -106
5016 -106 -66 -247 -121 182 -510 -382 433 -27 -270 -370 -40 -225 -357 -230 -387 -536 -318 -83 163 -88
5036 -88 -151 -243 -9 23 -206 -184 27 -205 -264 224 -223 -576 -83 266 266 -198 -174 72 107 40 23 46 253 244 227
5061 227 210 186 234 391 170 51 -188 238 177 21 -66 -11 -3 -156 269 394 152 -99 219 126 52 170 112 -164
5085 -164 -73 246 296 194 -22 -287 234 7 58 59 75 204 22 -52 202 -151 -187 47 -34 -10 4 362 -195 91
5109 91 44 166 -168 46 -236 202 -123 -68 51 130 71 -393 -22 48 -125 -131 115 -99 -317 -261 194 -236 -320
5132 -320 -330 139 85 -103 -296 -22 -402 61 -32 -221 79 -364 98 115 -66 -338 -76 -162 133 0 -152 -196
5154 -196 -289 -154 288 -164 -98 -76 72 -196 -114 -14 -120 -255 31 364 248 3 41 -103 84 176 -172 -96
5176 -96 10 57 -117 140 137 -206 -23 315 -63 -162 383 310 -170 189 120 46 -41 331 198 20 -65 80 441
5199 441 213 -246 -110 157 511 190 -42 261 105 18 433 212 -271 -47 73 415 -29 168 292 -29
5219 -29 205 -50 103 3 -110 612 197 57 -16 93 26 250 28 400 289 151 -383 105 177 -350 178
5240 178 184 365 -70 -268 242 -30 51 321 206 -243 78 -63 56 289 -209 -278 -382 74 -139 0 -226
5261 -226 -62 -12 51 -186 -422 -170 279 144 -273 -221 -267 -408 -236 162 -341 -268 33 244 -309 -60 -102 -221
5283 -221 235 122 85 -100 -116 345 72 14 -215 -171 104 -55 -71 -225 -317 144 78 217 166 -249 -276 -57 302
5306 302 -240 -192 -68 64 38 -209 414 68 205 356 422 43 -202 -149 284 219 223 171 39 66 188 6 256
5329 256 127 -36 312 167 -220 178 -43 316 519 436 -91 -174 91 61 286 198 63 -199 136 185 289 -52
5351 -52 -96 -114 276 -37 -19 -59 -92 98 168 -313 28 197 127 206 -137 -224 -174 -6 206 -348 -333 -43 33 257
5375 257 182 -366 -150 176 -226 8 -125 279 27 -82 224 -306 -249 -175 193 -228 149 149 -308 121 181 -77
5397 -77 -97 -378 -113 -315 -61 -42 -147 -250 44 -264 -236 80 -172 1 27 80 -25 -401 -42 -138 -31 -109 -214
5420 -214 -333 -203 167 194 -205 -29 -46 319 236 -76 -281 -4 67 167 -63 214 152 65 234 115 -73 -40
5442 -40 196 191 -78 77 151 13 79 -2 50 16 92 -67 95 3 73 199 231 324 235 165 101 142 220 79 113 327
5468 327 -34 199 171 42 -238 96 39 418 -56 -52 215 71 198 253 269 58 -138 -134 112 -50 -36 -12 140
5491 140 -72 -414 -56 -118 -390 141 -174 1 -4 -37 -315 -35 152 -250 -246 110 172 71 -170 -361 116 -78
5513 -78 78 -165 -581 -52 -43 -280 53 -100 62 -139 -4 -165 -408 -195 72 -11 -22 -285 -271 -52 -68 -275
5535 -275 -57 67 -246 42 -127 -159 -178 -299 54 284 -47 8 -75 88 -184 -124 -62 186 -28 120 -2 65
5557 65 57 106 51 143 -96 -180 122 98 -17 115 223 -312 -152 194 246 -97 136 437 88 -103 452 124 -256
5580 -256 142 5 342 -37 -65 137 -15 8 -15 140 199 -136 34 158 146 83 -148 150 93 -322 107 12 101
5603 101 138 115 105 -9 -126 -55 62 -88 29 105 48 -295 -64 162 98 -70 75 276 40 -125 180 410
5625 410 -138 -28 -41 53 -262 23 250 160 -442 -143 -40 18 -322 -98 -16 -199 -344 43 -377 -148 -23 -319
5647 -319 313 -461 -187 189 -36 -184 -23 -48 -9 -320 -140 113 -45 -219 -10 283 -151 -122 313 94 -55
5668 -55 -239 151 -80 -159 11 -41 192 -412 -311 237 167 -262 148 214 -271 54 62 226 9 -260 234 214 -372
5691 -372 338 329 230 -33 113 -19 -158 -23 78 219 116 122 33 8 136 284 229 417 -76 -108 168 382 69
5714 69 158 209 259 -197 257 646 75 -187 457 299 98 -72 370 399 -158 -8 276 463 -165 146 32 232
5736 232 -123 166 488 322 -162 177 479 -218 -200 71 -53 -321 -74 99 39 -263 364 -21 -31 -130 -136 -191
5758 -191 -252 -267 -240 44 -217 -215 -70 -46 -117 -439 -64 -74 -218 -540 -184 66 -501 12 209 -169 -191 7 108
5781 108 -96 -47 -99 -292 -74 -257 -430 -155 -296 -282 47 51 -126 -147 185 36 -301 -155 286 -7 -317 234
5803 234 411 -119 74 323 134 62 95 174 267 -89 179 177 195 148 75 199 98 28 68 743 305 191 187 287
5827 287 -146 -13 418 176 -34 242 377 300 -188 268 212 -60 -115 8 108 129 62 27 9 157 -328 217
5849 217 82 -8 -25 -31 192 -184 -111 257 425 -19 -352 -71 -278 -238 -124 91 160 -120 -42 110 -165 -222 -144
5872 -144 46 19 -86 -89 96 111 -115 319 266 -385 -163 -263 -97 -310 -26 -70 -339 -88 47 -277 -322 -168
5894 -168 -332 -245 -58 -190 -78 79 71 -164 70 -116 -312 -391 79 -21 -230 -126 440 -229 -165 105 -3 -243
5916 -243 -131 63 8 -265 -118 113 79 -39 78 -125 -124 43 -204 224 -109 86 -162 361 118 96 -156 19
5938 19 -233 -221 -146 368 -14 78 123 5 36 76 316 148 -117 210 -119 322 -190 202 65 48 217 41 158
5961 158 -126 -208 363 200 -10 21 155 92 107 -223 326 -193 73 504 197 -154 239 265 -14 -34 37 129 150
5984 150 1 -24 242 250 -87 -110 132 -22 -207 -43 -52 -69 -161 -199 358 16 -220 52 -148 -20 -90 127 -110
6007 -110 -337 6 -81 -156 -154 -275 -198 -133 -74 -34 -7 -192 -149 -209 -49 -248 62 41 -237 -325 -359 343 -185 -336 -90
6032 -90 73 -158 36 -105 -343 -168 -332 -96 379 -155 -144 41 10 50 -26 65 246 -157 -276 38 290 -221
6054 -221 -13 97 -190 -11 314 299 -249 -23 311 81 34 153 188 196 201 -160 166 106 -76 251 162 237 131
6077 131 191 610 68 -181 449 355 -335 11 351 300 84 314 286 -59 -22 289 356 -64 205 -14 282 326
6099 326 -42 236 -130 61 -61 377 197 -99 86 195 -94 -285 -148 -19 -137 -242 188 252 -75 -88 252
6120 252 223 69 62 -41 -259 -24 -295 -30 114 -91 -226 -37 317 14 -122 69 -130 -74 -101 299 -65 -41
6142 -41 -179 65 -205 -112 -43 -84 -354 -442 -125 -313 -196 96 -391 -201 357 91 -135 -165 -410 -121 75 -120
6164 -120 -382 -134 200 -138 -69 250 151 -566 -251 -177 242 -175 143 -130 73 80 29 215 -211 -9 243 448
6186 448 157 -17 294 106 103 -81 123 50 -62 -89 408 273 -112 271 232 -347 -158 153 271 135 -51 18
6208 18 -102 210 -33 135 208 112 88 382 286 -150 -448 -39 -114 -90 282 411 -287 -217 285 519 -114 -55 226
6231 226 146 -25 296 171 -140 104 266 252 -107 194 -278 216 56 -91 152 160 83 -278 -25 92 -134 -379
6253 -379 41 201 -129 -225 378 -112 -339 -39 -218 -158 63 -117 -158 -312 -100 61 -214 -71 -381 -165 -73
6274 -73 -52 -12 -150 -374 -373 20 194 -61 -294 -154 -105 -74 256 29 -91 -345 79 200 152 -130 -42 -26 43 93
6298 93 -125 1 -50 -173 123 235 -237 -125 -328 242 186 -31 87 284 -58 -10 -43 4 75 402 233 -185
6320 -185 -7 63 -108 -106 -155 14 -68 563 424 -39 -10 50 246 489 288 205 -227 11 29 52 127 150 37 176
6344 176 217 137 93 -35 -170 95 55 32 49 -413 -16 131 100 68 -53 -100 299 399 64 -317 168 -147 -30
6367 -30 -115 -113 -150 82 32 -190 -209 -5 123 19 -110 282 -338 3 186 501 -198 -290 52 151 43 99 -36
6390 -36 -521 -32 41 130 -192 -375 -57 246 51 -76 -248 -91 87 27 81 -58 -317 -102 81 98 -189 -160
6412 -160 -184 -58 -218 255 -117 -47 -51 38 35 208 -20 -104 -9 71 -222 35 -35 19 -205 88 -40 -192 -181 87
6436 87 -279 -488 -322 183 -51 -182 59 254 -263 365 203 -82 -225 -46 242 334 250 121 201 283 -25 246
6458 246 125 -17 -86 255 713 -98 -228 601 421 17 72 389 -167 90 215 302 35 338 272 113 274
6479 274 -15 286 116 -361 109 328 40 34 -186 -47 476 35 309 15 258 -142 99 329 71 -28 228
6500 228 161 -370 15 403 123 3 -161 124 -142 99 130 116 -67 -132 158 12 -204 -221 -131 73 404 -363
6522 -363 -37 200 -227 -281 -114 -174 -411 -327 -32 246 75 57 -72 -491 -217 66 -74 -106 -233 -109 248 -76
6544 -76 -301 -277 168 -44 -451 -183 25 -214 -234 -103 -194 -161 -47 121 -241 -499 268 169 -158 -123 193 127 -184
6567 -184 92 -25 24 56 -55 34 299 -130 -12 -96 280 98 175 303 -141 58 380 257 -274 -189 269 118
6589 118 -53 -10 -52 126 126 -86 103 66 65 33 -23 399 115 480 259 114 100 389 541 114 -134 58 7 32
6613 32 90 183 32 -71 -76 122 -313 -41 -67 211 0 14 77 -57 34 -185 -31 79 -112 -217 207 -126 71
6636 71 100 256 233 -229 36 106 -57 -383 -67 -26 -482 -361 58 1 -242 -302 -269 5 -61 -227 -280 -245 -268 -118
6660 -118 52 -161 -105 52 300 114 -292 104 -75 -36 -358 -117 -145 -13 86 77 15 -276 -64 17 78 -104 -16
6683 -16 12 180 -86 -29 58 186 -165 -15 95 48 28 433 37 -39 -90 154 -132 2 225 293 86 -309 100
6706 100 241 64 -80 246 23 380 48 244 65 51 -195 143 6 18 10 355 71 -299 9 250 -33
6727 -33 78 185 101 -118 -242 439 247 80 130 -235 180 174 65 107 -183 -127 -156 236 218 8 5 237 41 -135
6751 -135 -79 127 -43 -16 7 142 6 44 -25 12 -336 -152 46 -295 140 -30 111 128 23 -181 202 -109
6773 -109 -152 18 147 222 -207 -75 -114 -253 -182 130 178 -462 108 255 -68 -239 -180 -21 -270 97 176 113 120
6796 120 60 -82 85 -84 -231 -56 -138 -36 -243 -145 -44 117 -13 76 -292 -230 24 58 -304 -207 -83 78
6818 78 170 -119 180 12 -93 207 20 -202 -66 -317 117 45 88 -13 272 179 -203 -57 149 -149 -251 -36
6840 -36 32 151 -120 -20 349 19 -144 130 58 -31 -50 285 2 183 32 203 221 228 62 438 107 49 -5
6863 -5 171 264 164 368 234 -89 -57 183 -132 126 86 481 47 -128 202 220 191 -116 114 52 151 86 296
6886 296 58 10 -174 -49 64 -92 138 67 -86 16 -189 302 -91 -166 45 40 40 118 69 -348 -314 -118 51
6909 51 -139 -280 -221 -145 -391 -389 -310 209 408 -162 -97 338 -436 -323 174 220 -395 -560 -71 222 -645 -133 42
6932 42 -253 -535 64 295 -159 -411 -304 118 -51 -24 15 -52 53 -342 -185 187 -309 -353 -25 -141 -312 -105
6954 -105 407 -57 -317 -91 298 -314 30 65 -96 -291 8 359 152 -72 -49 383 281 -213 45 246 536
6975 536 -8 132 31 213 -112 61 179 55 327 308 297 -5 -18 326 221 -384 221 245 212 75 69 346
6997 346 -75 303 233 270 -56 32 249 67 -215 -26 270 181 -198 53 364 441 -67 -105 459 -299 -266 259
7019 259 265 -100 -372 111 -6 -149 -145 36 -202 -316 -342 29 101 -313 -216 -16 -87 -470 -45 -169 -403 -374 112
7042 112 101 -448 -358 173 -309 -463 -464 -33 -373 -497 -135 138 -52 87 -276 -13 -214 -152 -288 -160 -191 -456
7064 -456 232 171 -182 -440 130 106 -271 -58 243 12 -81 94 151 -173 111 24 -249 -66 278 275 198 51 83
7087 83 -90 466 -40 160 414 137 -192 -322 164 140 -157 265 309 362 320 267 167 -108 134 167 165 130 152 376
7111 376 251 -7 28 230 232 153 41 308 19 -45 133 185 74 -48 95 359 -179 -29 168 23 100 39 -54
7134 -54 -72 -301 51 396 -366 -199 -93 163 -109 -362 -49 41 -18 -113 90 389 -372 -171 204 -68 -59 -156 272
7157 272 18 -399 29 16 -160 -164 -12 164 -317 -104 164 -177 -188 -262 -170 -32 -235 -223 -212 162 -186 -58 16
7180 16 -122 -409 -12 316 -165 -140 -223 48 -58 -204 318 -145 -175 143 -168 -65 -244 204 11 -60 70 177
7202 177 76 -129 -63 -159 -61 72 285 55 255 -213 285 81 -30 -138 168 314 7 138 -142 340 -199
7223 -199 228 242 188 -102 266 -60 208 75 -81 -48 507 142 47 312 203 122 71 149 198 167 -44 83 -55
7246 -55 118 222 -162 109 281 347 -128 253 366 441 0 71 -68 140 135 186 -2 176 108 -76 168 246 71
7269 71 204 -33 -199 48 -43 21 -177 -114 258 13 -374 -20 186 13 150 -63 -22 -25 163 15 -31 -318 -100
7292 -100 -333 -118 -101 -246 -49 -82 90 121 -315 -88 -242 -146 131 -225 -388 -321 -37 -203 -258 -101 -301 -236
7314 -236 -61 -14 -31 -279 2 -141 -129 -104 -236 -164 -69 -32 -351 -194 120 -119 -240 239 -125 -225 191 -63
7336 -63 -71 244 37 -207 121 -164 345 -32 103 201 60 94 304 7 129 80 326 62 247 50 333 434
7358 434 347 584 65 270 210 122 90 277 108 -46 421 592 193 26 369 39 -178 -34 -123 200 -28 85
7380 85 251 132 232 270 265 -156 -445 -128 202 -484 -97 -113 1 -158 118 414 -232 -458 11 323 12 -386
7402 -386 -228 -29 -242 -393 -259 -51 -420 -246 -188 -295 13 -247 88 -141 -189 -239 123 -180 -233 -250 266 92
7424 92 -203 -172 -118 -159 -284 92 -5 -452 -303 -66 -111 78 -141 134 38 0 -368 -92 309 -61 70 -162 186
7447 186 -53 -94 195 -88 -564 401 43 -284 -386 -134 5 159 252 -53 -64 -56 91 308 -251 316 34 -270
7469 -270 77 276 -102 -118 107 -189 -10 121 61 -18 94 213 104 8 21 -221 110 282 91 225 26 41
7491 41 81 -14 -3 264 79 346 -80 106 255 155 374 126 189 251 9 244 362 -58 200 303 -50 226
7513 226 206 -116 -206 35 353 62 44 -111 -102 -9 114 -20 63 -280 116 -92 107 83 -274 32 -32 -40 -182 -364
7537 -364 56 -134 -8 132 -18 -164 121 85 -151 -233 8 160 25 -215 -169 -115 -45 -236 -255 -223 120 -247
7559 -247 96 -72 -98 -398 -180 28 187 95 -188 -336 -449 132 167 -262 -156 5 -159 -35 -15 71 167 -27
7581 -27 51 5 246 102 -239 -1 218 66 12 26 -76 -87 420 151 121 -210 297 80 -125 -160 148 -111 83
7604 83 -82 174 481 160 325 151 116 11 231 80 119 -57 133 202 398 204 399 248 213 111 200 69
7626 69 182 -31 206 147 187 141 222 -48 2 166 117 231 28 17 159 115 -42 35 48 230 -14 60 235 -35
7650 -35 -182 217 -157 -266 98 33 -82 111 112 75 -266 -106 -110 -43 -10 -171 -14 66 -298 -119 -199 134 -50 -94
7674 -94 -19 -55 -454 -201 -99 -244 -378 -109 534 -9 -204 92 9 -369 274 8 85 -397 -211 -16 -100 -270
7696 -270 -247 -134 254 -260 -89 84 85 -318 -245 228 7 -319 203 188 -17 27 197 -186 -271 72 -29 -148
7718 -148 -245 -15 114 320 -238 117 66 204 -42 -55 335 91 -295 -62 245 -50 -233 329 338 -213 364 148
7740 148 393 39 144 215 -130 -30 31 223 -29 195 88 116 -117 368 323 161 22 -75 296 33 143 120
7762 120 397 -197 -4 96 260 148 -313 -34 185 -142 303 553 89 -181 -124 103 -140 -143 215 189 282 76
7784 76 -123 264 -238 -344 46 224 74 86 -41 27 -168 -235 241 -121 -212 11 -99 -83 -246 121 -16 -479
7806 -479 -139 90 -115 -179 -311 -230 -90 -356 -439 165 -22 -279 -259 124 -98 -211 -10 13 -305 -266 110 62
7828 62 -466 -159 70 -332 -231 121 -191 -125 -248 -94 198 23 -276 -168 -68 151 5 -10 -88 -94 -238 168
7850 168 168 202 -119 193 224 -37 32 -107 214 -20 356 361 101 -11 584 145 204 210 -6 349 32 -143 526
7873 526 280 176 -10 263 -104 -64 274 160 157 -37 215 419 -167 42 370 222 -109 115 305 247 16
7894 16 218 236 56 -354 119 279 236 -535 137 0 29 -205 50 100 57 -343 2 108 -519 -265 536 -7
7916 -7 -539 25 -140 -171 -496 -153 -152 29 -196 9 16 -328 -273 -97 153 91 -518 -155 -217 -274 -147 130 123 -464
7940 -464 -116 88 64 -235 302 208 -226 -279 -203 -142 -377 -14 218 -223 -320 -300 -229 -131 -166 -172 -67 388 -150 -377
7964 -377 -82 -76 -284 96 412 -224 -114 363 219 6 85 125 -6 -118 275 247 36 -72 13 -128 86 380
7986 380 -88 100 136 12 7 288 28 -204 273 -119 -84 26 347 55 -226 624 262 27 69 143 149 85 144
8009 144 216 -182 -134 31 -145 0 144 -119 228 140 -175 11 184 254 -181 -28 129 51 -25 160 149 217 132
8032 132 296 102 -100 3 -48 -215 -6 182 -363 9 -86 -11 33 -185 -243 -141 43 -260 -105 -122 -12 -120
8054 -120 37 166 -165 -142 -144 273 -152 39 169 86 -53 -228 -82 -119 101 170 16 -92 78 -41 91 -82
8076 -82 103 106 153 138 62 -80 81 -220 21 57 142 207 -15 -112 -20 -14 -69 148 -164 231 -277 -19 221 -117 21
8101 21 -181 -19 215 -142 -213 145 82 448 15 -173 -147 -146 -59 -216 0 -63 -157 -180 -31 -4 83 -34 81 128
8125 128 -2 272 -34 -38 -95 -40 314 248 15 22 17 -242 -82 52 -203 81 189 83 329 137 58 266 198 -13
8149 -13 -27 205 76 152 140 236 -86 218 -117 34 93 91 -79 20 78 47 -90 45 50 -41 -292 68 -111 56 86
8174 86 -210 0 -204 -91 -170 -282 -13 -87 -413 -242 -282 -66 -138 -293 -79 32 99
8191I9
##END NTUPLES=NMR FID
##END=
