##TITLE=1H_CA-8712-4
 CDCl3, 8 sc, 
 9.6.2020
##JCAMPDX= 6.0         $$ Bruker NMR JCAMP-DX V2.0
##DATA TYPE= NMR FID
##DATA CLASS= NTUPLES
##ORIGIN= UXNMR, Bruker Analytische Messtechnik GmbH
##OWNER= root
$$ XWIN-NMR		Version 3.5
$$ Tue Jun  9 11:04:11 2020 Russian Standard Time (UT+4h)  she@DPX200
##.OBSERVE FREQUENCY= 200.1315
##.OBSERVE NUCLEUS= ^1H
##.DELAY= (6, 6)
##.ACQUISITION MODE= SIMULTANEOUS
##.ACQUISITION SCHEME= undefined
##.AVERAGES= 8
##.DIGITISER RES= 18
##SPECTROMETER/DATA SYSTEM= spect
##.PULSE SEQUENCE= zg30
##.SOLVENT NAME= CDCl3
##.SHIFT REFERENCE= (INTERNAL, CDCl3, 0, 15.7039)
##AUDIT TRAIL= $$ (NUMBER, WHEN, WHO, WHERE, WHAT)
$$ ##TITLE= Audit trail, XWIN-NMR		Version 3.5
$$ ##JCAMPDX= 5.01
$$ ##ORIGIN= Bruker BioSpin GmbH
$$ ##OWNER= she
$$ F:/spectra/data/she/nmr/H-F/1/audita.txt
$$ ##AUDIT TRAIL=  $$ (NUMBER, WHEN, WHO, WHERE, WHAT)
(   1,<2020-06-09 11:02:56.75 +0400>,<she>,<DPX200>,
      <created by zg, POWCHK disabled, PULCHK disabled
       configuration hash MD5:
       00 E9 B6 7A A2 85 ED C7 34 08 36 98 17 FE 4E 26
       data hash MD5: 16K
       7F 40 56 13 78 5F 08 4D 44 65 8B 7A 37 2C B3 2A>)
$$ ##END=
$$ 
$$ hash MD5
$$ AC 29 8A 8D BA 37 0A 23 DB 2C AE 08 98 43 0B 2F
##$RELAX= 
##$RELAX= 
##$RELAX= 
##$RELAX= 
##$RELAX= 
##$RELAX= 
$$ Bruker specific parameters
$$ --------------------------
##$DU= <F:/spectra>
##$EXPNO= 1
##$NAME= <H-F>
##$PROCNO= 1
##$TYPE= <nmr>
##$USER= <she>
##$AMP= (0..31)
100 100 100 100 100 100 100 100 100 100 100 100 100 100 100 100 100 100 
100 100 100 100 100 100 100 100 100 100 100 100 100 100 
##$AQSEQ= 0
##$AQ_mod= 1
##$AUNM= <au_zg>
##$AUTOPOS= <>
##$BF1= 200.13
##$BF2= 200.13
##$BF3= 200.13
##$BF4= 200.13
##$BF5= 200.13
##$BF6= 200.13
##$BF7= 200.13
##$BF8= 200.13
##$BYTORDA= 1
##$CFDGTYP= 0
##$CFRGTYP= 5
##$CHEMSTR= <none>
##$CNST= (0..31)
1 1 145 1 1 1 1 1 1 1 1 1 1 1 1 1 1 1 1 1 1 1 1 1 1 1 1 1 1 1 1 1 
##$CPDPRG= <>
##$CPDPRG1= <>
##$CPDPRG2= <>
##$CPDPRG3= <>
##$CPDPRG4= <mlev>
##$CPDPRG5= <mlev>
##$CPDPRG6= <mlev>
##$CPDPRG7= <mlev>
##$CPDPRG8= <mlev>
##$CPDPRGB= <>
##$CPDPRGT= <>
##$D= (0..31)
0 1.2 0 0 0 0 0 0 0 0.06 0 0.03 0 0 0 0 0.0002 0 0 0 0 0 0 0 0 0 0 0 0 
0 0 0 
##$DATE= 1591686176
##$DBL= (0..7)
120 120 120 120 120 120 120 120 
##$DBP= (0..7)
150 150 150 150 150 150 150 150 
##$DBP07= 0
##$DBPNAM0= <>
##$DBPNAM1= <>
##$DBPNAM2= <>
##$DBPNAM3= <>
##$DBPNAM4= <>
##$DBPNAM5= <>
##$DBPNAM6= <>
##$DBPNAM7= <>
##$DBPOAL= (0..7)
0.5 0.5 0.5 0.5 0.5 0.5 0.5 0.5 
##$DBPOFFS= (0..7)
0 0 0 0 0 0 0 0 
##$DE= 6
##$DECBNUC= <off>
##$DECIM= 24
##$DECNUC= <off>
##$DECSTAT= 4
##$DIGMOD= 1
##$DIGTYP= 9
##$DL= (0..7)
0 120 120 120 120 120 120 120 
##$DP= (0..7)
150 150 150 150 150 150 150 150 
##$DP07= 0
##$DPNAME0= <>
##$DPNAME1= <>
##$DPNAME2= <>
##$DPNAME3= <>
##$DPNAME4= <>
##$DPNAME5= <>
##$DPNAME6= <>
##$DPNAME7= <>
##$DPOAL= (0..7)
0.5 0.5 0.5 0.5 0.5 0.5 0.5 0.5 
##$DPOFFS= (0..7)
0 0 0 0 0 0 0 0 
##$DQDMODE= 0
##$DR= 18
##$DS= 0
##$DSLIST= <SSSSSSSSSSSSSSS>
$$ [...]
##$SUBNAM2= <"">
##$SUBNAM3= <"">
##$SUBNAM4= <"">
##$SUBNAM5= <"">
##$SUBNAM6= <"">
##$SUBNAM7= <"">
##$SUBNAM8= <"">
##$SUBNAM9= <"">
##$SW= 24.9337058887773
##$SWIBOX= (0..15)
0 0 2 0 0 0 0 0 0 0 0 0 0 0 0 0 
##$SW_h= 4990.01996007984
##$TD= 16384
##$TD0= 1
##$TE= 0
##$TE2= 300
##$TE3= 300
##$TEG= 300
##$TL= (0..7)
0 120 120 120 120 120 120 120 
##$TP= (0..7)
150 150 150 150 150 150 150 150 
##$TP07= 0
##$TPNAME0= <>
##$TPNAME1= <>
##$TPNAME2= <>
##$TPNAME3= <>
##$TPNAME4= <>
##$TPNAME5= <>
##$TPNAME6= <>
##$TPNAME7= <>
##$TPOAL= (0..7)
0.5 0.5 0.5 0.5 0.5 0.5 0.5 0.5 
##$TPOFFS= (0..7)
0 0 0 0 0 0 0 0 
##$TUNHIN= 0
##$TUNHOUT= 0
##$TUNXOUT= 0
##$USERA1= <user>
##$USERA2= <user>
##$USERA3= <user>
##$USERA4= <user>
##$USERA5= <user>
##$V9= 5
##$VALIST= <valist>
##$VCLIST= <CCCCCCCCCCCCCCC>
##$VD= 0
##$VDLIST= <DDDDDDDDDDDDDDD>
##$VPLIST= <PPPPPPPPPPPPPPP>
##$VTLIST= <TTTTTTTTTTTTTTT>
##$WBST= 1024
##$WBSW= 4
##$XGAIN= (0..3)
0 0 0 0 
##$XL= 0
##$YL= 0
##$YMAX_a= 919991
##$YMIN_a= -574275
##$ZGOPTNS= <>
##$ZL1= 120
##$ZL2= 120
##$ZL3= 120
##$ZL4= 120
##$ABSF1= 10
##$ABSF2= 0
##$ABSG= 5
##$ABSL= 3
##$ALPHA= 0
##$AQORDER= 0
##$ASSFAC= 0
##$ASSFACI= 0
##$ASSFACX= 0
##$ASSWID= 0
##$AUNMP= <proc_1d>
##$AZFE= 0.1
##$AZFW= 0.1
##$BCFW= 1
##$BC_mod= 2
##$BYTORDP= 1
##$COROFFS= 0
##$CY= 11.3945322036743
##$DATMOD= 1
##$DC= 2
##$DFILT= <>
##$DTYPP= 0
##$F1P= 16.9975609425685
##$F2P= -3.02152046262296
##$FCOR= 0.5
##$FTSIZE= 0
##$FT_mod= 4
##$GAMMA= 1
##$GB= 0.15
##$INTBC= 1
##$INTSCL= 1
##$ISEN= 128
##$LB= 0.24
##$LEV0= 0
##$LPBIN= 0
##$MAXI= 10000
##$MC2= 0
##$MEAN= 0
##$ME_mod= 0
##$MI= 1.114404
##$NCOEF= 0
##$NC_proc= 0
##$NLEV= 6
##$NOISF1= 3.799351
##$NOISF2= 2.8
##$NSP= 1
##$NTH_PI= 0
##$NZP= 0
##$OFFSET= 15.70392
##$PC= 1
##$PHC0= -9794.586
##$PHC1= 14.20088
##$PH_mod= 1
##$PKNL= yes
##$PPARMOD= 0
##$PSCAL= 0
##$PSIGN= 0
##$REVERSE= no
##$SF= 200.130013532006
##$SI= 16384
##$SIGF1= 3
##$SIGF2= 2
##$SINO= 400
##$SIOLD= 16384
##$SREGLST= <1H.CDCl3>
##$SSB= 0
##$STSI= 0
##$STSR= 0
##$SW_p= 3612.71676300578
##$SYMM= 0
##$S_DEV= 0
##$TDeff= 0
##$TDoff= 0
##$TI= <>
##$TILT= no
##$TM1= 0
##$TM2= 0
##$TOPLEV= 0
##$USERP1= <user>
##$USERP2= <user>
##$USERP3= <user>
##$USERP4= <user>
##$USERP5= <user>
##$WDW= 1
##$XDIM= 8192
##$YMAX_p= 0
##$YMIN_p= 0
$$ End of Bruker specific parameters
$$ ---------------------------------
##NTUPLES= NMR FID
##VAR_NAME=  TIME,          FID/REAL,        FID/IMAG
##SYMBOL=    X,             R,               I
##VAR_TYPE=  INDEPENDENT,   DEPENDENT,       DEPENDENT
##VAR_FORM=  AFFN,          ASDF,            ASDF
##VAR_DIM=   8192,          8192,            8192
##UNITS=     SECONDS,       ARBITRARY UNITS, ARBITRARY UNITS
##FACTOR=    0.0002004,     1,               1
##FIRST=     0,             0,               0
##LAST=      1.6414764,     0,               0
##MIN=       0,             -574275,         0
##MAX=       1.6414764,     919991,          0
$$ Real data points
##PAGE= N=1
##DATA TABLE= (X++(R..R)), XYDATA
$$ [...]
2506e154q85P85R98J075m97q69J782J771q90r03Q51R5K85K147R67j505l8n14J99
2525c00L079J980k642l033L359M145j942l025O3K057K800M77l370k391L497L237
2541G991j971k241K70J566J383O16k616j511K016J468j302j72P86j189j137K229
2557F186R83k830j583J401J742K55j007k863p51K525J106k746j162J355Q08j031
2573B388j820j613O36L224j84l402j156J698j241j122J376J224j341j102J15j131
2589c451J92Q92j191p84K266J061l056j620J419P21Q27l92p56R3J459j343k269
2606e932Q88L181l29j108O47n31j680R88J240N10m10O09p23p93J114J76j102K90
2624b965K019L23j192n97n05N72J547j98j337Q81J781j437j386M54K65J30J595
$$ y = [-5154, -6039, -5254, -4256, -3181, -3678, -4547, -2765, -994, -1884, -2787, -1936, -1841, -1556, 591, 1558, 53, 15, -499, -300, 2779, 4759, 2117, -916, 2443, 6588, 4646, 1621, 1684, 3741, 6541, 7018, 3648, 1257, 4754, 7991, 6020, 3779, 4049, 5615, 6998, 7614, 4998, 3487, 5503, 6971, 5669, 5497, 6283, 5094, 3957, 6186, 7169, 4339, 2756, 4157, 5899, 6154, 5147, 2284, 1533, 4058, 5164, 2418, 1256, 2611, 3419, 2388, 568, -1045, -409, 2815, 2631, -771, -1927, -229, -1470, -2592, -1216, 8, -1333, -2435, -2320, -3451, -3259, -2367, -3558, -4342, -2076, -1015, -4071, -5691, -4272, -3551, -2724, -3116, -3872, -3779, -2320, -3663, -5932, -5044, -1863, -2192, -3300, -2653, -3184, -4864, -3876, -2636, -2126, -2536, -1927, -2650, -3443, -2329, -2153, -3255, -2965, -946, -623, -1815, -2412, -2917, -2345, -798, -996, -2333, -1452, 329, -1108, -2494, -2040, -1775, -1645, -50]
2641e0O93j913j086Q08J52n14J642O63p94k30j2j324J40J791J102k75k4r80j146
2660a357J626J464j397n40J907O45m78j12m68j480J528L507j24j889j11R1k17
2677B595J045J234q41M2J216o72r37j85R85M26J246m20k584l44J792K2j215Q55
2695D260N77j292N76L67j651q73R01P62q19L25q07j285o3J776n68j739L05Q16
2713A568l40J00j528j818J562K009m90k826J05O89p20K31P55j269p92P70n28q62
2731c384P31J36k113k15J807j09j355m30j01j0N67j81j392J216J173j833j644
2748g137J618J158r32N81K56j185r8J898K88m83N61J02q57O82J410j2q78Q17P57
2767a454N86Q35q42j620K052K239j178j448J024J147J65L17o05j490J156K158
$$ y = [-50, 643, -1270, -2356, -1548, -1396, -1910, -268, 395, -399, -629, -641, -1965, -1825, -34, 1068, 793, 769, -211, -1357, 269, 1733, 336, -204, 1703, 2348, 1870, 1758, 1290, -190, 1338, 4845, 4721, 2832, 2721, 2812, 2595, 3640, 4874, 4033, 4075, 5291, 4619, 3682, 3497, 4482, 4908, 6154, 5734, 3150, 2806, 4598, 4620, 3405, 4260, 4837, 3545, 4121, 4488, 2837, 1964, 2865, 3627, 2808, 3133, 2326, 1041, 978, 2754, 2186, 447, 752, 1568, 1228, 1328, -200, -2018, -456, 1553, 1063, -1763, -1658, -969, -1689, -1458, -703, -1972, -2764, -1994, -2522, -3384, -2653, -2517, -4630, -4845, -3038, -3147, -4502, -4932, -5033, -5043, -4476, -4657, -6049, -4833, -3660, -5493, -7137, -5519, -4361, -5293, -4712, -4456, -5641, -5739, -3841, -3553, -4036, -3475, -3373, -4230, -3548, -2138, -2150, -3028, -2211, -1454, -868, -33, -875, -2495, -443, 1796, 618, -830, 194, 1341, 1506, 1823, 1218, -272, 884, 3042]
2783C042p00j241Q28m3j029P66J795J77j929J7K74L78R90k50p73N17J420r53q32
2802B454K57M64j67J513P44j504n09R34q60l85J773J011j679M1M41j793q80J216
2820C071J349R34l72k243k792J311J837Q1p53L23j094o58m2q61j087J677K771
2837C452j210k949r21p46M2K738Q98j403j632M74l59j098J71J9M52K103Q16l110
2855b263k900O29J616J896J348j788k596J84J049p74k64J592J127j157n11j039
2871c851j891J085K368O59j200j065p82M4J746Q54j332j017J423M12K71p68r57
2888d001n55K142K216j887j644J382J044J99N38o53j712J024K841K25j463m86
2904g90r2K63J871M99j735N94J557N28j536q54r34J134L642J884k987k848j27
$$ y = [3042, 2342, 1101, 1929, 1886, 857, 1623, 3418, 3595, 1666, 1683, 1957, 2335, 3325, 3075, 2302, 2819, 4239, 3286, 2454, 2711, 3175, 3008, 4521, 5265, 3761, 3252, 4186, 3326, 2941, 4714, 5725, 4046, 4087, 4528, 2735, 1855, 3071, 4420, 5354, 4982, 2739, -53, 1258, 3095, 3176, 2423, 2746, 1652, 994, 952, 91, -996, 681, 3452, 2242, -707, -1628, -2374, -2332, 406, 1304, -99, -1731, -1257, -1616, -2714, -2543, -2524, -2072, 31, 847, -2263, -5163, -4534, -2918, -1022, 326, -1462, -4058, -3874, -2825, -3599, -3863, -2271, -1144, -2301, -2812, -3851, -5742, -4657, -2289, -1630, -2830, -3895, -4677, -4633, -2887, -2033, -3365, -4382, -2959, -2547, -2276, -3044, -4001, -4556, -2414, -198, -2085, -3729, -2347, -1303, -1104, -566, -1219, -2931, -1907, 934, 1159, -304, -790, -882, -619, 1252, 1751, 16, 610, 2167, 2695, 1159, 305, -629, 505, 4147, 6031, 3044, 196, 69]
2921F9R84R25K081O90j667k80O99k195j493J765K788J245L07k615l138l93K899
2938B671J826Q06j11j876j387M32K11j458R05L154O99k030j831k106n30K784K720
2955D879l06k221q23j039o42Q45J084n69J433L39j991k465n16J113K177J699j419
2972A578l495p98J898JM6Q2r9q76M29K72j927p09J752R07p59j03q33j311Q11J262
2992a872l86j094R0L32K9O26q29j513N59J946m59j019K97l23RJ134P89k336p06
3011d726J681J450p38J57p47r88J077J842m76q20P36l8K12o3p04p05J974K728
3029A852j075k224l87K56J262K256K25k509k11J889J16j272L41O36L14J322l9
3046B752j603j231J421J261N34J84r24r46J108P70j468n2J755K19m56M0j027j091
$$ y = [69, 1053, 1978, 4059, 4749, 3082, 2802, 3501, 1306, -187, 1578, 4366, 5611, 5918, 3303, 165, -228, 2671, 4497, 5303, 5192, 3316, 1929, 2361, 2572, 1114, 2019, 5173, 5872, 3842, 2011, -95, -625, 2159, 4879, 4573, 2352, 1529, 490, -152, 693, 1777, 1208, 2641, 2980, 989, -1476, -1992, -879, 1298, 2997, 1578, -1917, -2715, -817, -816, -770, -688, -787, -1663, -1234, -962, -2889, -3598, -1846, -939, -1698, -1801, -2634, -3945, -3134, -1872, -2258, -3352, -3262, -2930, -2901, -2275, -3104, -4617, -4058, -2112, -2571, -3590, -3293, -3616, -3607, -2473, -1684, -4020, -4726, -3045, -1595, -2333, -2176, -2923, -3911, -2834, -992, -1468, -2288, -1552, -1590, -1378, -1441, -2145, -2850, -876, 1852, 777, -1447, -1834, -1578, -316, 1940, 2165, -344, -555, 1334, 1450, 178, 519, 1155, 1469, 2791, 2752, 1149, -82, 1339, 2600, 3134, 3318, 2394, 1448, 2556, 3326, 1858, 1806, 3561, 3780, 3324, 3364, 2337, 1246]
3064A246J183K131l81j405L92j78j327Q63R09k88n00O8r9l31M88l87o99Q17J425
3083C927j291j394p7J18M9J453o17j613K44J118j036j442J54P00K15Q66n05k794
3101a925p08J635J157K1p11j116q60P63O50j130l23J103N83p89r59j443o55K553
3119b154K327j557k143L00j3o89L67J139p3O85M28j499j909P76J259J79J087k5
3137a515j388n54J41k87M65K541l80j064J29m85n99M7K374M81n88j89k3j572J68
3156b298J547J211M51J11j350j451J415J126j72K3L80j7K89J33j547J39J980J526
3174C496j654j403R24L79M87K60o22p78R24J601j051j165L40J221j54K44n46j050
3192A453J053J756p75j344l87p10P39J648J81j346J87K54j234j214J148J712J66
$$ y = [1246, 2429, 4560, 4179, 2774, 3166, 2988, 1661, 2524, 3433, 3145, 2645, 2713, 2614, 2283, 2771, 2384, 1685, 2502, 3927, 2636, 1242, 1165, 1283, 1332, 2785, 2168, 555, 799, 1917, 881, -561, -407, 293, 508, 1374, 869, -1925, -2633, -998, 159, 180, -531, -1647, -2507, -1744, -1094, -2224, -2547, -1444, -861, -1650, -2609, -4052, -4707, -2154, 173, -1384, -3527, -3227, -3240, -3929, -3562, -2423, -2496, -1811, -1383, -2882, -4791, -4015, -2756, -2577, -1490, -1515, -2903, -3457, -3316, -3603, -3138, -597, -977, -2041, -1912, -2397, -2996, -2949, -575, -94, -682, -871, -894, -2466, -2298, -751, 460, 911, 1022, -328, -1779, -364, 762, 590, 613, 993, 976, 1265, 1398, -149, -10, 1970, 3496, 1842, 439, 1363, 1742, 2229, 2489, 1867, 1089, 2013, 3614, 2563, 1398, 1738, 2959, 2805, 3049, 2503, 1453, 2506, 4262, 3487, 2143, 1756, 1046, 1785, 3433, 3614, 2268, 2455, 2709, 1475, 261, 1409, 3121, 3287]
3209C287K23j521k211r7J726J099k30J79k34j061j384m18P2J856J751m82k314
3226B41r82l01k58J017J257K06m17ok120j971J092K637L49k28m32j882j437P36
3244b499O61m48J711R61j132k127j560J44J359K339J97k198p61N25r66k05J200
3261b799R51n57N69q25k177j26K237P91r93J71j50l93M06O0j009R16K055K2j082
3280a933j236N54J379J084l16j628K35K091O06j714J18M24M52J007K13j099l50
3297a13J630O89j176n49j2J096R31N94j062j301Q59M36k48P43R8j5P22K36j767
3316A791j054J641J860m54o27o46o78N51J038J00j190J134J106j041j343M3J58
3333B389O16R13k36o91l80o98j615R10K306o6j468j492J35J55M21l3j694K32J598
$$ y = [3287, 3510, 1989, -222, -319, 1407, 2506, 2276, 2455, 2221, 1160, -224, -642, -570, 1286, 3037, 2555, 241, -741, -1042, -1300, -283, 974, 1180, 763, 757, -1363, -3334, -2242, 395, 744, 516, 84, -1798, -3235, -2499, -1838, -2286, -575, 386, -746, -2873, -4433, -4289, -2930, -591, -394, -2592, -3353, -2828, -3794, -3999, -2799, -1848, -2405, -1836, -2661, -4838, -4964, -2727, -1936, -2929, -2758, -2908, -3301, -2895, -2835, -3844, -2928, -873, -851, -1933, -3169, -2615, -1236, -152, -468, -2096, -1861, 230, 836, -878, -760, -336, 116, 1123, 1336, 237, -113, 1517, 2206, 1030, 481, 469, 1565, 2496, 3090, 2028, 727, 1586, 2022, 1774, 2517, 2615, 2600, 3322, 3558, 1791, 737, 2378, 4238, 3784, 3157, 2511, 1833, 2384, 3422, 3522, 2332, 3466, 4572, 3531, 2188, 2231, 2389, 3005, 3918, 3682, 2991, 2611, 1913, 298, 1208, 3514, 3448, 1980, 488, 623, 778, 1199, 1166, -528, -296, 1302]
3352A302l96k487n10O50N84Q95j49j624j047Q95M80l20k36j52j01P34L18j631
3370b795j485J979J972o54j610o04j23J777J211k035k013J484K747o53k186j183
3386d171P91K311J206j985j864K93J585L41m15k05o33K24J385r5j335m16J290
3403a693J62P77J99j357r34J429J471p23l84O57J50j26J03l67M68J778j40j014
3421D56j70J031k81l9N59J51J20j22J86q56P28R94j227q23J857O39j054j492j85
3440D72J081J740J60k057j247J079J764n01q71m27k36J264R30r85k013M10R20
3457A483N56O73m82j964J63K036O35j979r34O70J018K13o23j506K02J693J4j459
3475D09p37J329N85q02o95j357N94K010j47k069m97Q89J79o19L90l60o16N44L55
$$ y = [1302, 906, -1581, -2091, -1441, -857, 38, -111, -1735, -2782, -1887, -1407, -1727, -1963, -2115, -2216, -1482, -1164, -2795, -4280, -2301, -329, -983, -2593, -3197, -3320, -1543, -332, -2367, -4380, -2896, -149, -802, -2988, -4171, -3380, -1069, 137, -1848, -3712, -3419, -1834, -1493, -1908, -2113, -2746, -2522, -1137, -1232, -2567, -2983, -1693, -1531, -754, -555, -1912, -2846, -1417, 54, -669, -1053, -396, -246, -372, -269, -636, -168, 1610, 1470, 456, 286, 1317, 1036, 997, 1556, 1707, 1827, 1705, 1891, 1035, 1763, 2757, 1530, 707, 2564, 3203, 2149, 657, 472, 1553, 3293, 3453, 1396, 149, 1228, 2992, 2491, 1620, 1193, 957, 2221, 3151, 2166, 153, 563, 1483, 2039, 2712, 2230, 266, 429, 2465, 3100, 1121, 187, 857, 1875, 2088, 1465, -41, 161, 1854, 1868, 409, -328, 1001, 1586, 784, 89, -1268, -674, 1336, 1189, -880, -1377, -488, -309, -928, -538, -898, -1514, -970, -615]
3494f15q00r4l56j83O60Q52P0j152o94K56J86R66J52l54j12p9o69o03J286N69
3514g14j109j87J494J17j779n40K81J192J243k21j570j026J066Q90m49J14L64
3531h34K42j40o51p35N9J438O96j229O49Q5o13j88P21j49O0Q59O27j504l95Q8
3551i14M40O71J129n27j333J26R78k39j0J42n5N93M55q31o24O88P15m91R3R55
3571A961j0m09l25J80j80J078O78j295k10Q36M60q89k93K35N38O65J6j111p94
3590A131Q08L43n50O72R0j139J80O14o76m83M13K40n65M28o31r50k56J230p3j501
3610f75R67Q88p67j014r3n56Q75R45m78j145l20O92m54K38J89q27M83N07m19o34
3630a598l28P04m38N79K66l36j199N72L98l33k23M44k32k49L40o78j99M98K16
$$ y = [-615, -1415, -1509, -1865, -2048, -1388, -536, -466, -1618, -2312, -2056, -1870, -904, -752, -1106, -1218, -1297, -1966, -2569, -1283, -714, -1823, -2010, -516, -399, -2178, -2718, -2437, -1245, -2, -223, -1793, -2819, -1753, -863, -1312, -1198, -834, -592, -732, -1383, -2118, -2059, -621, 75, -1154, -505, -420, -1033, -1221, -500, -649, -589, 270, 897, -607, -1002, -914, -474, 197, 1326, 799, -534, -408, 570, 331, 321, 463, 408, 1001, 1456, 625, 1, 689, 1404, 913, 1006, 1961, 1951, 1542, 1217, 1397, 1217, 2295, 2973, 1678, 1468, 2304, 2764, 1875, 1582, 1817, 2355, 3020, 3036, 1925, 1131, 1939, 2282, 1732, 2404, 2494, 1355, 1535, 2149, 1473, 990, 1403, 1643, 1078, 1506, 875, -75, -331, 899, 826, -675, 292, 1180, 413, -601, -694, -1250, -375, 570, 92, -1053, -1373, -681, -1135, -897, -708, -1535, -1052, -545, -964, -1598, -1926, -1222, -1660, -1081, -815, -1151, -2350, -1778, -1380, -1713, -1936, -1492, -1724, -1973, -1633, -2311, -2510, -2012, -1796]
3649a796m67L75N9l30l76Q47l09k22Q78J18p73r1J162k73o11P25P43m38J64q5
3669g00l23L80N90j48l68Q87K90l51K37j82o0rQ88k77m49K89K7l43O67L69l21
3690A093n97L37K94l41K92J38q9M2K05k79n39J031K43m20M5p5M0M13j72o65J1
3711A007J048K40q99J52N78j70o19N54M14r28O0O76l28k38J15m00k5K86L6p71
3731G88o6N06j48Q3J14p66j92Q35m72l91k95Q46l31n24j04m48j60N29L08j219
3751a107J5M22m8j57k02n88l24O99N32n24p32J9l43N02P16m21q26p8P56o34m55
3772b778R56K48j32k78P7p03P24P27m19o70O21K38l4k80J35MK45N73m86j21K08
3793a145r0k71R12M96p57J49M90o20k95R03N31p48K38N23k96K1K20l28N49K39
$$ y = [-1796, -2263, -1888, -1829, -2159, -2535, -1688, -1997, -2219, -1341, -1223, -1996, -2087, -925, -1198, -1809, -1084, -341, -779, -615, -700, -1023, -643, -53, -201, -569, 318, 608, 257, 494, 312, 252, 243, 1131, 854, 405, 694, 721, 378, 1045, 1414, 1093, 496, 833, 1127, 786, 1078, 1216, 1127, 1169, 1374, 1095, 556, 1587, 1830, 1410, 1455, 1380, 1420, 1833, 1661, 996, 1007, 2055, 2295, 1396, 1548, 2126, 1956, 1337, 1891, 2305, 1377, 1437, 2113, 1785, 1547, 1662, 1262, 1237, 1523, 1559, 788, 722, 1228, 1080, 1163, 1277, 511, 319, 1154, 682, 291, -4, 842, 511, -13, -117, -565, -725, -196, 112, -1107, -1092, -670, -718, -875, -1077, -1665, -1989, -1290, -758, -1282, -2014, -1995, -2338, -1836, -1120, -1541, -2367, -2445, -1689, -2323, -2778, -1822, -1574, -1706, -1984, -1907, -2610, -1886, -1159, -1578, -2248, -1627, -1389, -1423, -1703, -1568, -1564, -1319, -746, -1232, -1353, -1145, -1235, -1506, -594, -98, -855, -706, -216, -836, -1131, -228, 303, -445, -207, 316, 20, 41, 261, -67, 482, 721]
3813G21M27m45m97L24M50P93k03n83q49J043J355m23o43J28k58L69N13l66n58
3832A298L86J204p42j058L82L81p3N05n14j071L22J021n31j12j75k54K58N39p13
3851A053j116P7J341Q2k45m76m67n61O24N19o27lM89k05q09M42J74m0q8J82j38
3872B08q7mm33j27Q72N85r91m89j00l66O78P32q54q02L07N99j091j37M28j22K07
3893i87J04n00j046j18J215L93o52q60K8N31Q14n41j471O43J494J27o00p71o28
3912b825Q69J751n9j426n01Q64O77J26l4l55l30P70O99j114n44O81Q42J32k62
3931c9m08n88Q76J020j072lN12k56J7J61k8k55O01N09m03o38N07O4l58O14N16
3952A349L9m18m6k34O14Q59j87j004J72Q16k25j47k76j39N47J552o10j681l55
$$ y = [721, 1148, 703, 206, 530, 980, 1773, 1570, 987, 138, 1181, 2536, 2113, 1470, 1598, 1340, 1709, 2222, 1856, 1298, 1684, 2888, 2146, 1088, 1470, 1851, 1778, 2283, 1769, 698, 1020, 2041, 1510, 1398, 1223, 969, 1227, 1766, 1053, -63, 14, 1355, 1437, 1192, 716, 249, -312, 312, 831, 204, 201, 690, 485, -324, 118, 292, 252, 164, 346, 208, 121, 117, -316, -443, 429, 1014, 23, -466, -566, -932, -254, 478, -376, -1178, -871, -272, -1363, -1500, -1072, -1194, -987, -883, -1383, -2429, -2547, -1332, -939, -1591, -2451, -2423, -1892, -1078, -1619, -3090, -2447, -953, -826, -1426, -2197, -2825, -1956, -205, -264, -1690, -2191, -1327, -650, -524, -558, -913, -1243, -473, 226, -888, -1432, -751, 91, 223, -39, -447, -1035, -159, 861, -211, -214, 298, 42, 59, 220, 192, -63, 538, 1047, 644, 6, 513, 577, 219, 833, 1349, 1388, 970, 924, 690, 1304, 2163, 1976, 972, 1144, 1960, 1735, 1588, 1312, 1173, 1720, 3272, 2662, 981, 626]
3971F26J485P36l68q17n78j64P65P81r96q27L43N72P5j28j364k41R25J355r81
3990A199j641q4J046P09l50j091r10J486J158j163j691M07P59M78l1n73j003Q9
4008a206Q74K16m06k95o78J60R25j9r71jM77r6K66j88m97m84O59L60r22J41M54
4029a231o48j87N63M06m01l37l9Q9P16J55j054n59J274R31q89o22l27J087Q54
4048b19j55j165p55J745J374j485j129Q24N59R94Rj501p30J007J650K43j121l99
4066b54j03R95R25l30j490K32J019J108p45o89j030J035J833J42j965m40J140
4083A383N21j85P5l60R2O32k16q95q9J040j9l24k35K4M5k45k98M34J71L64p77
4104A138m82J40N84r91L59L76j14l72j24m58k59J056O22m47j141ql15P72M25j73
$$ y = [626, 2111, 2847, 2479, 1662, 1084, 920, 1685, 2466, 1470, 643, 986, 1558, 1633, 1505, 141, -100, 825, 2180, 1199, -442, -526, 520, 1229, 879, -212, -1122, 364, 1522, 359, -1332, -925, -166, 312, 281, -292, -1295, -1206, -332, -116, -522, -817, -1495, -1335, -410, -429, -1400, -1401, -924, -1020, -754, -942, -1439, -1923, -1264, -904, -1826, -1685, -1231, -1879, -2066, -1503, -1097, -1498, -1835, -1874, -1785, -1069, -914, -1968, -2527, -1253, -322, -1211, -1833, -2160, -1073, -219, -374, -1539, -2294, -549, 825, -660, -1789, -965, -406, 588, 597, -904, -1634, -627, 1023, 1266, 145, -254, -357, 638, 1563, 1233, -257, -25, 994, 2102, 1357, 668, -362, 673, 2506, 2648, 683, 243, 1383, 1904, 1719, 1794, 1434, 1526, 2158, 1942, 1047, 958, 1998, 1979, 1655, 1420, 1444, 1489, 1244, 946, 1380, 1551, 1915, 1138, 656, 796, 1380, 389, 748, 1124, 1010, 638, 514, 56, -203, 853, 1475, 1028, -113, -121, -436, 336, 761, 588]
4124E88j138P4Q84L01m14j182k42P34J779p12k271m40J254J330k19q83j407K59
4142a705J518n7j184n34R26M71l11q35l07L63Q19O29j105o84L63L33QJ80n68j42
4162a822Q00M39p96m04O40O06K22k0m49j231Q27J128k45m84J63j22O7J53L56l30
4182e02k69O50n33j14Q36j33r67l2J363P7m70q8j043O42J368O48j534k86K93L51
4202B57M11R8k95j43P37K80q01p59O79P82Q04J01j173n90N93J084m34m14J73M11
4222A801J3k4r83n06J421Q37l04j412n2K44M14M61o56n86K06O95m16n15M2j94
4242D86J48N08j40r90j55N80j33L21L68l83p01j35J77j79K08L99n47p27O95J16
4262h4k91l22K49n1J99O4q26k85P16K05p0p51k5j9L12J57l01j082O69P52k03o96
$$ y = [588, -550, -476, 408, 709, 295, -887, -1129, -395, 1384, 672, -1599, -2039, -785, 545, 326, -557, -1964, -1705, -187, -244, -1428, -1962, -1036, -565, -876, -1711, -2018, -1655, -836, -207, -1312, -1996, -1633, -1300, -1292, -1112, -1680, -1822, -1022, -583, -1379, -1783, -1143, -537, -315, -335, -784, -2015, -1188, -60, -305, -789, -626, -748, -681, -528, -172, -502, -771, -121, -654, -768, 68, -65, -1032, -1064, 299, 376, -94, -182, -1225, -583, 785, 1433, -101, -387, -94, 257, 668, 766, 471, 328, 1065, 1345, 544, -215, 464, 1246, 2050, 2151, 978, 388, 981, 2065, 1631, 1217, 1390, 1801, 1814, 1790, 807, 301, 1722, 2559, 2255, 843, 791, 1035, 1449, 1910, 1254, 668, 874, 1569, 1153, 638, 680, 486, 634, 1142, 1002, 12, -143, 437, 304, 625, 993, 610, -91, -226, -49, -228, -20, 379, -168, -895, -200, -84, -375, -697, -448, -499, -300, -236, -1062, -1347, -631, -426, -496, -1247, -1272, -1291, -979, -822, -1123, -2205, -1536, -784, -987, -1683]
4284a683M06j27j07J021o41j297L33J322J20n77n73L7O92P20o57p78L59P65L36
4303c29m32k43m12K77J193J64p06l50K85L21J12k34NL00K20K01n64K37N20j16
4323D49k56J80K20k38N01l01j49M58L52O2q76M72J01k31K39k7r6J61K48k05p28
4344C36M68Q09l94l38m1l9j57P93k64l52L2L23J07Q4l09r67M72J519n41q74l42
4365C25M57L12K21j94q83J18N71N70p22o55K18M91p4j68l71j61K23M04q48j08
4385b74O57m64j60K1k78k75N70M00q55J99l47O6j60K95Q5k94j82L47k78r49O96
4406a180J29N64m99pl59P0L23k75K6O12j38m55n4M3j96N74K09n33j58N93J39n64
4428a136N5L29K24k76L30o66j55L19P05l97K0P3j19L55K75n70l26N79P22o01j63
$$ y = [-1683, -1277, -1404, -1511, -490, -1131, -2428, -2095, -773, -653, -1230, -1803, -1766, -1074, -354, -1011, -1789, -1430, -665, -329, -761, -1004, -1416, -1139, 54, 218, -488, -838, -553, -232, -120, -354, -349, -49, 171, 372, -192, 45, 565, 449, 193, 373, 593, 355, 856, 555, 406, 864, 1216, 1278, 402, 874, 975, 744, 983, 956, 860, 1021, 1269, 1064, 336, 804, 1613, 1219, 881, 840, 801, 644, 1437, 1173, 821, 853, 1176, 1283, 1367, 1058, 91, 563, 2082, 1541, 667, 325, 782, 1094, 1315, 1121, 238, 356, 927, 1497, 775, 120, 338, 829, 755, 587, 216, 55, 278, 682, -166, -274, 383, -81, -241, -220, -498, -773, -203, 197, -658, -459, -806, -740, -900, -605, -520, -814, -996, -649, -927, -1876, -1180, -1051, -487, -986, -993, -1352, -1282, -959, -1234, -1208, -596, -734, -1189, -1243, -1200, -1396, -822, -613, -1146, -1304, -711, -572, -1136, -1081, -752, -528, -804, -474, -1140, -1295, -976, -271, -668, -648, -575, -694, -339, -64, -634, -960, -381, 341, -260, -423]
4449d23O11Q7o13M18K86m64P02L72k43j54j40K36J6L55pm05L53N4J53j52M33m01
4471A074P6J82j98l01L36P8k57k08K48M79j04k70ln27J7O60k99k46R6K34j37l71
4493E59L92l97K70J47j61m68L16j45p6J80K90j82l01J68j45l96L97R9n50K75l3
4514B39m30k62M80R5p09M39j5l3m35l41K05N8M28l39j55j07M7j95P2P5j17J23
4536h77J57l12n21K05O88j74o93M10K3j09O5j7r1J50K79j43k42M95K9m79M76l2
4558g13l05k10R37m47R3j20L17k09J34L95j23k29M11q0l24L24k6oM16m0K0j94
4580B1M10l3k16K84M54o33J95K74j91j61N08j81j59O23L3p65L6L02M28m87J61
4601I03K06j21l6o9q2K1L75nr9l27K89q3o0L69k81j65J65l56k19N16J85l98k70
$$ y = [-423, 188, 275, -338, 80, 366, -98, 604, 976, 733, 579, 439, 675, 691, 1046, 1039, 634, 987, 1041, 1194, 1042, 1475, 1074, 1150, 1332, 1134, 833, 1169, 1247, 990, 782, 1030, 1509, 1405, 1135, 1132, 605, 622, 1282, 983, 737, 833, 1067, 930, 559, 951, 554, 824, 971, 810, 342, 658, 513, 437, 617, 907, 725, 424, 592, 447, 51, 448, 547, -3, 272, 239, -191, -453, 27, 122, -587, -148, -163, -196, -631, -972, -767, -709, -281, -620, -775, -882, -835, -1030, -958, -883, -1000, -877, -720, -1032, -1553, -1348, -660, -834, -1527, -1117, -1094, -1203, -1138, -1155, -1246, -1096, -817, -960, -1202, -707, -678, -1157, -681, -713, -1018, -1228, -291, -738, -645, -765, -448, -657, -523, -128, -251, -480, -69, -149, -473, -149, -175, -181, 235, 195, 215, 21, 431, 398, 182, 466, 920, 287, 482, 756, 565, 404, 912, 731, 572, 1195, 1228, 463, 499, 801, 1229, 742, 903, 1109, 988, 952, 883, 801, 822, 1197, 1192, 1093, 766, 1055, 972, 912, 1281, 1000, 835, 1000, 644, 425, 941, 1126, 728, 458]
4624D58K81J6l82j77N09j18l2J14o15M8K80N0o54L53Q3m59M09P2n01J79L17m86
4646b55k57L63l16m04J57K12J81k67l40L04r8K14J21q18J76P09m71l52K76L5K9
4667h01j67J91l30M04J71m50k13L62R3l20J97N09m80j94J43J26nqK8j23k15N83
4689d99j77n82N17L8P2K27P0l92n5N86k20k07P41j59j83J37J09j13L55P3j64j
4711A73L38j98r3jM22n4k85M95j4L3J50j73l71N30J96n21N2K23Q0l38K10K75m67
4734F62K26L08k23m28N45o9j79k57M83j84k59R8K54k07J89R2n21P3L42m97K39
4755F87L6K06k23m18M96q34M67O26n70n87L46K52o55n8M46k93k89M69m58n18M72
4776d00K18j51k0K39m49l5K30j25m50K02K10k99k68M86m18K1J30K19n66L05m3
$$ y = [458, 739, 755, 373, 196, 705, 587, 555, 669, 54, 102, 382, 432, -222, 131, 214, -245, 164, 236, -265, -86, 231, -255, -512, -149, -465, -869, -712, -500, -319, -586, -926, -622, -720, -506, -385, -1203, -1027, -318, -789, -1141, -865, -830, -801, -968, -777, -1107, -703, -532, -982, -1195, -833, -740, -1060, -863, -354, -834, -1028, -885, -759, -764, -772, -744, -867, -1082, -499, -676, -1258, -741, -703, -631, -404, -334, -726, -781, -195, -415, -622, 119, -40, -223, -86, 23, -90, 265, 338, 174, 173, 511, 313, 220, 219, 641, 587, 302, 797, 783, 816, 966, 793, 422, 952, 1148, 627, 679, 902, 982, 644, 854, 1129, 662, 888, 1196, 973, 545, 1090, 1021, 842, 585, 1068, 884, 625, 723, 977, 770, 959, 1051, 530, 603, 945, 448, 687, 723, 929, 706, 288, 784, -50, 417, 1043, 473, -114, 232, 484, -171, -229, 217, -76, -365, 104, -354, -872, -400, -182, -333, -353, -114, -563, -598, -368, -493, -943, -741, -531, -830, -1098, -612, -1030, -1009, -879, -660, -1226, -921, -964]
4797i64J43k49K11J65o70O02M51k27l54M0J94k82N40j74k14J72L3qk22L83l10
4818g40p4M37J21m87J96J35n9k13P89j65k46K79j92RQ8L9j27N03J43l99m87L38
4840a12M44l8M4M01l91J81L00k2n83M81J46K16m68J84k16q5L56r1N1k1K18m46
4862E49K02P5n00N34M26k86j90N2O6k77K81M98m04n65J62K19J1M9l42j01J09J9
4884E87%k52j06K81j65j52J85k08n28N17J06m04M5j15N7J7J79m33k80M23L05m96
4906d37l8j1N5q3L76j87j66m85L32l2J37rm60J20N9J59m22M43mj68M4K53k94l99
4930a217J81M61j16j52K44l22j78J075m59n12L64j40M39l48N4j15L9M51j55l89
4950g95L41M5j59J79K88k23p4N22j21k23r0oO26j42L24n41j53J93L38K21k26K15
$$ y = [-964, -821, -1070, -859, -694, -1364, -762, -311, -538, -892, -852, -658, -940, -400, -574, -788, -616, -583, -591, -813, -430, -740, -814, -377, -256, -743, -547, -412, -471, -684, 105, -60, -306, -27, -219, -210, -122, -83, -210, 293, 436, 37, -450, -112, 332, 294, 338, 739, 348, 529, 829, 807, 224, 705, 851, 1067, 599, 783, 567, 482, 838, 747, 798, 777, 995, 549, 751, 826, 326, 860, 1286, 1000, 810, 862, 928, 651, 932, 1430, 1026, 461, 623, 842, 853, 902, 560, 459, 568, 587, 587, 335, 229, 510, 345, 193, 378, 170, -358, 159, 265, -139, -94, -209, -152, -135, 44, -389, -669, -246, 59, -437, -475, -486, -431, -514, -138, -325, -491, -976, -644, -676, -539, -548, -1008, -888, -829, -670, -1092, -649, -653, -821, -777, -524, -818, -1217, -1036, -575, -691, -843, -599, -921, -1099, -24, -483, -995, -631, -771, -332, -680, -626, -741, -702, -251, -406, -795, -454, -409, -568, -389, -101, -324, -398, 124, 3, -220, -310, -316, 310, 168, 492, -49, -202, -9, 329, 550, 324, 539]
4972E39k55n1M36M44r33J57K75J70n4q4l69K51K81L55m14o5L01m50L16K13j11
4993I52m60L61K16k82l58L02j00k8K14Q5k72j15L31l03K0M7J0l2J23l25k46J67
5015C07K63n37J16P5j83j41J73O19o58k11j50L35j2K34m30n53N31J88r6k52j21
5036e03l45L19K28m0m07K0l04L28L21J56o12l87O53J24m50QJ12M19j36rm53k08
5058a166O86R0k62pm03L65P3K09k27k29M52M03m00j57q7k52K64M43j7p64J77O57
5080a52k13K01Nl65O3M97L17l74m91N45k85K83N37p14K9q6M70L55K1j19k39k54
5102C1N12K83m29K49L9j61l2L83j94k35M99j49j7m40M10k9K04M2m17k06M25M4
5124H12J2j76Q7J21O5K52n38n87J09Q48k99J74o64l09N65M46q9p56j61O33m9m5
$$ y = [539, 284, 233, 669, 1113, 180, 337, 612, 782, 728, 644, 275, 526, 807, 1162, 748, 683, 984, 534, 850, 1063, 952, 492, 853, 1069, 787, 429, 731, 631, 603, 817, 902, 630, 515, 846, 543, 563, 610, 620, 588, 711, 386, 140, 307, 570, 33, 149, 224, 41, -100, 73, 692, 34, -177, -327, 8, -4, 230, -200, -753, -222, -34, -130, -382, -503, -848, -529, -301, -341, -748, -728, -1032, -704, -383, -227, -839, -1226, -573, -449, -899, -891, -779, -360, -496, -505, -958, -1166, -480, -390, -652, -659, -1062, -697, -624, -415, -642, -871, -419, -16, -416, -573, -660, -912, -648, -205, -222, -986, -809, -152, -365, -164, -159, -524, -461, 36, 353, -21, -512, 33, -252, 31, 568, -146, -117, -203, 267, 622, 643, 524, 285, 31, 543, 826, 397, 646, 685, 524, 492, 875, 681, 446, 945, 796, 779, 339, 749, 720, 924, 966, 549, 343, 768, 812, 824, 648, 735, 856, 921, 1173, 635, 48, 157, 1005, 706, 880, 216, -93, 472, 918, 829, 73, -88, 545, 496, 451]
5146D51M0o66K91K9M77m79n31K06J90L9K39o49j26J77L65m76qK21k47m8L20k80
5168d65k15j51L43nK88k90l1k31L4J46j30L47n84R6K14P3k33n01O02L26l21Kj17
5191h03o5N76K72n47o98K95M28o7n2J25Pm4P16m07l75m37M81P01r7k48n31L78
5213c92J87M88n58K6J67j10M27J21k41l54O32n1k43L6M45k84r4K20j48K67M0L0
5235F11K4qJ66m27M84K20l86k39J0L02j12q3M04m82p7O38j71k51r7K00l72L73
5257G27K15k66k83K99J21l25J48j39m88L65M21K2m32n13M96J84k34J94o35l0J34
5278a9M72l57k16l29M43j8L50m67o99P32J48j69k08k66K35L53Q0o98o7L45Q3k46
5300e18n8k70j0n1N58L6n60J51J29j18J10K8o04M25KM65m10k41J39L42q1J9j74
$$ y = [451, 491, -175, 116, 145, 622, 143, -388, -182, 8, 47, 286, -363, -489, -312, 53, -423, -431, -210, -457, -505, -185, -465, -680, -831, -488, -493, -205, -495, -526, -757, -723, -577, -707, -360, -944, -848, -634, -561, -794, -1295, -693, -367, -688, -686, -803, -868, -292, -20, -567, -1265, -970, -542, -609, -661, -536, -529, -573, 143, -264, -639, -1076, -595, 106, 9, -239, -770, -392, -205, 283, -275, -249, -82, -192, 235, 356, 115, -239, 393, 342, 99, 135, 580, 296, 202, 422, 274, 541, 581, 611, 635, 627, 793, 366, 850, 1070, 684, 445, 455, 757, 645, 562, 966, 484, 407, 1045, 874, 623, 526, 726, 354, 727, 942, 676, 393, 692, 813, 488, 636, 497, 9, 374, 795, 817, 385, -128, 368, 552, 318, 512, -123, -153, -19, 453, 96, -120, -449, -6, -24, 326, -141, -840, -108, 40, -129, -337, -603, -368, -15, 65, -633, -700, -355, -272, -518, -576, -846, -856, -907, -349, -313, -873, -722, -593, -711, -601, -573, -1177, -752, -750, -285, -695, -936, -797, -455, -536, -517, -691]
5323f91J32j32P8L75n9k49k64J65Q49j53n85J18l6L07K10K8k88m02O50J71J75
5344C99n89L4o8J88M86m71m9o4N03j94O7m03K20L65J88k32l88K72Q11m09o5k00
5366D01k25L46O12k47l50l30L74J38N16p76j83J78J30R8k9n6J47J6O3n4l11l73
5388H5L30K45k09P7M2L5l14K68n0j08j80j5k37M71o4k25l43J87J99k02j1r2r2
5411b03J55K57m87J5L39l60o1o2J35j77N9J52j88m09J89N24n22K75k26l60L35
5432f20L77R1n52r0L42l62M86j31o55K3N10L43o16L21N3p27R08j10k2l28J33P81
5454A55o50J74l7k03J38J93k18k09M57m6Q6k48K00l92M13J73M9k02J38o8j83K96
5476A6K07j27J0k8M7K99k0k84K41j77R2J99n26K01O18j42k33q3k43M72J17J29
$$ y = [-691, -559, -691, -613, -238, -297, -546, -810, -645, 204, 51, -534, -416, -452, -145, 65, 93, -195, -597, 53, 224, 399, -190, -156, -224, -36, 450, -21, -70, -134, 369, 175, 242, -161, 59, 424, 612, 380, -8, 264, 1075, 666, 601, 401, 176, 522, 1134, 887, 537, 207, 581, 719, 1235, 459, 276, 454, 584, 682, 653, 597, 744, 760, 823, 769, 458, 85, 415, 660, 451, 528, 570, 605, 291, 559, 509, 401, 221, 206, -31, 440, 376, 151, -192, -5, 194, -8, -19, -111, -203, -48, 209, -278, -263, 76, -284, -345, -407, -272, -449, -390, -238, -426, -835, -646, -122, -644, -369, -595, -955, -620, -243, -152, -704, -794, -452, -814, -328, -459, -1114, -1091, -581, -238, -854, -533, -480, -1207, -299, -409, -431, -759, -626, 155, -495, -321, -358, -561, -423, -230, -448, -657, -200, -246, -160, -408, -208, -600, -187, -14, 35, -167, -29, -97, -280, 16, 223, 96, 106, 78, 125, 424, 404, 120, 361, 184, 276, 475, -51, 150, 768, 626, 393, 310, 67, 539, 656, 785]
5498G85l05M38m91K29j78M44p09L37N4j30%L39j92J39L8l15K3j29K84l5j00ql10
5521B08N3J96J15J20p97N21p4r9j34Q6j34j22M25k52j03J84Q1l03K12k54k30j9
5543c20K26R7n13K46J53l24J28M2j08k68L25n1k61J43M3k56L27J61m32J42K81
5564b19l85k00J27L77j59k81K02j33K20k2j70Q3o0L62l67j16N04k7l09Q1j5J22
5586c85k44L65m7k55L30K21l56J04J19k79J27L90l0k2j20L34l15K17m3m58N43
5607A96K08o3L7j84K02k3R0k6j30M3J27K45k27n7K44l6m55L80K01l49R6K63m70
5630C12J00N28l61m3J00k86L4M61j82k55K77J44l26Q4l49L31l3k15J45j81r0L18
5652E13j34j82L80k59k43JK78l86K28j66m7j39J27J82j79J09p1l63j21L17j11
$$ y = [785, 480, 918, 427, 656, 478, 922, 213, 550, 604, 474, 474, 813, 621, 760, 798, 483, 506, 377, 661, 626, 526, 518, 208, 261, 457, 572, 692, -105, 416, 342, 243, 109, 195, 61, -61, 364, 112, 9, 193, 274, -29, 183, -71, -301, -320, -94, 3, -510, -264, -111, -435, -307, -265, -373, -641, -316, -367, -628, -485, -442, -698, -371, -210, -642, -500, -219, -604, -804, -677, -300, -459, -740, -538, -671, -451, -473, -643, -560, -620, -258, -625, -741, -237, -264, -573, -492, -507, -385, -629, -264, -311, -566, -236, -15, -371, -267, -148, -427, -300, 90, 60, 38, -82, 252, -63, 154, 111, -347, 196, 404, 341, 378, 194, 396, 373, 463, 437, 307, 350, 477, 722, 495, 438, 682, 646, 191, 571, 772, 423, 519, 782, 312, 412, 940, 579, 536, 636, 350, 384, 845, 663, 408, 685, 829, 503, 587, 238, 569, 536, 321, 466, 285, 195, 513, 379, 197, 577, 318, 75, 76, 354, -32, 196, 30, -17, -156, -29, 153, -26, 83, 12, -351, -472, -155, -266]
5673b66p8K23k82N0Q0qJ07m13jM31j82p7k14R1Q8j38p2J0L3O6o1j19M19k04j08
5698f25o0M63l91R5kj34K17k08M7O0j23LJ81j57N51k69k46L60J68l08L49n7j63
5721b49R6j83K20j94O26m96J39K19k76P4J73L61k97n3K20n8p5M4M44o13K10J08
5743D40j18k4J26j37L6J1M05m72r1M21j66p1K5J67l93L35r6n8k54K62M33m58K92
5766F15j95R0k5k72J1o0J07J98j73K32k20J06m1J19j77k56L57j35j45J63R3l6
5788C56m91N11r1k49J0K03m57J9J21o8j45J82j28N0P3m6k54L9M13l60j16P8J77
5811a73J9j65k9K22j84r3m1j89M98k15k1Q1p1o0j50J21j8L81j63j65q1M26k9n72
5835f71j6L30j31k07N7K06k6j20K94O0m39L75R2j33k8o9%O4R0m6k68M94j09q8
$$ y = [-266, -344, -121, -403, -353, -273, -281, -174, -587, -588, -157, -339, -416, -630, -539, -451, -589, -661, -651, -618, -552, -613, -732, -313, -517, -625, -685, -222, -613, -518, -520, -654, -437, -645, -598, -538, -661, -658, -477, -634, -83, -352, -598, -238, -70, -378, -29, -86, -249, -153, -336, -116, -310, 316, -180, -41, 178, -98, -24, 149, 510, 213, 160, 380, 322, 247, 291, 735, 122, 332, 440, 322, 298, 424, 287, 323, 334, 739, 267, 176, 597, 431, 360, 385, 552, 159, 494, 398, 340, 86, 348, 781, 323, 615, 420, 510, 485, 213, 224, 164, 271, 469, 296, 528, 308, 414, 373, 492, 315, 59, 416, 281, 136, 299, 392, 356, -135, 376, 285, 36, 46, 249, -208, -189, -68, -136, -281, -99, -227, -177, -104, -150, -404, -365, 48, -312, -428, -350, -173, -154, -319, -348, -126, -310, -403, -444, -633, -135, -350, -371, -290, -361, -421, -571, -450, -468, -87, -250, -415, -496, -70, -99, -671, -687, -357, -488, -695, -638, -432, -458, -578, -284, -224, -663, -288, -196, -329, -357, -426, -426, -362, -272, -318, -586, -92, -201, -289]
5859b89L66R1k35O4O1K52l70J91K76l32L65j98J54n1M8m1k03o6N17l36L69P8k0
5882F91j16m39M67j90J36J10l96j13L36K48l92R6J12k77J50K43k44jJ09l64K72
5903D38k27O16j97l25p2q7K46k73L27n22L79O0k24J83k65j16q6L15k9k0J15j61
5925G5l27J90L20N1n18m7J2J58P8k58K58n69J87j66K14L1m59J78R3J16j31k83
5947g97K94oP0j58J92k07R6N05o37K74k4J29Ll10J21q7M03l20M7P7P2K9j43j62
5971e39O90m68j83K50K26l3j36l8P6J08J96m14K6J77j58K63o7J66k37j69L03J88
5993B27m3o8J35j17M59Q2l40j18J93l2p7R6O3m08R5N07l10rQ5J28l91K73J44l89
6017A85J57K25j49j07M70o7k79k00O4r6J95p3Q3l19K48KL00l22R2j75m7K45P6
$$ y = [-289, 77, 168, -67, -3, 58, 310, -60, 131, 407, 75, 440, 242, 396, 345, 393, 352, 149, 83, 600, 264, 633, 711, 691, 575, 136, 603, 413, 549, 659, 263, 150, 486, 734, 342, 438, 550, 273, 423, 666, 422, 421, 530, 166, 438, 211, 827, 630, 305, 233, 146, 392, 119, 446, -76, 303, 363, 139, 322, 57, -59, -145, 170, 141, 121, 236, 75, -252, -62, 258, 309, -209, -256, -244, -86, -8, -266, -8, -577, -390, -556, -342, -311, -770, -592, -499, -383, -514, -797, -503, -509, -439, -597, -405, -612, -516, -11, -648, -374, -398, -269, -266, -576, -455, -542, -139, -459, -412, -335, -263, -234, -377, -539, 151, -317, -500, -250, -24, -57, -193, -231, -155, -47, 149, -265, -239, -62, -220, 43, -24, 142, -95, -264, 39, 227, 184, 116, 251, 134, 593, 675, 335, 217, 410, 378, 301, 397, 460, 52, 147, 654, 344, 335, 420, 548, 157, 430, 574, 185, 342, 567, 418, 311, 781, 714, 435, 235, 299, 203, 398, 325, 408, 89, 337, 339, 639, 317, 409, 234, 187, 432, 508]
6040E08l56k67K42J09k67M22j79l75M9J90j04J9J72m86Q1O8M24m07o3j28k5M22
6062D9j6k07j42l1K51j75j48J54j48j32L59M9m33J3L12m3J88k84QP9q4J13l07
6085e75P0R8r0K5M61o33L07J79N2l37j2o7J40J04L33m60l78M45L43k13p6j02k35
6108f21M55K52Jm40K5K41j97K02J91m50LL49K12k12OJ01k18K24K76J64n59J27
6130A32l5J48K18r2j80J42J32J6J07j24O0l47Q5N7J00J74R4k42J6k44M78m83J63
6153C75j46K4K06J67K35m31j67R8j20K34K10m54j75P3K50Q9N9k36l41J42L0K4
6175A46k47l9m9J00J76J66l00k16K80J20k52p4K84m00J72nR9k59R8k5j08L1J72
6198a30k95j37Lm3K47Q0r5K8j20J78m9O3K14l43j11j20K83j87q2J5K4R4J88J42
$$ y = [508, 152, -115, 127, 236, -31, 391, 212, -163, -114, 76, -28, -9, 163, -323, -242, -174, 250, -157, -220, -348, -373, 49, 33, -174, -316, -347, -96, -271, -419, -265, -413, -545, -186, -137, -570, -557, -245, -288, -100, -384, -376, -297, -381, -268, -575, -505, -407, -497, -472, -11, -644, -337, -158, -106, -443, -455, -522, -382, -278, 55, -405, -783, -338, 5, -208, -284, -386, -621, -166, 86, 87, -353, -328, -87, -284, -82, 109, -341, -338, 11, 223, 11, 17, 118, -100, 124, 400, 564, 5, 132, 97, 245, 463, 371, 191, 333, 465, 481, 588, 464, 524, 177, 262, 319, 419, 593, 687, 445, 461, 217, 695, 212, 375, 229, 253, 459, 626, 861, 430, 263, 361, 241, 475, 685, 231, 56, 129, 379, 468, 527, 291, -50, 92, 122, 146, -101, -140, -189, -89, 87, 253, -47, -263, 17, 137, -115, -189, 95, -305, -133, -138, -39, -298, -200, -225, -333, -302, -130, -425, -562, -559, -602, -355, -275, -370, -342, -462, -284, -333, -270, -56, -399, -510, -630, -347, -534, -616, -601, -577, -483, -295, -153]
6222a53r8r4n2k70O19n7k51l17K5N91K4j4o5q4q1O74l70m11K89r9J55J58n8k53
6246a92o8J95M8q7K56k77MJ41L47j96kj17L21p4J09K4l39N28l30l7k3L00M1p6
6270D96k10N8N9k26N63M6p07K52P8K72m3j51k01j04L49m1k3l7j47k69J43M64m05
6293B16l25k33O96q9J68m31L09l26N45q4l98R6l32M46q1J38k47k03L67Jl42p5
6315a84P3k21N99l91r2L8J56N7n11J94J98j32L0K81n60k69J95M49k47j91j7l42
6337h87O76j59J84j88k34J22K01J91l83q8J13J90J18r2l69J55j19R0M35j03m93
6358f40N30o8q0L49j86j82q3K24L38o53K08K6L89J09L7n73q1O04j26l54J69J34
6380I1l41K44L10j36qj3K69k93J36J16k69K99M2o8l62K08l3K25r0J31l62K23K30
$$ y = [-153, -251, -345, -397, -667, -48, -105, -356, -673, -648, -57, -33, -47, -112, -196, -277, 397, 27, -384, -95, -194, -39, 119, 61, -192, -260, -65, -17, -104, 152, -125, -121, 20, 367, 171, 169, 52, 373, 299, 408, 432, 93, 621, 291, 254, 231, 531, 572, 496, 286, 344, 403, 177, 740, 786, 79, 331, 409, 681, 638, 487, 286, 182, 531, 490, 467, 430, 283, 14, 157, 621, 216, -109, -342, 354, 265, 433, 2, 311, -15, 530, 446, 48, 144, -188, 258, 177, 315, 68, -135, 232, 233, -109, -184, -111, -332, 267, -124, -216, -178, -22, 35, -476, -282, -84, -216, -186, 95, -465, -734, -539, -90, -337, -528, -545, -887, -211, -370, -186, -374, -608, -486, -285, -94, -477, -565, -452, -262, -144, -236, -605, -450, -569, -479, -44, -147, -640, -110, -178, -258, 91, -95, -277, -360, -136, 202, -451, -243, -217, 172, 281, 318, -255, -336, 268, 142, -212, -43, 91, -250, -6, 304, 168, 160, 147, 416, 123, 259, 375, 106, 405, 447, 379, 17, 225, 192, 417, 327, 458, 96, 319, 549]
6403E49k27j75K45l46L53oL47o38L7J99K64p2l41l8r2M21L7n3k00K64q5l31K07
6426C19j76k2Q8Nk03j02L03jm0k17P5J49k37o1R4k05J50q1J54j86M3j36O7J61
6450e9l1j30K69m69q0N15j8j35j42R8k81L69q9N0l41J68N6J39l3m05J11K18j71
6473c91P9k27J89J06k63J62k6k1p8o8J19J91J4q4L22n57M41J44k39p1M53m29N5
6496a79K45l14K21n9J2o7M0R2J52r4K56k32j23J01j33J81l0R2q2L13k06Ll23N47
6520D13j21o9k49O3J59J29r4J45l35L06J0l6J12N8m18Q5M74l66K51m01M01N3m17
6543A53M78k68k38K87j37m5j55N7K30k70J29k55J90m5J87k41J83q8m0k28M8K64
6565A96j72m6r7j66j44L48o3n4p9M79j67k90Q0J35k62L72k48J26L4k46J23j17
$$ y = [549, 322, 147, 392, 46, 399, 393, 740, 102, 139, 338, 602, 530, 189, 151, 59, 480, 517, 464, 264, 528, 443, 112, 319, 143, 121, 209, 214, 11, -91, 212, 211, 171, -46, 29, 178, -59, -120, -26, -231, -81, -162, -8, -194, -151, -287, -220, -59, -90, -220, 49, -420, -500, 15, -3, -138, -280, -182, -463, -94, -183, -133, -474, -306, -250, -111, -144, -549, -438, -220, -391, -312, -539, -350, -244, -507, -345, -371, -392, -470, -538, -419, -228, -214, -298, 24, -533, -92, 52, -187, -258, 195, -234, -179, 66, -248, -27, -86, -74, -141, -101, -9, 143, 49, 305, 73, -50, 51, -82, 99, 69, 161, 79, 392, 186, 189, -134, 413, 292, 223, -26, 37, 196, 325, 231, 376, 41, 347, 357, 321, 433, 491, 73, 158, 632, 266, 517, 116, 517, 570, 153, 631, 363, 125, 412, 275, 230, 75, 132, 362, 92, 221, -34, 156, 111, 298, 57, 240, 152, 112, -116, -68, 196, 24, -22, -119, -285, -429, -81, -144, -198, -277, 202, 35, -255, -175, -40, -302, 70, -178, -52, -18, -264, -141, -258]
6587b58R6k4M9M8k67k03K6J02L53k03K06l53K62K34k33k24Q3j10K11q9j41r0K90
6610b35J87n8l29Q3R0ok9J76P5k30L11k95L31l8j08m0j27L3M1J11J97j50N2o0
6634a8j02J96k28J79k4l0M26k61j51O6j51R6K54j88L07k51k06N52l75L3J48J1
6656B83Lj44N95o28k42N04k48L28k42K32l20L67j99j12K5Q7p0P0Q0q8k91L04J94
6679D88k39N9p8j78lJ48J05j71k06J89koL5q0n9k88L16J28r3J57j85o3jP2l71
6704c26J05M71m41K68o0k91L0p1K86j65j85K68j25l8k6l3J71k6p1Q4M5j54m6n82
6728i12L53J95K9K85j64r3k77J80Q5N6J16k67P1q8J90j33J67J29m9l05L33kj80
6751b81k6M19j12l18J97J78k80K1J42R7j55L7l9l53O61r6K63k27K38k09J53j15
$$ y = [-258, -162, -186, -137, -89, -356, -559, -533, -431, -78, -281, -75, -428, -166, 68, -165, -389, -306, -416, -205, -294, -435, -525, -235, -48, -106, -435, -352, -262, -268, -297, -121, -46, -276, 35, -260, 71, 33, -75, -115, -242, -209, -168, -57, 140, -10, 42, -18, -120, 76, -152, 27, 3, -27, 399, 138, -13, 53, -98, -2, 252, 64, 371, 120, -86, 466, 91, 124, 272, 283, 286, 142, 737, 109, -133, 371, 123, 451, 209, 441, 121, 488, 289, 177, 202, 289, 219, 289, 369, 281, -10, 294, 488, 249, 308, 230, 52, 49, 197, 302, 131, -75, 114, 112, 106, 141, 61, 2, -286, 30, 158, 65, 222, 37, -26, -27, 45, -326, -221, 250, -191, 77, 17, -274, -244, -315, -29, -194, -379, -111, -236, -274, -300, -333, -162, -188, -259, -175, -130, -284, -330, -912, -559, -364, -335, -50, -214, -307, -584, -404, -319, -263, -147, -414, -343, -431, -241, -374, -207, -78, -127, -432, -99, -101, -281, -307, 112, 0, -318, -121, 57, -223, -202, -60, 37, -118, -81, -120, -473, 188, 92, 355, 128, 366, 157, 310, 195]
6773A95N4q8J86Q4l10K12o6L03p6k60K52j5o41Q60k92m62M81Q2l17J28j06Jk40
6796c5K11q4J91n0O4J14j36J63m38jM00j76K96k25j57L21m19K20J13q9q8j70P3
6819I8m0qJ71l33J7J92j85K81m74j60O10k26k53qK68k25l4J35m7K16k57n3n7k61
6843f33L68J35k27M40k42k11P2J25k30j6J16k1M7Q3R8l4j70K58j51k36J78J90
6865f1k46qM5p2O6L0j4m2N5N9L67k65K4j36L71k28qR2j8P0j60J96m99O02j10m9
6891F1K10l62L10J23j11k76K18j93L07q2j18O7p5N2R1j88L34L7k19k29K44p0J80
6914C11k30L01j80j17J37K92j75j10k19rM51l36J63l86N04m33K23K61k13Oj87
6935E4O9Q3j4j20J23l6jn3J53j54l41K47M9J3j30R6Pm3j72L12l48M44j64k56J89
$$ y = [195, 249, 161, 347, 431, 121, 333, 267, 570, 494, 234, 486, 471, -170, 690, 398, -64, 417, 499, 182, 310, 204, 205, -35, 176, 92, 283, 233, 297, 411, 275, 438, 0, -1, 399, 223, 519, 294, 137, 458, 39, 259, 372, 283, 195, 25, 98, 58, 50, 221, -112, -95, 97, -88, 193, -281, -441, 169, -57, -310, -318, -50, -275, -309, -174, -221, -5, -262, -315, -372, -633, -265, -130, -357, 83, -159, -370, -298, -173, -403, -419, -303, -324, -277, -194, -96, -130, -300, -42, -193, -429, -251, -61, -307, -315, -270, -342, -276, -246, -260, -302, -247, -188, 179, -86, -62, -198, 173, -55, -63, 29, 11, 81, -79, 117, -382, 220, 110, 61, 271, -91, 219, 342, 231, -45, 173, -20, 287, 205, 87, 154, 79, 131, 222, 34, 368, 405, 186, -43, 201, 131, 311, 81, 382, 202, 85, 222, 514, 339, 229, 10, 1, 452, 116, 279, -107, 397, -36, 187, 448, 235, 241, 54, 123, 206, 192, 72, 195, 159, 158, 105, 258, 104, -237, 10, 59, 72, -58, 38, 45, 2, -170, 142, -206, 238, 74, -182, 7]
6960Go3j00L4K96k31m7m55J87L64l10J92Q7n6k65J88J40K47p06M26m2j44PK8j47
6984c63Mp3J78j02J86N0p2J24k03k31L12Q1p4l17M46j70loK35j90J56L9J24j27
7008Dj20K54k19m0m5O3l08L82k65j8n6O12l61M08j58j13J92j4k41j03K90K5j03
7031F6j13K03K29l38K08j86J38j08L14n37K23J98j25K29J48k17q7M9J25n6k63
7052A00j06K32o3P7O6l90L51P8M9mj27j29O6k09J33J06P7l9J37j42K3k20j37m9
7076a20K43k40L56L0r5k07P4j0j24J19Q0j93m5O9L38m06lK66j82JJ31m87K65L20
7100A80k92k86L22j79j04m5l8K78r5QK7K0l3K2%j50M06k85k6O3j0j14K50J02m4
7125b3l29J15j14Q9J22l7j35J97j24M7K82p0l1qP4q9m7j37J09j45J71j18L77l24
$$ y = [7, -56, -156, -122, 174, -57, -104, -559, -372, -8, -318, -126, -39, -95, -360, -172, -32, 215, -491, -65, -107, -251, -244, -216, -363, -359, -432, -254, -356, -170, -120, -192, -68, -271, -502, -190, -109, -183, -500, -54, -224, -227, -233, 2, -188, -32, 7, 131, 4, -116, 138, -81, -121, -166, -103, -411, -29, -294, -312, -368, 244, -117, 291, 133, 20, 212, 198, -43, -146, 144, 169, 66, -47, 156, 385, 47, 255, 69, 207, 99, 413, -124, 99, 297, 172, 401, 549, 332, 245, 294, 419, 363, 100, -6, 226, 163, 240, 306, -84, 267, 345, 394, 390, 263, 134, 200, -9, 124, 230, 307, 268, 405, 263, 286, 66, -71, -120, 123, -117, 239, 269, 174, -33, 41, 31, -93, 26, 106, -87, -132, -63, 275, -131, -134, 132, -50, -49, 82, -405, -140, 180, -112, -398, -76, -255, -359, -404, -442, -164, -259, -251, -224, -204, -237, -215, -215, -365, 41, -244, -270, -207, -217, -331, -81, 21, -23, -352, -237, -351, -262, -140, -177, -312, -115, -239, -192, 90, 20, -11, -19, 55, -34, -81, -218, -109, -254, -83, -201, 176, -148]
7149a48L18j37J12R6l6K1k08P7M1k03N2K84j35J04J85k52j40qJ27J82n7J14j51
7172B38R4k3m9Q3q0M5r8j24L09k88r5J87L97l31k55K18Q2n39O11k72K24O4m62
7195f4J67Q4p7p5M7qm2K59j09K37m50j66J69o6K28k30j19J01J78q9k47J25M7O9
7219c1K10k07k44Q9P7j2k04R7LN3o6m9J76k62K02J10j08j04o7J35J85j93j66J72
7243b04R9m6j56J67o1J13O3N1k2j16q9J13k77j0O9J94j59K25j62NL00q7o2o2j6
7268a30j05l9K29n1P7l99M19Q6k29L97j15M9j42J66J85l45J5J31j99L31K41o89
7290a17J83k1K58j96K00R5k07j46j0J64J23l02j33K15O7r2j44J58J38M5j21K75
7312D32k30m14O57r3j25k99L31j62j78P7K48k12J00K14j36k23J48N9l1O7r7p2
$$ y = [-148, 170, 33, 145, 241, 205, 226, 18, 95, 136, -67, -15, 269, 134, 238, 423, 171, 31, 23, 150, 332, 275, 389, 238, 332, 309, 260, 343, 263, 308, 210, 86, 395, 107, 12, 199, 596, 265, 10, 228, 310, -229, 382, 110, 334, 398, -64, 103, 187, 110, 35, 82, 74, 32, 291, 182, 419, -31, -197, -28, -94, 134, -96, -215, -114, 64, -25, -272, -147, -100, -31, 179, -28, -272, -183, -106, -118, -322, -225, -222, -169, -235, -284, -108, -370, -168, -58, -166, -270, -337, -202, -17, -210, -376, -204, -105, -151, -307, -140, -201, -88, -25, 26, 4, -112, -201, -88, -365, -375, -306, -112, -271, -46, -208, -203, 97, 10, -52, -114, -130, -235, -274, -45, -96, -19, -418, 1, 87, -142, 255, 140, 189, 47, 213, 398, 53, 68, 199, 0, 331, 572, -117, 66, 45, 303, 107, 307, 402, 195, 49, 39, 203, 326, 24, -109, 106, 173, 81, -63, 95, 233, 278, 157, 432, 202, -212, 445, 352, 227, -72, 259, 97, -81, -4, 244, 32, 132, 346, 210, -13, 135, 194, 163, 230, 133, 61]
7334F1k44M70j51j37L12m08J16rJ45k01J21k3q0O0j60L69j28l66L21l15k9M02
7356A26m49M13j98j9J10K1j05l84J40J70q9J1K52j93q3J15o0J84l32J25j89L11
7378a23k85J24J07m9L2Q1j47O6j58p0J56j7J34k85R8M90k41LR7k93J80L4Q9k66
7402b43J1K08L3J02l07J33m1J85N5lJ36l79R0J51n7q2P9K01q3n8j1j01N6N85j8
7427F42m76K57j24k49J30J62J33k31P2Mj44Q0j9q9K09k60K05j15q6P8K05q0j15
7450A89m75L74M5J11P0j72Lk5p9j46o4L89l51K62j0J68k01N1j46J81N8k65m46
7473d79M90L12l50P8j52j23Rp2O1J4L7K15k93j11M27o9j59o4K50m09J15J25Q5
7496f3j24Q8J57l37J59J06j48j21K62k12P4j91J21k15K66L92k64J4j45n8q3M47
$$ y = [61, -183, 287, 136, -1, 311, -97, 19, 10, 155, -46, 75, 52, -28, 32, -128, 241, 113, -253, 68, -247, -276, 126, -323, 90, -108, -127, -17, 4, -101, -485, -345, -175, -264, -253, -1, -194, -277, -162, -222, -38, -370, -245, -434, -123, -408, -284, -177, -226, -194, -113, -260, -194, -352, -422, -266, -283, -149, -434, -336, 154, -87, -84, 13, -280, -100, -66, 23, -243, -232, -24, 9, 111, -196, -63, -104, 81, 136, 133, 269, -110, -20, 131, 74, -8, 71, 272, 189, 131, 120, 19, 75, 660, 642, 166, 423, 299, 50, 180, 342, 475, 244, 316, 320, 176, 256, 237, 148, 357, 97, 302, 187, 101, 179, 384, 304, 189, -286, 88, 133, 244, 314, 142, 145, 120, 41, -105, -169, 220, -131, 131, 121, 289, 88, 139, -7, 174, 232, -33, -479, 11, 323, -27, 51, -101, -224, -215, -287, -226, -212, -175, 40, -253, -364, 63, -6, -165, -229, 21, -388, -273, -148, -63, -187, -99, 58, -279, -120, -14, -162, -283, -21, -233, -159, -350, -229, -444, -178, 214, -50, -36, -181, -239, -322, 125]
7518A25k87N0j02J92L1j79J71K6j59J36j35K23j37J36m53M43J07k77P2K65m31
7539a83J58J1J37j78r3K38j60J39J59j42n9j18L7P1L2M30k75j97K17p4Q0j05K61
7562C86L5k2p1k78J89p4O3K8P5j65k21L02k15Q2J24R9k53J96k95J96K37l97Q5
7585A06j2n3p7J25j46J23j16J09n2l4O7J9M7n1k4l6K05j29q3l4j36N4R8J15m96
7610d11K6L92j22N4Lj3Q6j54j36o7n6K68J87k31K44l60nJ40L4l8q1J26o0l8J28
7635h4J56l77j09K97K06j71m9J86m18J36K43j82K7j50O2j1J56K76o15L55K09n99
7657d56O34k66J91k64J20l7R1J8O7J5j17L2K34k04j82J86L17j56k01K58k69J79
7679A90r1l32K42K52j80R8O3k63K19j03J65k45J95l16K68M7L49k02l24K31J00
$$ y = [125, -162, -112, -214, -22, 9, -170, 1, 27, -132, 4, -131, 92, -45, 91, -362, 81, 188, -89, -17, 248, -183, -25, -14, 123, -55, -148, 90, -70, 69, 228, 86, 27, -91, -54, 17, 49, 479, 204, 7, 224, 150, 230, 125, 386, 421, 399, 328, 50, 239, 165, 228, 256, 331, 166, -55, 247, 32, 114, 238, 337, 84, 280, -15, 181, 418, 21, 106, 94, 41, -36, 89, -57, 66, -50, 59, 7, -27, 40, 59, 106, 55, 31, -5, 200, 71, -12, -46, -182, -128, -30, 85, -411, -385, 7, -115, -61, -58, -71, 15, -139, -275, -342, -398, -130, 57, -174, 70, -290, -295, -155, -121, -159, -240, -114, -174, -212, -84, 72, -305, -414, -117, 89, -82, -131, 55, -363, -227, 16, -166, -139, -289, -227, -238, -82, 194, -421, -66, 143, -456, 178, -88, 103, -161, -41, -78, 13, 31, 98, 113, -4, 28, 262, 58, -124, 62, 379, 223, 22, 280, 11, 190, 99, -233, 9, 261, 81, 179, 242, -21, 198, 95, 260, 15, 210, -106, 162, 209, 558, 356, 32, 263, 363]
7700C63j0p9j32K16j51r2k99J60L15mk19J50j74j35o1K65o5j37J86m8K03j72L3
7723A13j56j67M65j29j75j30J27n4n1J35j18J35J9j80m4J50k66J60L23R6l11k83
7745c41L23l12J93j30J8N4j3J1j31p6M97l12J60L60m85J0nj52K30j29J12Ml2J24
7769b2o1j44m4K61j79K16j08O7p2k7j35j11M81J72l1l72J01Jj78J46p3L34j86
7792C6l37L01j38J48J69l26N9M05m33J45K06j8k01k44R2L38j78Rp2M3J15L22k60
7815A81k36P6K31p4J46J1m55P0M65j82l32J7K20n0k31O78k53j34J2j17K87k69
7837F1L85l58n2J84L5k14K72j13r4K23o8l34J92r3J51j08q3J11l88L41l73O20
7859B97k35j8k83J07L38k05k51J35j71J34N6j44J03J0N1K03m69Q9J97L1k1J83
$$ y = [363, 353, 274, 142, 358, 207, 115, -184, -24, 291, 287, 68, 218, 44, -91, -152, 113, 48, -89, 97, 49, 252, 80, 113, -43, -210, 255, 126, -49, -179, -52, -106, -157, -22, -140, -5, 14, -166, -210, -60, -326, -166, 157, 253, -58, -341, -18, -330, -137, -267, -249, -195, -208, -197, -328, -404, 93, -219, -59, 301, -184, -174, -179, -331, -101, -230, -118, -114, -146, -22, -83, -227, -271, -10, -189, 27, -81, -14, -86, -113, -248, -359, 122, 294, 263, -109, -8, -7, -185, -39, -112, 222, 36, -301, 0, -138, 10, 179, -147, -88, 317, -116, 29, 235, 217, 16, -228, -136, 202, 24, 33, -39, 4, 119, 441, 181, -55, 21, 252, 178, 324, 335, -120, -50, 415, 233, -99, -82, 138, 88, -143, 535, 282, 148, 160, 43, 330, 61, 446, 88, 36, 220, 255, 41, 313, 200, 106, 329, 261, -73, 119, 26, 177, 69, -14, 97, -291, 50, -323, 297, 62, 44, -239, -132, 206, 1, -250, -115, -286, -152, -96, -240, -137, -127, -76, 127, -342, -253, -56, -25, -46, 137]
7881A37l24Q3j38J98r4J80j94P0L7q1J82l51R4J74j49M7k18K00J58k90K64r4j32
7904b41k0N5MJ36OJ1P2l3J24p6J0K1k95L36l4j05p0J74l17M5K02K69k03j99PL7
7930h4J94m3k2J90k62o2J02J74J4m00J95Q3k0K89j33m2j18n4M15l23j5K98j62
7953B14n6L1n2L5j30J86K2j21K31k2l39N99l28j40Q8k73j50K10mL6J14K3r1J04
7977A87q8pK90n26K23l24N26r0p2j1j95K26k42m0K80j2q6j37pM3k4m5j19L87l84
8002b47R8J63j56q9p9L29m38K08J25q0L0n4k0no0J2K30j28j4P1K7P3l17L50l47
8027c18R4K6r7L9L40m66L04k55J93J36l73K62n3q2j80N13j95L1M6J70l89J69J56
8050G1N4k21P2J78J55j32j14N4m45N76p4n6j82L49j68l16M94o3k73K39J2j12k32
$$ y = [137, -187, -104, -242, -44, -138, 42, -152, -82, -45, -126, 56, -295, -201, -27, -176, -129, -347, -147, 11, -279, -15, -109, -241, -261, -206, -202, -66, -60, -49, 23, -10, 114, 38, 48, 69, -226, 110, 76, -29, -99, 75, -242, -197, 5, 274, 71, -128, -121, -84, 110, 67, 45, 235, -27, -89, 13, 187, 201, -199, -4, 79, 59, 348, 215, 173, 55, 1, 416, 93, 78, 376, 214, 158, 189, 137, 172, 42, 228, 250, 129, 360, 338, -1, 598, 270, 130, 218, -55, -205, 5, 1, 37, 151, 174, 83, 187, 99, 92, 382, -144, 79, -245, 281, 191, 119, 108, -87, 139, -103, -143, 137, 125, 39, -98, -105, -62, -86, -131, -250, 137, -247, -149, 14, -142, -231, -310, 19, -419, -211, -86, -166, -136, -190, -210, -215, -275, -263, -33, -161, -175, -104, -77, -4, -321, 29, -318, -224, -198, -295, -256, 84, -382, -78, -333, -140, -4, -377, -115, -168, -250, -430, 83, -112, -81, -35, 135, -254, -85, 71, 125, -96, -24, 154, 309, 177, 63, 117, -328, 248, 174, 118, -64, 285, 117, -199, 295, 232, -41, 198, 210, 98, -134]
8073a34L46o2l9P9M3m8K28K60q45J85L09j82q4m3J59j06J82Mj13R8J08l62k59
8096b76K87J25K58m99J44oP2R9r0K5L5j40o4P3Nk76L41L7l03J19ll16K03L06l05
8121a49N9J5K03n58N57k63r2L0P3K29o93L09j22N40k81J21p0k67M5O4j11J14L44
8144I7l19j86K45K18k79J76k81K5K70K45k34Mj56N5kj06J06Q8o0kn3l3P2K28K58
8169C76n57M1J49m7j84J10n4P9R8J74j83J25r0k74M92j95P5k16O1o5J10q3
$$ y = [-134, 212, 150, 111, 190, 233, 185, 413, 673, -172, 13, 322, 140, 56, 13, 172, 66, 248, 252, 139, 237, 345, -17, -276, 11, 136, 394, -105, 39, 33, 105, 204, 114, 139, 174, 34, -30, 43, 48, -228, 113, 150, -153, -34, -37, -353, -150, 156, -149, -90, -75, 128, -430, 127, -136, -228, -198, -125, 104, -589, -280, -402, 138, -143, -22, -92, -359, -314, -250, -361, -247, 97, -222, -408, -163, 55, -224, -48, -329, -304, -34, 211, -23, -19, -175, -120, -122, -228, -122, -34, -94, -96, -149, -182, -110, 118, 376, -181, -140, 9, -38, -222, -112, -166, -87, 11, 185, 2, 127, 37, -237, 255, 60, 135, -81, -20, -85, 25, -58]
8191e8
$$ Imaginary data points
##PAGE= N=2
##DATA TABLE= (X++(I..I)), XYDATA
0@%%%qJ6j6K4m0M8n6Q0j04J23j49J86k24K69l25L84m53N32o19P20q35R58j098
26e87J256j427J618j833K067k321K604k918L257l629M044m495M985n531O129o781
42c562P507q317R211j0210J1345j2627J4091j5793J7791k0174K3082k6720L1422
55A7046l7776M6886o1136Q6785j47226N36614M78798j031170l37715M66258O14433
66F31797j54051m23446j21492L21325J73925j52777k84506m1737J19870J51849
76B20757O0624k5564j78167k03161m7952K12866K33844n0783l34701j42799K75618
87B0582K58054k48534m06630Q7474N02052J78948m09800m41426J21585M86281
97A48586J69389l50350l15498J60543L29651P0k52728r9253J28917R9752k9365
$$ y = [0, 0, 0, 0, -8, 8, -8, 16, -24, 24, -32, 48, -56, 67, -82, 104, -120, 149, -176, 208, -245, 287, -332, 388, -447, 511, -587, 669, -758, 860, -973, 1094, -1227, 1377, -1541, 1716, -1913, 2131, -2364, 2621, -2910, 3219, -3562, 3945, -4372, 4839, -5371, 5974, -6653, 7438, -8355, 9436, -10738, 12344, -14376, 17046, -20730, 26156, -34980, 51805, -95421, 441193, 919991, -111179, -448894, 17364, 631797, 477746, 54300, -67192, 254133, 428058, 275281, -9225, -50962, 68908, 220757, 281381, 255817, 77650, -125511, -173463, 39403, 273247, 222464, -112237, -255036, 20582, 278636, 30102, -376528, -289054, 212998, 391946, -17854, -459280, -337695, 148586, 317975, -32375, -347873, -187330, 142321, 142391, -110337, -209590, -80673, 19079, -10286]
108a0286j0648M2952p2633j72728L5484K96695J12355l19788l06132J75800M04262
119A75333O4157l40614k90993J08277L49787J34970k47750k65738R0793K78793
129E7015L7261k30928j25869J57463J91459l0579j46944l1635N5748l98J4172
140e3235J22194M9824j57752j18627J46731J83304q9373k25546J1657K82878J74495
151C26550k12855l48454k421L64482K32437j95069l10445j0874K41111J29563
161B14025j39011j91771J7878J81882R2602r2698j44252o0860M9897J16986P7284
172A21962m8637j15398n4999L5775P6093N0291m0220r1710J0601J25375L1583
183A00716j41981r3207J16153J53464k8674j43948l1109J13750O3126q5273p5452
$$ y = [-10286, -20934, 22018, -50615, -223343, -187859, 108836, 221191, -98597, -404729, -228929, 175333, 239490, -101124, -392117, -283840, 65947, 200917, -46833, -312571, -221778, 57015, 94276, -136652, -262521, -105058, 86401, 55822, -91122, -122757, -67009, -67407, -53235, 68959, 118783, -38969, -157596, -10865, 172439, 83066, -142480, -130823, 152055, 326550, 113695, -234759, -237180, 127302, 359739, 164670, -145775, -156649, 84462, 214025, 75014, -116757, -98879, 83003, 175605, 82907, -61345, -122205, -72308, 44678, 121962, 73325, -42073, -97072, -61297, 14796, 65087, 24867, -66843, -56242, 69133, 100716, -41265, -134472, -18319, 135145, 106471, -37477, -68586, 45164, 108290, 23017, -52435]
194e2435O3347R4952n630o1689l7728j2334K2926O0814K7120m1676m3048o558
206H061l14J2602M0160Q745n4814m3034L6260O3136p222q5920n4555O5732J02929
219I1766q822j01602n2505L6052N0360J9297r293k6788j9407M276R409O154M637
232C534j5258j7180L2936M3329m0390p7842J0714P6914J9715m6071k3033K2979
244i653J3533l0964m0056J4943O5564L3480m2822o9070l1728L3223P5371L0570
256D2391o8041o9817L9379P3172j9337p0649q828M8595M0123N353l2137m9450
268f9246j2886M2335M7380K917l4339k3800K1325K7576k6183l8073L2067O7094
280C6167j300o1147l1154K3738M4110K1727k5975m5092O325N5695K2022l9252
$$ y = [-52435, 10912, 105864, 100234, 38545, 817, -11517, 11409, 72223, 99343, 57667, 14619, 8061, 7747, 20349, 60509, 69254, 14440, -28594, 7666, 70802, 63580, -22340, -76895, -11163, 91766, 82944, -18658, -71163, -35111, 15249, 34546, 25253, -1535, -20942, -16666, -7257, -1103, 3534, -11724, -28904, 4032, 47361, 6971, -70871, -60157, 16757, 36472, -9599, -32632, -9653, 3880, -27084, -67140, -52197, 13367, 46847, 4025, -65045, -96773, -63550, 11821, 42391, -25650, -95467, -56088, 17084, -2253, -72902, -81730, -33135, 6988, 12341, -19796, -69246, -82132, -39797, 7583, 10500, -23839, -47639, -26314, 1262, -24921, -62994, -30927, 36167, 34867, -26280, -57434, -33696, 10414, 32141, 6166, -38926, -32601, 23094, 45116, 5864]
292E864m3037L79M3845M6563j2521o4871k1652N5784M4796k5322m6306r268K6714
305I68L3371R916j8499k3351j3575k490K3751L6551j212l3605k165J8684j8943
318I401k5991K6934M2480j217k3054q133l583r625n468J0937K9290K6935q233
331F0673l7551k7171m952J1648L4600L3492n225k6385j7160k6139k7095K8798
343b467P2865K4705m9513n2487q562K0438J3698q890l354L0936K8737l0791o3135
356b7820k8513K1066M6920M5495L95n7507n0861M194K9609J3339j609j732N659
369a365Q284k0191m5108j2435L8051L5843K734j2962k4717k7743M861K7053N30
382b7165j6108J4874L0041r074m6667k9876K5772N4576J3538m2073k6338K5854
$$ y = [5864, -37173, -36794, 7051, 53614, 41093, -23778, -45430, 10354, 55150, 29828, -16478, -25746, 968, 34339, 44255, 25756, 2405, -11170, -13660, 10091, 46642, 45430, 11825, 9660, 28344, 9401, -16590, 10344, 52824, 51607, 28553, 20420, 16837, 7212, 1744, 12681, 41971, 68906, 60673, 23122, -4049, -9001, 2647, 37247, 70739, 65514, 39129, 21969, -4170, -31265, -2467, 70398, 95103, 45590, -6897, -15459, 4979, 18677, 9787, 6433, 37369, 66106, 35315, -27820, -56333, -35267, 11653, 57148, 57543, 36, -50825, -46631, -17022, -3683, -5292, -7024, -1365, 6919, -13272, -58380, -70815, -32764, 3079, 5813, -7149, -31866, -59609, -54748, -27695, -27165, -43273, -28399, 1642, -7432, -54099, -83975, -58203, -3627, 9911, -32162, -58500, -32646]
394c2646K0062j7263j1951R569N532N859J5976K17k1338q683R508R165P186O534
408b273P10J067J067j0355q165J2947J3978l052L090J2362m744j3315j141k218
422d2k699K1133K8215o878l0273j6732M609J6681J3581m806q123J2134O679k7337
436F142k4846J3113K3834Q202J752n957j9615j2820K901N877P012J2290N393n083
450A8195j1110k0400j3728K3252L6212j075k3528j668N349j1272l643J4782J0552
463B1918K842N964j201j3504j2381j218J3886K4081N975k0313j0525Q822o527
476A7819j4704J2860K5224k724j8362q942m179r79N096M16l318P219L856j5586
490C696j6690o78M551Q057J1573n793k0157m705R629k222o560P075O616k943j862
$$ y = [-32646, -12584, -29847, -41798, -32229, -26697, -20838, -4862, -4645, -25983, -34666, -25158, -15993, -8807, -2273, -1563, -496, 571, -9784, -17949, -5002, 8976, 5924, 9014, 21376, 16632, 3317, 2176, -42, -2741, 18392, 46607, 39729, 9456, -7276, -2667, 14014, 27595, 22789, 14666, 26800, 33479, 6142, -18704, -5591, 18243, 26445, 28197, 22240, 2625, -10195, -7294, -1417, 5595, 17885, 23278, 18195, 7085, -13315, -27043, -3791, 32421, 31346, 7818, 6150, 11499, 227, -3416, 11366, 21918, 24760, 30724, 29523, 16019, 3638, 2420, 16306, 40387, 46362, 26049, 15524, 24346, 17819, 3115, 15975, 41199, 38475, 20113, 11171, 6992, 6013, 11109, 11525, 8207, 15426, 19282, 3696, -12994, -13672, -9121, -1064, 10509, 4716, -15441, -20146, -10517, -12739, -19299, -12224, -5608, -8551, -10413]
505a0413m634j0071J221J0801M473J033l34j2261q623J3546R466j6224o799J8669
519a0150O384j7854j2162M035O178M111J11o874m515j244l304J476P526n178j0620
534d2080R438J1935j3375j3810J2863J2860n295j923P473L0k977L548M650P196
548i467Q606k314l850J0847Q958p466j138J5700Q124m078J653L218k909K640P389
563C5913M12J93L524m062l351N309k763j2285M832J5229m944j5429j738l50p072
578A3418L372Q034n616r699N02M41n346m084k838L690J2440J565j5849r173N427
593c716K878L956J2278k310j6032K752J6248o216j7289O314K1298O974q774j4160
607D201r022O763J2922Q10k981O81o989q952M423M422j1722m523J4156Q953j1044
$$ y = [-10413, -15047, -25118, -23897, -13096, -8623, -7590, -7924, -20185, -28808, -15262, -5796, -22020, -28819, -10150, -3766, -21620, -33782, -29747, -23569, -19458, -19347, -26221, -30736, -31980, -35284, -33808, -26282, -31460, -42080, -32642, -20707, -34082, -47892, -35029, -22169, -27464, -29387, -21914, -21884, -24861, -21313, -16663, -9467, -861, -3175, -7025, 3822, 12780, 5314, 4176, 19876, 28000, 23922, 25575, 28793, 25884, 28524, 35913, 36325, 36518, 40042, 35980, 32629, 37938, 35175, 22890, 27722, 42951, 38007, 22578, 20840, 20490, 13418, 16790, 24824, 19208, 9509, 10011, 10452, 5106, 1022, -1816, 1874, 14314, 15879, 30, -9143, -3716, -838, 3118, 15396, 13086, -2946, -194, 16054, 9838, -7451, -1137, 20161, 27135, 18361, 4201, -4821, 1942, 14864, 15674, 12693, 13374, 6385, -2567, 1856, 6278, -5444, -9967, 4189, 13142, 2098]
622B098j8723j2334P105K3525O063k3554j4993J4511J0728r348p921m89K601J2797
636g934J0770j3008j9841M076J9780Q533o065j0663j629J2947R989r190j0946
649a3181K397M852O210J1417m527k5504m407K5742Q800k2243j4223J0638J3870
662a59M114j2589k2748p061J9622J7391m872j4648r713O19R991J310j1510j17
676c0370J8721Q043j1397r453n196l847J5662K8944N787k1966j7037K337J6308
689c464J8314R26j5459K916K5061L096k9638j6502K1852L2467J1018j6282k4612
702I693o570J1861J1231O225L643q428j1670Q516J0680k0053k0628J9265L2472
715D6237K733k5132k7095j0051K1367L3682J450l2188j7940J5183J8437m750k2319
$$ y = [2098, -16625, -28959, -21854, 1671, 7734, -15820, -30813, -16302, -5574, -14922, -22843, -23332, -20731, -7934, 2836, -10172, -30013, -25937, -6157, 2376, -3689, -14352, -15981, -3034, 6955, -2235, -13181, -10784, -5932, 278, 11695, 7168, -18336, -22743, 2999, 11799, -10444, -24667, -14029, -159, 3955, -8634, -31382, -38443, -18821, -1430, -6302, -20950, -30663, -30044, -20053, -18743, -30253, -30370, -11649, -3606, -15003, -24456, -29652, -33499, -17837, 11107, 16894, -5072, -22109, -19772, -3464, 14850, 15776, 317, 3233, 28294, 31390, 1752, -14750, 7102, 39569, 50587, 34305, 9693, 3123, 14984, 26215, 32440, 36083, 27655, 15985, 24501, 35181, 15128, -5500, 13765, 46237, 48970, 23838, -3257, -13308, 8059, 41741, 43191, 11003, -6937, 8246, 26683, 21933, -386]
728c86p958K5476K5110j5929l6024q038K0818K0710P505j3300k7530o475K3938
741G917J4976j3704j4994P16P305Q276j492k1232j5023J8577K7986m079l0733
754a5504k1352R232K8740J2647k1240k4559N715J7621R29j1136q569L582J7621
767f273R993k1448k5451R333K4187O444k912k109j4714j5111J2975K5169K583
780B666j7046q495R702J1952o823j9274J578K7237J4744j5734j9972p411O852
793b0024J9938J4718j2977k0378M064J3412k175o791J816K115L466J0462k864
806D782j9765j0016J4902K1070O909j4248k0969n28K1547J0399j2301j0137O692
819a663J3544M483j2276k1031M345L2838J4032k3630k1198N881J4203R079J986
$$ y = [-386, -8344, 17132, 42242, 26313, -9711, -17749, 3069, 23779, 31284, 17984, -9546, -16021, 7917, 22893, 9189, -5805, -5089, 2216, 10492, 9000, -12232, -27255, -8678, 19308, 15229, -15504, -36856, -27624, 1116, 13763, -7477, -32036, -26321, -8700, -7771, -18907, -27476, -23894, -6273, 3720, -17728, -43179, -33846, -9659, -3215, -6127, -8236, -22950, -38061, -25086, 83, 2666, -14380, -22875, -13173, -1221, -8044, -27318, -25740, 1497, 16241, 507, -19465, -26876, -20024, -86, 14632, 1655, -18723, -14659, -1247, -3422, -10213, -8397, -6282, -2816, 7646, 4782, -14983, -24999, -10097, 10973, 17882, 3634, -17335, -17863, 3684, 14083, 1782, -8355, -1663, 11881, 16364, 4088, -16943, -12598, 20240, 34272, 10642, -10556, -4675, 9528, 18607, 20593]
832B0593j0192j0580Q739J5573m608j6374k105J3277J1803p07j4194j0222P025
845H028J2685K930l950q071p742R014J8772q004k6989P61K8159Q783j8591j4826
859I59J008R597J0185j565j3343n185Q960M642n123o489l823L832J0327Q01j3635
874A148q997M027O323M339J267j0828j0015P530J1105q122j0763L274N053R91
888c668K901m790j5921k391J7385J0649q131j3380m591N059Q590j649r310J785
902a7462R618J180q140q274n795P090K1685O161k1568j6990P009J0192L680N471
916f143j021j0966k300R841L25j0776k141J3726J6686q72k2888j9557J1796K7286
930B996P812j1840r314k804M609O601l290q843R683K1190L19k0965j2788K288
$$ y = [20593, 10401, -179, 8560, 24133, 19525, 3151, 1046, 14323, 26126, 25419, 11225, 1003, 8028, 20713, 23643, 19693, 11622, 3880, 12894, 31666, 23662, -3327, -2566, 25593, 34376, 15785, 959, 1967, 11564, 21749, 20184, 6841, 1656, 10616, 15258, 10135, 3646, -177, 3655, 13982, 14783, 1148, -7849, -3822, 2501, 6840, 8107, -2721, -12736, -5206, 5899, -2223, -12986, -9712, -4659, -3668, -767, -5557, -21478, -23869, -6484, 4165, -3966, -17346, -21937, -16878, -8288, -9937, -19247, -17462, -7844, -6664, -14804, -23078, -28873, -21783, -98, 6063, -15505, -32495, -25486, -15294, -11614, -6143, -7164, -18130, -20430, -10589, -10264, -21040, -23181, -9455, 7231, 6359, -16529, -36086, -24290, 2996, 10808, -1032, -10346, -13150, -8541, -1940, -5230, -14073, -4390, 16800, 17119, -3846, -16634, -14346]
944a4346J2235J9252R437j4337j7966o80Q918N892N166J553j428K698O28j0515
958F507j0072O076J7927J4966j525k4103k0769J1723K6449K695j2788j648K498
971A7936m774l124K303j077L266R543N50j1058j0050l387M783J3561Q708r009
985A8171j6722p006M197J1583Q989p966j3805M563R057j0609j4055Q456J6940
998A1793L216q562j4264j2218L796J7601R559k146q193j3751j0622P940J6650
1011G99L275o245k188l86n562p527n416P794K2786J0845j8821k3776m792Q353
1025b0861J3123J5629K013j6088j1558K482K29j931P041J1633M673k747j1020
1038g382j6846n355J4135K1152J2199o832k4485j7351J1089K0164J901n372M122
$$ y = [-14346, -2111, 17141, 26578, 12241, -5725, -6405, 2513, 8405, 13571, 15124, 13696, 16394, 17022, 6507, -3565, 2511, 20438, 35404, 33879, 9776, -10993, 730, 27179, 29874, 17086, 15438, 17936, 13162, 10038, 12341, 11264, 14530, 24073, 24623, 13565, 3515, 128, 4911, 18472, 27180, 18171, 1449, -5557, -1360, 10223, 19212, 11246, -2559, 2004, 11061, 452, -13603, -5147, 11793, 15009, 6447, -7817, -20035, -16239, 1362, 10921, 8775, 582, -13169, -23791, -15851, 799, 4074, -2171, -4359, -4745, -10307, -17834, -23250, -15456, 7330, 18175, -646, -24422, -29214, -20861, -7738, 7891, 9904, -6184, -17742, -15260, -15031, -16962, -9921, 1712, 6385, 3638, -7382, -24228, -29583, -15448, 5704, 17903, 11071, -13414, -30765, -19676, 488, 2389, -2983, 1139]
1051A139L078o344r025q557K20J9444K1739m424k2899j4822J052J2005J6831N631
1065A5068j1521j0186Q89L489M5m10j316M558J2174J218j8985j4455Q998J7659
1079G225Q858m234j5094j1030R663J4645l805r660J833N522J30l81l549p529K904
1094d502J3660O196r322j3273n187J1736J8684Q38j8690j0972R722J1684K289
1107A2863l520p743k936J2151J0507j2500j6547N989J9216J0259p214j8266j1713
1120i454J1945K2081L044j4004j0805O85J0126Q605o876j6022K453J8752P510
1133B8040j4024j7108m860J1935J9403J314k1465j3579J0697J1940l815r636m993
1146f151L923J1856L045j6541j6096N943J5345P742l678j4232j2251N445J4977
$$ y = [1139, 4217, -2127, -11152, -19709, -19489, -45, 21694, 17270, -5629, -20451, -19399, -7394, 9437, 15068, 3547, -6639, -5750, -2261, -2216, -2626, -3942, 616, 12790, 14008, -4977, -19432, -10434, 7225, 16083, 11849, -3245, -14275, -4612, 10033, 6228, -3432, -1599, 3923, 4053, 3672, 123, -7406, -4502, 9158, 15354, 6032, -7241, -12428, -692, 17992, 18830, 140, -10832, -1110, 10574, 12863, 9343, 1600, -1336, 10815, 21322, 8822, -7725, -1736, 17480, 27739, 20525, 2259, -9454, 2491, 24572, 27616, 13612, 2807, 3492, 13618, 22223, 15347, -675, 1778, 20530, 28040, 14016, -3092, -7952, 3983, 23386, 24700, 3235, -10344, 353, 12293, 8478, -1158, -6151, -2228, 9628, 12673, -3868, -19964, -14021, 1324, 9066, 5388, -8844, -21095, -15650, -673]
1159f73K099r334o971N12Q025Q691q316k0731j72K3361J2468j2467j6249n319
1173b5076N849J1844O617p744j0240J58N554M493k00j0030q208J2068J7886k954
1187A7k0283j2130O201J7739J4416p883k2023m029J7152R000q520q224L876J2525
1201b166R703r211k1186l609K1753J9377k228j3699j1034N85J2578R796n180o414
1215i35N183Q876J966o517j3722n461K0722K5803l918k6010j3939P773J5571J0792
1229B6184l572j1070k04R576j196j1577k787Q074J0313O239l908j3845p841K736
1243G122P477J0108Q169q115j7674j797J2269L246n966q31M648K490r96q194j0054
1258A902L065J3219L943p837p301m439N94N992K069q677o395M887M808j870o819
$$ y = [-673, 1426, -7908, -14879, -14367, -6342, 2349, -5967, -26698, -26870, -3509, 8959, -3508, -19757, -25076, -19227, -7383, -766, -8510, -18750, -18592, -13038, -8545, -8745, -18775, -26983, -14915, 2971, 17, -20266, -32396, -26195, -8456, 5960, -1923, -23946, -27975, -10823, -1823, -10343, -18567, -14691, -2166, 7537, -1674, -22860, -26469, -4716, 14661, 12433, -1266, -12300, -11715, 863, 10659, 5479, -935, 4248, 13124, 15090, 8573, -5149, -10610, 10112, 35915, 31997, 5987, -7952, -179, 15392, 26184, 22612, 11542, 11338, 20914, 19718, 8141, 5354, 13428, 23741, 29980, 26072, 12227, 4386, 7122, 14599, 24707, 32876, 24761, 7087, 5290, 17559, 20805, 14839, 14008, 18656, 21146, 20150, 11956, 1902, 4967, 18186, 22129, 14292, 6991, 2552, 3146, 9138, 11207, 2530, -3865, 1022, 5830, 3960, -2859]
1273b859j0028j851J2817P626j4074j6045L218J3015O161o147j6894j1337J1070
1286b5328K0834K74j7601j0606L849Q197L270n004n708N724J1090j710j1548p768
1300c2035N36R834J6529M679j3705j1922J421M039L134Q754O882j816l444m016
1314a1130p886k292J1668J3411M346l449q593r682j24P988O355P208O005m411
1328I414j1281k967J917PN998J3713O692o356j2265j2786q74J8651K0036l145
1342B6754j5165o116K647K527J836M5j359P600Q881l431j5032j0693K356J5769
1356A6619J6515l578j9426q900Q307N988j956j184R9N17M687j00j2303p707Q567
1371F145R995o48n344m853j291L682N87o792k763O637N181k605m467o234l238
$$ y = [-2859, -12887, -14738, -1921, 5705, -8369, -24414, -21196, -8181, -2020, -8167, -25061, -36398, -25328, -4494, -4220, -21821, -32427, -28578, -20381, -17111, -22115, -27823, -22099, -11009, -12719, -24267, -32035, -31499, -21665, -5136, -457, -14162, -26084, -24663, -20624, -17490, -8736, -1854, -3670, -7114, -11130, -19016, -21308, -9640, 3771, 8117, 4668, -3925, -13607, -13731, -5743, 612, 7820, 13825, 9414, -1867, -4834, -2917, -2910, 3088, 16801, 23493, 17137, 4872, -7914, -8788, 9863, 29899, 26754, 11589, 5473, 8120, 10647, 12483, 12528, 11169, 18769, 27650, 24219, 9187, -1506, 850, 16619, 33134, 29556, 10130, 1230, 9537, 15525, 13569, 12385, 12484, 13001, 17688, 17588, 5285, -2422, 6145, 16140, 15492, 10148, 5295, 4004, 7686, 8273, 1481, -1282, 5355, 10536, 7931, 3464, -2770, -6008]
1386f008N843N434l908n236K955J166l724m37J9n758j134P540N222l159o028o963
1402a4176m495O459J1063O21p278n301j001K425L856k792n908L405R150J826o478
1417h624p936o661M274J6572P940j2329j1897L287O354K02o20k12J423N205K196
1432h26q220p921K752R202O247N85p174n459M574M866m689k851O862O153o20k856
1448F25o888n672O779J3520R34q618l051J802K03K827J506k488K00N115J519l576
1464D737l515k319J270Q065N000m698n577p85q78K026P157J551o912k020M287
1479G389r67k210J820k2j265M594M602p041q489K683P029L992j480n554l557L984
1495E508K493l712j128L733K154k91q61o318o045Q442J0929l553r613q26L394
$$ y = [-6008, -165, 5269, 1361, -3875, -920, 246, -3478, -3915, -3896, -9654, -10788, -3248, 1974, -1185, -7213, -14176, -18671, -12212, -1149, -528, -7806, -13107, -14108, -11683, -7827, -10619, -16527, -13122, -3972, -2146, -8624, -16560, -23221, -18947, -2375, 5565, -6764, -18661, -15374, -9020, -8818, -9438, -9650, -8227, -3022, -826, -9046, -16967, -14215, -5013, 1234, 1819, -5355, -10814, -6240, -1374, -6063, -8914, -2052, 4101, 3481, 625, -6263, -11935, -5156, 8364, 9298, 680, -2371, -569, -366, 2461, 3967, 1479, 1679, 6794, 8313, 4737, 1222, -1097, 173, 8238, 13238, 8540, 2963, 2178, 1300, 3326, 10483, 12034, 5122, 3102, 7389, 6422, 4212, 6032, 6010, 4745, 9339, 13941, 6900, -1589, 1094, 8123, 12115, 10635, 5081, 1524, 5508, 8001, 4289, 3161, 6894, 9048, 8757, 7896, 1578, -4467, 3975, 14904, 11351, 1738, 912, 4306]
1510D306J365Q59j948l511L076P545j156q573n146K121O544O892j023r569m767
1525b985M019L303L36j026k872j26N945l12j0755m904Q468N244l516j932p21m431
1541f265k538J710L7o76K348l77l098k562j963l222J059M433Q06j447j712m427
1557a7894k665M511K077m262J582P363q32p866j212J783P48M432N758r5m736j095
1573a2403k73O65M453L592L46J665K297k905m307K26K637N685P957K46r190l371
1589b680M051Q62m80N680M260j157j560k292o312o25R015P006o96k174k697l841
1605F360o1K666K126L296M158n63l782k359k719j972O692R095j528o071j028j345
1621A2965m426J585N157N33k94J354m228p836j853K049K077K225Q63m464m625
$$ y = [4306, 5671, 6530, 4582, 1071, 4147, 11692, 10536, 1963, -3183, -1062, 5482, 12374, 11351, 1782, -2985, 1034, 4337, 4673, 3647, 775, 649, 6594, 6282, -4473, -9377, -909, 4335, 819, -1113, -1834, -6265, -8803, -7093, -7056, -7732, -5384, -5761, -8859, -11421, -13384, -16606, -15547, -11114, -10308, -11755, -13467, -17894, -20559, -16048, -13971, -18233, -16651, -9288, -10120, -17986, -19198, -17415, -16667, -12235, -6477, -6572, -11308, -12403, -12676, -12011, -7558, -3966, -3620, -1955, 342, -2563, -6870, -6644, -4007, 1678, 9635, 9881, 691, -2680, 1371, 2233, 1753, 7433, 11693, 10536, 8976, 6684, 372, -253, 8762, 15768, 15072, 12898, 10201, 6360, 6299, 8965, 11091, 14387, 18545, 17982, 14200, 11841, 9122, 7150, 13842, 22937, 21409, 15338, 14310, 12965, 8539, 10124, 15281, 15814, 15520, 16874, 12646, 4810, 2957, 5006, 7083, 9308, 10171, 5707, 1082]
1636A082j639l381j838K023K387O11J525l725j0937m206P807N429k475n84J951
1651e970k610l520j878j107K705Q245M213l784l598k020l088P16P581O432J448
1666C765k129n332l744J672J655M71N958P836m667j2268k512M735J481O21L461
1681A003J479j730l582p175n110N177J0016J982m495l590l526k787n1K550N013
1696d826O401j902r608k641N790J698k947L046O236J324k475l996m586J840Q963
1711B317M058k541j428n0l800j149M347L632q63j598n40J208J288m006o015L929
1727a211R672r79q203j400L932J126k303k749O4O402O009o847r699L694J0053
1742G561L22o057o90N240M499n26n376k741M990M083M87J764J584m732n099L533
$$ y = [1082, -557, -3938, -5776, -3753, -1366, -755, 770, -2955, -13892, -18098, -10291, -4862, -7337, -7921, -5970, -8580, -12100, -13978, -15085, -12380, -4135, 78, -3706, -7304, -9324, -12412, -11696, -4115, 2317, 3765, 1636, -3696, -7440, -5768, -4113, -3642, 2316, 10152, 5485, -6783, -9295, -4560, -3079, -2458, 1003, 2482, 752, -2830, -10005, -15115, -9938, 78, 2060, -2435, -6025, -9551, -12338, -12389, -9839, -4826, 1575, -327, -9935, -12576, -6786, -5088, -8035, -4989, 1247, 2571, 96, -3900, -8486, -6646, 2317, 6375, 3834, 2406, 2356, -1444, -2593, 1754, 5386, 4523, 2925, 2385, 3593, 4881, 875, -5140, -1211, 8461, 7482, -721, -2121, 1811, 2937, 634, -2115, -2051, 4351, 10360, 3513, -6186, -2492, 7561, 7883, 1826, 1136, 6376, 10875, 10349, 4973, 2232, 7222, 11305, 11792, 13556, 15140, 10408, 5309, 8842]
1758H842N727L27j066j000k016Q00J440m773l674N188M855m981n598K88P27k910
1774B176k388J63M221K953p239j0375J048Q554J076n821k755J715J556o53m095
1789i864m393M788P925k297p937l00M338J36j200R45Q14J451J431l218l422O80
1805a0123M187J880J295q59n995j794N277L965k246k978o12J567M493k22q992
1820a1157m102R705Q970n020r066n67M027L304n32k768J647O004j087q158j818
1835a0618O522N140M36j498k491j72L174ql227K630O519J036l371k099k063j301
1851a391N463O987r02m334j493l59l46Q36J172J731M085J086p667n544K736N263
1867G323K649L52k553k441J597jo468j149R553P832m996q199m857J167O979N344
$$ y = [8842, 14569, 14896, 13830, 12830, 10814, 11614, 13054, 8281, 4607, 9795, 14650, 9669, 4071, 4359, 5086, 2176, -212, -49, 4172, 7125, -114, -10489, -9441, -887, 189, -5632, -8387, -6672, -5116, -5769, -9864, -14257, -9469, -1544, -3841, -11778, -12078, -7740, -7604, -8804, -7859, -7045, -5594, -4163, -7381, -10803, -10123, -5936, -4056, -2761, -3620, -9615, -11409, -6132, -2167, -4413, -7391, -8003, -6436, -1943, -2165, -11157, -15259, -5554, 3416, -1604, -10670, -11237, -7210, -3906, -4438, -7206, -5559, 445, -642, -8800, -10618, -4096, 1044, 1480, -18, -2509, -2681, 493, 485, -2742, -112, 6407, 7443, 4072, 1973, -90, -1391, 4072, 11059, 10157, 5823, 4330, 3971, 3625, 4461, 5633, 7364, 11449, 12535, 4868, -676, 2060, 7323, 9972, 10324, 7771, 5330, 6927, 6926, 458, -691, 8862, 16694, 11698, 3499, -1358, -191, 6788, 12132]
1883A2132l344n636K002L021k289m773r07L723O124J180p060o258K677M327m41
1898D478j393k18j001R21P69m201m849L944O131j599n963k024J259L022J957m516
1914c283n216K182N493k42m425j611J281K067l35m334k930O447O905l329p943
1929i273k614K240L299L932o27l677J279K586m871n784K438Q717N722j671p811
1944f115p799K191Q028K879j914O18J457q49l378n385j194Q696J1748q84j0755
1959b656n681O80L208M001L644k64M19P06m852p548P2R007Q341J447o171r166
1975d813k050N523K997j152K805M264j634o642n220j089P224R426k94r159l279
1990c093L589O65j700N29L014K804K572m239q070m69P713N934o38m281l594J839
$$ y = [12132, 8788, 3152, 5154, 8175, 5886, 1113, 206, 3929, 10053, 11233, 4173, -2085, 592, 4919, 4478, 3085, 2867, 1866, 2787, 3556, -645, -5494, -1550, 4581, 2982, -2981, -5005, -3746, -724, 1233, -3283, -8499, -6317, -824, -1066, -5491, -7102, -5821, -3754, -4089, -8423, -11353, -4906, 1999, -1330, -9273, -11887, -9647, -6348, -2416, -3043, -6720, -5441, -2855, -7726, -13510, -11072, -2355, 3367, 1696, -6115, -13914, -11723, -3695, -816, -2730, -2112, -655, -1504, -4882, -10267, -11461, -2765, 8983, 8099, -2656, -8337, -7657, -4449, -448, 3196, 2932, 3351, 4057, -795, -8343, -8271, 736, 9077, 10524, 4353, -4813, -6863, -1340, 1657, 505, 3310, 7574, 5940, -702, -5922, -7011, 213, 9639, 9345, 186, -3093, 496, 1161, -539, -10, 3004, 5808, 8380, 4141, -3929, -4398, 3315, 9249, 8611, 4330, 736, 2575]
2006B575M853m66n241R69P062J534m862m210q8M606N706j033q449k538P139N201
2022A2758l789m806k39K430L062j300n693j069P058K990n539o297j573L727O152
2037G872N98o851m411L064J434l200j330K474J533n29k536o342j888N612M867
2052C67l178m450o20J292l0k213l713J245P850K863p520q343K04O005N951m3o384
2069a0717k913N649K666o308l910N881O987O54m538n583j297O763N743k941l829
2084g693J527L448Q49k745l674J204P754N263n152p004j32N000M825J352m370
2099D52l981N100O073k923o800J417O041M014r64l886k976K480M536p62j903K565
2115H483K442k072l099j047K512M587J219m993l837L560K897k669k312N34J229
$$ y = [2575, 7428, 6962, 1721, 2690, 9752, 11286, 6424, 2214, 2126, 6732, 12438, 11405, 2956, 418, 7557, 12758, 8969, 4163, 3924, 6354, 9416, 8116, 2423, 1354, 8412, 11402, 5863, -434, -2007, 1720, 7872, 8470, 1619, -2792, 272, 1706, -1494, -2824, -350, 1183, 654, -1882, -8224, -10112, -4500, 367, -2811, -7261, -7881, -6589, -6619, -8832, -12545, -11300, -3450, -587, -8107, -16450, -16246, -10241, -4290, -4333, -10717, -13630, -7981, -5315, -11623, -15533, -9652, -2665, -2011, -6549, -12132, -13429, -6666, -923, -3864, -7693, -6166, -2718, -1869, -4614, -8288, -7084, 670, 5933, 781, -6223, -6355, -1355, 3470, 4822, 452, -3529, 1571, 7644, 4721, -2079, -662, 5379, 9393, 8429, 4543, 1567, 4047, 8583, 7821, 5918, 8483, 10925, 8853, 5754, 4707, 7219, 11806, 13025, 8032, 4195, 7755, 10652, 7983, 5671, 6205, 7434]
2130G434J957R4n132n411L222O178r12n019k287P18J089K15l368k582L692N464
2146E352k570p341l848K937P422M288o434q752L391R252k27p196k942M975P009
2161E316K442p790r184K762J1747M656o130o699r06M302M051j554m796j24M432
2176B525Q25l127l375j775J605M700N82o071l131L139R53k681l61J630J55J88
2192d219j652l565j54N336J915k996k069L54R95R57N05J35J834J904l197l757
2208g674K688N672J316k497k139j306K253M014j403n275J716O901N71o479n894
2223g536J228P029O157k084r689m385M896N860Q76l546l629K371N656q54q097
2238e747k492P671P339Q14n180o582o66P164O295k514l481L110L109j953m023
$$ y = [7434, 9391, 9485, 4353, -1058, 2164, 8342, 7430, 2411, 124, 842, 1931, 2146, -1222, -3804, -112, 5352, 2782, -4559, -8407, -5470, 1952, 6240, -194, -8946, -5555, 3697, 3470, -3726, -6668, -1693, 5316, 7758, -32, -9216, -6454, 5293, 9949, 3819, -2880, -3786, 516, 4567, 3013, -1783, -1907, 2525, 3350, 223, -3152, -4927, -3322, 1378, 1960, -4111, -7242, -4103, -3150, -5831, -6192, -4562, -4407, -4219, -5871, -9436, -9590, -4254, -2339, -5335, -7404, -7050, -6055, -5098, -4593, -4458, -2624, -720, -3917, -7674, -4986, 686, 2002, -495, -2634, -3940, -1687, 2327, 924, -4351, -2635, 4266, 4837, -1642, -7536, -6308, 721, 6878, 4794, -4895, -9280, -4384, 1476, 2352, -1194, -4823, -2452, 3204, 2350, -5747, -8239, -568, 6771, 7585, 2405, -4177, -4843, 2321, 8616, 6102, 2621, 5731, 8840, 6887, 2864]
2253B864j341M197P830K671o485p272J17M444M171R06k794l109N40N41l319k192
2269A769L194K882j311k106k809l833l36K806J464o24O08k449n172j916L695M595
2285D57K73k770m364M08L944M16l570p5M030K358j092l213l667J363P719M190
2301F407n122n732J70M085L036J1l519k467L751L613l399n807K46N977M165k621
2317B794p658m167N650P329j810n795k305J649K824Q73l536l847L664O270j140
2332G95o232k512K259L743L202o00l984k012K276J606L7R04J08n45N84p20j860
2349b951M85K392M91p87J174q49l742K00K436R79P6P36k244m365J660M111J68
2366c0k176j113J519J540k06l275k071M846M829q86m809k188J574M512L084k914
$$ y = [2864, 1523, 5720, 13550, 16221, 9736, 2464, 2581, 7025, 11196, 12102, 9308, 6199, 6739, 7280, 3961, 1769, 4963, 7845, 6534, 4428, 1619, -2214, -2550, 256, 1720, 1096, 1704, -745, -5917, -7833, -4138, 457, 730, -2040, -6404, -5996, -2052, -1636, -5206, -5281, -1251, 1107, 15, -3198, -6865, -5502, 2217, 6407, 1285, -4447, -4277, -192, 2844, 2855, -664, -3131, 620, 4233, 834, -4973, -4727, 1250, 5415, 2794, -4864, -9031, -3381, 3948, 2138, -3657, -5962, -4313, -1489, -616, -4152, -7999, -4335, 1935, 795, -5437, -7949, -5690, -1947, 1255, 655, -3329, -5341, -3065, -1459, -1422, -518, -410, -955, -371, -1091, -2951, -2466, -74, 417, -370, 804, -45, -3787, -3587, -1151, -172, -96, 640, -1604, -5969, -4309, -198, -30, -2206, -3319, -1800, -260, -466, -3741, -5812, -966, 3863, 2977, -1832, -4020, -2446, 2066, 5150, 2236]
2382B236m544K825N139l97l903p01K118L035L112j982n615r40N452L805j762l294
2398D584j867J643L461k7m153r62L106J712j277j655k415m6M042J227l862k631
2414H80K301J084j528n11N07q31L24Q65j343j362Q26K09m82K06l14j225k28Q7
2432e35p85Q37J671j647l063P68K501p98j480n55o05L80K144r63m165J39L616
2449b540J169j957k419p80Q61K688m8l050j129K049J446J06j634k559J98M433
2465c166J943m080k864J543K096R47K68j850k144K516L547j979l528O14L332K013
2481g92p39k895j585K841L083j014j511N44R33j6Q43K4p05J355J476m97jJ343
2499B687j049j989K502M014p38k975J6J246J071Q59n01p97J727J460j989j001
$$ y = [2236, -2308, 517, 5656, 5259, 1356, 655, 2773, 5808, 8920, 6938, 1323, 383, 5835, 9640, 7878, 4584, 2717, 4360, 7821, 7794, 3641, 2679, 5785, 7497, 6220, 4565, 2150, 2104, 6146, 7373, 3511, 880, 3181, 4265, 2737, 2226, 2733, 1902, 2226, 3091, 1748, 386, 1212, 1421, 939, 1145, 831, -394, -622, -535, -1320, -483, 1188, -459, -3522, -2754, -253, -1051, -2531, -3086, -3691, -3311, -1167, -2130, -6295, -6156, -2540, -1371, -3328, -5747, -6527, -5666, -2978, -3026, -6076, -7205, -5156, -3710, -3604, -5238, -7797, -7599, -3166, -1223, -5303, -8167, -6624, -4528, -3581, -3313, -5163, -7307, -4791, -1244, -3223, -6751, -6137, -2805, -792, -1531, -4426, -6011, -3170, -87, -1101, -2612, -2068, -1135, -1151, -308, -284, -989, 366, 1842, 1345, 1344, 2687, 1638, -351, 2151, 6165, 5427, 2452, 2468, 3714, 4785, 5644, 5143, 4346, 6073, 7533, 5544, 4543]
2515D543J000N61J00J452j57j452j217L57N97J185J206k831k672L067L031k972
2531E798l879P44K746J730j516l619j618L674K018k585l216O17J813M37q41k635
2547c32j022J953J680j974j575Q41j028j247J870P08k870j519J914J516q03j784
2563c672j934K91K464R31k622j666J776J010j462j457m78J605K488l27l872p4
2579f999K230o1r67J489J696j838q74K91L42N10J285n07m53J823O32k515n43J737
2597b722K088l78n1n51j54J030l55j769J808K934n94k291N16O11j125J111J616
2614A724K7r81J31k36q59J545O22j387O35J567k62j645m47J88R77J184m84j147
2632A152L42J847j397j861J038J434l04P67L74k312r88J979K76n35J205P76j740
$$ y = [4543, 5543, 6104, 6204, 7656, 7499, 6047, 4830, 5187, 5784, 6969, 8175, 5344, 2672, 5739, 8770, 5798, 1919, 2663, 5409, 7139, 5623, 2004, 386, 4060, 6078, 3493, 277, 894, 2707, 3144, 2303, -332, -1354, 599, 2279, 305, -1270, -429, -1457, -2704, -834, -126, -2996, -4515, -2601, -1085, -1888, -3672, -5606, -5315, -2851, -1920, -4542, -6208, -4432, -3422, -4884, -6341, -6819, -5214, -2726, -3053, -6925, -6999, -4769, -4830, -5797, -4308, -2612, -4450, -5324, -5033, -4691, -4181, -2896, -3403, -3856, -2033, -1401, -3916, -4459, -2722, -634, -1012, -1063, -1614, -1768, -738, -1093, -2862, -1054, 1880, 1286, -1005, -489, 122, -1003, 108, 1724, 1751, 770, 901, 665, -194, 1351, 1973, 586, 1221, 2788, 2526, 881, 434, 622, 1599, 2783, 2299, 1152, 1494, 3341, 1944, 83, 1121, 2555, 2251, 3018, 3392, 1080, 92, 2071, 2347, 1812, 3017, 3793, 2053]
2649B053k20M32n65L51J692J006j129q61k40n44J579J342j315j144J686M80j575
2666C028k10k53k68J420K084j274k912j59P93k05Q20O43j608l89K48m90j828N10
2684e0P23L25M17j174k408l17K278J1k081R3P55p46m65K94q98r07J208P37q59
2703c064m72j91r19N28J347q42j295M19J129m4q63n23j041J567K283j228k727
2720e936N89J441m31Q0R60q53o64Q07N04o90N13O09j354K14J898J71j418q4J212
2739b432J33Q12K95q09J054J574j429p53J929J823p83n39J023m74K12J678M44
2756C758j214Q09N89r29N75J391n58j080M66Q81K80p3q15r32J251J444j177j973
2774B693J119J327m86r98j49p88M09J980p71k408N19O82o65K88J290o09j646j97
$$ y = [2053, 1833, 2265, 1700, 2051, 3743, 4749, 3620, 2759, 2519, 1975, 3554, 4896, 3581, 2437, 4123, 4603, 3028, 2818, 2565, 2297, 3717, 5801, 4527, 1615, 1456, 2249, 2044, 2864, 3507, 1899, 1510, 1758, 1268, -560, -50, 673, 998, 1415, 241, -2167, -2484, -206, -195, -2276, -2183, -1428, -2174, -2639, -2345, -3243, -4150, -2942, -2205, -3064, -3536, -3727, -4646, -4118, -2771, -3613, -4908, -4489, -3360, -3404, -4267, -4790, -5831, -4264, -1981, -3209, -5936, -5347, -3906, -4337, -4257, -3297, -4150, -4814, -4007, -3503, -4193, -3680, -3071, -4425, -4211, -2313, -2142, -3560, -3644, -2432, -2299, -1487, -1192, -2001, -947, 627, -802, -1555, 374, 2197, 1414, 875, 1898, 1424, 1636, 3314, 3758, 2544, 3353, 3942, 3013, 3588, 4979, 4421, 3341, 3807, 4688, 4968, 4895, 4080, 3148, 4399, 5843, 4666, 2693, 3812, 5139, 4653, 3655, 3506, 2718, 3127, 5107, 4336, 1928, 2447, 3129, 2464, 2752, 4042, 3433, 1787, 1590]
2792A590M88M73M96j91j377L16J240j175j303R12O19o51J74L84j808m56P45m86
2810a0m71J185M56k193r19O31q81p21J405J715j158j064k297j177J639K301l19
2827a878j309m44j94j126M01P1m49J930K185j648l336m94J418J276J657P03k021
2844c258j458M88P81n89R45M50N79Q06l0k713j843K367K924N93j30j857k419O81
2862c683K334k09q5J632M81j630o50l27K3J268K546N29k356j204O53O48J432J233
2880B635j623j039J626Q93n03m6o86q8K328J195j699j956J518J468j71m32l97
2897C023q04Q83K715n25k482n05L53L50J241N74k095LJ460J86k171r63K55J622
2915C120K347q7l483l110J651J936O10J053n95k244o19O45j252p87K294K578q17
$$ y = [1590, 2078, 2551, 3047, 2856, 1479, 1795, 3035, 1860, 557, 1469, 2088, 1437, 1611, 1995, 187, -269, 476, -10, -481, 704, 1160, -1033, -1952, -1321, -2202, -2923, -1518, 197, -961, -2025, -4322, -5499, -3860, -1559, -1878, -3187, -3631, -3825, -4951, -4550, -4479, -4928, -2998, -813, -2461, -5797, -6291, -4873, -3597, -1940, -1237, -3258, -4716, -4228, -3447, -4036, -3091, -2641, -2062, -1256, -1286, -3999, -5842, -3475, -551, 42, -88, -1945, -4364, -3683, -1349, -1558, -1643, -11, 470, -1160, -1810, -2137, -2114, -846, 1700, 2229, -127, -1331, -678, -30, 1402, 2635, 1012, -27, 1599, 2492, 1989, 1943, 1257, 1169, 3497, 4692, 2993, 1037, 2555, 4023, 3852, 3420, 3023, 2219, 3102, 5817, 5292, 2810, 2305, 2658, 3008, 4249, 4823, 2728, 2731, 4191, 4377, 2206, 1243, 1498, 3120, 5467, 5380, 1897, -1213, 438, 2374, 2984, 4037, 3442, 1198, 579, 1224, -28, -815, 1479, 4057, 3240]
2932C240j991k384k253J648L570J154j209j549j380j420R43J385j389N39K349
2947A253l32k979k034k29P95L221J896k404l194n45J021o30J412J008j24P4K5
2964a766k121k198J414K181J423N81j981l200k06K929Q19n55K97q2j055M76M09
2981b635j116m7J959J046j254o81k9m20R40J863m71j613O01O75Q4P15o93q54J151
3000g79J754k41j557O80L21l60J613M49j892l74K281J021j024n16m24l95J268
3017A825J959q34j063O45R2k73K82l04k61J456J996j640k908J58J871J069O62
3034D732m11k453j42K092R4j629K30Q59j18M13k28j926o34J416J331m21j157n29
3052A519o66O36P48j121p66J625J18r44m76m75r70J106K004j222j921K5L01o68
$$ y = [3240, 1249, -1135, -3388, -1740, 1830, 2984, 1775, 226, -1154, -2574, -1631, -246, -1635, -1096, 1253, 921, -2058, -4092, -4321, -3526, -305, 1591, -813, -4007, -4552, -3531, -4161, -2749, -1741, -1865, -1791, -1766, -3887, -6085, -4671, -2490, -1067, -486, -2467, -5667, -5873, -2944, -2125, -2680, -2383, -2465, -3520, -3044, -2635, -3751, -3798, -1839, -793, -2047, -2728, -2757, -3177, -2237, -374, -845, -2458, -1857, -1182, -1098, -383, -1076, -1930, -779, 975, 734, -823, -143, 178, -182, 1431, 1880, -12, -386, 1895, 2916, 1892, 1376, 952, 557, 1825, 3784, 2950, 1887, 2532, 2624, 2351, 2633, 2329, 2068, 3524, 5520, 3880, 972, 1130, 3001, 4070, 4732, 4321, 1868, 1726, 3818, 3912, 2283, 2513, 3372, 3254, 3667, 3439, 1513, 879, 2295, 3626, 3205, 2048, 1519, 853, 1489, 2237, 1116, 350, 1975, 2093, 1149, 673, 198, -772, 334, 2338, 1116, -805, -780, -479, -1147]
3070a147L20J127n70j036j52L89p49J50m2k68P80O79j805j299N69O21L98K71n33
3089b297j637N97J203o49j275R43R22k75K59n87k408K81K298J663r64j096o15
3106c637l88J422Q36q68j61J155L52r84p25m85N23K398J719k150k183J285R48
3123i43k92L78R65J63j5p9j018j022J310K065J29m60M2j124n10R40N12Q80J488
3142C409l73j481n97L49j84P79J891o4j427m73J60m15M61J543O06p78k97j446
3160A663k40J045J027J29r55P4K99m86k0j098Q6K223L74j828j800J514L82l34
3178B055J88n92p63M40J348r85j650P94R35l65o90m34k86P39Q94r54j954P4L15
3197h91N21J373m71j844m95J153o53j000J239J507o15q43j352j302N57K101R29
$$ y = [-1147, -827, 300, -270, -1306, -1458, -1069, -1818, -1668, -1710, -1978, -1198, -519, -2324, -3623, -3054, -2433, -2035, -1764, -2297, -3934, -3337, -2134, -2783, -4058, -3115, -2193, -2468, -2209, -2796, -5204, -4923, -2625, -962, -1926, -3022, -3637, -4025, -2603, -1767, -2635, -2796, -1641, -1289, -2273, -2998, -3483, -2960, -562, 1157, -993, -3176, -1891, -943, -1235, -857, 108, 271, 256, 177, -841, -1863, -553, 1512, 1641, 1181, 1223, 99, -411, 529, 1041, 1921, 3409, 3036, 1555, 958, 1307, 1123, 1902, 3793, 3729, 2302, 1829, 1989, 1574, 2035, 3578, 4184, 3406, 3109, 1663, 1423, 2468, 3495, 3624, 2669, 2743, 3042, 2556, 2536, 1438, 1524, 3747, 4121, 2293, 493, 2007, 2389, 2055, 2243, 1651, 888, 1328, 2676, 1691, 41, 835, 1770, 1405, 715, 281, -5, 734, 1628, 674, -1280, -1206, -891, -370, 1003, 532, -1312, -1807, -654, -1307, -2307, -1068, 439, -176, -1019, -2371, -3673, -3116, -1015, -86]
3214h6j157l57m50j055q24M75J264J389Q49j426k690k46P61O21J238J068m69j277
3232b372o86j023n66J563K966k80j542o63j189n37J510J461j0N62L62j818j752
3249d014M34J473J711J388r15k650l79J473Q9M48Q43J128q92n09Mj385J262K032
3267A541J231j811m73N87l18K92P73l71N94J656k76k029m83J158J281Q89p06j462
3285B073k42K356M6j567m53Q76J65M91k90q99p42J988O00k073r49Q96N48M65n0
3304C239j236r62M97J004o58k46P71m45l10Jj703n01K534J403j197k264l31J0
3322c94M88J211o45j247N92R77j913j281L50N71P53nn22j389p0l68m75J031J671
3341f65o42k369q02J009L21L84O7r72J11J251j21j975k02J502J110L06l50j591
$$ y = [-86, -1243, -1600, -2050, -3105, -3929, -3454, -2190, -801, 48, -1378, -4068, -4314, -3553, -2932, -1694, -626, -1095, -2372, -3058, -4081, -4647, -3084, -118, -398, -1940, -2603, -3792, -4329, -2819, -1358, -1368, -806, -444, -2262, -4014, -3580, -2107, -396, 992, 77, -2573, -2952, -1479, -1390, -942, -99, 1029, 137, -372, -368, -1753, -491, 1541, 2772, 961, 488, 1075, 757, 1049, 1822, 1451, 2045, 3701, 3425, 1396, 913, 2071, 3352, 4241, 3535, 2073, 1831, 4187, 4233, 2666, 2213, 3089, 3254, 3745, 3455, 2556, 1814, 3802, 4402, 2329, 1380, 2276, 2824, 3289, 3239, 2003, 1041, 1538, 2542, 1884, 1638, 2409, 1964, 1654, 1655, -48, -549, 1985, 3388, 2191, -73, -404, -394, 94, 1305, 660, -587, 5, 982, -931, -2212, -1862, -1291, -538, -543, -1065, -2454, -2524, -2892, -3367, -2336, -665, -1307, -3676, -4478, -3469, -3148, -2764, -2697, -3669, -3558, -2307, -2428, -4403, -4605, -3103, -1993, -1687, -2037, -3628]
3359c628n40J408J058m47k03M26R5N94K21j383r38K632J836j350j733m55J086
3376a321J788O58j826j841K048K399r70k810j63J917K156J62k137k070J733K011
3392A734j1o73m48N6K99R63J17j594N12J121L50J34J28j268n66J564J297r53j000
3411A762J079M50n64l22qM2J047O2j721j39R71J04n70K10J32o08N9l41o91M97
3431A451J051j493j341J651J198j934j407N22J141J124q22j790j118J520J748
3446A501r31j092k47K12M78P76j236j401O40J550J29k95r03j118L5J975L07j973
3464a593r28J549O23m50r83p16r0J869K9j953k21J274O24j091o86n5Q80J459l30
3483g89k258OJ495K88p23N19J15m06K31N65q00k55N62J68M76O02m48j223j55J180
$$ y = [-3628, -4168, -2760, -1702, -2149, -2352, -1926, -1831, -1237, -1016, -2399, -3337, -705, 1131, -219, -1952, -2407, -1321, 467, 1125, -701, -2542, -494, 1905, 935, -1875, -2038, -121, 2035, 2197, 60, -2010, -277, 1734, 1723, 1050, 602, 658, 957, 1920, 2037, 443, 955, 2076, 2426, 2560, 2688, 1420, 854, 2418, 3715, 2762, 1762, 2841, 3291, 2727, 2405, 2397, 2439, 3486, 3548, 1827, 1688, 2659, 2763, 2193, 2403, 2535, 1927, 1986, 1645, 954, 1451, 2502, 1009, -332, 1319, 2517, 583, -824, -302, 839, 1963, 1141, -649, -1767, -247, 1501, 570, -522, -769, -557, -79, 697, -539, -1940, -1300, 250, 379, 84, -819, -1937, -1902, 73, 380, -1593, -2521, -972, -349, -799, -1782, -2498, -2588, -719, -690, -2643, -2864, -1590, -966, -2057, -2743, -2798, -1918, -459, -789, -3047, -3041, -1546, -1258, -1981, -1462, -1347, -1753, -1522, -957, -1757, -2012, -1450, -1282, -806, -204, -652, -1875, -2030, -850]
3503h50O92m1L20k65n69J9m8j74J166Q04p86j096J402k02j242m48J468J233K2
3522A405n12j417j92J547P43m38q01J059L5o54n77k7O13J487k6j187j84O98o05
3541I67j18J015l26k2M93o7j071l49O53O94P7O19p49j242J91J144J31n91RL37
3561A795j12L82o52q55P89J030p16k78M76k95p17J93K33l63O27N82j505q35J070
3580H49J96j058m98P30K78M4l60q58r20J019J99m35l8j89o02k1K81l11n38J20
3600b112Q62n75p4r5p02J59J430m54p67J53J008o64j072j5K14J540N96q60j411
3619b839N74R46k18O9K63n49Q9O43n0r24M09P58NJ5K84l94r21M79J011k79l00
3640i29O17k54J37N90n81m58R35N69k36k36L87p8l83N33M84k65O07K25j025M19
$$ y = [-850, -158, -199, 121, -144, -713, -694, -742, -916, 250, 1054, 268, -828, 574, 372, -870, -1318, 150, 1383, 1405, 893, -524, -716, 831, 1574, 1136, 335, 1394, 1429, 775, 198, 171, 784, 2271, 2245, 1058, 874, 1572, 967, 849, 1864, 1538, 1516, 2009, 1942, 871, 522, 1175, 1869, 1946, 2565, 1816, 574, 765, 1909, 2040, 1449, 1458, 1795, 1683, 2065, 1413, 558, 1347, 2377, 1661, 1383, 1859, 1564, 847, 1040, 1273, 910, 1537, 2119, 614, -221, 849, 1045, -13, -511, 219, 497, 541, 181, -677, -1597, -578, -379, -814, -852, -1041, -1643, -1664, -1383, -1694, -2232, -2112, -1250, -1825, -1899, -1994, -2696, -2537, -1107, -1561, -2328, -2175, -1167, -1831, -2903, -2918, -2704, -1164, -568, -1428, -2839, -2265, -1319, -1537, -1468, -1205, -1754, -1665, -1022, -1072, -1996, -1587, -829, -824, -809, -525, -919, -1840, -1361, -350, -629, -929, -312, -566, -429, 161, -420, -878, 57, 626, 390, 154, 541, 463, 80, 613, 1097, 832, 1439, 1664, 639, 1058]
3660A058N08P0l95N02M03j2p80K97L94mL21l81o30M07N71o73k16M2O0L10L27k81
3682A898j231L40M57m49J81P87o30o79K72N90n57l3L29j01j19j32jm05O88K71
3702A476o92m90N18ok57L54p38m05P48J89p35m09R69l89o71L30rl92L1O3l19k04
3724a038N06p5o55O84k79p38l40P60j76m52J93n93L0L06R7p04J66J006k75j183
3744b760M63J70l21K47P08q49p9R21N7n24J54j43M7Q64q6n89k54M10J93N61O41
3765a69m97m99K74P57l99k00J014j3m84J40J87n41Q57O53L1p46M46J38l85Q7M20
3786A071K46n1L99k48k62L63j25k50O02M74q99k40N10R2l65P33J55p21n0R35k86
3807B083n92J49L13k72N25j24q80K1L26O65Nj30j126n14J230O42j230k67k42M13
$$ y = [1058, 1566, 1636, 1241, 1743, 2146, 2134, 1354, 1651, 2045, 2041, 2362, 1981, 1351, 1758, 2329, 1656, 1440, 1482, 1542, 1852, 2179, 1898, 667, 1007, 1464, 1015, 1196, 1983, 1353, 674, 946, 1536, 979, 946, 1275, 1174, 1055, 923, 922, 517, 1205, 1476, 784, 294, 812, 806, 549, 903, 165, -240, 508, 697, -38, -447, 522, 133, -538, -208, -217, -609, -578, -515, -834, -1038, -532, -607, -1262, -578, -857, -1595, -1935, -1175, -1351, -1803, -1610, -2203, -2173, -1867, -1770, -2474, -2308, -1302, -1577, -2760, -2297, -2127, -2448, -2201, -1493, -2342, -2421, -1500, -1443, -1967, -1813, -1956, -1909, -1045, -1131, -1720, -1974, -1564, -1371, -810, -169, -666, -1165, -891, -134, -533, -733, 281, 268, -216, -76, 111, -430, 427, 1080, 1111, 365, 811, 949, 564, 651, 1071, 1317, 1266, 1665, 1417, 1155, 1518, 1393, 1143, 1745, 2219, 1320, 1080, 1590, 1682, 1317, 2050, 2205, 1484, 1434, 2369, 2083, 1491, 1640, 1953, 1681, 2206, 2082, 1202, 1223, 1549, 2214, 2219, 2089, 963, 449, 1679, 2321, 1091, 824, 582, 995]
3827I95O4J53m86q20O99M47p69o55j60O12J80l56m71o36j00R41k75p24K95K6L00
3848g40J62j004p18P07J165L76j048m84r3J30Q67L64q10j64K84O0m93P5M95n7
3868i26j13L76p03j4m8j01nP73L20j168n01L79L3N72K63m32n04J95N45m47j97
3889a703M35K53l5R1k12q94N14J461K62j000m55J51Q63N44l43q07P78J587k37
3908A253j166n80M34R77J441l15k039k8J255O99l73j49k49l26O52M34j250l26
3926C44J052O36l13k85m26m06R80M40k96p37K72J50n25O00R7m19L08P19o60n55
3946I76J25P19k00j00L65l05o58j92K97K98O46n42r86k94J196r8n29o38J24K23
3966D27O30j002j473M58J528J59r43n55n47l7R42M30p40j217K96J026k90k21j051
$$ y = [995, 1059, 1212, 726, -94, 605, 1052, 283, -372, -532, 80, 260, -96, -567, -1203, -1303, -362, -637, -1361, -1066, -1040, -740, -578, -1582, -2300, -1593, -428, -52, -1100, -1584, -1677, -1547, -680, -316, -1126, -1290, -1006, -946, -1439, -1364, -869, -926, -1039, -663, -1366, -1380, -1428, -1529, -1534, -761, -441, -1609, -2110, -1731, -1698, -1126, -863, -1295, -1799, -1604, -1059, -1506, -1703, -1268, -1015, -1050, -959, -1171, -2065, -1551, -90, 172, -828, -1283, -1132, -269, 275, -68, -875, -97, 1490, 1253, 87, -493, -59, 918, 2359, 2044, 5, -23, 1232, 1931, 1558, 1409, 1160, 834, 1486, 1920, 670, 344, 1396, 2032, 1719, 1434, 1008, 602, 1582, 2022, 1726, 989, 1261, 1411, 886, 1486, 1583, 1164, 1472, 2191, 1531, 976, 1101, 1820, 1620, 1520, 1885, 1580, 922, 730, 1027, 1325, 1971, 1429, 443, 149, 1345, 1247, 718, 80, 204, 427, 1057, 55, -1418, -960, 568, 727, -216, -771, -1318, -1355, -413, 17, -723, -1940, -1644, -618, -908, -1129, -2180]
3985b180j16J590L52j295j162P35P96N60l38j379l42J733J096j708j325J057J004
4002i22L11k13q88m28L10J262l8p45k61K38n0N34K26j060M81M26K26m69K02l59
4022a217n2M76R35r00j55P04j04m33Q56M43o62l68N48L4N31K30r31j22J281O03
4042A697p94r36N66P73O67j24j444p1J476Q94j692r39J076J161N6m70j170m37
4060B89J420J222n55j508l84P58N17P42l86j553L09J258K07r89r19j08J042J032
4078B394m28j716m68J472L21o59n67M13n4J91m12p99j61J239j38q02j51Q2j21
4097c64k51K85k5R4l5o76m82P53K34n04J8M06p5r00J09l53K82J168l9r76o89L22
4119a698L42N79K0k24j011O7J348J61q81j002N52Q95Q68j066j674j04J709J039
$$ y = [-2180, -2296, -706, -354, -1649, -2811, -2076, -1280, -720, -1058, -2437, -2779, -1046, 50, -1658, -2983, -1926, -922, -611, -824, -1712, -2140, -1830, -568, -606, -1351, -1612, -1374, -1424, -890, -664, -1724, -1243, -817, -591, -1060, -858, -1217, -1269, -793, 142, -758, -913, -209, -313, -746, 110, 553, -109, -477, 71, 105, 636, 866, -65, -187, 1094, 1697, 903, -33, 533, 1306, 1973, 1849, 405, 334, 1810, 2704, 1012, 73, 1149, 2310, 2366, 1896, 726, 289, 1709, 2931, 2376, 868, 484, 1242, 1759, 2501, 2115, 562, 871, 2129, 2336, 1347, 428, 320, 1362, 2394, 1966, 250, -218, 1254, 1575, 916, 349, 762, 708, 899, 487, -312, -473, 766, 628, -174, -325, -243, -364, -615, -330, -355, -261, -296, -972, -1454, -701, -467, -971, -953, -547, -622, -1522, -1413, -1766, -1484, -316, -355, -1331, -2020, -1698, -1356, -777, -757, -981, -1992, -1925, -577, -416, -1297, -2299, -1747, -852, 16, -1050, -2724, -2828, -1119, -80]
4137h0n06j281m91R15R38K09j110j32J260N06j141n34Q6P18Q26L35r68m20K97
4156e73N22K16k63l6M33R3K97m50p11J102N45j81k67n15k92N03J437o28p54J73
4176F51J53k13J90L71l32M4J64l78J36N80m71j75J11P32j9n70l14k69N62J378
4196B331K87j901n72P07M94K69O3p28M3M04J38q51m45Q26Q48j76n78p58n96R86
4216G91O12n19o43nL21J44l97j066J7J161J034j607j273J44O53O91k49o75m15
4235a281k9Q57l38o04j09M72K71K11m38o20m0Q87j37j65L17l45o66k03P51j34
4255a343J10P95j087m50R37J60r0m02J71L0K72J01m13o17O18J012n45l47r4K75
4275i07K88M55n18m81M91O44o67k26N12K32K19K13l20n87L58J576Pj243j39K72
$$ y = [-80, -586, -1867, -2358, -1443, -505, -296, -1406, -1538, -278, 228, -913, -1447, -1361, -643, 183, 518, -450, -870, -573, -51, 165, -98, -134, 299, 392, 689, 239, -472, 630, 1175, 994, 727, 212, -80, 423, 1860, 1232, 478, 651, 804, 591, 781, 1152, 820, 864, 1028, 650, 786, 1366, 895, 720, 831, 1563, 1544, 974, 660, 391, 953, 2331, 2618, 717, 145, 852, 1346, 1615, 1678, 950, 993, 1397, 1535, 684, 239, 1065, 1913, 1737, 1159, 401, -195, 791, 1403, 884, 241, 236, 557, 701, 304, -762, -745, 416, 1450, -157, -1430, -1286, -633, 58, -191, -866, -1281, -1310, -453, -791, -1395, -1504, -1032, -761, -550, -988, -1608, -1648, -761, -898, -1063, -746, -1091, -1757, -1960, -1209, -1343, -1233, -438, -1525, -1975, -1038, -878, -968, -1370, -1199, -1169, -897, -796, -1209, -1826, -1208, -196, -741, -1088, -1182, -907, -619, -164, -682, -1163, -672, -28, -695, -921, -409, -177, 42, 255, -65, -652, -294, 1282, 1289, 46, -93, 179]
4295A79R56J51l83p53J62J013l6k42j78k79N01N58J15j021KN12K13O0j78L7l56
4316A033M21Q6o81O0L25L71m56j36J09l52R2K58m14k79J171n50q28K14L96L6k05
4337F71q3jn47N34j40n74J94Q36m28k55k4m05K44J06k25n45M21O93k34n25j19
4358d06k52L99M18J78j255l91R64mlj30j26m54N04J76r35l81Q24N45l56n25j21
4379a331m35P05Kj79j64J16K60k88n3k33K88L40K36m78j09M15J88m90M91k16l8
4400i73PM74l07l56P27J08j43K42r3p3j49O05o4j98O13j2m83M6K19J66j82N06
4422F80n06l09O90M41r48M9Q43p8j30l47j62j79Q48Q6p4l61J07K62J73K24k72
4443A037k31L97L69n14j05L83j96m3M55k48j50Q7L42l01k41J9R5k17L90j33l25
$$ y = [179, 1135, 1286, 903, 150, 312, 1325, 1289, 1047, 869, 590, 1091, 1649, 1764, 743, 745, 1257, 1470, 1530, 1352, 1389, 1033, 1454, 1540, 859, 919, 1244, 1615, 1159, 1023, 1132, 780, 872, 1130, 716, 437, 1608, 1058, 230, 444, 840, 876, 671, 588, 587, 40, 574, 434, -140, 54, 890, 462, 207, 183, -222, 22, 128, -97, -642, -221, 472, 238, -287, -406, -658, -259, 159, 337, -918, -1309, -345, -349, -352, -482, -608, -1062, -558, -382, -1317, -1698, -874, -329, -685, -1210, -1331, -1766, -1061, -1059, -1238, -1402, -1286, -1026, -1314, -1367, -1600, -1312, -972, -736, -1214, -1323, -908, -720, -1210, -719, -935, -973, -966, -492, -799, -1155, -428, -320, -463, -221, -314, -387, -536, 69, 5, -193, 420, 408, -75, -29, 190, 356, 174, 680, 174, -135, 555, 996, 48, 97, 940, 862, 732, 385, 223, 44, 892, 978, 904, 543, 650, 912, 1085, 1309, 1037, 806, 1203, 1572, 1058, 953, 1336, 1140, 1097, 1552, 1304, 1154, 1241, 1583, 1282, 1041, 1060, 1155, 938, 1328, 1195, 870]
4464H70k42N42j74n42j3K13r7k42N30p70K93k56N0j98J48J30l92K94m79r1M9M22
4486D5mq21L56n2j90j19K65Nk93M31j04p16J22L65j12j09L66m00l64N98o3o78
4508a472N14M12m32m63L51j40k04N58J35m39k1M82k70n67N35k62K30K79J39o07
$$ y = [870, 628, 1170, 996, 454, 441, 654, 557, 315, 845, 75, 368, 112, 162, -36, 112, 242, -150, 144, -335, -426, -377, 45, 41, -780, -424, -476, -666, -785, -520, -515, -808, -377, -481, -1197, -1075, -710, -822, -931, -565, -965, -1329, -731, -794, -1472, -958, -546, -978, -1441, -1090, -1230, -1434, -876, -741, -1180, -1201, -719, -989, -1556, -1021, -1283, -1053, -774, -635, -1242]
$$ [...]
8191B28
##END NTUPLES=NMR FID
##END=
