##TITLE=1H_CA-8712-3
 CDCl3, 8 sc, 
 8.6.2020
##JCAMPDX= 6.0         $$ Bruker NMR JCAMP-DX V2.0
##DATA TYPE= NMR FID
##DATA CLASS= NTUPLES
##ORIGIN= UXNMR, Bruker Analytische Messtechnik GmbH
##OWNER= root
$$ XWIN-NMR		Version 3.5
$$ Mon Jun  8 12:18:48 2020 Russian Standard Time (UT+4h)  she@DPX200
##.OBSERVE FREQUENCY= 200.1315
##.OBSERVE NUCLEUS= ^1H
##.DELAY= (6, 6)
##.ACQUISITION MODE= SIMULTANEOUS
##.ACQUISITION SCHEME= undefined
##.AVERAGES= 8
##.DIGITISER RES= 18
##SPECTROMETER/DATA SYSTEM= spect
##.PULSE SEQUENCE= zg30
##.SOLVENT NAME= CDCl3
##.SHIFT REFERENCE= (INTERNAL, CDCl3, 0, 15.7039)
##AUDIT TRAIL= $$ (NUMBER, WHEN, WHO, WHERE, WHAT)
$$ ##TITLE= Audit trail, XWIN-NMR		Version 3.5
$$ ##JCAMPDX= 5.01
$$ ##ORIGIN= Bruker BioSpin GmbH
$$ ##OWNER= she
$$ F:/spectra/data/she/nmr/H-F/1/audita.txt
$$ ##AUDIT TRAIL=  $$ (NUMBER, WHEN, WHO, WHERE, WHAT)
(   1,<2020-06-08 12:08:27.42 +0400>,<she>,<DPX200>,
      <created by zg, POWCHK disabled, PULCHK disabled
       configuration hash MD5:
       00 E9 B6 7A A2 85 ED C7 34 08 36 98 17 FE 4E 26
       data hash MD5: 16K
       23 8C 4F 6A E3 2E 6E F6 F3 B3 BA 27 90 92 D1 4F>)
$$ ##END=
$$ 
$$ hash MD5
$$ 7E 83 09 78 D2 80 24 A7 1C 64 67 D0 2A 87 D3 54
##$RELAX= 
##$RELAX= 
##$RELAX= 
##$RELAX= 
##$RELAX= 
##$RELAX= 
$$ Bruker specific parameters
$$ --------------------------
##$DU= <F:/spectra>
##$EXPNO= 1
##$NAME= <H-F>
##$PROCNO= 1
##$TYPE= <nmr>
##$USER= <she>
##$AMP= (0..31)
100 100 100 100 100 100 100 100 100 100 100 100 100 100 100 100 100 100 
100 100 100 100 100 100 100 100 100 100 100 100 100 100 
##$AQSEQ= 0
##$AQ_mod= 1
##$AUNM= <au_zg>
##$AUTOPOS= <>
##$BF1= 200.13
##$BF2= 200.13
##$BF3= 200.13
##$BF4= 200.13
##$BF5= 200.13
##$BF6= 200.13
##$BF7= 200.13
##$BF8= 200.13
##$BYTORDA= 1
##$CFDGTYP= 0
##$CFRGTYP= 5
##$CHEMSTR= <none>
##$CNST= (0..31)
1 1 145 1 1 1 1 1 1 1 1 1 1 1 1 1 1 1 1 1 1 1 1 1 1 1 1 1 1 1 1 1 
##$CPDPRG= <>
##$CPDPRG1= <>
##$CPDPRG2= <>
##$CPDPRG3= <>
##$CPDPRG4= <mlev>
##$CPDPRG5= <mlev>
##$CPDPRG6= <mlev>
##$CPDPRG7= <mlev>
##$CPDPRG8= <mlev>
##$CPDPRGB= <>
##$CPDPRGT= <>
##$D= (0..31)
0 1.2 0 0 0 0 0 0 0 0.06 0 0.03 0 0 0 0 0.0002 0 0 0 0 0 0 0 0 0 0 0 0 
0 0 0 
##$DATE= 1591603706
##$DBL= (0..7)
120 120 120 120 120 120 120 120 
##$DBP= (0..7)
150 150 150 150 150 150 150 150 
##$DBP07= 0
##$DBPNAM0= <>
##$DBPNAM1= <>
##$DBPNAM2= <>
##$DBPNAM3= <>
##$DBPNAM4= <>
##$DBPNAM5= <>
##$DBPNAM6= <>
##$DBPNAM7= <>
##$DBPOAL= (0..7)
0.5 0.5 0.5 0.5 0.5 0.5 0.5 0.5 
##$DBPOFFS= (0..7)
0 0 0 0 0 0 0 0 
##$DE= 6
##$DECBNUC= <off>
##$DECIM= 24
##$DECNUC= <off>
##$DECSTAT= 4
##$DIGMOD= 1
##$DIGTYP= 9
##$DL= (0..7)
0 120 120 120 120 120 120 120 
##$DP= (0..7)
150 150 150 150 150 150 150 150 
##$DP07= 0
##$DPNAME0= <>
##$DPNAME1= <>
##$DPNAME2= <>
##$DPNAME3= <>
##$DPNAME4= <>
##$DPNAME5= <>
##$DPNAME6= <>
##$DPNAME7= <>
##$DPOAL= (0..7)
0.5 0.5 0.5 0.5 0.5 0.5 0.5 0.5 
##$DPOFFS= (0..7)
0 0 0 0 0 0 0 0 
##$DQDMODE= 0
##$DR= 18
##$DS= 0
##$DSLIST= <SSSSSSSSSSSSSSS>
$$ [...]
##$SUBNAM2= <"">
##$SUBNAM3= <"">
##$SUBNAM4= <"">
##$SUBNAM5= <"">
##$SUBNAM6= <"">
##$SUBNAM7= <"">
##$SUBNAM8= <"">
##$SUBNAM9= <"">
##$SW= 24.9337058887773
##$SWIBOX= (0..15)
0 0 2 0 0 0 0 0 0 0 0 0 0 0 0 0 
##$SW_h= 4990.01996007984
##$TD= 16384
##$TD0= 1
##$TE= 0
##$TE2= 300
##$TE3= 300
##$TEG= 300
##$TL= (0..7)
0 120 120 120 120 120 120 120 
##$TP= (0..7)
150 150 150 150 150 150 150 150 
##$TP07= 0
##$TPNAME0= <>
##$TPNAME1= <>
##$TPNAME2= <>
##$TPNAME3= <>
##$TPNAME4= <>
##$TPNAME5= <>
##$TPNAME6= <>
##$TPNAME7= <>
##$TPOAL= (0..7)
0.5 0.5 0.5 0.5 0.5 0.5 0.5 0.5 
##$TPOFFS= (0..7)
0 0 0 0 0 0 0 0 
##$TUNHIN= 0
##$TUNHOUT= 0
##$TUNXOUT= 0
##$USERA1= <user>
##$USERA2= <user>
##$USERA3= <user>
##$USERA4= <user>
##$USERA5= <user>
##$V9= 5
##$VALIST= <valist>
##$VCLIST= <CCCCCCCCCCCCCCC>
##$VD= 0
##$VDLIST= <DDDDDDDDDDDDDDD>
##$VPLIST= <PPPPPPPPPPPPPPP>
##$VTLIST= <TTTTTTTTTTTTTTT>
##$WBST= 1024
##$WBSW= 4
##$XGAIN= (0..3)
0 0 0 0 
##$XL= 0
##$YL= 0
##$YMAX_a= 844532
##$YMIN_a= -515401
##$ZGOPTNS= <>
##$ZL1= 120
##$ZL2= 120
##$ZL3= 120
##$ZL4= 120
##$ABSF1= 10
##$ABSF2= 0
##$ABSG= 5
##$ABSL= 3
##$ALPHA= 0
##$AQORDER= 0
##$ASSFAC= 0
##$ASSFACI= 0
##$ASSFACX= 0
##$ASSWID= 0
##$AUNMP= <proc_1d>
##$AZFE= 0.1
##$AZFW= 0.1
##$BCFW= 1
##$BC_mod= 2
##$BYTORDP= 1
##$COROFFS= 0
##$CY= 11.3945322036743
##$DATMOD= 1
##$DC= 2
##$DFILT= <>
##$DTYPP= 0
##$F1P= 16.9975609425685
##$F2P= -3.02152046262296
##$FCOR= 0.5
##$FTSIZE= 0
##$FT_mod= 4
##$GAMMA= 1
##$GB= 0.15
##$INTBC= 1
##$INTSCL= 1
##$ISEN= 128
##$LB= 0.24
##$LEV0= 0
##$LPBIN= 0
##$MAXI= 10000
##$MC2= 0
##$MEAN= 0
##$ME_mod= 0
##$MI= 1.114404
##$NCOEF= 0
##$NC_proc= 0
##$NLEV= 6
##$NOISF1= 3.799351
##$NOISF2= 2.8
##$NSP= 1
##$NTH_PI= 0
##$NZP= 0
##$OFFSET= 15.70392
##$PC= 1
##$PHC0= -9795.537
##$PHC1= 16.00088
##$PH_mod= 1
##$PKNL= yes
##$PPARMOD= 0
##$PSCAL= 0
##$PSIGN= 0
##$REVERSE= no
##$SF= 200.130013532006
##$SI= 16384
##$SIGF1= 3
##$SIGF2= 2
##$SINO= 400
##$SIOLD= 16384
##$SREGLST= <1H.CDCl3>
##$SSB= 0
##$STSI= 0
##$STSR= 0
##$SW_p= 3612.71676300578
##$SYMM= 0
##$S_DEV= 0
##$TDeff= 0
##$TDoff= 0
##$TI= <>
##$TILT= no
##$TM1= 0
##$TM2= 0
##$TOPLEV= 0
##$USERP1= <user>
##$USERP2= <user>
##$USERP3= <user>
##$USERP4= <user>
##$USERP5= <user>
##$WDW= 1
##$XDIM= 8192
##$YMAX_p= 0
##$YMIN_p= 0
$$ End of Bruker specific parameters
$$ ---------------------------------
##NTUPLES= NMR FID
##VAR_NAME=  TIME,          FID/REAL,        FID/IMAG
##SYMBOL=    X,             R,               I
##VAR_TYPE=  INDEPENDENT,   DEPENDENT,       DEPENDENT
##VAR_FORM=  AFFN,          ASDF,            ASDF
##VAR_DIM=   8192,          8192,            8192
##UNITS=     SECONDS,       ARBITRARY UNITS, ARBITRARY UNITS
##FACTOR=    0.0002004,     1,               1
##FIRST=     0,             0,               0
##LAST=      1.6414764,     0,               0
##MIN=       0,             -515401,         0
##MAX=       1.6414764,     844532,          0
$$ Real data points
##PAGE= N=1
##DATA TABLE= (X++(R..R)), XYDATA
$$ [...]
2320B883K240k681k346l13J894K982j842n609m79N511K597j922k823j664O11L541
$$ 2883 5123 2442 96 -217 1677 4659 2817 -2792 -3271 2240 4837 2915 92 -1572 -961 2580
2336B580K080l063j999J57m48r62P17R02k47J079R58l572j782P08M21r21J486
$$ 2580 4660 1597 -402 -245 -693 -1655 -938 -36 -283 796 1754 -1818 -3600 -2892 -2471 -3392 -1906
2353a906P5j859r33M11n49J297L127j222m752o82K295J451k57n05n81J407L259
$$ -1906 -1831 -3690 -4623 -4212 -4761 -3464 -337 -1559 -6311 -6993 -4698 -3247 -3504 -4009 -4590 -3183 76
2370G6p17m683j4L598K295k91k101k040J076M371J440k953j061J918J204p82j427
$$ 76 -641 -5324 -5338 -1740 555 264 -1837 -3877 -2801 1570 3010 57 -1004 914 2118 1336 -91
2387i1j954O72M443K297l620l038J331J653J077N03k810k395K411K424j275j521
$$ -91 -2045 -1373 3070 5367 1747 -1291 40 1693 2770 3273 463 -1932 479 2903 1628 107
2403A07Q06R21J033p0j742k441J300K505r35j063J612L82j013J024j29q95K47
$$ 107 913 1834 2867 2797 1055 -1386 -86 2419 1484 421 2033 2415 1402 2426 2297 1402 1649
2420A649J039j318j029J442M88q82M96J218n27j72l17k149k62K525K53k303m61
$$ 1649 2688 1370 341 1783 2271 1389 1885 3103 2576 2404 2087 -62 -324 2201 2454 151 -310
2437c10J588J27N60m27k096j003K485M89l039j188J668J431M86n05k124r48K448
$$ -310 1278 1405 1965 1538 -558 -1561 924 1413 -1626 -2814 -1146 285 771 266 -1858 -2806 -358
2454c58J162k995j707J354J099J268J72k418k108K731L039j408k650r95l41K158
$$ -358 804 -2191 -3898 -2544 -1445 -177 -5 -2423 -4531 -1800 1239 -169 -2819 -3814 -4155 -1997
2470a997K471j697k603J467L620q08l264r42R36K276J912j914l343J460L854O71
$$ -1997 474 -1223 -3826 -2359 1261 453 -2811 -3753 -2817 -541 1371 -543 -3886 -2426 1428 2099
2486B099j943o6p88O1J750L38k160j5J768Q04O18J345k135k693J380K527m19q07
$$ 2099 156 90 -698 -637 1113 1451 -709 -724 1044 1848 2466 3811 1676 -1017 363 2890 2471 1664
2504A664n16K96L02J500r25j712J518J743j750k294J64j10O80K096K70j957n88
$$ 1664 1148 1444 1746 3246 2321 609 2127 3870 2120 -174 -10 -120 560 2656 2926 969 381
2521C81p0l84J009J139k522l108K602L489r58k518p48O53K282J189k994l495K079
$$ 381 311 -73 936 2075 -447 -3555 -953 2536 1578 -940 -1688 -1035 1247 2436 -558 -4053 -1974
2538a974L341j471j617L83R75J490L76k063k337J076J739J34q07N55j329o01K909
$$ -1974 1367 -104 -1721 -1338 -363 1127 1503 -560 -2897 -1821 -82 52 -755 -200 -1529 -2130 779
2555G79J514k025j885K20Q45J097O29k306r75K487J803j562q85K013K34j546j199
$$ 779 2293 268 -1617 -1397 -552 545 1174 -1132 -2107 380 2183 621 -264 1749 1983 437 -762
2572g62r94J159K976J226k578q48P62M42q66J301P5j467m21Q09n04J137J182j479
$$ -762 -1756 -597 2379 3605 1027 179 941 1383 517 1818 1893 426 5 814 310 1447 2629 1150
2590A150j584J876J069j896j276L43k64j29J414K06j51Q10j483k794O26K668j06
$$ 1150 -434 1442 2511 615 -661 -318 -582 -711 703 909 758 1568 85 -2709 -2083 585 479
2607D79j313j10m65j255J472R39k93l5N20k124j326J812N54r86L83J596q00k91
$$ 479 -834 -944 -1409 -2664 -1192 -253 -546 -581 -61 -2185 -3511 -1699 -1145 -2131 -1748 -152 -952 -1243
2625a243M15l50l79L95l69j170P34K798p11j339n8O4M44J841P31k514j165R85
$$ -1243 -828 -1178 -1557 -1162 -1531 -2701 -1967 831 120 -1219 -1277 -1213 -769 1072 1803 -711 -1876 -891
2643h91k21P83K549Q98j923p04P8r47P22J678J35j899L06L37L6J718M05k162j407
$$ -891 -1112 -329 2220 3118 1195 491 569 -378 344 2022 2157 258 564 901 937 2655 3060 898 -509
2662e09J801J015p59j37j159k074J776K597J74j050o99j736j120J455J655j039
$$ -509 1292 2307 1548 1411 252 -1822 -46 2551 2725 1675 976 -760 -1880 -425 1230 191
2678A91l15P66j208j078R20R88k38N34k64k714k49K392M79o26L47L10j270J025
$$ 191 -124 642 -566 -1644 -724 264 26 560 296 -2418 -2667 -275 204 -422 -75 235 -1035 -10
2696a0O67j665j092J109k05J1J347N83j043n23J416j303r41J340O58q15m02o96
$$ -10 657 -1008 -2100 -991 -1196 -1185 162 745 -298 -821 595 -708 -1649 -309 349 -466 -868 -1564
2714a564j005J593L257r44j946q86j53J17J287J122j426j354J117M14K28J832
$$ -1564 -2569 -976 2281 1337 -609 -1495 -1648 -1531 -244 878 -548 -1902 -785 -371 -143 1689
2730A689o04k904m42J808P39R0K45j232p23J860P67m47M42r4k130j034J913Q15
$$ 1689 1085 -1819 -2261 -453 286 376 621 -611 -1334 526 1293 846 1288 1194 -936 -1970 -57 758
2748G58l6n0L6j081j22J553j64q59J92r78j930J815J940Jj064l63q66K26J269
$$ 758 722 672 708 -373 -495 1058 894 35 227 -751 -2681 -866 1074 1075 11 -352 -1218 -992 277
2767B77Ok035K51J516j137k33J857K87k49j61o39j535Q34K314q63m09J81k89n31
$$ 277 283 -1752 -1501 15 -1122 -1355 502 789 540 379 -260 -1795 -961 1353 490 81 262 -27 -558
2786e58J668J822j230j503m19q53R92J989j43j931M21J265n07K33J41j039j354
$$ -558 1110 2932 1702 199 -220 -1073 -81 1908 1765 -166 255 1520 1013 1246 1387 348 -1006
2803a006N36M92j29P78L99j750q46J632J055p27K27p64k398p30K253J735R28O4
$$ -1006 -470 22 -107 671 1070 -680 -1526 106 1161 434 661 -103 -2501 -3231 -978 757 1685 1749
2821A749k023k567J273K100L2m37j17n70l78R37k92q2J558J562j615j844m5k95
$$ 1749 -274 -2841 -1568 532 564 127 10 -560 -938 -1 -293 -375 1183 2745 1130 -714 -759 -1054
2839a054M48J441L91j122K26J470o51j602m57m10N53K568O70l075k121R03J649
$$ -1054 -606 835 1226 104 330 1800 1149 -453 -910 -1320 -767 1801 2471 -604 -2725 -1822 -173
2856a73J426J360j327k354l78L02j172Q84K839O93q50q44j497j144K093K541p96
$$ -173 1253 2613 1286 -1068 -1446 -1144 -2316 -1432 1407 2100 1250 406 -1091 -2235 -142 2399 1603
2873A603j967p70j23R04K526m7j938p69J358L88k78k09k026r73K568J922j263
$$ 1603 -364 -1134 -1257 -353 2173 2126 188 -581 777 1165 887 678 -1348 -2321 247 2169 906
2890I06r74O23n79j02O66p87j132J056J569j396o25P27J82J88Q39j146k394Q05
$$ 906 -68 555 -24 -126 540 -247 -1379 -323 1246 -150 -775 -48 134 322 1161 15 -2379 -1574
2908a574K730J85j325j189j089Q68L544J157k599k049m12JJ177J849L48j083N26
$$ -1574 1156 1341 16 -1173 -2262 -1394 2150 3307 708 -1341 -1753 -1752 -575 1274 1622 539 1065
2925A065m17j767k44J795J156J60j22k025k134J334K490P81m30k63j460o54J350
$$ 1065 648 -1119 -1363 432 1588 1748 1626 -399 -2533 -1199 1291 2072 1642 1379 -81 -735 615
2942F15l98k086O43K788L99l76n70k253j350K091K398m48n92m64j955m79J559
$$ 615 217 -1869 -1226 1562 1961 1585 1015 -1238 -2588 -497 1901 1453 861 397 -1558 -2037 -478
2959d78J263N71J238m93k990j801O58R97K110J869j606k396l04J210O91N4K83
$$ -478 785 1356 2594 2101 -889 -2690 -2032 -1035 1075 2944 1338 -1058 -1362 -152 539 593 876
2976H76j203j156R33Q07j052N49P98m45j09N87n03j390M06M86q57M15J917m99
$$ 876 -327 -1483 -550 257 -795 -246 552 107 -2 585 82 -1308 -902 -416 -1273 -858 1059 560
2994E60l85J67r78q80J574J214j091j044m0k71M86J732K32j988r5M03k03N02Q40
$$ 560 175 342 -636 -1516 58 1272 181 -863 -903 -1174 -688 1044 1276 -712 -807 -404 -607 -105 735
3013G35r39j185P28Q31m49Q35N70r67q57j86l66j67K316J153j826j431J40P75
$$ 735 -204 -1389 -661 170 -279 556 1126 159 -698 -884 -1250 -1417 899 2052 226 -1205 -1065 -290
3031b90J178R81j289k445L55J526L46o11P04n43j48J534n7k126J23P70l41M25
$$ -290 888 1869 580 -1865 -1510 16 362 -249 455 -88 -236 1298 1241 -885 -762 8 -333 92
3049I2J41q2k33J280l64j718O7J581L48n06l70j748n13K244J449l91j075p5j106
$$ 92 233 151 -82 1198 834 -884 -817 764 1112 606 236 -1512 -2025 219 1668 1277 202 127 -979
3068i79k43J316M62r15K9M11m15J09R99n87p04O01M95j525K60Q09o26K87Q61n54
$$ -979 -1222 94 556 -359 -330 81 -334 -225 774 187 -517 84 579 -946 -686 123 -503 -216 645 91
3088I1q90J606O12j886q14J42N69J502J326j504j930j5J646L94O43m71k052o22
$$ 91 -799 807 1419 -467 -1281 -1139 -570 932 2258 754 -1176 -1191 455 849 1492 1021 -1031 -1653
3106a653J509O50q92P50O69j48n11o66j139l4K026R70j934o92Q69j86M21P18q91
$$ -1653 -144 506 -386 364 1033 885 374 -292 -1431 -1465 561 1531 -403 -1095 -226 -412 9 727 -164
3125a64n59J027M21j919k39L96M25M42J611m01j341o51l25q42R45K034q1q48k47
$$ -164 -723 304 725 -1194 -1433 -1037 -612 -170 1441 1040 -301 -952 -1277 -2119 -1174 860 779 -69 -316
3144c16o26p30J156J631m98r88J89j324n82R75J187K90O99j98j621m40J038P53
$$ -316 -942 -1672 -516 1115 617 -371 -182 -1506 -2088 -1113 74 364 1063 865 -756 -1196 -158 595
3162E95j097J06N55k24M51K34j266l02J701Q12j650l28M6k73K54J226l85P7J231
$$ 595 -502 -396 159 -65 386 620 -646 -948 753 1565 -85 -413 -367 -640 -386 840 455 532 1763
3181A763l16j549n00O46j2L35O32r08r62J535Q85l95r03q9r32M87J163j36r72
$$ 1763 1447 -102 -602 44 32 367 999 91 -871 664 1549 1154 251 162 -770 -283 880 744 -228
3200b28Q38N95j555m9P08M29O25p8j827j516P94J863jj02L90o15q97K40n10k26
$$ -228 610 1205 -350 -399 309 738 1363 1285 -542 -2058 -1264 599 598 496 886 271 -626 -386 -896 -1122
3220a122J588J113j229r97J15l66j98J512M22p01M4j87j444j246J369J361K89
$$ -1122 466 1579 350 -647 -532 -898 -1096 416 838 137 181 -6 -1450 -2696 -1327 34 323
3237C23J220m11k198n34P63m29R66J196N00j773n50m12K43J597J877p22j697j68
$$ 323 1543 1132 -1066 -1600 -837 -1266 -300 896 1396 -377 -927 -1339 -1096 501 2378 1656 -41 -209
3255b09k31l88M18J390p1P12K69j177j611P88O08k4K02J10p05L6N12n64n02J111
$$ -209 -440 -828 -410 980 909 1621 1890 713 -898 -110 498 474 676 786 81 117 629 65 -437 674
3275F74J305j535j086l59k99J182J089l86j118P06J079j116p68k92K05M95J159
$$ 674 1979 444 -642 -1001 -1300 -118 971 585 -533 173 1252 136 -632 -924 -719 -224 935
3292I35p30j668R16J591L53j298l75l90Q5J305k9j411j16J370j03j77J31j55m36
$$ 935 205 -1463 -547 1044 1397 99 -276 -666 -581 724 695 -716 -832 538 435 258 389 234 -202
3311b02J042r03j635K68J545R16n29k79o10l54J041L04j481j55J292J6o11k38
$$ -202 840 -63 -1698 -1430 115 1031 502 223 -387 -741 300 604 -877 -1032 260 276 -335 -573
3329e73q4L83N64J006j101k88l39l67n16J401J439o04m63j57j75J77L44l34r39
$$ -573 -657 -274 290 1296 195 -93 -432 -799 -1315 86 1525 921 458 301 126 303 647 313 -626
3348f26J055J053j216n60M78J1Q57Q06m00j859j50M89j14M55L71n55K15O46m82
$$ -626 429 1482 266 -294 184 195 1052 1858 1458 -401 -551 -62 -176 279 650 95 310 956 474
3367D74j385k30J619M40p09o87q69O35J814J22k066j41J687M97j304r38j49P38
$$ 474 -911 -1141 478 918 209 -478 -1347 -712 1102 1224 -842 -983 704 1201 -103 -1041 -1190 -452
3385d52J712K62j651p93J277K51j15m40l94m89R76J147j014p42K48N34L27L75
$$ -452 1260 1522 -129 -922 355 606 491 51 -343 -832 144 1291 277 -465 -217 317 644 1019
3403A019j143j365j84J464k37l72M88n6p3K60m55p69Q05P85j111j050O95O44k75
$$ 1019 -124 -1489 -1673 -209 -446 -818 -330 -386 -459 -199 -654 -1423 -618 167 -944 -1994 -1299 -655 -930
3422i30K34M66m59N32L5r00l38J062m96m36O34J437l18o74n98J52O25J088m93
$$ -930 -696 -230 -689 -157 -122 -1022 -1360 -298 -794 -1230 -596 841 523 -151 -749 -597 28 1116 623
3441F23j494J99J065m7L29Qm08m3O79k20j490r8R07O90M19L09j737m64J300J029
$$ 623 -871 -672 393 346 675 683 275 232 911 691 -799 -897 10 700 1119 1428 -309 -773 527 1556
3461A556j132j023L4J37J049N72r55j076J144J612o27j409K9L63l21K28m86l32
$$ 1556 424 -599 -565 -428 621 1193 238 -838 306 1918 1291 -118 -89 274 -47 181 -305 -637
3479f37J381J040j226o67L32m3l15O08l25q87M88Q61k08l21J82o69l28R64J64
$$ -637 744 1784 558 -109 223 180 -135 473 148 -739 -251 610 402 81 263 -406 -734 230 394
3498C94j090j22mQ8n4J364k69k66l43r1j164J00J252k30m22M70O01r85m56K64
$$ 394 -696 -818 -822 -734 -788 576 307 41 -302 -393 -1557 -1457 -205 -435 -857 -387 214 -771 -1227 -963
3518i63M52M75P52j479j741J132J223K01p50P17l73K15M41q69j073N12J061LK35
$$ -963 -511 -36 716 -763 -2504 -1372 -149 52 -698 19 -354 -139 302 -567 -1640 -1128 -67 -64 171
3537A71L11p11q18J204k50l17O98N40j019l14r5j41P84J664k34j449l19M07O9
$$ 171 482 -229 -1047 157 -93 -410 288 828 -191 -505 -600 -741 43 1707 1473 24 -295 112 181
3556A81O5m5J50j00Q44j50r24n5J036n28o45N13J20p15K49j7k89L93J034p15k21
$$ 181 246 201 351 251 1095 945 21 -34 1002 474 -171 342 462 -253 -4 -21 -310 83 1117 402 181
3577A81L16j19r28L7M54K13K61P46l04j295O26P18n68J37N7p75kR11N17p04j43
$$ 181 497 378 -550 -513 -59 154 415 1161 857 -438 188 906 338 475 532 -243 -245 666 1183 479 336
3598C36M97m72K64K47j193k31N77L29k32J35J284q09o80m09n39O20Q26J80j390
$$ 336 833 361 625 872 -321 -552 25 354 122 257 1541 732 52 -357 -896 -276 550 730 -660
3617f60n20Q31M10p4K92j046k36R09r6n22k35L21K78j1Q47o59o76J07O01k96k11
$$ -660 -1180 -349 61 -13 279 -767 -1003 -94 -190 -712 -947 -626 -348 -359 488 -171 -847 -740 -139 -435 -646
3638f46L29J79N3N64l16q28L09Q09l60j91L54p48l20M64L83o7N29J39q44j96M25
$$ -646 -317 -138 -85 479 163 -665 -356 453 93 -98 256 -492 -812 -348 35 -32 497 636 -208 -404 21
3659B1m1r2L92K49q90J82M81L73l34L63l91p37M95O32j22o70L19k14J46J293k77
$$ 21 -20 -112 280 529 -361 -179 302 675 341 704 313 -424 71 703 581 -89 230 16 162 1455 1178
3680A178p22m05m0k21M84Q02m86o38K14N21m4J78K07j131k28P99l56k33O76j81
$$ 1178 456 51 11 -210 274 1076 590 -48 166 687 643 821 1028 -103 -331 468 112 -121 555 374
3700C74m6m10M59l3j65k18o59k22O97N74q99J67P96n73j70L85l89p24Q07M24k12
$$ 374 328 -82 377 344 179 -39 -698 -920 -223 351 -548 -381 415 -158 -328 57 -332 -1056 -249 175 -37
3721c7o86Q29l27k00J290j08q33o49P43j42L85K71l83m21N12O99n95j90M83q45
$$ -37 -723 106 -221 -421 869 761 -72 -721 22 -120 265 536 153 -268 244 943 348 158 641 -204
3741b04l01O32K12j92N01l8q15M46O39o7o70k50m64j32J105Q76q15p95J26J10
$$ -204 -505 127 339 147 648 610 -205 241 880 813 143 -107 -571 -703 402 1278 463 -332 -206 -96
3761i6K51Q46o72j130j35O89J28j11M93J6n29J37k84p16K32Q90q46k90Q14K46
$$ -96 155 1001 329 -801 -936 -247 -119 -230 263 279 -250 -113 -397 -1113 -881 9 -837 -1127 -313 -67
3781f7k68k5qo7k38O71k30o55L99N2O7L03N85o28j24J96k43m34K97m1j09Q04L57
$$ -67 -335 -360 -368 -435 -673 -2 -232 -887 -488 -436 -369 -66 519 -109 -233 -37 -280 -714 -417 -458 -567 237 594
3804E94m79n71K66j6P2N29J6j132l78Q94M82N15O4q22q89N56J362k43r06l45l07
$$ 594 115 -456 -190 -206 -134 395 411 -721 -1099 -205 277 792 856 34 -855 -299 1063 820 -86 -431 -738
3825g38Q12R06k61o85O9P73l74l44J59j09m33Q91j78n42O74O71n81o52r2N5K74
$$ -738 74 980 719 34 103 876 502 158 317 208 -225 666 488 -54 620 1291 710 58 -34 21 295
3846B95O23m43j475J37J179N82l78l71q85l90P93L25q23l60J003l4j43k1o8n23
$$ 295 918 475 -1000 -863 316 898 520 149 -736 -1126 -333 -8 -831 -1191 -188 -222 -365 -386 -454 -977
3866i77N51M97l77q14K71j99K99R13O29p43m54j20%K79O09m01p57P32J27K58j01
$$ -977 -426 71 -306 -1120 -849 -1048 -749 164 793 50 -404 -524 -524 -245 364 -37 -794 -62 65 323 222
3887B22L50m76k93P32k9p84o9L99j06M19K21k27l70L67o71o48J20J278J07n55
$$ 222 572 96 -197 535 506 -278 -347 52 -54 365 586 359 -11 356 -315 -963 -843 435 542 -13
3907a3m05n83J95J963K90j774o43M16K28j18M63k94k83P45O17q63k07J72N21k95
$$ -13 -418 -1001 -806 1157 1447 -327 -970 -554 -326 -444 19 -275 -558 187 804 -59 -266 -94 427 132
3927A32K62o29k41O28K71J90k98L39l74q0O0n24J17K61P28o63n73O17M21n28Q6
$$ 132 394 -235 -476 152 423 613 315 654 280 200 260 -264 -147 114 842 179 -394 223 644 116 202
3948B02l42O0j5M29q32j20O66j24L11O6J02q94k60O56k53L61P04k91q76p5R60
$$ 202 -140 -80 -95 334 -498 -618 48 -76 235 301 403 -491 -751 -95 -348 13 717 426 -450 -525 435
3969D35ML29J58j599l67J163Q17o26l43m6P9O44L58j198p10Q27M26j69n03O4L84
$$ 435 439 768 926 -673 -1040 123 940 314 -29 -75 4 648 1006 -192 -902 -75 351 182 -321 -257 127
3990A27M04K37q69m43N56P28p20p86L81JP08O46o67r01QR71Ol96k26k18L00Q74
$$ 127 531 768 -101 -544 12 740 20 -766 -385 -384 324 970 303 -598 -590 381 387 -9 -235 -453 -153 721
4012G21j69p60k01P25L9L7l63p15o2R35N65l00m91J84k40K62N49q4r70k07K37
$$ 721 552 -208 -409 316 355 392 29 -686 -748 187 752 452 -39 145 -95 167 716 632 -338 -545 -308
4033c08J11O89L94j148o85J130P44m29r67k57o9J158L24q40j065J563N93r96m66
$$ -308 -197 492 886 -262 -947 183 927 498 -469 -726 -795 363 687 -153 -1218 345 938 -58 -524
4052e24k27L70O93M39j203o46P21R34P42p23r74n28L53J338k73j550p9J216P80
$$ -524 -751 -381 312 751 -452 -1098 -377 557 1299 576 -398 -926 -573 765 492 -1058 -1137 79 859
4071H59M1p68r91L38J547k0j380m92P72N51J12J05n24J01O40N3j045k19K44K30
$$ 859 900 132 -859 -521 1026 1006 -374 -866 -94 457 569 674 150 251 891 944 -101 -320 -76 154
4091A54p2N70J51p83K95L3l9K41L11j127m43R32k9k71L31M15l25j06j31n10k50
$$ 154 82 652 803 20 315 348 309 550 861 -266 -709 223 194 -77 254 669 344 238 107 -403 -653
4112f53O04N92o89k51N4m2M48O32l87j190L21N54l1q9k97p20Q25J560n47j332
$$ -653 -49 543 -146 -397 -343 -385 63 695 308 -882 -561 -7 -38 -127 -424 -1144 -319 1241 694 -638
4132f38m24Q55M89M50p24q42m6J869m69q81j15Q90j56Jm33j085J06J573O02j142
$$ -638 -1062 -207 282 732 8 -834 -880 989 520 -361 -476 414 258 259 -174 -1259 -1153 420 1022 -120
4152a20n14L08O12J43l91n39p41R97Q60q98o63K46J016L78L3j019p27N93Q71m77
$$ -120 -634 -326 286 429 38 -501 -1242 -245 615 -283 -946 -700 316 694 727 -292 -1019 -426 445 -32
4172c2k97J49K41j7Q74m28p95L92J90l82J09n5m49L74L25L94j53k15j24p31N9
$$ -32 -329 -180 61 44 918 490 -305 87 277 -105 4 -51 -500 -126 199 593 440 225 101 -630 -571
4193e71J085Rq35j07K60m0P1K65l73k46P68j3j124k06L41N06O16J17j140l88J004
$$ -571 514 523 -312 -419 -159 -199 -128 137 -236 -482 286 273 -851 -1057 -716 -210 406 523 -617 -1005 -1
4214aJ70k85n10M20L1L01L02q30j78J059M78l06q54J62j52M37L73k03p70Q97L46
$$ -1 169 -116 -626 -206 -175 126 428 -402 -580 479 957 651 -203 -41 -193 244 617 414 -356 541 887
4235H87j10q02l1l06P14L49k65r12J13O32j43J14K29n38k46K35l63j91P02N05
$$ 887 777 -25 -56 -362 352 701 436 -476 -363 269 126 240 469 -69 -315 -80 -443 -634 68 573
4255E73o01l30O53q8j51k47j95j97N89Q1n57k98Q64L48k21m4l25o69N40O01l36
$$ 573 -28 -358 295 207 56 -191 -386 -583 6 87 -470 -768 96 444 223 179 -146 -815 -275 326 -10
4276a0q91O64P50m50q0j23n94L90N60l06q27K05N66l44L14J75k93J4N14l36o22
$$ -10 -901 -237 513 63 -17 -140 -734 -344 216 -90 -917 -712 -146 -490 -176 -1 -294 -280 234 -102 -724
4297g24J00O63j8p0L1n30K40R70j83o30j22k9K62J05J57k14j91P34j81o54L98
$$ -724 -624 39 21 -49 -18 -548 -308 662 479 -151 -273 -302 -40 65 222 8 -183 551 370 -284 114
4318A14j18m05L30p8K47J06L23j53o86L78L90J04p36L34l62P3N29k9l56K10N36
$$ 114 -4 -409 -79 -157 90 196 519 366 -320 58 448 552 -184 150 -212 -139 390 361 5 215 751
4339G51m28m94n2K21m0K26K3q56P48M62m25j56K68n8j42J74l47m49J20P86j18
$$ 751 323 -171 -223 -2 -42 184 207 -649 99 561 136 -20 248 190 48 222 -125 -574 -454 332 214
4360B14l21k1K57K1L68l79r19L91Q38J10m53l75K92J43L44J42j051o4O82Rm35
$$ 214 -107 -128 129 150 518 139 -780 -389 449 559 106 -269 23 166 510 652 -399 -463 219 228 -207
4381b07P9K92J40Q0K49m51p94R54P4o90R3L2l61K84P03j31n61K35j6l05q6k0J86
$$ -207 -128 164 304 384 633 182 -612 342 416 -274 -181 -149 -510 -226 477 346 -215 20 4 -301 -387 -407 -221
4404b21j89O57j30j69J78k13j46J67N64o10j49P4J36q1N03O9l66j50M76k60n12
$$ -221 -410 247 117 -52 126 -87 -233 -66 498 -112 -261 -187 -51 -132 371 440 74 -76 400 140 -372
4425c72M34p7K76M13k85m29l30Q56O6q67J67j23KK65J15k56P9L78J56l20j97j64
$$ -372 62 -15 261 674 389 -40 -370 486 552 -315 -148 -271 -269 -4 111 -145 -66 312 468 148 -49 -213
4447b13j86K02M06l90m7M50J44n9j22l38R9K67K3m14l09N30J2l7M07m60j43O68
$$ -213 -399 -197 209 -181 -228 222 366 307 185 -153 -54 213 236 -178 -487 43 55 18 425 -35 -178 490
4469D90Q8q6q56N89O4k62Q4L17k65RK10n81l3J19N17n53R9M77o54K28J46r6j78
$$ 490 578 492 -364 225 289 27 111 428 163 172 382 -199 -232 -113 404 -149 -50 427 -227 1 147 51 -127
4492a27L42K44o37k70K61J37p1M82o5r9j51L92p26n5O27j51k69N31j46n52j21
$$ -127 215 459 -178 -448 -187 -50 -121 361 296 197 46 438 -288 -343 284 133 -136 395 249 -303 -424
4513d24Q43n08O9K88l9p26J68M96l34N33L40n87k84K86J48n85K09M1k16N36j64
$$ -424 419 -89 -20 268 229 -497 -329 167 -167 366 706 119 -165 121 269 -316 -107 -66 -282 254 90
4534I0k65r1L53j35j89J46q3jj08M04l33j41M54k52K5P0k45j85K27K65J7k15M16
$$ 90 -175 -266 87 -48 -237 -91 -174 -175 -283 121 -212 -353 101 -151 -126 -56 -301 -486 -259 6 23 -192 224
4557B24k51q1J73j47l94K49J43L28p85M37K21M8j55J63m46L15J80l40k98k87K43
$$ 224 -27 -108 65 -82 -476 -227 -84 244 -541 -104 117 165 10 173 -273 42 222 -118 -416 -703 -460
4578d60L58K60M24m03j96K18l00k58R4M43j93r6K33o5j71K62K36k93j62l82L17
$$ -460 -102 158 582 179 -17 201 -99 -357 -263 180 -13 -109 124 59 -112 150 386 93 -69 -451 -134
4599a34l91Q64j63k53M61R1o62K08L97l41l03J65J49j59L34l67N8o9N56l39l08
$$ -134 -525 339 176 -77 384 475 -187 21 418 77 -226 -61 88 -71 263 -104 -46 -115 441 102 -206
4620b06K13Qn62M31K7N7l15P84m19j49K51J26l52j32L54n16M49L52On00Q5k6j20
$$ -206 7 15 -547 -116 -89 -32 -347 437 18 -131 120 246 -106 -238 116 -400 49 401 407 -93 -8 -34 -154
4643a54K44K91m31l21M94m2k70N20m34l7k7K78k44m56N12L0l74R3L49o4j50N59
$$ -154 90 381 -50 -371 123 81 -189 331 -103 -140 -167 111 -133 -589 -77 -47 -421 -328 21 -43 -193 366
4665C66p22r3M55k44k49J1O91k70j25O71n59o6j8J44l15K9N28k31k3L28m35j00
$$ 366 -356 -449 6 -238 -487 -476 215 -55 -180 491 -68 -134 -152 -8 -323 -294 234 3 -20 308 -127 -227
4687b27J3J23j09K9R7q4k19N01K21l97k0L55l53k52P39k20m12J82N3j76k6L28
$$ -227 -214 -91 -200 -171 -74 -158 -377 124 345 -52 -72 283 -70 -322 417 197 -215 -33 20 -156 -182 146
4709A46l5J55Mj89j35%M0k62K12J45J8j00M01l5n83J72J13Oj10L76K9m60K66o0
$$ 146 111 266 270 81 -54 -54 -14 -276 -64 81 99 -1 400 365 -218 -46 67 73 -37 339 368 -92 174 114
4733A14k32K59M07n84l5N9J2q3R2J33j97K26j0k78k2J30l6m41N43J62J7j85K41
$$ 114 -118 141 548 -36 -71 -12 0 -83 9 142 -55 171 161 -117 -139 -9 -45 -486 57 219 236 51 292
4756B92l46k25L60N4j22l1J93k51m4J21K31l23K54L8k94j32M01m0l36J33jo4n9
$$ 292 -54 -279 81 135 13 -18 175 -76 -120 1 232 -91 163 201 -93 -225 176 136 -200 -67 -68 -132 -191
4779a91M05m08k25M68k12m7L75K31o42o7N86k53N2J59k55m15K88j%JP21p46M2
$$ -191 214 -194 -419 49 -163 -210 165 396 -246 -313 273 20 72 231 -24 -439 -151 -152 -152 -151 570 -176 -134
4802a34L38p9j53K66l7p01K38M38k56M7L81l71l82L07M09m06k76L13j49RO41j78
$$ -134 204 125 -28 238 201 -500 -262 176 -80 -33 348 -23 -405 -98 311 -95 -371 -58 -207 -198 443 265
4824B65k90JM18j47m99J55K2N2K17M6l09n6L02r8K59r9l75k59M43K34k62O8J62
$$ 265 -25 -24 394 247 -252 -97 -75 -23 194 240 -69 -125 177 79 338 239 -136 -395 48 282 20 88 250
4847B50j49pK76j17l92K3N5m23N76L14o56j26P47j91q0L50R5l94k18p2J82mL14
$$ 250 101 94 370 253 -139 -116 -61 -484 92 406 -250 -376 371 180 100 450 545 151 -67 -139 43 39 353
4870C53Q8o16K4L8r6J4K61m8M7J99R5k39k37K82l28J34K91j53n44L48J42mJ24
$$ 353 441 -175 -151 -113 -209 -195 66 18 65 264 359 120 -117 165 -163 -29 262 109 -435 -87 55 51 175
4893A75p5J53m10M24l96p3J31mn6J88q0k87K70j22N70n49j45K69l0q9N7L00n09
$$ 175 100 253 -157 267 -129 -202 -71 -75 -131 57 -23 -310 -40 -162 408 -141 -286 -17 -47 -136 -79 221 -288
4916b88K39K96n70Q5N12n05J75k04JK41r1K65M8n38M11k09j95L23J27l43N6J26
$$ -288 -49 247 -323 -238 274 -231 -56 -260 -259 -18 -109 156 204 -334 77 -132 -327 -4 123 -220 -164 -38
4938c8r0K24O1j68J19l4m24p9L48j86J88j05M12k46k78L48O4k26l77P2J60L29
$$ -38 -128 96 157 -11 108 74 -350 -429 -81 -267 -79 -184 228 -18 -296 52 116 -110 -487 -415 -255 74
4960G4L05k51j30k27L02K16l89J16j91n9L86j8k28J36Q5J8j00L60l86o06O80M4
$$ 74 379 128 -2 -229 73 289 -100 16 -175 -234 152 134 -94 42 127 145 45 405 19 -587 93 137
4982A37q0k50J08L02K6K26n09k85K49L67j22l48J62l61N70q2K51n21N7J38J8p1
$$ 137 57 -193 -85 217 243 469 -40 -325 -76 291 169 -179 -17 -378 192 110 361 -160 -103 35 53 -18
5004a8J68k23p8L80r2m4J08K9l16m1J02j57p9J95L62l72J07j04J25k23L89j10
$$ -18 150 -73 -151 229 137 93 201 230 -86 -127 -25 -182 -261 -66 296 -76 31 -73 52 -171 218 108
5026A08n50M78J4k4P2p3l39J3K06K09J49p07L52j29L70J84o50L87o1L99o80J58
$$ 108 -442 36 50 26 98 25 -314 -301 -95 114 263 -444 -92 -221 149 333 -317 70 9 408 -272 -114
5048a14%k25K30j2K67n36M15m5Q5p1R1l80L8J04M59n23J49K48m81J44K0K41k68
$$ -114 -114 -339 -109 -121 146 -390 25 -20 65 -6 85 -295 -257 -153 306 -217 -68 180 -301 -157 -137 104 -164
5071a64J13J77o42N35N8J93m66K63k93M8J81N46p15j64K8J24L45K04m37J88K14
$$ -164 -51 126 -516 19 77 270 -196 67 -226 -178 3 549 -166 -330 -302 -178 167 371 -66 122 336
5092C36j57o6q1l9j47k04K93L31m57M82j75j9q5J45p78K55P52j50j03J42r4o1
$$ 336 179 113 32 -7 -154 -358 -65 266 -191 291 116 97 12 157 -621 -366 386 236 133 275 181 120
5114A20k0M2j70k11N3K13k1j0K16m1J9K56k34m71J07M85l98J12k55N5K61K84l13
$$ 120 100 142 -28 -239 -186 27 6 -4 212 171 190 446 212 -259 -152 333 -65 47 -208 -153 108 392 79
5137G9j93K15K46mm00kk79K0J078n9n88k21r0K70L91l02l05P4j55J83J38k81K73
$$ 79 -114 101 347 343 -57 -59 -338 -318 760 701 113 -108 -198 72 463 161 -144 -70 -225 -42 96 -185 88
5160H8j63Q2K67k10m61J11O22l32j54M43m32O3J48l3k57Q6L44q61M91L61m87k6
$$ 88 -75 7 274 64 -397 -286 336 4 -150 293 -139 -76 72 39 -218 -132 212 -649 -158 203 -284 -310
5182c10M07K0k68M19o68L33j38O48m64l42L10J65L9l22K13k88N11k12J19n31K27
$$ -310 97 117 -151 268 -400 -67 -205 443 -21 -363 -53 112 151 -171 42 -246 265 53 172 -359 -132
5203a32k38O75j90j44m68M1N83K14m21k02j65J84J50L37j16k1j25J93j44k3J6
$$ -132 -370 305 115 -29 -497 -456 127 341 -80 -282 -447 -263 -113 224 108 87 -38 155 11 -12 4
5224Dj64L57J16k82R1l7R8j21K30N9m56j13L88O3m08N36K5k56J99l7o00L00k08
$$ 4 -160 197 313 31 122 85 183 62 292 351 -105 -218 170 233 -175 361 386 130 329 292 -308 -8 -216
5247b16L68m96O03L3k68N4J52k39m58J59L03L0j37j4J38j68O65n40L68k00j09
$$ -216 152 -344 259 292 24 78 230 -9 -467 -308 -5 25 -112 -126 12 -156 509 -31 337 137 28
5268B8k08N1J65l78L5N81J56m44m1M9j35M22j98l47k20N09j09L4M28j36l24l4
$$ 28 -180 -129 36 -342 -307 274 430 -14 -55 -6 -141 281 83 -264 -484 25 -84 -50 378 242 -82 -116
5290a16K2p9n6nM42l50M1o7J39J38J44m29j3J61j2O2K04j5m14M10J37q5m04K8
$$ -116 -94 -173 -229 -234 208 -142 -101 -168 -29 109 253 -176 -189 -28 -40 22 226 211 -203 207 344 259 -145 -117
5314a17k11K46lL85m54k05M31J32j03L04l62l93L49J12k19k71L14j76K58J07L07
$$ -117 -328 -82 -85 300 -154 -359 72 204 101 405 43 -350 -1 111 -108 -379 -65 -241 17 124 431
5335D31o86J47J18k92J09K78l53RM43L3q6l88k6M70k93p4rj89L3N31k35k25K96
$$ 431 -255 -108 10 -282 -173 105 -248 -239 204 237 151 -237 -263 207 -86 -160 -169 -358 -325 206 -29 -254 42
5358D2p5L33l40j06Q8k30M92J78n43K88J66l02L62j67m75N4M75pm5k26K15M8j7
$$ 42 -33 300 -40 -146 -58 -288 204 382 -161 127 293 -9 353 186 -289 -235 240 233 188 -38 177 225 208
5381B08J28p83L57J77l02K82j04J09q7K22r1p4n0k84O4L0j5K35o4m21L87J98j84
$$ 208 336 -447 -90 87 -215 67 -37 72 -15 207 116 42 -8 -292 -228 -198 -213 22 -42 -463 -76 122 -62
5404f2k6O1j08J74L06n29J13q5K90J1j42p0j0j5J69m91L72q4J61l02K58k52J7
$$ -62 -88 -27 -135 39 345 -184 -71 -156 134 145 3 -67 -77 -92 77 -414 -42 -126 35 -267 -9 -261 -244
5427b44K9L06L78p59K3K32L0J74N8l38j17M28K53l87k54J11p9K69q8l12J61L34
$$ -244 -215 91 469 -290 -267 -35 -5 169 227 -111 -228 200 453 66 -188 -77 -156 113 25 -287 -126 208
5449B08k80j46K27L96o12N60l42m30KP17m0k87j9J0k8m0K7l1oj88M27j69J23j8
$$ 208 -72 -218 9 405 -207 353 11 -419 -417 300 260 -27 -46 -36 -64 -104 -77 -108 -114 -302 125 -44 79 61
5473F1l8o4L13o7k82K61mq6j27M28m76j02L88k32K74l27Pj97N17l58j24L82R1
$$ 61 23 -41 272 205 -77 184 180 94 -33 395 -81 -183 205 -27 247 -80 -73 -270 247 -111 -235 147 238
5496B38l52K02k85M29l84J08J99l00O7K26l16n2K31J34m44K62o2j4J30K99k98
$$ 238 -114 88 -197 232 -152 -44 155 -145 -78 148 -168 -220 11 145 -299 -37 -99 -113 17 316 18
5517A8K66P4j37n57l05Q70j42j26J55Kj58Q2L04k94K76k09N7k90O9l8k99L35n7
$$ 18 284 358 221 -336 -641 229 87 -39 116 118 -40 42 346 52 328 119 176 -114 -45 -83 -382 -47 -104
5540a04K15j37N1K37m53J09j15q4K71j01Q8j10J57J37k5r4J03r8N2o3K7k7j10
$$ -104 111 -26 25 262 -191 -82 -197 -281 -10 -111 -23 -133 24 161 136 42 145 47 99 36 63 36 -74
5563g4K84k79j93L8M24m4l64Q6m00P62R9k92q2J14k47m4K61j01J06k16K53k44
$$ -74 210 -69 -262 -224 200 156 -208 -122 -522 240 339 47 -35 79 -168 -212 49 -52 54 -162 91 -153
5585a53l25O65N8o6j81O5k96LK6j9K47j10J6P0J61j85O2L7L0l51K11J45p8p6p3
$$ -153 -478 187 245 179 -2 63 -233 -230 -204 -223 24 -86 -70 0 161 -24 38 75 105 -246 -35 110 32 -44 -117
5610a17N06m30l3L10l54L8J83l77J23N30l37Qm1j46M38k7k29j34n0j88M19N7j88
$$ -117 389 -41 -74 236 -118 -80 103 -274 -151 379 42 50 9 -137 301 274 45 -89 -139 -327 92 149 -39
5633c9M29K0k74k45K70k24k69N68l91q8M33J10l71K46j74j07q9J55n4j07O97n66
$$ -39 390 410 136 -109 161 -63 -332 236 -155 -243 190 300 -71 175 1 -106 -195 -40 -94 -201 496 -70
5655g0J41K52k76PK97K3p06n2J26J18K1j37L73j84l20M74j34OK69l32j70L56l9
$$ -70 71 323 47 54 351 374 -332 -384 -258 -140 -119 -256 117 -67 -387 87 -47 -41 228 -104 -274 82 43
5678D3l17J99K27j85k28K05J19j66l14K27R8J00J64P1k53O8qR7l85J98m6o28M11
$$ 43 -274 -75 152 -33 -261 -56 63 -103 -417 -190 -92 8 172 243 -10 58 50 147 -238 -40 -86 -714 -303
5701c03K49j12J2L72j43j95L79l58p0J24j1r6ML99o9l64L01j22n4K26m27J66J45
$$ -303 -54 -166 -154 218 75 -120 259 -99 -169 -45 -56 -152 -148 251 182 -182 119 -3 -57 169 -258 -92 53
5724E3j64qJ38K72j77m1J38j41q5l3L40l46J10L6k48L6L49o3j30K31j48j30o35
$$ 53 -111 -119 19 291 114 73 211 70 -15 -48 292 -54 56 92 -156 -120 229 166 36 267 119 -11 -646
5747f46N92J25j09J6R3j88j25K25R8j81R2J12r4q0M91l84O2p2Mj3m3j35J18kL20
$$ -646 -54 71 -38 -22 71 -117 -242 -17 81 -100 -8 104 10 -70 421 37 99 27 31 18 -25 -160 -42 -44 276
5772B76l07k52N13l19r5K1K20j8J1j68M16m06J23J1J27k49M16o63L12q8l0P2k24
$$ 276 -31 -283 230 -89 -184 -163 57 39 50 -118 298 -108 15 26 153 -96 320 -343 -31 -119 -149 -77 -301
5795c01K36K0p5J1n8p6J81j0M2l6K71m03j34L75j33j85J71M74k73o7J37m64K63
$$ -301 -65 -45 -120 -109 -167 -243 -62 -72 -30 -66 205 -198 -332 43 -90 -275 -104 370 97 30 167 -297 -34
5818c4J01J97l62K39l45L45j91L07m90K7K77o8k38K10L19p41M89Q7m71m5K83J84
$$ -34 67 264 -98 141 -204 141 -50 257 -233 -206 71 3 -235 -25 294 -447 42 129 -342 -387 -104 80
5840H0j47O9L58n83J35N55l04j01n4J04p7J8j12n1K71J20j89j81K82j40k19J09
$$ 80 -67 2 360 -223 -88 467 163 62 8 112 35 53 -59 -110 161 281 92 -89 193 53 -166 -57
5862e7R0J33j34L62m55M8J36j14j06L27j09k30j8N7M39l06J04K7l23K46k11j26
$$ -57 33 166 32 394 -61 -13 123 9 -97 230 121 -109 -127 -70 369 63 167 194 -129 117 -94 -220
5884b20J45kj61K8N5L93k03k95L33k53J53j35K52j17R5l38K45j54K84j3k61L38
$$ -220 -75 -77 -238 -210 -155 238 35 -260 73 -180 -27 -162 90 -27 68 -270 -25 -179 105 92 -169 169
5906A69Qk95n4N18j62k06Q5p7Oj6o6N72o05K04l70K20K24j29J40r1m5k11R8J68
$$ 169 177 -118 -172 346 184 -22 63 -14 -8 -24 -90 482 -123 81 -289 -69 155 26 166 75 30 -181 -83 85
5930H5j85J96o3J80j82j95K57k73J26k27J96K11m4J03m3J09k78q9J47Mq9J36l4
$$ 85 -100 96 33 213 31 -164 93 -180 -54 -281 -85 126 82 185 142 251 -27 -116 31 35 -54 82 48
5953D8OJ07j80l3J02j79L89r0m80K68Q4k03R7m2K2j17L37J6J8m53J42J9Q8P3k77
$$ 48 54 161 -19 -52 50 -129 260 170 -310 -42 42 -161 -64 -106 -84 -201 136 152 170 -283 -141 -122 -34 39 -238
5978b38O0K90R5l43J27J45k73j60Q2N23m77j59J21K77J06R7l24N5N2j87J34j1
$$ -238 -178 112 207 -136 -9 136 -137 -297 -215 308 -169 -328 -207 70 176 273 -51 4 56 -131 3 -8
6000hQ4j29m3J48R3k52J8L2j65J67K93n81J42N02l99K40J16j37J01j59j11m6j40
$$ -8 76 -53 -96 52 145 -107 -89 -57 -222 -55 238 -343 -201 301 -98 142 258 121 222 63 -48 -94 -234
6023b34J93j92K79l45M23j46j5L22m34j74P11n41M9J53P6k30L93j24q9j87M5L5
$$ -234 -41 -233 46 -299 124 -22 -37 285 -149 -323 388 -153 -104 49 125 -105 288 164 75 -112 -67 -32
6045c2o5L9N5J11jn9J71k45K41p0m7pJ06k16j12Q4J42J27j85O0J03m43L03R8k56
$$ -32 -97 -58 -3 108 107 48 219 -26 215 145 98 91 197 -19 -131 -47 95 222 37 97 200 -243 60 158 -98
6070i8L10j56m12N11Q7k08k92KJ66p6J24N3l04O9O37n23J03m70O95m01O9J32Q
$$ -98 212 56 -356 155 242 34 -258 -256 -90 -166 -42 11 -293 -224 413 -110 -7 -477 218 -183 -114 18 26
6093B6P8j89qj94L44J62m36q7M13j94K26k38O2k07J18K44j89J48j6o2j11P3j5
$$ 26 104 -85 -93 -287 57 219 -217 -304 109 -85 141 -97 -35 -242 -124 120 -69 79 63 1 -110 -37 -52
6116e2J60O8o7k38J34K99l11k76k0M01k00J05M1j11J78L1j70J9J23j75k43K29
$$ -52 108 176 109 -129 5 304 -7 -283 -303 98 -102 3 44 -67 111 142 -28 -9 114 -61 -304 -75
6138g5J75k66r7L54j78Q1K72j34k25K07m3m85L32L46l19k9K33O2j08j31n2J00
$$ -75 100 -166 -263 91 -87 -6 266 132 -93 114 71 -414 -82 264 -55 -84 149 211 103 -28 -80 20
6160B0l27p8O31q8Pj8l27K89J17R8n05j30K66j65N7J66j15p7L85j0M8l39j41O4
$$ 20 -307 -385 246 158 165 147 -180 109 226 324 -181 -311 -45 -210 -153 13 -102 -179 206 196 244 -95 -236 -172
6184a72K89O6k13M7r5k7J25j21J07k28K63k58L52o6o3j21J8K00J06l47m9L05k27
$$ -172 117 183 -30 17 -78 -105 20 -101 6 -222 41 -217 135 69 6 -115 -97 103 209 -138 -187 118 -109
6207a09l2K36n93L89L76j21j7L6K5p1j42j9k61L37o1K67m39k6Q1L65j07J5r1l33
$$ -109 -141 95 -498 -109 267 146 129 165 190 119 -23 -42 -303 34 -27 240 -199 -225 -144 221 114 129 38 -295
6231b95K43l3j5J23p5J48j46J07Kl37K44k09K06L21j05k66k15M05M00k72%j85
$$ -295 -52 -85 -100 23 -52 96 -50 57 59 -278 -34 -243 -37 284 179 -87 -302 103 503 231 231 46
6253D6m3J8K05k1l59K15j89M23k59J69l01L4j1%j87M54J3p4J87l36J10j28j86
$$ 46 3 21 226 205 -154 61 -128 295 36 205 -96 -62 -73 -73 -260 194 207 133 320 -16 94 -34 -220
6276b20L04k75R0J24K2J40l84L67p4K34k32k94L28j37j1M2K75j36n61J33M73M5
$$ -220 84 -191 -101 23 45 185 -199 168 94 328 96 -198 130 -7 -18 24 299 163 -398 -265 208 253
6298B53l51j21pJ76K67K12m66j7L89l62r9K65r8k72K94r7j10J40J22O9k25p5j3
$$ 253 -98 -219 -226 -50 217 429 -37 -54 335 -27 -126 139 41 -231 63 -34 -144 -4 118 187 -38 -113 -126
6321a26L3p1J29m80K15K80j96K8L29l89RL23L5j74j5K4j35K67K99l90j13J4J09
$$ -126 -93 -164 -35 -515 -300 -20 -216 -188 141 -248 -239 84 119 -55 -70 -46 -181 86 385 -5 -118 -104 5
6344Ej86K52l74O0OQ5L80k51j31K59j11j34M05k12j03L5L63n06K91J65k11j15
$$ 5 -181 71 -303 -243 -237 -152 228 -23 -154 105 -6 -140 265 53 -50 -15 348 -158 133 298 87 -28
6366b8K88k72k96J95L38j84m3J27J0q3n9j62R8L7J03m9k9K1O2p4J36M0k53l3Q9
$$ -28 260 -12 -308 -113 225 41 -2 125 135 52 -7 -169 -71 -34 69 20 -9 12 74 0 136 176 -77 -110 -21
6391b1j1K35j64j05q4K20K67l79Q9J17l1j46J18j11k16K7N31k28k58K72j40p2
$$ -21 -32 203 39 -66 -150 70 337 -42 47 164 133 -13 105 -6 -222 -195 336 108 -150 122 -18 -90
6413i0K06J31q4l37L58RM2j91J59m64K02K9j85K22p6J76j85j1K02r4O9j30J37
$$ -90 116 247 163 -174 184 193 235 44 203 -261 -59 -30 -215 7 -69 107 -78 -89 113 19 88 -42 95
6436I5R4j00k23J89pn6J82m74L98m5j28J87j34K7r1J12j26k56K93K78k45J97m09
$$ 95 189 89 -134 55 48 -8 174 -300 98 53 -75 112 -22 5 -86 26 -100 -356 -63 215 -30 167 -242
6459b42j70L25M6q4j63J41n7J5J67N9m2q1J09j13R0j44O3L7L5K44k52J26p9o8
$$ -242 -412 -87 -41 -125 -288 -147 -204 -189 -22 37 -5 -86 23 -90 0 -144 -81 -44 -9 235 -17 109 30 -38
6483c8k18J80l13J21K33K4j44r8M29k5k69K39l6l41J7K03o3J25J13R3n80M39k62
$$ -38 -256 -76 -389 -268 -35 -11 -155 -253 176 151 -118 121 85 -256 -239 -36 -99 26 139 232 -348 91 -171
6506a71l09M92j1j98N8J53p1p8M87N8m05k43l5J50K60p7J11l70L19Ql8q9J24j54
$$ -171 -480 12 1 -197 -139 14 -57 -135 352 410 5 -238 -273 -123 137 60 171 -199 120 128 90 1 125 -29
6530b9K92j04l55jK00j62L18Q7k20o1k72J43k48K32Q6M4L73m92Q2k87MN19O9m28
$$ -29 263 159 -196 -197 3 -159 159 246 26 -35 -307 -164 -412 -180 -94 -50 323 -169 -87 -374 -370 149 218 -210
6554b10K1K37l72K38L92Kk20J43k32j78oj3K29J12j75k7Q6k07Q8J0K2k0j59K13
$$ -210 -189 48 -324 -86 306 308 88 231 -1 -179 -185 -198 31 143 -32 -59 27 -180 -92 -82 -60 -80 -239 -26
6578b6K18j47k80K38K45m46K63N4J03k33K8K51n01K78o2J82j80J22l19K27L66
$$ -26 192 45 -235 3 248 -198 65 119 222 -11 17 268 -233 45 -17 165 -15 107 -212 15 381
6599C81l95j22J47l2L1n3K51j64P7o7j08J6N8j30K02k88M57j69j82J95r7k6j38
$$ 381 -14 -136 11 -21 10 -43 208 44 121 54 -54 -38 20 -110 92 -196 261 92 -90 105 8 -18 -156
6622a56J88k7r6K20l62K48o2K08k17J96l36K24j08J71J90k70j80K56N7j22J05
$$ -156 32 5 -91 129 -233 15 -47 161 -56 140 -196 28 -80 91 281 11 -169 87 144 22 127
6643A27j73j87q1J51n6L24k34J53J05j13J46J58r9k20J6J26K28j80O7j07J08j92
$$ 127 -46 -233 -314 -163 -219 105 -129 24 129 16 162 320 221 1 17 143 371 191 258 151 259 67
6665F7M9k3m8n6j74J76q3J47N4j4l5L56l69j92p7L04j43oM60m86K34m6m47J81
$$ 67 116 93 45 -11 -185 -9 -92 55 109 95 60 416 47 -145 -222 82 -61 -67 393 -93 141 95 -352 -171
6689a71J12Q4j46L52lk14j30L51R3k68K63k05M0j13j24l37K26M12j94p7m1M9K2
$$ -171 -59 25 -121 231 228 14 -116 235 328 60 323 118 158 45 -79 -416 -190 222 28 -49 -90 -41 -19
6712a9J71p4j90j6m5M23m29J4K00j22J92k91Q3J13lJ01j55J06K23m18K74qj59
$$ -19 152 78 -112 -128 -173 250 -179 -165 35 -87 105 -186 -103 10 7 108 -47 59 282 -136 138 130 -29
6735b9l31R3M00O7k54j48K73k03M87l36j18J9Q9L8k99K51k21j04K61R0J9O0J03
$$ -29 -360 -267 133 200 -54 -202 71 -132 355 19 -99 -80 9 47 -252 -1 -222 -326 -65 25 44 104 207
6758B07j41p3J26N3l60L42j14J53k07M16l45J88j12J22m87j7J62q5K64L4o4q8
$$ 207 66 -7 119 172 -188 154 40 193 -14 402 57 245 133 255 -232 -249 -87 -172 92 126 62 -26
6780b6R6j75L25k64K04j49M0K11j24J11m88M35m51m1N02j55J8K7l93j10K90J30
$$ -26 70 -105 220 -44 160 11 51 262 138 249 -239 196 -255 -296 206 51 69 96 -297 -407 -117 13
6802A3j6J30O4ml05L33l27L0M9J92k05O5J75j56j70K01J37l92l5R8k18M52K51
$$ 13 -3 127 191 187 -118 215 -112 -82 -33 159 -46 19 194 38 -132 69 206 -186 -221 -123 -341 111 362
6825C62m52L10l00n9J6J34K18l06J90n2r8P6L35n96L23j77j11K65k27l1J15j42
$$ 362 -90 220 -80 -139 -123 11 229 -77 113 61 -37 39 374 -222 101 -76 -187 78 -149 -180 -65 -207
6847b07K71J03l11J96o8m5N4k52Q6k25K10J13J04j77J71J05j75K70k34j41K24
$$ -207 64 167 -144 52 -16 -61 -7 -259 -173 -398 -188 -75 29 -148 23 128 -47 223 -11 -152 72
6868G2p9n1J81K42q0m38L41k10L5k40M11l79NJ01K45j04L54L3p60L77K85m17j58
$$ 72 -7 -58 123 365 285 -153 188 -22 13 -227 184 -195 -190 -89 156 52 406 439 -321 56 341 -76 -234
6891b34J22K52j24J83J0n06J54K71l1k92K28o8m4Q6j72J42J62J49k80k18K53J7
$$ -234 -112 140 16 199 209 -297 -143 128 97 -195 33 -35 -79 7 -165 -23 139 288 8 -210 43 60
6913F0r4j00R0J93l33k7M02j81J92j09m7j36j58J09K81k36K47j83p7J93k78J50
$$ 60 -34 -134 -44 149 -184 -211 191 10 202 93 46 -90 -248 -139 142 -94 153 -30 -107 86 -192 -42
6935d2K02O0k10J1P9j13o8L01k72j9j06K46P9j70j91L93j39K15j94k3K32m8j52
$$ -42 160 220 10 21 100 -13 -81 220 -52 -71 -177 69 148 -22 -213 180 41 256 62 39 271 223 71
6958G1l25K86k37K03P7J27j20J64k06L1j55J47n7L1P1j88K9k7K84J4R7J0j13m53
$$ 71 -254 32 -205 -2 75 202 82 246 40 71 -84 63 6 37 108 -80 -51 -78 206 220 317 327 214 -239
6982b39J02J38M2l0J86j20j01o4K71k77J30j65R1o3L04k34L71j94k55O9m56O48
$$ -239 -137 1 43 13 199 79 -22 -86 185 -92 38 -127 -36 -99 205 -29 342 148 -107 -38 -494 154
7004A54j4k28J34k8J84M9j84m8K6K83j4l04j71p9J02J39M0k61M54r0j55J23qN5
$$ 154 140 -88 46 18 202 251 67 19 45 328 314 10 -161 -240 -138 1 41 -220 234 144 -11 112 104 159
7028A59r3J95k01j77j15L85q5k15M17k43j81J49q5n7J11L5o4L9K50k36J69ll3
$$ 159 66 261 60 -117 -232 153 68 -147 270 27 -154 -5 -90 -147 -36 -1 -65 -26 224 -12 157 154 121
7051A21p7j5J04m02L6J99n6j90L95p2O7J50l79N7o7L26r8l40J45K64j10k31M70
$$ 121 44 29 133 -269 -233 -34 -90 -280 115 43 110 260 -119 -62 -129 197 99 -241 -96 168 58 -173 297
7074B97m37J79o2Q1J2J74j16k18Q1J61l05nK03k47O1K47k3o7L8J19q4k2J5l8R3
$$ 297 -140 39 -23 58 70 244 128 -90 -9 152 -153 -158 45 -202 -141 106 83 16 54 173 89 67 82 44 137
7099A37k99j1m9Q5L09k53K6l5J91L0q8j97o6J29R9n0k4M09k06j39Q6q6jl26L35
$$ 137 -162 -173 -222 -137 172 -81 -55 -90 101 131 43 -154 -220 -91 8 -42 -66 343 137 -2 84 -2 -3 -329 6
7124FJ47k46K6K0j09J1K36J93o74M21k36P3L40kK1k16J03J68l96L03J69r7k42
$$ 6 153 -93 -67 -47 -156 -145 91 284 -390 31 -205 -132 208 206 227 11 114 282 -114 189 358 261 19
7147A9R0n1L5L9J91k32K4j06j75J81l65O13l34K31j24j06K54k97J67k28R3P3R0
$$ 19 109 58 93 132 323 91 115 9 -166 15 -350 263 -71 160 36 -70 184 -113 54 -174 -81 -8 82
7170H2K8j00J2q7m9J36jj37K31q8J7j45J2j03K77J9J61k09j44j71J96J32r1j40
$$ 82 110 10 22 -65 -114 22 21 -116 115 27 44 -101 -89 -192 85 104 265 56 -88 -259 -63 69 -22 -162
7194a62J36j05k6L35j87j00K84Nl85J29p2Q4j41J54P9mJ66j67LN4j64RK86Kl42
$$ -162 -26 -131 -157 178 -9 -109 175 180 -205 -76 -148 -64 -205 -51 28 24 190 23 26 80 -84 -75 211 213 -129
7219a29K50m00L74j35J11M5k45O6K18k23k4l06L89j24n0K84o4M0k31J97j72p3
$$ -129 121 -279 95 -40 71 116 -129 -63 155 -68 -92 -398 -9 -133 -183 101 37 77 -154 43 -129 -202
7241b02K83k26J14O5J4m8j54K75r9n0N1mj50J38L51k17j22j48K7l15K66J76n2
$$ -202 81 -145 -31 34 48 0 -154 121 22 -28 23 19 -131 7 358 141 19 -129 -102 -417 -151 25 -27
7264b7j13L60l58K32k68K45l97M71n8k87J54K71j04k15K59l16P4J76q0J60j23
$$ -27 -140 220 -138 94 -174 71 -326 145 87 -200 -46 225 121 -94 165 -151 -77 99 19 179 56
7285E6l11r5J72M31l60L43m73K98l94J32P7K28oK7j81k09K33M07k61j86R7j10
$$ 56 -255 -350 -178 253 -107 236 -237 61 -333 -201 -124 104 98 125 -56 -265 -32 375 114 -72 25 -85
7307h5o6NJ07l35L47K99l52J41k24L26l30k4K81j0n5M8j79J76np1j01Q8L5k48
$$ -85 -151 -146 -39 -374 -27 272 -80 61 -163 163 -167 -191 90 80 25 73 -106 70 65 -6 -107 -19 16 -232
7331b32L79k70K31o3Q6j44J00q5o5j19K34r8Qj01J35J8K81n81L95l46N4L31l98
$$ -232 147 -123 108 45 131 -13 87 2 -63 -182 52 -46 -38 -139 -4 14 295 -286 109 -237 -183 148 -250
7354b50J61K60j72J75oJ57j11m39K20k04L11k71J71l0j2K36j78j52K08k00P3q6
$$ -250 -89 171 -1 174 168 325 214 -225 -5 -209 102 -169 2 -28 -40 196 18 -134 74 -126 -53 -139
7376a39k7j06J22J68O3k08K19J04k46r3N1J38N7j56q1P7L48p0l48K19k97K45l58
$$ -139 -166 -272 -150 18 81 -127 92 196 -50 -143 -92 46 103 -53 -134 -57 291 221 -127 92 -205 40 -318
7399c18M98l9j74O4o6J32L9k52J83Mo6J66r2p2R6j57j7J57J0l55M34j37k84L26
$$ -318 180 141 -33 31 -35 97 136 -116 67 71 5 171 79 7 103 -54 -71 86 96 -259 175 38 -246 80
7423H0k54J08J76N7k13j11M02j70PJ36k56k47L72J65j43J8l13M10k25n3j35L78
$$ 80 -174 -66 110 167 -46 -157 245 75 82 218 -38 -285 87 252 109 127 -186 224 -1 -54 -189 189
7445A89l47L81k0j40k43J88J00j1K89n15J35k18N79o32Q8j62L08q9MJ88j94j14
$$ 189 -158 223 203 63 -180 8 108 97 386 -129 6 -212 367 -265 -177 -339 -31 -120 -116 72 -122 -236
7467b36N61j05k04k65k6O40m29J8q8K56l06m5K6R5j45L0K09Q8l49M62l3j20j73
$$ -236 325 220 16 -249 -275 365 -64 -46 -134 122 -184 -229 -203 -108 -253 -223 -14 74 -275 187 154 34 -139
7490a39jJ52j19L18j66K34l52J11j0p0R4K4r5p6P0n8PK48j03q0K1m7l63M22j33
$$ -139 -140 12 -107 211 45 279 -73 38 28 -42 52 76 -19 -95 -25 -83 -76 172 69 -11 10 -37 -400 22 -111
7515a11MK73j80P0m60L74J38q4N2P3j66m9K20k06J46j17M70n87j07N25k22J86
$$ -111 -107 166 -14 56 -404 -30 108 24 76 149 -17 -66 154 -52 94 -23 447 -140 -247 278 56 242
7537B42J1k37K16j76j5r7J22J09p8M7l9K8r9k50K01nP3J64k32K8K10J99o56k45
$$ 242 253 16 232 56 41 -56 66 175 97 144 105 133 34 -216 -15 -20 53 217 -15 13 223 422 -234 -479
7561d79N49r3Lj37K07n4K09m32L33j56j56K42j78O5J01k55J72P1l7K05k7k63K5
$$ -479 70 -23 -20 -157 50 -4 205 -227 106 -50 -206 36 -142 -77 24 -231 -59 12 -25 180 153 -110 -85
7584h5J94L37n43J21K62p4o5J90m41J04J3q2M1o4K28k81j36K50J95j76N8l72L61
$$ -85 109 446 -97 24 286 212 147 337 -104 0 13 -69 -28 -92 136 -145 -281 -31 164 -12 46 -326 35
7607C5l56N13l29J45K46m09K88k73K8K14l43J47j75M1m0J67Q8k53J91J17l1j1
$$ 35 -321 192 -137 8 254 -155 133 -140 -112 102 -241 -94 -269 -228 -268 -101 -13 -266 -75 42 11 0
7629@n01J30L13Q7j90J39K44m05k8M85m7k90N9NJ00j92K9j64L56K8P8n9j60R9
$$ 0 -501 -371 -58 29 -161 -22 222 -183 -211 274 227 -63 -4 1 101 -91 -62 -226 130 158 236 177 17 116
7653A16j54q6K28j09k15K40J16k63K01j12j38M1P1m00N86Q1j80q7J49j51L00k92
$$ 116 -38 -124 104 -5 -220 20 136 -127 74 -38 -176 -135 -64 -464 122 203 23 -64 85 -66 234 -58
7675e8k8J4q6k5K27p9l7N22o29j0J03L82m15L51k18j08M0L08n52K31O2J17m7N0
$$ -58 -86 -72 -158 -183 44 -35 -72 450 -179 -189 -86 296 -119 232 14 -94 -54 254 -298 -67 -5 112 65 115
7699A15k81p0J30J76k35M6K10Q3j70m4J75o9l26K47k32N00j72l2j31J13%K2j65
$$ 115 -166 -236 -106 70 -165 -119 91 174 4 -40 135 66 -260 -13 -245 255 83 51 -80 33 33 55 -110
7722a10J04O8j81k46o4L64J48p3m9k58K89l6n1J77k24R1J50p7K83j83Q8m0k46
$$ -110 -6 62 -119 -365 -429 -65 83 10 -39 -297 -8 -44 -95 82 -142 -51 99 22 305 122 210 170 -76
7745g6J78J21m14k9J27K14k14L00O4j70J6m1P1m70M97q5l0N4k7j65K90q9n5k09
$$ -76 102 223 -191 -220 -93 121 -93 207 271 101 117 76 147 -323 174 89 59 113 86 -79 211 122 67 -142
7769a42K20k32k7K91j0O3m54K51n9l03M14J09l09K62P2p7p3J30m8j40j41M13k42
$$ -142 78 -154 -181 110 100 163 -291 -40 -99 -402 12 121 -188 74 146 69 -4 126 78 -62 -203 210 -32
7792c2p1L01k98j0K11r3J7n1o9L56k50j32J58J33k81M07o38N47J49p10M18m3q9
$$ -32 -103 198 -100 -110 101 8 25 -26 -95 261 11 -121 37 170 -111 296 -342 205 354 -356 62 19 -70
7815g0m2J14J3q2r6Q5m8N37l27j34q5J57%P6pj72J96m8k47Nj7L33j27k06J54n5
$$ -70 -112 2 15 -67 -163 -78 -126 411 84 -50 -135 22 22 98 91 -81 115 67 -180 -175 -192 141 14 -192 -38 -93
7841i3qK84l07J50j74J02K50j25k00j83K34j76M59k33j8K54j01R9n3N4K1j95k71
$$ -93 -101 183 -124 26 -148 -46 204 79 -121 -304 -70 -246 213 -20 -38 216 115 214 161 215 236 41 -230
7864b30J01J64j04p5L59m45M08j94n1q1J35j01Q0j41K24pJ19L1j33N8Q1p6j69
$$ -230 -129 35 -69 -144 215 -230 178 -16 -67 -148 -13 -114 -34 -175 49 42 161 192 59 117 198 122 -47
7887d7q1R8M62m33k10J9K27p0L0j44J03K89m50K08J33j1k12L52l16m04L58K88
$$ -47 -128 -30 432 -1 -211 -192 35 -35 -5 -149 -46 243 -207 1 134 123 -89 263 -53 -457 -99 189
7909A89m13K17J79j26o5P2O2L03m27J99k13m3J14m9l90O61j71j61L15N0m41p6
$$ 189 -224 -7 172 46 -19 53 115 418 -9 190 -23 -66 48 -1 -391 270 99 -62 253 303 -138 -214
7931b14K69p3NJ86J13l82N86l91J80r2r3k37j51M62j63j03R8L8K96l95L17l21
$$ -214 55 -18 -13 173 286 -96 490 99 279 187 94 -143 -294 168 5 -98 0 38 334 -61 256 -65
7953f5R0K3j21K4J04J51J02m76J30n1j40P9J0k25J31J09J24L2J77j42r3Q2m5k06
$$ -65 25 48 -73 -49 55 206 308 -168 -38 -89 -229 -150 -140 -365 -234 -125 -1 31 208 66 -27 55 10 -196
7977a96q4L59o7j70K38j08Q8k24L37j36J69l9k55J00L5l58M38k05Qm8J60j31m
$$ -196 -280 79 12 -158 80 -28 60 -164 173 37 206 167 -88 12 47 -311 127 -78 -70 -118 42 -89 -93
8000i3J37k67L43l62K41J89k66p4L4PJ96k4j15m09K13M38k65Q9j66M87l42O3P0
$$ -93 44 -223 120 -242 -1 188 -78 -152 -118 -111 85 61 -54 -463 -250 188 -77 12 -154 333 -9 54 124
8023A24k01K27k53J45j17K25Q1j8l80J83K70k18J76k09k26J10K63l74K37K76p5
$$ 124 -77 150 -103 42 -75 150 231 213 -167 16 286 68 244 35 -191 -81 182 -192 45 321 246
8044B46k05J67r2o5j18L8OJ17pK22l31J48p6j20j53N8J07k85M05j1j59P4J32j33
$$ 246 41 208 116 51 -67 -29 -23 94 87 309 -22 126 50 -70 -223 -165 -58 -343 62 51 -108 -34 98 -35
8068c5J66k0k86K42j76jJ75M9q4j89J91k65K09K5l3n8K94J95m12k8K25k45L70
$$ -35 131 111 -175 67 -109 -110 65 114 30 -159 32 -233 -24 1 -32 -90 204 399 -13 -41 184 -61 309
8091C09m46J13K14j72j60k9l1k8M55l34j88L45j15J23l1n0q0M0lm7N9L7P5R5j60
$$ 309 -137 -24 190 18 -142 -171 -202 -230 225 -109 -297 48 -67 56 25 -25 -105 -65 -68 -115 -56 -19 56 151 -9
8116ik43N82m12m2O5K64k69L3J25k92N26N7l20L18n85J88L45l99j45M36j14j01
$$ -9 -252 330 -82 -124 -59 205 -64 -31 94 -198 328 385 65 383 -202 -14 331 -68 -213 223 109 8
8138Hl13J88j0j9J74L60m60m5J06J73l15Q2o3j5j2J94k0j0j2m1K1J97K17n43k3
$$ 8 -305 -117 -127 -146 28 388 -72 -117 -11 162 -153 -71 -134 -149 -161 33 13 3 -9 -50 -29 168 385 -158 -181
8163a81J46L5n1K34j66J99k05Mn8j0P6j47J20n7Kj0J07K54n48M17l69J62k51O4
$$ -181 -35 0 -51 183 17 216 11 15 -43 -53 23 -124 -4 -61 -59 -69 38 292 -256 161 -208 -46 -297 -233
8187b33K32k24J44K00
$$ -233 -1 -225 -81 119
8191A19
$$ Imaginary data points
##PAGE= N=2
##DATA TABLE= (X++(I..I)), XYDATA
0@%%%qJ6j6K4m0M8n6P2q8J12j41J73k08K48k97L53m17M89n70O61p65Q78j005J150
$$ 0 0 0 0 -8 8 -8 16 -24 24 -32 40 -48 64 -77 96 -112 136 -161 192 -225 264 -306 355 -410 468 -537 613
27F13j307J481j678J892k123K383k673K982l321L702m117M565n062N610o208O871
$$ 613 -694 787 -891 1001 -1122 1261 -1412 1570 -1751 1951 -2166 2399 -2663 2947 -3261 3610
43C610p612Q433r347J0382j1557J2900j4457J6286j8467K1129k4458K8760l4573
$$ 3610 -4002 4431 -4916 5466 -6091 6809 -7648 8638 -9829 11300 -13158 15602 -18971
56a8971M2906n5944P9412j34759M94530M37358r38588l61678L76772O11005o2857
$$ -18971 23935 -32009 47403 -87356 407174 844532 -94056 -455734 -78962 532043 469186
67D69186m10784j92187K90577K13555j34710k83813j7443J31988R9518J5694N63
$$ 469186 58402 -133785 156792 370347 235637 -48176 -65619 66369 165887 181581 182144
78A82144j30612j98333o0041K13936K27282o9281l25120j06816K86449K29205
$$ 182144 51532 -146801 -206842 7094 234376 165095 -160025 -266841 19608 248813
88B48813k64909l86626J02132M81990J64326l84477m03751J24043M51812J45260
$$ 248813 -16096 -402722 -300590 181400 345726 -38751 -442502 -318459 133353 278613
98B78613l25310k69100J57100K74792j7377k03866o6026J05468Q8998n3j2945
$$ 278613 -46697 -315797 -158697 116095 98718 -105148 -171174 -65706 23292 23239 10294
109A0294j181p1097j10994N3776K40338P6781k81941k66659J66830L90624P2994
$$ 10294 9113 -61984 -172978 -119202 121136 197917 -84024 -350683 -183853 206771 279765
120B79765l40934l00421J23859L60592R8219k67730k07049J37747K17000l3901
$$ 279765 -61169 -361590 -237731 122861 221080 -46650 -253699 -115952 101048 67147
130F7147j78791l1624J43888J09261n3578j13713j9577N6299K7448K2301O6560
$$ 67147 -111644 -143268 620 109881 56303 -57410 -76987 -20688 6760 29061 95621
141I5621L964j13333m5138J35144J08603j17812j84437M3814K62418J36166k19464
$$ 95621 99585 -13748 -58886 76258 184861 67049 -117388 -73574 188844 325010 105546
152A05546l16777L0172L50332J79762k15532k75649J9051K20282R1506j49385
$$ 105546 -211231 -181059 169273 349035 133503 -142146 -123095 97187 188693 39308
162C9308j67720N0768J87040N5946j32040j34824j6160O7857Q9629M6466n4847
$$ 39308 -128412 -77644 109396 165342 33302 -101522 -117682 -49825 39804 86270 31423
173C1423j09914m4354O1848R5922K4234q4011q3068N5556J19164j8807j38538
$$ 31423 -78491 -122845 -60997 34925 59159 -24852 -107920 -52364 66800 47993 -90545
184i0545l8547J21745J03940m4444j09801j4866R9614N8679q1657r3490M6508
$$ -90545 -129092 -7347 96593 52149 -57652 -72518 27096 85775 4118 -89372 -42864
195d2864J12580K1181p0684o3368p331M4238N6993J4262l2889l9641l3618j0579
$$ -42864 69716 90897 20213 -43155 -50486 -6248 50745 65007 32118 -7523 -41141 -51720
207e1720M9889O4649j8865p9792k0738N8605M7717k3612p0640l2121N6656P2483
$$ -51720 -1831 62818 43953 -35839 -56577 2028 49745 26133 -44507 -76628 -19972 52511
219E2511j7668p1668j8354L6187K5875N798m124j8016j0239J0851O316q238m055
$$ 52511 34843 -36825 -55179 -18992 6883 12681 8557 -9459 -19698 -8847 -2531 -10769 -14824
232a4824p13R700L7053J8318n0579n5147K0678N4839J1546k3327j4882L241R352
$$ -14824 -15537 -5837 31216 49534 -1045 -56192 -35514 19325 30871 7544 -7338 -4097 5255
245E255j1947l0275J2174O6838K7574o3951p5741j436O0896N7933o043o4062l2732
$$ 5255 -6692 -36967 -24793 42045 69619 5668 -70073 -71509 -10613 47320 41277 -22785 -55517
258e5517M8858M7176k9147n1729m844L3185L7281J0363l7513m5336J0155M6942
$$ -55517 -6659 40517 11370 -40359 -45203 -12018 25263 35626 -1887 -47223 -37068 9874
270I874K0243j4178j9019n682J4648R946l1414l1656L9046O8192J104o1769m3694
$$ 9874 30117 15939 -3080 -8762 5886 15832 -15582 -47238 -8192 60000 61104 -665 -44359
283d4359J3286N2823L3959l3931n8395N506N6084J7269l5352l0133O156L2982
$$ -44359 -31073 21750 55709 21778 -36617 -31111 24973 42242 6890 -23243 -17087 15895
295A5895K5265k4289n0952j520M6879K0574k3834k7946r783J5591L8464J6674
$$ 15895 41160 16871 -34081 -35601 11278 31852 8018 -19928 -29711 -14120 24344 41018
307D1018l1674m0481r355J5219K7736K3747r982k8197j075J3202q886p684J5273
$$ 41018 9344 -31137 -40492 -25273 2463 26210 16228 -11969 -13044 158 -8728 -16412 -1139
320a139J0160n250k91k047j3048n565N616N963J9320K6339q679m0608k3726L816
$$ -1139 9021 3771 3480 1433 -11615 -17180 -11564 -5601 13719 40058 31379 -9229 -32955 -29139
334b9139J4610K6137K3773p29j3637j7736l2920j8389M1250N9969L559m4967l7043
$$ -29139 -14529 11608 35381 34652 21015 3279 -29641 -48030 -6780 53189 56748 11781 -25262
347b5262o141J8234K1351L86l372K2358J3824l6289m9038q433K8969M0919K8666
$$ -25262 -31403 -13169 8182 8568 5196 27554 41378 5089 -43949 -52382 -23413 17506 46172
360D6172j5150m7774k1420J7983J5757J048q39j524M243J1873j3158l8473q637
$$ 46172 31022 -16752 -38172 -20189 -4432 -3384 -4223 -5747 -1504 10369 -2789 -41262 -49899
373d9899L7997L6105L005k0322l0725j5191J7769J4983j1335K583L2263J1627
$$ -49899 -11902 24203 27208 6886 -23839 -39030 -21261 -6278 -17613 -15030 17233 28860
385B8860k9334l2873l415K6537L4925J340l6302j8209K2584J8171n345n691k477
$$ 28860 -474 -33347 -36762 -10225 24700 26040 -10262 -28471 -5887 12284 6939 1248 -1229
398a229k124J3124J5984j0793k0449j922M330M796J4920J0149p579n299K059r745
$$ -1229 -3353 9771 25755 14962 -5487 -7409 -3079 1717 16637 26786 19207 13908 15967 6222
412F222q879R169Q083j542N998L771j1075q001L612l136L91J8199P670k1964j9656
$$ 6222 -2657 6512 14595 13053 19051 22822 11747 3746 7358 4222 4613 22812 30482 8518 -11138
427a1138L74P230Q044M779p307k061J4569j727l1670j8277J4534J8909Q260J714
$$ -11138 -10764 -3534 4510 9289 1982 -79 14490 12763 -18907 -37184 -22650 -3741 4519 6233
441F233j2474j6298R08O136m206M731J6825J516j3822j1242r867J018K5507K3455
$$ 6233 -6241 -22539 -21631 -15495 -19701 -14970 1855 3371 -10451 -21693 -31560 -30542 -5035 18420
455A8420p102j5086k546k912k441Q408M771l497J0497J6231n753j7094m683M544
$$ 18420 11318 -3768 -6314 -9226 -11667 -3259 1512 -1985 8512 24743 18990 1896 -2787 1757
469A757R230J3881J105j5603m544L463p665k299J9130J2346q964r486p190j0766
$$ 1757 10987 24868 25973 10370 5826 9289 1624 -675 18455 30801 21837 12351 5161 -5605
483e605K24R877L72j525R428N33j6152p544M397K606O591O475j1355j3522N967
$$ -5605 -5381 4496 4868 3343 12771 13304 -2848 -10392 -5995 -3389 3202 9677 -1678 -15200 -9233
498i233P745m632K060R813k4l435Q74p876j0853O640J2507J474J45M84q003k472
$$ -9233 -1488 -6120 -4060 5753 5729 2294 3168 -4708 -15561 -8921 3586 5060 5205 5689 -2314 -4786
514d786R734j075j1875L595J0046o997j0250M26J825M100R507k261j4211k891
$$ -4786 4948 3873 -8002 -4407 5639 -1358 -11608 -11182 -9357 -5257 4250 1989 -12222 -15113
528a5113M884l332k876M797p38j872Q728K493j0108j06J0221j061l361N740P87
$$ -15113 -10229 -13561 -16437 -11640 -12378 -14250 -5522 -3029 -13137 -13243 -3022 -4083 -7444 -1704 -917
543i17o309N488R005N41L794P145l504m209N443M91n946O160Q547m099r95P242
$$ -917 -7226 -1738 7267 7808 11602 18747 15243 11034 16477 16968 11022 17182 25729 21630 20635 27877
559B7877k383p768L727K074q464k011K797m983l133K941o243o278P771M987j1301
$$ 27877 25494 17726 21453 23527 15063 13052 15849 10866 7733 10674 4431 -1847 5924 10911 -390
574c90q893j393p452k760R788K813p548R29K805o282l762L274j903J304R611l54
$$ -390 -9283 -10676 -18128 -20888 -11100 -8287 -15835 -14906 -12101 -18383 -22145 -18871 -20774 -19470 -9859 -10213
590a0213j1743J4R907M415M567N281o691n202R228K399j2096j944J4896J0469
$$ -10213 -21956 -21942 -12035 -7620 -3053 2228 -4463 -9665 -437 1962 -10134 -12078 2818 13287
604A3287K014k409j1716q957Q505R727l204j937J191o418l440O316q85n575Q095
$$ 13287 15301 12892 1176 -7781 724 10451 7247 5310 6501 83 -3357 2959 2074 -3501 4594
619D594J0543p421j4895p782j071J1520J7592k746j8621m19J4973L648p581o256
$$ 4594 15137 7716 -7179 -14961 -16032 -4512 13080 10334 -8287 -8706 6267 9915 2334 -3922
633c922l082P547J6215j312j8317k219J5915P127l391k630m539k013P566J536
$$ -3922 -7004 543 16758 15446 -2871 -5090 10825 17952 14561 11931 7392 5379 12945 14481
647A4481j1730m797P618O464M426m3j5825j4764J0911J5353j0169j8773j744J0300
$$ 14481 2751 -2046 5572 12036 16462 16419 594 -14170 -3259 12094 1925 -16848 -18592 -8292
661h292J0587K556j6141j8817O479J8635n2j1378l887k99Q68M380j913l947J1683
$$ -8292 2295 4851 -11290 -30107 -23628 -4993 -5045 -16423 -20310 -20609 -19741 -15361 -17274 -21221 -9538
676i538J4862m152j4078o680m010N477K2969J6136j1312j7441j891Q281J1921
$$ -9538 5324 1172 -12906 -19586 -23596 -18119 4850 20986 9674 -7767 -9658 -1377 10544
689A0544O355r192q728J2070J1281j4211j7421N374J7671J3774J478j6431j9866
$$ 10544 16899 7707 -1021 11049 22330 8119 -9302 -3928 13743 27517 28995 12564 -7302
702g302O59J1733J707k072K873l64j370L263p906j7509J858K2919J2605r739k0773
$$ -7302 -6643 5090 6797 4725 7598 7234 5864 9127 1221 -16288 -14430 8489 21094 11355 -9418
717i418k0455L539L2036K0798j6906k2069J347J1037J398q103r034P240K2596
$$ -9418 -29873 -26334 5702 26500 9594 -12475 -11128 -91 1307 -6796 -15830 -8590 14006
730A4006N156k5456j7554J3770K0203O996o748j8596j3332J1896J9691j737j3516
$$ 14006 19162 -6294 -23848 -10078 10125 17121 10373 -8223 -21555 -9659 10032 8295 -5221
743e221k787N043P952N912j1214k0559K876K3389Q689j4782j5696k339J3728J8705
$$ -5221 -8008 -2965 4987 10899 -315 -20874 -17998 5391 14080 -702 -16398 -18737 -5009 13696
757A3696k314k0804m541J5039L683j2691o069P006J3678J2163o652k3117p020
$$ 13696 11382 -9422 -13963 1076 4759 -7932 -14001 -6995 6683 18846 12194 -10923 -17943
770a7943J6843J4410K064k989j2093j4801N206J9377Q262m770n074m411j860J667
$$ -17943 -1100 13310 15374 12385 292 -14509 -9303 10074 18336 13566 8492 4081 2221 3888
784C888m464o388J0105J6855l917j7763p815M298J0413J0734m826j8159m039J1103
$$ 3888 -576 -6964 3141 19996 16079 -1684 -9499 -5201 5212 15946 11120 -7039 -11078 25
798B5K506o597m24K287J262P602K666j3319j3316K370J0052R195L300j0007j2824
$$ 25 2531 -4066 -4490 -2203 -941 6661 9327 -3992 -17308 -14938 -4886 4309 7609 -2398 -15222
813a5222N811J3194k887q915M987P540j777q570j1432j239K0644K0618j0201k3438
$$ -15222 -9411 3783 896 -8019 -3032 4508 2731 -5839 -17271 -18510 2134 22752 12551 -10887
827a0887m654J0602R375M391o580j2084K218J3149R13q278P27N018J619R99m377
$$ -10887 -15541 -4939 4436 8827 2247 -9837 -7619 5530 6443 -1835 -1108 3910 5529 6528 2151
842B151j0356J098J3654M230r244n086K263P488R347l221k0089p764J7729J3772
$$ 2151 -8205 -7107 6547 10777 1533 -3553 -1290 6198 15545 12324 -7765 -15529 2200 15972
856A5972o060j1154m660K651J1075P022r872r664O036M903n674m463J204L343
$$ 15972 9912 -1242 -5902 -3251 7824 14846 4974 -4690 1346 6249 575 -3888 -2684 659
870F59Q441L615j0984j0702O798R162r66l768m315o420L905J3326J271j0082l694
$$ 659 9100 12715 1731 -8971 -2173 6989 6023 2255 -2060 -8480 -4575 8751 10022 -60 -3754
885c754J918K262N979R46j2413q085R305Q867m33P0j604n363M04K502n281q33
$$ -3754 -1836 426 6405 7351 -5062 -13147 -3842 5025 4592 4662 3058 -2305 -1901 601 -4680 -5513
901e513J0412L845r802q083J71N024J2198Q335j1078j6343j878N851M368P080
$$ -5513 4899 8744 -1058 -9141 -8970 -3946 8252 16587 5509 -10834 -12712 -6861 -2493 4587
915D587K500q451m498O700J222o504q27N262L749J730n852j3107l04J7396Q703
$$ 4587 7087 -1364 -5862 838 2060 -4444 -5271 -9 3740 5470 -382 -13489 -13793 3603 12306
930A2306p449o436M19J458pm073q996N002J9885O994j4816j4167l48N428J0747
$$ 12306 4857 -1579 -1160 298 291 -3782 -12778 -7776 12109 19103 4287 -9880 -10228 -4800 5947
945E947Q590m412j1526m357n43K42Q406R143n79k316j82j1320j3242N216J8260
$$ 5947 14537 10125 -1401 -5758 -6301 -6059 2347 11490 10911 8595 8413 -2907 -16149 -10933 7327
960G327J0961m137j4742j4651M730J9040N579j1439m920K398j987k440l19j058
$$ 7327 18288 14151 -591 -15242 -10512 8528 14107 2668 -2252 146 -1841 -4281 -4600 -5658
974e658K834J0044J712q517n838k420l455N502J1885J36j1677n238K445M387O532
$$ -5658 -2824 7220 8932 415 -5423 -7843 -11298 -5796 6089 6225 -5452 -10690 -8245 -3858 2674
989B674Q3o710L15O820p162j3208L498J5649Q600l70q794j4044l699J3234J1851
$$ 2674 2757 -3953 -3638 3182 -3980 -17188 -13690 1959 10559 10189 1395 -12649 -16348 -3114 8737
1004H737J323l677j0025j1915L217J6735P623l408k147k830m630l018l361m43
$$ 8737 10060 6383 -3642 -15557 -12340 4395 12018 8610 6463 3633 -997 -4015 -7376 -7819
1018g819J3283J6975m969k0891j0222O392J1588J1406J586j2575r840K522J768
$$ -7819 5464 22439 17470 -3421 -13643 -7251 4337 15743 17329 4754 -5086 -2564 -796
1031g96j433N003N638J274L403k36j5181j5520M421J8331J4324J081j5816j9952
$$ -796 -2229 2774 8412 9686 13089 12853 -2328 -17848 -13427 4904 19228 20309 4493 -15459
1045a5459Q84J7239P353m877r33L53l914n510o698m083J1504K0362L525j7575
$$ -15459 -14575 2664 10017 5140 4207 4560 646 -4864 -11562 -15645 -4141 16221 19746 2171
1059B171j5968n656N567J6402R697r932j4038L5N986L188O11m211l201P675O578
$$ 2171 -13797 -19453 -13886 2516 12213 2281 -11757 -11722 -5736 -2548 -1937 -6148 -9349 -1674 4904
1074D904j0991j4726K068J2348Q304J956p525j1132J469J0039K39p412l83L559
$$ 4904 -6087 -20813 -18745 -6397 1907 3863 -3662 -14794 -13325 -3286 -3047 -10459 -10842 -7283
1088g283J938L091j302q197PJ2741O254o660q962n729K565J3799R614q468j1487
$$ -7283 -5345 -2254 -3556 -11753 -11746 995 7249 589 -8373 -14102 -11537 2262 11876 3408 -8079
1103h079L441R352L188j582m855m048P243P754q024r579O171J3072N081l365j0986
$$ -8079 -4638 4714 7902 6320 1465 -2583 4660 12414 4390 -5189 982 14054 19135 15770 4784
1118D784j0495N332J6042L469j0885p274J456O709P818k297j3598l008J3740O937
$$ 4784 -5711 -379 15663 19132 8247 973 2429 9138 16956 14659 1061 -1947 11793 18730
1132A8730j0055j1538l413P417J3222L448j4269r866Q792Q739o021r840l068N531
$$ 18730 8675 -2863 -6276 1141 14363 17811 3542 -6324 2468 11207 5186 -4654 -7722 -2191
1146b191J1470M775j4724j3712N716J3647N811l570j1226j1623L961J4339L253
$$ -2191 9279 14054 -670 -14382 -8666 4981 10792 7222 -4004 -15627 -11666 2673 5926
1159E926r752n302L717O191N231o790j5874k015J6284J0078q109j0824m012L890
$$ 5926 -3826 -9128 -5411 780 6011 -779 -16653 -18668 -2384 7694 -415 -11239 -15251 -11361
1173a1361J0962N043j0364r662M198P065L5l298o388l984R697J6188j325j6104
$$ -11361 -399 4644 -5720 -15382 -11184 -4119 -4084 -7382 -13770 -17754 -8057 8131 6806 -9298
1187i298j1590K009J3390J3705l212j8665n256J4515R939n958o965J263P784Q234
$$ -9298 -20888 -18879 -5489 8216 5004 -13661 -18917 -4402 5537 -421 -7386 -6123 1661 9895
1201I895n137j7961n402J7181J6254L53q896j0236l856R760J0885m578j0100J711
$$ 9895 4758 -13203 -18605 -1424 14830 15183 6287 -3949 -7805 1955 12840 8262 -1838 -127
1215a27Q171M121k376j0288q125J1805K0582J072j8976j3842J327J0244J1457
$$ -127 8044 12165 9789 -499 -8624 3181 23763 24835 5859 -7983 -6656 3588 15045
1228A5045J294q646j813O775j423q959j143M745M160N205R97j0041r294K200P570
$$ 15045 16339 7693 5880 12655 11232 2273 1130 5875 10035 15240 16237 6196 -3098 -898 6672
1243F672Q204O222o799j6026m069R009M883k534j143M27K84L140l028j0545k382
$$ 6672 14876 21098 14299 -1727 -5796 3213 8096 5562 4419 4846 5130 8270 5242 -5303 -7685
1258g685Q548L662l502l446m096l340M910N494l879m587J151N37r68j555m599
$$ -7685 863 4525 1023 -2423 -6519 -9859 -4949 545 -3334 -7921 -6770 -6233 -7201 -8756 -13355
1273a3355m179Q091J0540n223j1603m33Q261O088o82j0355r132P364J5566J665
$$ -13355 -17534 -9443 1097 -4126 -15729 -16162 -7901 -1813 -2495 -12850 -21982 -14618 948 2613
1287B613r446l305K516L222L238j518n207L590R273j083q702l401K422O370J0133
$$ 2613 -6833 -10138 -7622 -4400 -1162 -2680 -7887 -4297 4976 3893 -4809 -8210 -5788 582 10715
1302A0715M302j0182j0340j9K852K798N685M484j825j146k483p963k797R360Q045
$$ 10715 15017 4835 -5505 -5524 -2672 126 5811 10295 8470 7324 4841 -3122 -5919 3441 11486
1317A1486m85k689n139p081L1O421L339L329M617k780r329m506n60j263N790J1530
$$ 11486 11001 8312 3173 -3908 -3877 2544 5883 9212 13829 11049 1720 -2786 -3346 -4609 1181 12711
1333A2711M119o333q959q763j917J2697J2924l686j1515m305J059K343K557j014
$$ 12711 16830 10497 1538 -7225 -9142 3555 16479 12793 1278 -3027 -1968 375 2932 1918
1347A918k924P384Q392o606j5052o807M088J1730J1634k101j5129o552P911N266
$$ 1918 -1006 6378 14770 8164 -6888 -13695 -9607 2123 13757 11656 -3473 -10025 -2114 3152
1361C152k539l500j750J614P016J23j1834o024R280R523K98m129o222l731M680
$$ 3152 613 -2887 -4637 -3023 3993 4116 -7718 -13742 -4462 5061 5359 1230 -4992 -8723 -4043
1376d043L312n467k786O427O389j427l541n106l518M938O963k595n788J281J592
$$ -4043 -731 -6198 -8984 -2557 3832 2405 -1136 -6242 -9760 -4822 2141 -454 -6242 -4961 -3369
1391c369P51L227o00o316l28P486L389l493l742n450j741Q703R276j779o186j502
$$ -3369 -2618 609 9 -6307 -6635 851 4240 747 -2995 -8445 -10186 -1483 7793 6014 -172 -1674
1407a674p13J814L347k317o343L231J0178J556o131n451l478L877J1594L278j0787
$$ -1674 -2387 -573 2774 457 -5886 -2655 7523 9079 2948 -2503 -5981 -2104 9490 12768 1981
1422A981q642L526N394J695J10l175n59O800K959r571q004K723N745L598J527
$$ 1981 -6661 -3135 2259 3954 4064 889 330 7130 10089 518 -7486 -4763 982 4580 6107
1437F107m357m936K812L397m335k639M324K801j416k018n075m437N784R706m02
$$ 6107 1750 -3186 -374 3023 -1312 -3951 373 3174 1758 -260 -5335 -9772 -3988 5718 5316
1452E316o099k426j162p14K857J62l865J461O041L19m610j522q90j68M717L061
$$ 5316 -783 -3209 -4371 -5085 -2228 -2066 -5931 -4470 1571 1890 -2720 -4242 -5132 -5300 -583 2478
1468B478m667l488J015p25M49O466K400m614j215J132k281q11K280j98l09N394
$$ 2478 -2189 -5677 -4662 -5387 -4938 1528 3928 -686 -1901 -769 -3050 -3861 -1581 -1779 -2088 3306
1484C306K340n837l233L083K419K031J625m426m733L258M035k302M95M183Q28
$$ 3306 5646 -191 -3424 -341 2078 4109 5734 1308 -3425 -167 3868 1566 2061 6244 7072
1499G072k036j066l933k752N859N447l536l890J910J370n89J214j676l362L326
$$ 7072 5036 3970 37 -2715 3144 8591 5055 1165 3075 4445 3856 5070 3394 32 3358
1514C358M592m119o500j026K764M016O056j914r350l039L818Q98j899m56l76L01
$$ 3358 7950 3831 -2669 -3695 -931 3085 9141 7227 -2123 -5162 -1344 -446 -2345 -2801 -3177 -2876
1530b876L559j166p722j211O398J789l207j336j620k640J629K666j776J145M479
$$ -2876 683 -483 -8205 -9416 -3018 -1229 -4436 -5772 -7392 -10032 -8403 -5737 -7513 -6368 -1889
1545a889o02l949m64j042k004K370N792J18j056J449j084j725L102J610k386K088
$$ -1889 -2491 -6440 -6904 -7946 -9950 -7580 -1788 -1670 -2726 -1277 -2361 -4086 -984 626 -1760 328
1561C28M732j993l972P44J436J351N244K558l883l322M74j608j228M204K097j347
$$ 328 5060 3067 -905 -161 1275 2626 7870 10428 6545 3223 3697 2089 861 5065 7162 5815
1577E815J962J663m029m655J26P42K538N274j842p460j560K825o6M44M394Q42
$$ 5815 7777 9440 5411 756 882 1624 4162 9436 7594 134 -1426 1399 1333 1777 6171 7013
1593G013l161j745k952n119K058O972K844r12j83l355m727J281K325j130Q69L482
$$ 7013 3852 2107 -845 -5964 -3906 3066 5910 4998 4815 1460 -3267 -1986 339 -791 78 3560
1609C560j153l974j399j437r33N712M756l765n064j037k322k138K911L877o6J382
$$ 3560 2407 -1567 -2966 -4403 -5336 376 5132 1367 -3697 -4734 -7056 -9194 -6283 -2406 -2472 -1090
1625a090J50m650l839J039J042M98M360J871l971j525J961k40k67L755K704Q1
$$ -1090 -940 -5590 -9429 -8390 -7348 -6850 -2490 -619 -4590 -6115 -4154 -4394 -4661 -906 1798 1879
1641A879J463k739n712J158P636K999p67J904J598l008j831j304k020L246P255
$$ 1879 3342 603 -5109 -3951 3685 6684 5917 7821 9419 6411 4580 3276 1256 4502 11757
1656A1757J051m336j340k133l787J659N723R87k525k422m522l447J675J683l79
$$ 11757 12808 8472 7132 4999 1212 2871 8594 9581 7056 4634 112 -3335 -1660 23 -356
1671c56L609M063n954q364j026K080m34K136K899N80O80k181p478l394Q514P622
$$ -356 3253 7316 1362 -7002 -8028 -5948 -6382 -4246 -1347 -767 -87 -2268 -9746 -13140 -4626 2996
1687B996j029l721k413k817k87L856L222K735L402k009p056j141M087j287j418
$$ 2996 1967 -1754 -4167 -6984 -7271 -3415 -193 2542 5944 3935 -3121 -4262 -175 -1462 -2880
1702b880M603M123o23k806m249k738L599N801j454l422Q27j358m352J203M280
$$ -2880 1723 5846 5223 2417 -1832 -4570 -971 4830 3376 -46 781 -577 -4929 -3726 554
1717E54J641j275j72q23m83j81l392k749O359O942k507n887J204L532r5j051j946
$$ 554 2195 920 748 -75 -558 -739 -4131 -6880 -521 6421 3914 -1973 -769 2763 2668 1617 -329
1734c29P87N138J638o622l624P551N028l548l874q7K182K757n79o906l148M785
$$ -329 458 5596 7234 612 -3012 4539 9567 6019 2145 2058 4240 6997 6418 -488 -3636 1149
1750A149L775j36R89j670o590l236M135K987j519k662j424n58L033O84n484j49
$$ 1149 4924 4788 5777 4107 -2483 -5719 -1584 1403 -116 -2778 -4202 -4760 -1727 -1043 -6527 -6676
1766f676M536J465n408j530K439n3l60P1J075M490L414n405o973K978P171j00
$$ -6676 -2140 -675 -6083 -7613 -5174 -5227 -5587 -5516 -4441 49 3463 -1942 -8915 -5937 1234 1134
1782A134l045P22J745K033L26l433j422N875M007m207m969J355J640n30J692J785
$$ 1134 -1911 -1189 556 2589 2915 -518 -1940 3935 7942 3735 -1234 121 1761 1231 2923 4708
1798D708p53j9m54l626j568K617Q32j136J058o75m083P19M960O43l765k790j05
$$ 4708 3955 3936 3482 -144 -1712 905 1737 601 1659 984 -3099 -2380 2580 3223 -542 -3332 -3437
1815c437K449L377k366p583N69Q987L412m045l257j074K63J429M48j190K388L958
$$ -3437 -988 2389 23 -7560 -6991 1996 5408 1363 -1894 -2968 -2705 -1276 -828 -2018 370 4328
1831D328m123n725K385O504J051j527k982k965L74L781j200l128L231L908p91
$$ 4328 205 -5520 -3135 3369 4420 2893 -89 -3054 -2680 1101 -99 -3227 4 3912 3121
1846C121k124k041l594j30N553K193l549j843J213l35J7L65j334J869N115j302
$$ 3121 997 -1044 -4638 -4768 785 2978 -571 -2414 -1201 -1536 -1519 -1154 -2488 -619 4496 3194
1862C194p640m042L539N111L680N98l516k499J848j084m803J922P965K370m343
$$ 3194 -4446 -8488 -4949 162 3842 4440 924 -1575 273 -811 -5614 -3692 4273 6643 2300
1877B300m985l300K660P829K231n017l657J185P46j393R0n22J172M331J546m976
$$ 2300 -2685 -5985 -3325 4504 6735 1718 -1939 -754 -8 -1401 -1311 -1833 -661 3670 5216 240
1893B40l781J990J150o96O23L89n00J952L83m601j207N696L092k476k899k487
$$ 240 -3541 -1551 -401 -1097 -474 -85 -585 1367 1750 -2851 -4058 1638 4730 2254 -645 -3132
1909c132m00L647L192l008j576L401J153k813o41J072M41j9r63l610P81O794L144
$$ -3132 -3532 115 3307 299 -1277 2124 3277 464 -177 895 1336 1317 354 -3256 -2475 4319 7463
1926G463m703m779m17J029K819J879k662k057L003N25n439j388M842N028J052
$$ 7463 2760 -2019 -2436 -1407 1412 3291 629 -1428 1575 2100 -3339 -4727 115 5143 6195
1941F195l634q254k949O049N515j793k448J858J392k26l034n602q14Q705O397
$$ 6195 2561 -5693 -8642 -2593 2922 1129 -1319 539 1931 1705 -1329 -6931 -7745 960 7357
1956G357m148p251k795J453L247M112n04j666K228P0p560n591L547Q141O313Q05
$$ 7357 3209 -4042 -6837 -5384 -2137 1975 1471 -195 2033 2103 -5457 -11048 -7501 640 6953 7758
1972G758p335q426O88O344K246q01J489N03k176k111k131M56O468O255l266o440
$$ 7758 423 -8003 -7315 -971 1275 474 1963 2466 290 -1821 -3952 -3496 2972 9227 5961 -479
1988d79r62J290O4J419J085N49K760K037m398n560J581M435J187N3j736l113N02
$$ -479 -1441 -151 -87 1332 2417 2966 5726 7763 3365 -2195 -614 3821 5008 5061 3325 212 714
2005G14K635j394k133L989L077k943m530k749K18M145M068k644n779R56M517n14
$$ 714 3349 1955 -178 3811 6888 3945 -585 -3334 -3116 1029 5097 2453 -3326 -2370 2147 1633
2021A633k297j509k22J146J313l281k936M383N713k266n883k178J904L857L269
$$ 1633 -664 -2173 -2395 -1249 64 -3217 -6153 -1770 3943 1677 -4206 -6384 -4480 -623 2646
2036B646l440o047J279M873N02j826J31J139J203R74l366m836J982O591J129l362
$$ 2646 -794 -6841 -5562 -689 -187 -2013 -1882 -743 460 1434 -1932 -6768 -4786 1805 2934 -428
2052d28r45J510K326O78l399m249L587P894l63o702m036J998N403M783j872n823
$$ -428 -1373 137 2463 3141 -258 -4507 -920 6974 6611 -91 -4127 -2129 3274 8057 6185 362
2068C62m85M115q90m887m1M658L311N87m130n572O47O425J460m013k539M58J041
$$ 362 -123 3992 3102 -1785 -1826 2832 6143 6730 2600 -2972 -2325 4100 5560 1547 -992 -534 507
2085E07J300o96l505P91N685P07n317l295Q29K090J885l27l785L71N550J331o106
$$ 507 1807 1111 -2394 -1603 4082 4789 -528 -3823 -2994 -904 981 654 -3131 -2760 2790 4121 -1985
2102a985l828K214L543K756j319n396k059L513L050q95L01J048k241l032j69R35
$$ -1985 -5813 -3599 -56 2700 1381 -4015 -6074 -2561 489 -406 -105 943 -1298 -4330 -4499 -3564
2118c564J723K506j519l740P94M626p02k961m47Q33J228J937j392m142J162N193
$$ -3564 -1841 665 -854 -4594 -3800 826 124 -2837 -3284 -2451 -1223 714 -678 -4820 -3658 1535
2134A535K026j992j336J28O66J975j368m080J150P602L016n004n434p18M774O583
$$ 1535 3561 1569 233 361 1027 3002 1634 -2446 -1296 6306 9322 4318 -1116 -1834 2940 9523
2150I523p76q530l037N872L876l310m625K08M947M098k812j0374m035P475P621
$$ 9523 8747 217 -2820 3052 6928 3618 -1007 -799 4148 8246 5434 -4940 -8975 -1500 6121
2165F121j953o409m730J155N837L467n241n498J849M264K04k110l030r91L955
$$ 6121 4168 -2241 -6971 -5816 21 3488 -1753 -7251 -5402 -1138 -934 -3044 -6074 -7065 -3110
2180c110N507q96m568J62J345m38K55J239M44J789J308k289k933K942L860k79
$$ -3110 2397 1501 -3067 -2905 -1560 -1998 -1743 -504 -60 1729 3037 748 -2185 757 4617 4338
2196D338j600j527j969nK384J124k48J412j117l800j503L774J250j617j651k076
$$ 4338 2738 1211 -758 -763 1621 2745 2497 3909 2792 -1008 -2511 1263 2513 896 -755 -2831
2212b831J86K837J242l534q44L862J537l438l753j549L024N749J999n395m614
$$ -2831 -2645 192 1434 -2100 -2944 918 2455 -983 -4736 -6285 -3261 2488 4487 -908 -5522
2227e522K919M925Q66k337l125R7M548K766n167n329L015O882K593k166n792m543
$$ -5522 -2603 2322 3188 851 -2274 -2177 2371 5137 -30 -5359 -2344 4538 7131 4965 -827 -5370
2243e370K814M865j189l251J252K689j239l591l075J40N529M876m395q614k207
$$ -5370 -2556 2309 1120 -2131 -879 1810 571 -3020 -6095 -5955 -426 4450 55 -8559 -10766
2258a0766M506M606J730k260l100Q04L100j038m396P50M048K689K37j048l022
$$ -10766 -6260 -1654 76 -2184 -5284 -4480 -1380 -2418 -6814 -6064 -2016 673 910 -138 -3160
2273c160N4M293K466n24o0M61j912j021K209J284J552J654l09k423K58N04k203
$$ -3160 -3106 1187 3653 3129 3069 3530 1618 597 2806 4090 5642 7296 6987 4564 4822 5326 3123
2290C123m82K858J577j773j764k342j375L914M034k177n542j701J078J181J453
$$ 3123 2641 5499 7076 5303 3539 1197 -178 3736 7770 5593 51 -1650 -572 609 2062
2305B062j357k299J303L287j598n204k00K760K829P7l952m761K513O438J538m424
$$ 2062 705 -1594 -291 2996 1398 -3806 -4006 -1246 1583 1660 -2292 -7053 -4540 1898 3436 -988
2321i88k578R50K239J402k227m505J255N667J661l737l228M6J548K839P99l885
$$ -988 -3566 -2616 -377 1025 -1202 -5707 -4452 1215 2876 -861 -4089 -4043 -2495 344 1143 -2742
2337b742k372J062R34l79J203N56m31M36k76k412j618K121J737m71M23Q43j533
$$ -2742 -5114 -4052 -3118 -3497 -2294 -1738 -2169 -1733 -2009 -4421 -6039 -3918 -2181 -2652 -2229 -1386 -2919
2354b919r46J871J148M57K057j536l641K54L751K131o13m78J77O13K207j365l718
$$ -2919 -3865 -1994 -846 -389 1668 132 -3509 -3255 496 2627 2014 1536 1713 2326 4533 3168 -550
2371e50M91M486J306j909k008j096J635L739N84m619j435K824N63k161p78o99
$$ -550 -59 4427 5733 3824 1816 720 2355 6094 6678 2059 624 3448 4011 1850 1072 373
2387C73J372L289J053m506l188J725K458J27j004j747j459K315K595j769j936
$$ 373 1745 5034 6087 1581 -1607 118 2576 2703 1699 -48 -1507 808 3403 1634 -302
2402c02J266P58j71l43j440j488J619K732r18j903J316N09j348M06J04j229M59
$$ -302 964 1722 1551 1208 -232 -1720 -101 2631 1713 -190 1126 1635 287 693 797 -432 27
2419B7O40q99j106J300R11j165L85N32j297j195K01r87j91K763Mk027o44J775
$$ 27 667 -232 -1338 -38 873 -292 93 625 -672 -1867 -1666 -2653 -2844 -81 -77 -2104 -2748 -973
2437i73J96q10l58j264m87K299R63k937r38L133J452j026o15j483m89K372J133
$$ -973 -777 -1587 -1945 -3209 -3696 -1397 -434 -3371 -4309 -1176 276 -750 -1365 -2848 -3337 -965 168
2454A68k595j297K087K408k00n83j762j231K603K697j732l130L05J456K252J605
$$ 168 -2427 -3724 -1637 771 571 -12 -1774 -3005 -402 2295 563 -2567 -2262 -806 1446 3051
2470C051j797k837J846L350j240l427l90K336K480M07k211k028J429L924o45k782
$$ 3051 1254 -1583 263 3613 2373 -1054 -1444 892 3372 3779 1568 -460 969 4893 4248 1466
2486A466r18N57j00J752P3j784k20K115K48k1k95k036k530J914K504n32k017J1
$$ 1466 548 1105 1005 2757 2830 1046 826 2941 3189 3168 2873 837 -1693 221 2725 2193 176 187
2504A87M15l6R26j093j693R71J762k420k161P93J415M67J038j26k262r56J310
$$ 187 602 566 1492 399 -1294 -323 1439 -981 -3142 -2349 -934 -467 571 445 -1817 -2773 -1463
2521a463L4L80N00j424k037K796L247j488l022q1J405J967J47k486k527K523L648
$$ -1463 -1429 -1049 -549 -1973 -4010 -1214 2033 545 -2477 -2558 -1153 814 961 -1525 -4052 -1529 2119
2538B119j339k534R50J493K99j97j751j721J408L150q06j301N77m67OJ928R46
$$ 2119 780 -1754 -804 689 988 791 -960 -2681 -1273 1877 1071 -230 347 -120 -114 1814 2760
2555B760k638k194J375J734K83J07j479j132K548J453j954j380J630K49j597j064
$$ 2760 122 -2072 -697 1037 1320 1427 -52 -1184 1364 2817 863 -517 1113 1362 -235 -1299
2571a299N63J315K251K17l524j266K105K10j039O83K65j728l64R97N99q8Q66j571
$$ -1299 -736 579 2830 3047 -477 -1743 362 572 -467 216 481 -1247 -1611 -614 -15 -103 763 -808
2589h08j363J172J314k331j019J121Q67k25Q95L57j093m04l30j600R59K916p4
$$ -808 -2171 -999 315 -2016 -3035 -1914 -1047 -1272 -377 -20 -1113 -1517 -1847 -3447 -2488 428 354
2606C54k537O1P64m42J477R72n04r54k29r08n45K057J526j325J54J347m52j146
$$ 354 -2183 -2122 -1358 -1800 -323 649 145 -809 -1038 -1946 -2491 -434 1092 -233 -79 1268 816 -330
2624c30O69j64l63O41J98n35P71K317q26k248Q9J224K79R79k14k342r16J733Q52
$$ -330 339 175 -188 453 651 116 887 3204 2378 130 219 1443 1722 2701 2487 145 -771 962 1814
2643A814K60J155L4k441j018O11j33L1J678k57k107J28R78K58J34K70k373j397
$$ 1814 2074 3229 3263 822 -196 415 282 313 1991 1734 -373 -245 733 991 1125 1395 -978 -2375
2661b375K129J197j297p71n28p05J702K566p62k528r04m85m4J690J792j090r66
$$ -2375 -246 951 -346 -1117 -1645 -2350 -648 1918 1156 -1372 -2276 -2761 -2805 -1115 677 -413 -1379
2678a379R06o41q84J298O31m26J09n63j267J0K766P28j552K19J48q59K36J048
$$ -1379 -473 -1114 -1998 -700 -69 -495 -386 -949 -2216 -2206 560 1288 -264 -45 103 -756 -520 528
2696E28j178q90J174M32J01O74N62j843m12R71l03p80R66P50j052n44K39oJ639
$$ 528 -650 -1540 -366 66 167 841 1403 -440 -852 119 -184 -964 2 752 -300 -844 -605 -611 1028
2715A028K049j810l257K31J051N45J175M27j633r29J286J103k67R86p58k827j04
$$ 1028 3077 1267 -1990 -1759 -708 -163 1012 1439 -194 -1123 163 1266 999 1985 1227 -1600 -1704
2732a704K865P12j029j98m95o31J514J102j469m58O8j176q91K442J146q08n84
$$ -1704 1161 1873 844 646 151 -480 1034 2136 667 209 277 -899 -1790 652 1798 990 406
2749D06k43n89k57J463l94j016K29m11j025J713K016o64j696o7j36L8J553l2j752
$$ 406 163 -426 -683 780 386 -630 -401 -812 -1837 -124 1892 1228 -468 -535 -671 -633 920 888 -864
2768h64M57J395n07l98R78P49r53n28j34j226J278J763o02j310M98J79k01J205
$$ -864 -407 988 481 83 1061 1810 857 329 195 -1031 247 2010 1408 98 596 775 574 1779
2786A779P67j817j833L11K56J306Q40m13j869j35J267l73l97j36n30j129J024
$$ 1779 2546 729 -1104 -793 -537 769 1609 1196 -673 -808 459 86 -311 -447 -977 -2106 -1082
2803a082J456n37J52L19j113p23J737R22j281o04r3j451N81K777J528p97j180
$$ -1082 374 -163 -11 308 -805 -1528 209 1131 -150 -754 -847 -2298 -1717 1060 2588 1791 611
2820F11j869j784K437K584k05j682j9k78l67J030L84o10P95O20j753j904P49J224
$$ 611 -1258 -3042 -605 1979 1774 92 73 -205 -572 458 842 232 1027 1647 -106 -2010 -1261 -37
2838c7r4J501K44j602l21J194j014j287J43P69Q55J423l40l133j167K017K523
$$ -37 -131 1370 1614 12 -309 885 -129 -1416 -1273 -504 351 1774 1434 -1699 -2866 -849 1674
2855A674N36k69j915k337M60J525K28O94J888j47j867j352l84J01K004J725j242
$$ 1674 2210 1941 26 -2311 -1851 -326 -98 596 2484 2337 470 -882 -1266 -1165 839 2564 1322
2872A322k486k1O68J279J339n01k729j84K124R2r06n88r42j71K597J569j681j884
$$ 1322 -1164 -1185 -517 762 2101 1600 -1129 -1313 811 903 -3 -591 -1533 -1704 893 2462 781 -1103
2890a103P34j38m92J021m14q54J157J030j087r17J202N87n62L04p76j585J232
$$ -1103 -369 -507 -999 22 -392 -1246 -89 941 -146 -1063 139 726 164 468 -308 -1893 -661
2907f61K766l92k206n55J05J306K372K03l643k221J137J290J504J422n70j662
$$ -661 2105 1713 -493 -1048 -943 363 2735 2938 -705 -2926 -1789 -499 1005 2427 1857 195
2923A95n12N98j320m50K645P01j287o59j366j108K429K354j89j351r38j126l90
$$ 195 -317 281 -1039 -1489 1156 1857 570 -89 -1455 -2563 -134 2220 2031 680 -258 -1384 -1774
2940a774J381K53j237P26K496j06j698q43j056n97K605K021j368j717k81q86K51
$$ -1774 -393 -140 -1377 -651 1845 1739 41 -802 -1858 -2455 150 2171 803 -914 -1195 -2081 -1830
2957a830K244J389o71j86r47k739p67K346K070L43N68j648k659L03K037R17n23
$$ -1830 414 1803 1132 946 -1 -2740 -3507 -1161 909 1252 1820 172 -2487 -2184 -147 770 247
2974B47j83j123p94J360J067j150M51O17k43m75J97kj598O50J061k04K43J082
$$ 247 64 -1059 -1853 -493 574 -576 -125 492 249 -226 -29 -31 -1629 -979 82 -122 121 1203
2992A203p36j056J57j61m07R86J092j276j071M01P68K57J353k37k231o15J362
$$ 1203 467 -589 -432 -593 -1000 -14 1078 -198 -1269 -868 -100 157 1510 1273 -958 -1573 -211
3009b11J75k33O59l47j323J126J259m58l09L22p73j273N67L92R8J835P01k230
$$ -211 -36 -269 390 43 -1280 -154 1105 647 338 660 -113 -1386 -819 -427 -329 1506 2207 -23
3027b3j672J251J097L94K79j407j912Q15K325j41j180N79j92l16J075l66j842
$$ -23 -1695 -444 653 1047 1326 -81 -1993 -1178 1147 1006 -174 405 213 -103 972 606 -1236
3044a236J5J389L80p03Q78m18l16K86J78j646K67J623L48j147o21m91J62J881
$$ -1236 -1221 168 548 -155 723 305 -11 275 453 -1193 -926 697 1045 -102 -723 -1214 -1052 829
3062H29J507j569j908R3k46J53J533P79j483k74O62k75O4Q10m72j114P69N34r49
$$ 829 2336 767 -1141 -1048 -1294 -1141 392 1171 -312 -586 76 -199 -135 675 203 -911 -142 392 -557
3081e57l29J232p4K37J10l21p54R77M29j921m20J117R67M0J110j400k156M63K262
$$ -557 -886 346 272 509 619 298 -456 521 950 -971 -1391 -274 693 733 1843 443 -1713 -1250 1012
3100A012J39o05o68j207k03J443J215q23n9P02q37o83m26n65O33K004L17k011
$$ 1012 1151 546 -122 -1329 -1532 -89 1126 303 244 946 109 -574 -1000 -1565 -932 1072 1389 -622
3118f22m99J079L87l63J65k50p52P52O04j360n25J212M78M09R08p80j852m81N92
$$ -622 -1121 -42 345 -18 147 -103 -855 -103 501 -859 -1384 -172 306 715 1623 843 -1009 -1490 -898
3137h98J60P53J631k31j462m30N3j77J506R43j272j348L48l76J71J183J275o09
$$ -898 -738 15 1646 1415 -47 -477 -424 -601 905 1848 576 -772 -424 -800 -629 554 1829 1220
3155A220l1n06j630l47J854K36n12k37R25n09O15q6j141k34J791K91j679n45N97
$$ 1220 1189 683 -947 -1294 560 796 284 47 972 463 1078 992 -149 -383 1408 1699 20 -525 72
3174G2P3J71J248o48l39M31jk105J29J077L10q5L23r07m18J515R98j469j065M01
$$ 72 145 316 1564 916 577 1008 1007 -1098 -969 108 418 333 656 -251 -669 846 1844 375 -690 -289
3194b89m76M83J005m06q18M67N91j141j55Q69M13l11m40j214j040J769K015m86
$$ -289 -765 -282 723 317 -501 -34 557 -584 -739 130 543 232 -208 -1422 -2462 -693 1322 836
3212H36m80l37n18j034M43L18l1J137R03j062j659P35L48L17N68M28j124k99P8
$$ 836 356 19 -499 -1533 -1090 -772 -803 334 1237 175 -1484 -749 -401 -84 484 912 -212 -511 -433
3231d33j126j92K369J293k73o77p19j768R6J628M36M01N05o9j771r00J048P15
$$ -433 -1559 -1751 618 1911 1638 961 242 -1526 -1430 198 634 1035 1540 1471 -300 -1200 -152 563
3249E63R76Q94j311k473N31P84P3L59J190j01p98n4j325j222J248J719l34n32
$$ 563 1539 2433 1122 -1351 -820 -36 37 396 1586 1485 687 633 -692 -1914 -666 1053 719 187
3267A87l08n5n16R13j89o79Q44P02j447j140L03R60O54R13o01j486L71J052p38
$$ 187 -121 -176 -692 221 32 -647 197 899 -548 -1688 -1385 -425 229 1142 541 -945 -574 478 -260
3286b60j124P01N81J69N86m32j286J070J549p65j504o2K59L84Q65l03j450K44
$$ -260 -1384 -683 -102 67 653 221 -1065 5 1554 789 -715 -777 -518 -134 731 428 -1022 -778
3304g78J523K54q81J05j70l73L4j65r07K56K227M43j491n56j92K5Q39N95j241
$$ -778 745 999 118 223 53 -320 -286 -451 -1358 -1102 1125 1568 77 -479 -671 -646 193 788 -453
3323d53m28J385J95j420O12K44M8O37N00j410r67P95l40K73J458Q04q60j312M36
$$ -453 -881 504 699 -721 -109 135 183 820 1320 -90 -1057 -262 -602 -329 1129 1933 1073 -239 197
3342A97r4k48Q99q04l08O33R60j130r69Q01K84O4Q04j020j731J20J373R7j49L66
$$ 197 103 -145 754 -50 -358 275 1235 105 -864 -63 221 285 1089 69 -1662 -1542 -169 -72 -221 145
3362A45m52l10J080n84j406N5J684L59j120p36R3R72J259j14j977j74J881N4j394
$$ 145 -307 -617 463 -121 -1527 -1472 212 571 -549 -1285 -1192 -220 1039 925 -1052 -1226 655 709 -685
3381f85m48M29N56J981m78k192l12J447L64p95n26j75k47R88J046j505o50Q67
$$ -685 -1133 -704 -148 1833 1355 -837 -1149 298 662 -133 -659 -834 -1081 -93 953 -552 -1202 -335
3399c35M99j96n00o37j121Q27J587K57j454M67P3K41j60Ln57Q10P44j006p53J010
$$ -335 164 -32 -532 -1169 -2290 -1463 124 381 -1073 -606 -533 -292 -452 -449 -1006 -196 548 -458 -1211 -201
3419b01J109k19k94J37m33q6R63p39n08Q96M00q71M78J293p70r10j1o7N51P19
$$ -201 908 689 395 532 99 13 976 237 -271 625 1025 154 632 1925 1155 245 234 167 718 1437
3439A437n14j484K52J498J53j013k0J94n54M33J59j406J03J375N65j17l45r53
$$ 1437 923 -561 -309 1189 1342 329 309 503 -51 382 541 -865 -762 613 1178 1061 716 -237
3457b37n79J046J349j400j346Q7J082Q09J67j249p81J382J251j338q47q3O95k3
$$ -237 -816 230 1579 179 -1167 -1080 2 811 978 -271 -1052 330 1581 243 -604 -687 8 -15
3475a5r7k28r7Q24Q16j511j350Q29L70k26L19m0p19K65J228l75m89O8j47l82M52
$$ -15 -112 -340 -437 387 1203 -308 -1658 -829 -459 -685 -366 -406 -1125 -860 368 -7 -496 -428 -575 -957 -505
3496e05N74r03l30N73N54l53M12J65o00o27J60j65L41J328k88o51O17K96r35o51
$$ -505 69 -834 -1164 -591 -37 -390 22 187 -413 -1040 -880 -1045 -704 624 336 -315 302 598 -337 -988
3516i88O53Q00O5N24j493j420J893J613n09q85L13M1j34J2n25o22Q59J383n96
$$ -988 -335 465 530 1054 -439 -1859 34 1647 1138 253 566 607 473 485 -40 -662 197 1580 984
3535I84j87K72m69n96N39K52m71M32N10q26q29P14N75K8N93k44j492m48J011R4
$$ 984 797 1069 600 4 543 795 324 756 1266 440 -389 325 900 928 1521 1277 -215 -663 348 442
3555D42l62L56P0q9J37Kr42j68Q01M1o01J57J96j93K2N12j89J79N60n88q36N74
$$ 442 80 436 506 417 554 556 -386 -554 247 288 -313 -156 40 -153 -131 381 192 371 931 343 -493 81
3577H1J40p25Q4Q68o4J60K91o88j077N24Q41l61l50K66q0l42J196R6j056J1J31
$$ 81 221 -504 -420 448 384 544 835 147 -930 -406 435 74 -276 -10 -90 -432 764 860 -196 -185 -54
3598e4Qj04J98p72n17J172K34n54L11N37o29j119J57J10L92J095l90j019n62J339
$$ -54 -46 -150 48 -724 -1241 -69 165 -389 -78 459 -170 -1289 -1132 -1022 -630 465 75 -944 -1506 -167
3618a67M62k51j61n85p4M33O77p87j46J106K2k37M96n57p29K79O50k71m74Q21
$$ -167 295 44 -117 -702 -776 -343 334 -453 -599 507 529 292 788 231 -498 -219 431 160 -314 507
3638E07k44N5N69l33j090N26P09m19j90K39L2p48O70N13j24%K02r58m48N61K58
$$ 507 263 318 887 554 -536 -10 699 280 90 329 361 -387 283 796 672 672 874 -84 -532 29 287
3659B87j08K9M60p14K97P26k45m57k99o7n54J229O81r13p33P19J7k8P75k25j264
$$ 287 179 208 668 -46 251 977 732 275 -24 -91 -645 584 1265 352 -381 338 355 327 1102 877 -387
3680c87m70Q05j42J60O73m94o22L25M23m77P7p5n45k40Q94n5p41Q58L15q23k67
$$ -387 -857 -52 -194 -34 639 145 -477 -152 271 -206 -129 -204 -749 -989 -95 -150 -891 -33 282 -541 -808
3701h08N44l7l15K26p8m46N59Q18p52k44Q88j45q18K65K55l44R6O31l54k35P57
$$ -808 -264 -301 -616 -390 -468 -914 -355 463 -289 -533 355 210 -608 -343 -88 -432 -336 295 -59 -294 463
3722D63J71n52M31K38j236k47P43N37j21R2k36o26O66P17p78m03M04l83k85M72
$$ 463 634 82 513 751 -485 -732 11 548 427 519 283 -343 323 1040 262 -141 263 -120 -405 67
3742F7M95l71M1J77r84L13P24n65n45k93q9N83O04N20r39r49M60L06J26M32l44
$$ 67 562 191 232 409 -575 -262 462 -103 -648 -941 -1030 -447 157 677 -262 -1211 -751 -445 -319 113 -231
3763b31j296O27R04O8o08L85j57j90K05J00q58K00J062k95n31O29M33n32j65M81
$$ -231 -1527 -900 4 72 -536 -151 -308 -498 -293 -193 -1051 -851 211 -84 -615 14 447 -85 -250 231
3783B31p23K99O03k81n22N64M47n54R19r7p60l06M15k99n15N75P83n87N46N48
$$ 231 -492 -193 410 129 -393 171 618 64 983 886 126 -180 235 -64 -579 -4 779 192 738 1286
3803A286q56p47L52L34N7k45q9o46rJ227M37j74n83l74n75P24Q86m46o48k38K69
$$ 1286 430 -317 35 369 426 181 92 -554 -563 664 1101 927 344 -30 -605 119 1005 559 -89 -327 -58
3824e8O59N84m11o26j10N36m42n60M99J09j48K16J26p22M00M64o29q69J63N16
$$ -58 601 1185 774 148 38 574 132 -428 71 180 32 248 374 -348 52 516 -113 -982 -819 -303
3844c03K11P1l15j173K98J685kp77o34n16O8Q92P20q32l08J038J71o24j34n6j53
$$ -303 -92 -21 -336 -1509 -1211 474 472 -305 -939 -1455 -1387 -495 225 -607 -915 123 294 -330 -464 -520 -673
3865f73M85R09j060o45N53L06L70P32K41j099q34L43N99M22L83m56p94L27P19
$$ -673 -188 721 -339 -984 -431 -125 245 977 1218 119 -715 -372 227 649 1032 576 -218 109 828
3884H28k95k83O2m70n9N05k5o97j13P07Q1K37K00n88n87K58J23n24M40P29K89
$$ 828 533 250 312 -158 -217 288 263 -434 -547 160 241 478 678 90 -497 -239 -116 -640 -200 529 818
3905H18q81o43J74N43J032M7j683m66Q66P28J27m6m03j84O74M55r59n02K04L05
$$ 818 -63 -706 -532 11 1043 1090 -593 -1059 -193 535 662 616 213 29 703 1158 199 -303 -99 206
3925B06J40J19j60l67K85P85l83p85L87Mn68o3K66l13O41N53p60q47P71L01n12
$$ 206 346 465 305 -62 223 1008 625 -160 227 231 -337 -400 -134 -447 194 747 -13 -860 -89 212 -300
3946c00n2M78n01K26K30N9o53R01K41n23P4L54r54j59M54K81J94L30j35r18k9
$$ -300 -352 126 -375 -149 81 140 -513 388 629 106 180 534 -420 -579 -125 156 350 680 545 -373 -402
3967d02O95K80m31k96n24L2J215L15l50p19J47K54r0J54p30o56Q39J143q46p05
$$ -402 293 573 142 -154 -678 -646 569 884 534 -185 -38 216 126 280 -450 -1106 -267 876 30 -675
3987f75K22O45kQ4p43m29R68J077j334o29K68J107K09j43q18p14N85P17qk68n02
$$ -675 -453 192 190 274 -469 -898 70 1147 -187 -816 -548 559 768 625 -193 -907 -322 395 387 119 -383
4008c83L01O3N76k18o69KO66j4o71l9j27J02N75N19l93o09J05K61l66Q10m55m86
$$ -383 -82 -19 557 339 -330 -328 338 324 -347 -386 -513 -411 164 683 290 -319 -214 47 -319 491 36 -450
4030d50l53P92K48K56j9q57m89J170M26p91p95K18M17N60O13r45q35J027Q17r88
$$ -450 -803 -11 237 493 474 -383 -872 298 724 -67 -862 -644 -227 333 946 1 -834 193 1010 22
4050B2q44J31P21O09j3q11r12J120J245l44j133l14r2M74J223n48j282L9J647
$$ 22 -822 -691 30 639 626 -185 -1097 23 1268 924 -209 -523 -615 -141 1082 534 -748 -709 938
4069I38L13m12j167l01N07J177K18j632m39J021O43j18l06m06k15M67K94j199
$$ 938 1251 839 -328 -629 -122 1055 1273 -359 -798 223 866 748 442 36 -179 288 582 -617
4087f17r5O59N34k40L95m35n43r8N48j83o3p3l44n46Q35L85m58R3O33p97l46K91
$$ -617 -712 -53 481 241 636 201 -342 -440 108 -75 -138 -211 -555 -1101 -266 119 -339 -246 387 -410 -756 -465
4109d65j58m21J263J83q54k95P44k34J05P30p85q20K51Q85j71l1l02o7P16J209
$$ -465 -623 -1044 219 402 -452 -747 -3 -237 -132 598 -187 -1007 -756 129 -42 -73 -375 -442 274 1483
4129A483j216j453K22J072L76j67o00J0j72J136J9j211n4R35L0l74p31j87M71
$$ 1483 267 -1186 -964 108 484 317 -283 -273 -445 691 710 -501 -555 380 410 36 -695 -882 -411
4148d11Q79O93j232n65L25L83k54K29l43M3M44P42r76l47O48L89p5m24n45n15
$$ -411 468 1161 -71 -636 -311 72 -182 47 -296 -253 191 933 -43 -390 258 647 572 148 -397 -912
4168i12Q99Q70n78o95M20L89j32N81p60o17N47J20Q7r69P99j51m13R06L17o24
$$ -912 -13 857 279 -416 4 393 261 842 82 -535 12 132 219 -750 49 -102 -515 391 708 84
4188H4j71n49j84M97P08j24p36J73M49L1l16P7j56q8K95L78q41k75J054N09m16
$$ 84 -87 -636 -820 -323 385 261 -475 -302 147 178 -138 -61 -217 -305 -10 368 -473 -748 306 815 399
4209C99K89q71l90J055N39j251J2M65K33J28k91n30rJ011j5p03n23k51M13P06
$$ 399 688 -183 -573 482 1021 -230 -218 247 480 608 317 -213 -222 789 774 71 -452 -703 -290 416
4229D16J36m52o67O97M86q57m30jM90M29L50p38p97N07P22k91O6j63j63m98N03
$$ 416 552 100 -567 130 616 -241 -671 -672 -182 247 597 -141 -938 -431 291 0 66 -97 -260 -758 -255
4250b55J8j72N97K37k65o65O09j26j28o6k9l15L53K67l36k80P52L14l82j20k48
$$ -255 -237 -409 188 425 160 -505 104 -22 -150 -216 -245 -560 -207 60 -276 -556 196 510 128 8 -240
4271b40l11M15L66k28m85N84L72l36o6l25l5k08Q54k78r68O67R16k78m34O7j62
$$ -240 -551 -136 230 2 -483 101 473 137 71 -254 -289 -497 357 79 -889 -222 694 416 -18 49 -113
4292a13L91L66o32o76O84O59j03l12l76j67M35R19n48n16j85K10j08K33L65r4
$$ -113 278 644 12 -664 20 679 576 264 -112 -279 156 1075 527 11 -174 36 -72 161 526 432
4312D32PJ90L2o48J3K38l11j78N71j36q2L24J5l72j83Q74o59n77K27K9K28K35
$$ 432 439 629 661 13 26 264 -47 -225 346 210 128 452 467 95 -88 786 127 -450 -223 -194 34 269
4334B69K23r64N55N43m32q45N42L47k98J24J23n41J40N38k0l91l36N46M5k94k22
$$ 269 492 -472 83 626 194 -651 -109 238 -60 64 187 -354 -214 324 304 -87 -423 123 168 -126 -348
4355c48r2J07R68l7r97K71J90K17j97Q2r27O83P05r7q75M4N82J92j05O7p57k57
$$ -348 -440 -333 635 598 -399 -128 62 279 82 164 -763 -80 625 528 -347 -303 279 471 366 433 -324 -581
4377e81P06K04m84n5M18n5j90J11m26m02R65J08m48k49K73Q4L7L42k82l65J49
$$ -581 125 329 -155 -210 208 153 -37 74 -352 -754 211 319 -129 -378 -105 -21 16 358 76 -289 -140
4398a40o3lk87K83M33j83L67j18m22M93m11K3K13J21j32k50J45K47j34L14J66
$$ -140 -203 -206 -493 -210 223 40 407 289 -133 360 -51 -28 185 306 174 -76 69 316 182 496 662
4419F62q29k14N63j60m48L70L71R6o9Q0r41L0Q88j84o61O0L36j3L2Q3l43N2N61
$$ 662 -167 -381 182 22 -426 -56 315 411 342 422 -519 -489 399 215 -446 -386 -50 -63 -31 52 -291 -239 322
4442C22K4m76m6k01j68L76M53m49q0O94M01o96K3k03k97J82N40k08m36M56N1j20
$$ 322 346 -130 -176 -377 -545 -169 284 -165 -245 449 850 154 177 -26 -323 -141 399 191 -245 211 262 142
4464A42J78j99l78j39O53k77p03N37K07QP1J65l35r1L3k66k35M17K56j90R2N12
$$ 142 320 121 -257 -396 257 -20 -723 -186 21 29 100 265 -70 -161 -128 -394 -629 -212 44 -146 -54 458
4486D58n79k50N74k30k16L55q2m10J40J18PJ64L01P6o62J04P6j20l35P48q3p6
$$ 458 -121 -371 203 -27 -243 112 30 -380 -240 -122 -115 49 350 426 -236 -132 -56 -176 -511 237 154 78
4508G8Pr4l38kM93q2j48oK04m48L6L72p2M3M2Jo42j41O82n36L04K71j34L53K18
$$ 78 85 -9 -347 -349 144 62 -86 -92 112 -336 -300 72 0 43 85 86 -556 -697 -15 -551 -247 24 -110 243 461
4533D61o86l28L73L37n68J15M51k29j17N99m12j90L20J03n97j07L43j05m0N07
$$ 461 -225 -553 -180 157 -411 -296 155 -74 -191 408 -4 -194 126 229 -368 -475 -132 -237 -277 230
4553B30j23k66M2P05m96K66l62J44m25K52J63l00K50K58k92j19K43k22K1P5J84
$$ 230 107 -159 -117 588 92 358 -4 140 -285 -33 130 -170 80 338 46 -73 170 -52 -31 44 228
4574B28n04QO70p8j76K68l8m41M5K78l39M5N87o04J81L10n3o26K49K45m79J72
$$ 228 -276 -268 402 324 148 416 378 -63 -18 260 -79 -34 553 -51 130 440 387 -239 10 255 -224 -52
4596e2K4k07K9L16k17n0L14M21n86k61J78k08m5M60K63m93K17K32m38n4P01n62
$$ -52 -28 -235 -206 110 -107 -157 157 578 -8 -269 -91 -299 -344 116 379 -114 103 335 -103 -157 544 -18
4618a8j02j57M1K3O6P49l57j17q3k75k36M08M31o41k7N72l32K51K96m01m67J00
$$ -18 -120 -277 -236 -213 -147 602 245 128 45 -230 -466 -58 373 -268 -295 277 -55 196 492 91 -376 -276
4640b76K40l2k74L54l13Q9M02o1J5N1l01l29J48M51k32k14M78j74l27J22M15q4
$$ -276 -36 -68 -342 12 -301 -212 190 129 144 195 -106 -435 -287 164 -68 -282 196 22 -305 -183 232 148
4662A48j87L20m16O2m2K48l6j4L3J20j03l6J5l54K0K74n24L77M31r9k33J85j30
$$ 148 -39 281 -135 -73 -115 133 97 83 116 236 133 97 112 -242 -222 52 -472 -95 336 237 4 189 59
4685E9j53n2L39r4l51K38p8L7L93M37l95n18L23m60K54K36K31k31k13N06m59K37
$$ 59 -94 -146 193 99 -252 -14 -92 -55 338 775 380 -138 185 -275 -21 215 446 215 2 508 49 286
4707B86J83l80j24P2N6l07j17L97J7k98N73j57M3k23M72r39K58L40k75Q0L04m0
$$ 286 469 89 -35 37 93 -214 -331 66 83 -215 358 201 244 21 493 -446 -188 152 -123 -43 261 221
4729B21m33M59m27O9P4m3l7k61M69j15P5Q9L08l98k08K64j50k59M5L20k46K49
$$ 221 -212 247 -180 -111 -37 -80 -117 -378 91 -24 51 140 448 50 -158 106 -44 -303 -258 62 -184 65
4751F5k4J92j23O8m33p3K12K55l19n5M82k68J5R1L69o54K31k00m25M19K97j34
$$ 65 41 233 110 178 -255 -328 -116 139 -180 -235 247 -21 -6 85 454 -200 31 -169 -594 -175 122 -12
4773a2k66J98j58J87j84M09j21n94N71j15k19M51j63l96L71J71j28j89J86j04
$$ -12 -278 -80 -238 -51 -235 174 53 -541 30 -85 -304 147 -16 -412 -41 130 2 -187 -1 -105
4793a05j03P4M99k50p2M13m59j91J90l00K54n3K32k70m3O07k29j58R8m8k41J40
$$ -105 -208 -134 365 115 43 456 -3 -194 -4 -304 -50 -103 129 -141 -184 423 194 36 134 86 -155 -15
4815a5K51l25n9K73n4m08L82M28m28J5K61n22j43L66R1Q6n4l1l69J16O48l50k48
$$ -15 236 -89 -148 125 71 -337 45 473 45 60 321 -201 -344 22 113 199 145 114 -255 -139 509 159 -89
4838h9L51k64m22L31J64k31N48k45J5k24l9J05m49K77K05O5J0K43l79j97K52q4
$$ -89 262 -2 -424 -93 71 -160 388 143 158 -66 -105 0 -449 -172 33 98 108 351 -28 -225 27 -57
$$ [...]
8191b1
##END NTUPLES=NMR FID
##END=
