##TITLE=1H_CA-8712-2
 CDCl3, 8 sc, 
 8.6.2020
##JCAMPDX= 6.0         $$ Bruker NMR JCAMP-DX V2.0
##DATA TYPE= NMR FID
##DATA CLASS= NTUPLES
##ORIGIN= UXNMR, Bruker Analytische Messtechnik GmbH
##OWNER= root
$$ XWIN-NMR		Version 3.5
$$ Mon Jun  8 11:23:11 2020 Russian Standard Time (UT+4h)  she@DPX200
##.OBSERVE FREQUENCY= 200.1315
##.OBSERVE NUCLEUS= ^1H
##.DELAY= (6, 6)
##.ACQUISITION MODE= SIMULTANEOUS
##.ACQUISITION SCHEME= undefined
##.AVERAGES= 8
##.DIGITISER RES= 18
##SPECTROMETER/DATA SYSTEM= spect
##.PULSE SEQUENCE= zg30
##.SOLVENT NAME= CDCl3
##.SHIFT REFERENCE= (INTERNAL, CDCl3, 0, 15.7039)
##AUDIT TRAIL= $$ (NUMBER, WHEN, WHO, WHERE, WHAT)
$$ ##TITLE= Audit trail, XWIN-NMR		Version 3.5
$$ ##JCAMPDX= 5.01
$$ ##ORIGIN= Bruker BioSpin GmbH
$$ ##OWNER= she
$$ F:/spectra/data/she/nmr/H-F/1/audita.txt
$$ ##AUDIT TRAIL=  $$ (NUMBER, WHEN, WHO, WHERE, WHAT)
(   1,<2020-06-08 11:21:49.23 +0400>,<she>,<DPX200>,
      <created by zg, POWCHK disabled, PULCHK disabled
       configuration hash MD5:
       00 E9 B6 7A A2 85 ED C7 34 08 36 98 17 FE 4E 26
       data hash MD5: 16K
       B7 DC F8 19 09 A3 8B 6B 8F C8 B8 00 83 9C C0 2C>)
$$ ##END=
$$ 
$$ hash MD5
$$ ED 77 74 99 97 E0 2A 12 29 38 76 D4 E9 FC 7B 18
##$RELAX= 
##$RELAX= 
##$RELAX= 
##$RELAX= 
##$RELAX= 
##$RELAX= 
$$ Bruker specific parameters
$$ --------------------------
##$DU= <F:/spectra>
##$EXPNO= 1
##$NAME= <H-F>
##$PROCNO= 1
##$TYPE= <nmr>
##$USER= <she>
##$AMP= (0..31)
100 100 100 100 100 100 100 100 100 100 100 100 100 100 100 100 100 100 
100 100 100 100 100 100 100 100 100 100 100 100 100 100 
##$AQSEQ= 0
##$AQ_mod= 1
##$AUNM= <au_zg>
##$AUTOPOS= <>
##$BF1= 200.13
##$BF2= 200.13
##$BF3= 200.13
##$BF4= 200.13
##$BF5= 200.13
##$BF6= 200.13
##$BF7= 200.13
##$BF8= 200.13
##$BYTORDA= 1
##$CFDGTYP= 0
##$CFRGTYP= 5
##$CHEMSTR= <none>
##$CNST= (0..31)
1 1 145 1 1 1 1 1 1 1 1 1 1 1 1 1 1 1 1 1 1 1 1 1 1 1 1 1 1 1 1 1 
##$CPDPRG= <>
##$CPDPRG1= <>
##$CPDPRG2= <>
##$CPDPRG3= <>
##$CPDPRG4= <mlev>
##$CPDPRG5= <mlev>
##$CPDPRG6= <mlev>
##$CPDPRG7= <mlev>
##$CPDPRG8= <mlev>
##$CPDPRGB= <>
##$CPDPRGT= <>
##$D= (0..31)
0 1.2 0 0 0 0 0 0 0 0.06 0 0.03 0 0 0 0 0.0002 0 0 0 0 0 0 0 0 0 0 0 0 
0 0 0 
##$DATE= 1591600908
##$DBL= (0..7)
120 120 120 120 120 120 120 120 
##$DBP= (0..7)
150 150 150 150 150 150 150 150 
##$DBP07= 0
##$DBPNAM0= <>
##$DBPNAM1= <>
##$DBPNAM2= <>
##$DBPNAM3= <>
##$DBPNAM4= <>
##$DBPNAM5= <>
##$DBPNAM6= <>
##$DBPNAM7= <>
##$DBPOAL= (0..7)
0.5 0.5 0.5 0.5 0.5 0.5 0.5 0.5 
##$DBPOFFS= (0..7)
0 0 0 0 0 0 0 0 
##$DE= 6
##$DECBNUC= <off>
##$DECIM= 24
##$DECNUC= <off>
##$DECSTAT= 4
##$DIGMOD= 1
##$DIGTYP= 9
##$DL= (0..7)
0 120 120 120 120 120 120 120 
##$DP= (0..7)
150 150 150 150 150 150 150 150 
##$DP07= 0
##$DPNAME0= <>
##$DPNAME1= <>
##$DPNAME2= <>
##$DPNAME3= <>
##$DPNAME4= <>
##$DPNAME5= <>
##$DPNAME6= <>
##$DPNAME7= <>
##$DPOAL= (0..7)
0.5 0.5 0.5 0.5 0.5 0.5 0.5 0.5 
##$DPOFFS= (0..7)
0 0 0 0 0 0 0 0 
##$DQDMODE= 0
##$DR= 18
##$DS= 0
##$DSLIST= <SSSSSSSSSSSSSSS>
$$ [...]
##$SUBNAM2= <"">
##$SUBNAM3= <"">
##$SUBNAM4= <"">
##$SUBNAM5= <"">
##$SUBNAM6= <"">
##$SUBNAM7= <"">
##$SUBNAM8= <"">
##$SUBNAM9= <"">
##$SW= 24.9337058887773
##$SWIBOX= (0..15)
0 0 2 0 0 0 0 0 0 0 0 0 0 0 0 0 
##$SW_h= 4990.01996007984
##$TD= 16384
##$TD0= 1
##$TE= 0
##$TE2= 300
##$TE3= 300
##$TEG= 300
##$TL= (0..7)
0 120 120 120 120 120 120 120 
##$TP= (0..7)
150 150 150 150 150 150 150 150 
##$TP07= 0
##$TPNAME0= <>
##$TPNAME1= <>
##$TPNAME2= <>
##$TPNAME3= <>
##$TPNAME4= <>
##$TPNAME5= <>
##$TPNAME6= <>
##$TPNAME7= <>
##$TPOAL= (0..7)
0.5 0.5 0.5 0.5 0.5 0.5 0.5 0.5 
##$TPOFFS= (0..7)
0 0 0 0 0 0 0 0 
##$TUNHIN= 0
##$TUNHOUT= 0
##$TUNXOUT= 0
##$USERA1= <user>
##$USERA2= <user>
##$USERA3= <user>
##$USERA4= <user>
##$USERA5= <user>
##$V9= 5
##$VALIST= <valist>
##$VCLIST= <CCCCCCCCCCCCCCC>
##$VD= 0
##$VDLIST= <DDDDDDDDDDDDDDD>
##$VPLIST= <PPPPPPPPPPPPPPP>
##$VTLIST= <TTTTTTTTTTTTTTT>
##$WBST= 1024
##$WBSW= 4
##$XGAIN= (0..3)
0 0 0 0 
##$XL= 0
##$YL= 0
##$YMAX_a= 867643
##$YMIN_a= -488439
##$ZGOPTNS= <>
##$ZL1= 120
##$ZL2= 120
##$ZL3= 120
##$ZL4= 120
##$ABSF1= 10
##$ABSF2= 0
##$ABSG= 5
##$ABSL= 3
##$ALPHA= 0
##$AQORDER= 0
##$ASSFAC= 0
##$ASSFACI= 0
##$ASSFACX= 0
##$ASSWID= 0
##$AUNMP= <proc_1d>
##$AZFE= 0.1
##$AZFW= 0.1
##$BCFW= 1
##$BC_mod= 2
##$BYTORDP= 1
##$COROFFS= 0
##$CY= 11.3945322036743
##$DATMOD= 1
##$DC= 2
##$DFILT= <>
##$DTYPP= 0
##$F1P= 16.9975609425685
##$F2P= -3.02152046262296
##$FCOR= 0.5
##$FTSIZE= 0
##$FT_mod= 4
##$GAMMA= 1
##$GB= 0.15
##$INTBC= 1
##$INTSCL= 1
##$ISEN= 128
##$LB= 0.24
##$LEV0= 0
##$LPBIN= 0
##$MAXI= 10000
##$MC2= 0
##$MEAN= 0
##$ME_mod= 0
##$MI= 1.114404
##$NCOEF= 0
##$NC_proc= 0
##$NLEV= 6
##$NOISF1= 3.799351
##$NOISF2= 2.8
##$NSP= 1
##$NTH_PI= 0
##$NZP= 0
##$OFFSET= 15.70392
##$PC= 1
##$PHC0= -9793.334
##$PHC1= 15.40088
##$PH_mod= 1
##$PKNL= yes
##$PPARMOD= 0
##$PSCAL= 0
##$PSIGN= 0
##$REVERSE= no
##$SF= 200.130013532006
##$SI= 16384
##$SIGF1= 3
##$SIGF2= 2
##$SINO= 400
##$SIOLD= 16384
##$SREGLST= <1H.CDCl3>
##$SSB= 0
##$STSI= 0
##$STSR= 0
##$SW_p= 3612.71676300578
##$SYMM= 0
##$S_DEV= 0
##$TDeff= 0
##$TDoff= 0
##$TI= <>
##$TILT= no
##$TM1= 0
##$TM2= 0
##$TOPLEV= 0
##$USERP1= <user>
##$USERP2= <user>
##$USERP3= <user>
##$USERP4= <user>
##$USERP5= <user>
##$WDW= 1
##$XDIM= 8192
##$YMAX_p= 0
##$YMIN_p= 0
$$ End of Bruker specific parameters
$$ ---------------------------------
##NTUPLES= NMR FID
##VAR_NAME=  TIME,          FID/REAL,        FID/IMAG
##SYMBOL=    X,             R,               I
##VAR_TYPE=  INDEPENDENT,   DEPENDENT,       DEPENDENT
##VAR_FORM=  AFFN,          ASDF,            ASDF
##VAR_DIM=   8192,          8192,            8192
##UNITS=     SECONDS,       ARBITRARY UNITS, ARBITRARY UNITS
##FACTOR=    0.0002004,     1,               1
##FIRST=     0,             0,               0
##LAST=      1.6414764,     0,               0
##MIN=       0,             -488439,         0
##MAX=       1.6414764,     867643,          0
$$ Real data points
##PAGE= N=1
##DATA TABLE= (X++(R..R)), XYDATA
$$ [...]
2303h53K59J809j830k550K705M341J137k721l355o79K266K025k489l804O77L269
2319B07K170K30j538j449J743K523k905n502m31K994K580M83p5j846j148K117
2335A53R78j645k656j70o23K19N67l12J711K488K5k364j260p10j121m11J840L49
2353b942L10K088m03j557J556K635o87m129o34J184J368Q42j72K07K464K832j279
2370C683l881j689P85J762J317j279j941J831L414J46j918o74k26k97L04j389
2386e2k704J80M539K620j357j902n40L25R12m65k856j419K268J764L70L5l91M62
2404A789J455O0l584j759J499O33m84J280J602p9l82O71o89k167l17L62j193L35
2422i68Q03Q10K18J001k7k64k68j987k020J87J660J29p73Q41R95L45J275j181
$$ plain form
2303 -853 -594 1215 -615 -3165 -460 3881 5018 2297 -1058 -1737 529 2554 65 -3739 -3062 207
2319 207 2377 2607 1069 -380 1363 3886 981 -4521 -4952 -1958 622 1105 1030 -816 -1964 153
2335 153 1131 -514 -3170 -3340 -3963 -3744 -3177 -3489 -1778 710 735 -1629 -2889 -3599 -4720 -5131 -3291 -2942
2353 -2942 -2632 -544 -947 -2504 -948 1687 1000 -3129 -3763 -2579 -1211 -369 -541 -334 2130 4962 3683
2370 3683 -198 -1887 -1102 660 1977 698 -1243 588 4002 4148 2230 1556 1330 1033 1337 -52
2386 -52 -2756 -2576 1963 4583 3226 1324 784 1109 2021 1556 -1300 -2719 -451 1313 1683 1718 1327 1789
2404 1789 3244 3304 -280 -2039 -540 93 -391 889 2491 2412 2030 2701 2012 -155 -472 -110 -1303 -968
2422 -968 -165 645 863 1864 1837 1573 1305 -682 -2702 -2515 -855 -726 -1499 -658 337 682 1957 776
2440G76l575n8J972n27j867K34J648J258J396K13k078j315Q15L07j669j405O13
2457c262J851K718R38k518j297J823J082j289j227k050m57L084K917j514j745
2472i46K419K161j256k789j654l64K097J944r64p84J623J767k20m02j304j903
2488e75R0J197n43r50J152M85O49K142L81l042k727R02O76j119n9Q67M82Q56Q79
2507A743j257r13Q84l0k077n87j82k48J080K080O25j66j8j693j002J079J89k829
2525c322q58K901K699j81j072k14j18J332K25k742j964J625J603j6K5Q22R33J104
2543B782n92k148j070K90l94L3K059N94j653Q08K697k57k124j291o00q9J144Q3
2561B72q89N05K495K37j136l21L15m99j338j386p29J867K309j18o46M85K21j555
$$ plain form
2440 776 -2799 -2857 -885 -1412 -3279 -3045 -1397 -139 1257 1470 -608 -1923 -1108 -801 -2470 -3875 -3262
2457 -3262 -1411 1307 2245 -273 -1570 253 1335 46 -1181 -3231 -3688 -604 2313 799 -946
2472 -946 1473 3634 2378 -411 -2065 -2429 -332 1612 648 -136 1487 3254 3034 2632 1328 -575
2488 -575 -485 712 169 -781 371 856 1505 3647 4028 986 -1741 -839 -163 -1282 -1341 -474 8 864 1743
2507 1743 486 -427 457 427 -1650 -2237 -2419 -2667 -1587 493 1118 952 934 -759 -1761 -682 -493 -3322
2525 -3322 -4180 -1279 1420 1239 167 -47 -165 1167 1392 -1350 -3314 -1689 -86 -102 -77 745 1678 2782
2543 2782 2190 42 -1028 -738 -1132 -1099 960 1554 -99 709 3406 3149 1025 -266 -866 -955 189 272
2561 272 -617 -112 2383 2620 1484 1163 1478 979 -359 -1745 -2474 -607 1702 1584 938 1423 1644 89
2579H9q28M55q79p22N16M94p5J615R60j456o02J032q28j881l34L8j5O19J446R86
2599F30J193j41k675j644J080N49j069K22J214p0j5J562Q4o86Q85n09k210p00
2617b300R35J14J25J830P81m7O5k42j030o13n50j031L63K104R95l24J63M18r45
2636H11kN36n14j880L75O6o04J401K208K06m86k62j629j323j89O94n19M04M00
2655c07K03J359J035j184k116RN66n53l03P54j511j57K220J436K91k68p97j866
2673a189j153L85P61p3J370J271q23K99Q5oK08o72j675o01J171J067k29O14R79
2692A789l8o26Q32r29k308j88M08j04J167J584K11p14K62l96r93n97k52J08J73
2711f11q6o83O66K512P73j537o46p40j018n48J098J17q9J170M06k68J043J050
$$ plain form
2579 89 -739 -284 -1163 -1885 -1369 -875 -950 665 1625 169 -433 599 -229 -2110 -2444 -2406 -2421 -1802 -356 630
2599 630 1823 1682 -993 -2637 -1557 -1008 -2077 -1855 -641 -711 -726 836 920 234 1119 610 -1600 -2300
2617 -2300 -1365 -1251 -1126 704 1485 1438 1503 1261 231 -382 -932 -1963 -1600 504 1499 1175 1338 1756 811
2636 811 809 1345 831 -1049 -674 -608 -1212 189 2397 2603 2117 1855 226 -1097 -1286 -592 -1111 -707 -307
2655 -307 -104 1255 2290 1106 -1010 -1001 -435 -988 -1291 -537 -2048 -2205 15 1451 1742 1474 677 -1189
2673 -1189 -2342 -1957 -1196 -1269 101 1372 549 848 933 927 1135 463 -1212 -1813 -642 425 196 810 1789
2692 1789 1751 1125 1957 1028 -1280 -1468 -1060 -1164 3 1587 1798 1084 1346 950 -43 -640 -892 -784 -611
2711 -611 -697 -1380 -714 1798 2571 1034 388 -352 -1370 -1918 -820 -703 -792 378 784 516 1559 2609
2729B609j942k299o29J143O3Q70M00n99N05Q64L0R5k53j882k184Q08J401J83M87
2748c30J455k25o11K44m08j249J02L37j432m88J815K101Jj20l82p63L49j32j253
2767i89o44J027M99L20J039Q84k97l15J20j354j033N93l24o7J256O72p96k10J726
2786B107K23j728j358j088n43J360J311j82o42Q32K53q5K07m77j999k76M55j28
2804a758Q89J506k24m77Q33K84j190m66J005j180j460J04J624J516J695L10k162
2821H49j044mK91o93l1j94J20J588P76j070K02P05q5j256j11j046j008O41J651
2840B81m0M70J087M32o93j494j209j668J185K872L39j298l69m48Q97J268M28j676
2858C64j068L23j398n54J616J434Q75L94M09k463j631P55P59m90l98K06j91R95
$$ plain form
2729 2609 667 -1632 -2261 -1118 -1055 -185 215 -384 121 985 1015 1110 857 -1025 -3209 -2401 -1000 -817 -330
2748 -330 1125 900 289 533 125 -1124 -1022 -685 -2117 -2605 -790 1311 1312 1192 810 47 396 264 -989
2767 -989 -1633 -606 -107 213 1252 2136 1839 1524 1644 290 -743 -150 -474 -541 715 1387 591 381 2107
2786 2107 2330 602 -756 -1844 -2387 -1027 284 102 -540 292 545 460 667 190 -1809 -2085 -1630 -1758
2804 -1758 -869 637 413 -64 769 1053 -137 -603 402 -778 -2238 -2134 -510 1006 2701 3011 849
2821 849 -195 -199 92 -601 -632 -826 -706 882 1658 588 790 1495 1410 154 43 -1003 -2011 -1370 281
2840 281 241 711 1798 2230 1537 43 -1166 -2834 -1649 1223 1562 264 -105 -553 344 1612 2040 364
2858 364 -704 -381 -1779 -2333 -717 717 1592 1986 2395 -68 -1699 -944 -185 -675 -1073 -867 -1058 -63
2876f3J650p38j146k70M11mj03j420j564J116K395J067m08J29n49j764O83j48
2894g26j306P1J652K65o8N77K29k68M42J98k213j039M76J505Q27N32r97o70J002
2913D89J839m05j503r02j396p9J587J144l47N95J182r34j419m21m1n52J053P54
2931F44r73n11R93R37N65K45o97j271k8oj381n72J539Q69J786J326r34l046j202
2950a717J125J20N36N71k98j036M31Q64j85P78R74o42k128j200o70K92K265J731
2968A811n18m88J60o96m59K72q61q90N55J512o57p2Q13p4k51R89Lj981p43q5J23
2989a537K32J524Q71j75L13o79j773K28L65R3p3J03o56P8J600J482q85o64l75
3008G2r68o71R33L57j049L22J530O8K86M8o27l50l75j023m77O44J769L18Q5l15
$$ plain form
2876 -63 1587 849 -297 -567 -156 -160 -263 -1683 -3247 -2131 264 1331 923 1052 503 -1261 -578 -726
2894 -726 -2032 -1961 -309 -44 -112 465 694 426 868 1066 -1147 -2186 -1710 -205 622 1154 157 -513 489
2913 489 2328 1923 420 -482 -1878 -1957 -370 774 427 1022 2204 1270 -149 -570 -611 -1163 -110 644
2931 644 -329 -840 153 1090 1655 1900 1203 -68 -96 -102 -1483 -2055 -516 353 2139 3465 2531 -515 -1717
2950 -1717 -592 -472 64 635 337 -699 -268 596 411 1189 2163 1521 -607 -1807 -2477 -2185 80 1811
2968 1811 1293 805 965 269 -190 82 -779 -1669 -1114 398 -259 -331 482 408 157 1146 1149 -832 -1575 -1660 -1537
2989 -1537 -1305 219 1090 915 1228 549 -1224 -996 -631 -538 -611 -508 -1164 -1086 514 1996 1111 447 72
3008 72 -896 -1567 -634 -277 -1326 -1004 526 594 880 928 301 -49 -424 -1447 -1924 -1280 489 807 892 577
3028E77l54k60J204n94j979k38N55N17P12R42k43q81Q32P58j017j325m03k43L63
3047a077R72M67N77p0R51j192q19k25l26J51J015o10r81P57K012K63n58lo99j923
3067a318O25N38n72L10O89J35O25P15n17j087k95J30l28l96P04l03N62J422l64
3086A275p62M77N60j721q93j63j42J89K168J265j237j050L48K19r8J78j074j426
3104a887N56J479m1J75L81J62M18l32j878j403R39P37k85N15O73M84n47N48m61
3123B33j615J10J259o24o07M84k74K15J630Q92n57n92q70j632j43P50P14P56J104
3142A233m2j185R5L31n25n44O18k22j002L24P93N40O78O82j24j320n10k10p41
3161a131j53M97N84J309P17j165j013N63K59m84j75n5p93K61R68K71j61J189P36
$$ plain form
3028 577 223 -37 1167 573 -1406 -1644 -1089 -572 140 1082 839 -42 790 1548 531 -794 -1197 -1440 -1077
3047 -1077 -105 362 939 869 1820 628 -191 -416 -742 -591 424 -186 -1167 -410 1602 1865 1307 1304 605 -1318
3067 -1318 -693 -155 -727 -417 272 407 1032 1747 1230 143 -152 -22 -350 -746 -42 -345 217 1639 1275
3086 1275 513 990 1550 -171 -1064 -1227 -1369 -1180 988 2253 1016 -34 314 533 435 613 -461 -1887
3104 -1887 -1331 148 107 282 663 825 1243 911 -967 -2370 -1431 -694 -979 -464 209 693 146 694 233
3123 233 -1382 -1272 -13 -637 -1244 -760 -1034 -819 811 1703 1146 554 -316 -1948 -2091 -1341 -627 129 1233
3142 1233 1191 6 101 432 -93 -637 -19 -241 -1243 -919 -126 414 1092 1774 1650 330 -180 -390 -1131
3161 -1131 -1284 -787 -203 1106 1823 658 -355 208 467 -17 -192 -247 -1040 -779 189 460 299 1488 2224
3180B224j523j061q5p81j35J107R67j043M97Q11J71k76l95j420R0N61j28r20J252
3199h7J223m50l17M4l32JM66o65j686o2J395J070j71M85P7m70K22o18j741j19
3219a735J215Q16M3M00l65j10N78j35q94J30N63o53j151J81M88P62J466P34q75
3238A458j362j39j237l46N69J286L34M35m42o65j13Q51L6m76j52n43j175L41R63
3257c77M3P55J327m72j576m85l64q34M02J224J14K18P22k92r41J01P53l2o27n72
3277i13j111O44J347O99o62O99M61n34j036j93j005J59J649K86j047M48J195J3
3295A099n0p89p08o04O45J98n91l91J245P52J03o2j004p33J063P3j405n78Q35
3314i02J258O61O57r62p39M09L68j219j100Q47J069K35K72r2n48P23K28j77n33
$$ plain form
3180 2224 701 -360 -445 -1226 -1361 -254 713 -330 167 978 1149 873 478 -942 -852 -291 -419 -1339 -87
3199 -87 1136 686 369 413 81 82 548 -117 -1803 -1865 -470 600 429 914 991 521 743 125 -1616 -1735
3219 -1735 -520 296 339 739 374 264 842 707 -187 -57 506 -147 -1298 -1117 -629 133 1599 2333 1458
3238 1458 96 -43 -1280 -1626 -1057 229 563 998 556 -109 -222 629 665 189 37 -506 -1681 -1340 -377
3257 -377 -334 421 1748 1276 -300 -785 -1149 -1983 -1581 -357 -243 -25 697 405 -536 -435 318 286 -341 -913
3277 -913 -2024 -1380 -33 666 4 703 1164 630 -406 -599 -1604 -1445 204 490 -557 -109 1086 1099
3295 1099 1049 260 -448 -1052 -407 -209 -800 -1191 54 806 909 847 -157 -890 173 246 -1159 -1737 -902
3314 -902 356 1017 1674 712 -27 382 750 -469 -1569 -722 347 582 854 762 214 937 1165 988 455
3333D55k57q10k24N92Q06j47P64L68l56q64q1n78p99K30Q73j24J55O79j51k14
3353C17M1L10q92m26l95j53J66J314j03L9J151M66j500j247R1K29M62r8m58j70
3373h56J863R13j036j279O54L43o30o38n48m15J281J070J02n75O4m46l08l7p21
3392a199j087R94Q32J32k30K53K28n4R53j011j557l71J239k7m07P95J067L87k81
3411F56m98j294M26P73l93r53N92J038M35M13m40q3J19K84j137q74P67N3l11O99
3431B72J108J68m11lj124l73K19N37n45l37Q10pq8Q58l74p05K60J80o52k07l91
3452h05J06O02K129j83j434j48N60k26n63o76k12R41Q98qq24L89R09l76j144k80
3472c45j30l34L89j19j52R04Q48k98k92J59j177p26N78K71n64K69Q64N6K51L28
$$ plain form
3333 455 198 -612 -836 -244 562 415 1179 1547 1191 327 246 -332 -1131 -901 -28 -152 3 682 531 317
3353 317 358 668 -224 -650 -1045 -1198 -1032 282 179 218 1369 1835 335 -912 -821 -592 -130 -228 -686 -856
3373 -856 1007 1920 884 -395 259 602 -28 -666 -1214 -1629 -348 722 824 249 313 -133 -441 -478 -1199
3392 -1199 -2286 -1292 -460 -328 -558 -305 -77 -131 822 -189 -1746 -2117 -878 -905 -1312 -517 550 937 656
3411 656 158 -1136 -710 63 -330 -1283 -691 347 782 1195 755 672 791 1075 -62 -936 -169 -116 -427 272
3431 272 1380 1548 1137 1134 10 -363 -144 393 -152 -489 321 314 226 1084 710 5 265 445 -207 -414 -805
3452 -805 -699 -97 2032 1849 415 267 827 601 38 -638 -850 91 989 981 157 546 1455 1079 -65 -345
3472 -345 -475 -809 -420 -539 -691 213 1061 763 471 630 -547 -1273 -695 -424 -988 -719 145 201 452 780
3492G80l95j555L28K36l12j6N20k20R1O78N93Q1j49p92j382R7P14J48m47O28J012
3513F38mj32k77j090M02R70p94j282J7J399K86L69k27M0k76N48o60j169K0K45
3533i77M29J153Q86q25k90J58o3p62q2M21j11N6L71q07J12J526P79r57j039J10
3553H8n56M0KJ64O2J109Q87r99k21o6n49m74K84J92k96J1J019m50K80N00l21m93
3575B13O0k72p76N7M59N0O65O44o4o49O2p48j48j81k5m45J06J414R4k72o9J78
3597C53p56Q9K14j390J29O77K30j17M54P03m2l41j62j239k29J001K70o6j56L23
3617e5M25K51N88j184m59J03J12p15K96P89k36J78J003J50j052N6P4j006j54J27
3637g09L11N45M79J44n36J81p7n31j1J19o39k2O82j34J35P41M87n83p06j39l26
$$ plain form
3492 780 385 -1170 -842 -606 -918 -934 -414 -634 -543 135 728 809 660 -132 -1514 -1417 -703 -555 -1002 -374 638
3513 638 634 502 225 -865 -463 507 -287 -1569 -1552 -153 133 502 275 315 39 587 -73 -1242 -1222 -977
3533 -977 -548 605 1491 666 376 534 471 -291 -373 48 -63 -7 364 -443 -331 1195 1974 1017 -22 88
3553 88 -468 -428 -426 -262 -200 909 1796 797 576 510 -39 -513 -229 -37 -333 -322 697 247 527 1027 706 213
3575 213 273 1 -775 -718 -259 -209 456 1100 1036 387 449 -299 -447 -628 -653 -1098 -992 422 516 244 175 353
3597 353 -403 -314 -100 -1490 -1361 -684 -454 -571 -117 586 544 203 41 -1198 -1427 -426 -156 -222 -378 -55
3617 -55 370 621 1209 25 -434 -331 -219 -934 -638 151 -85 93 1096 1246 194 250 324 -682 -836 -709
3637 -709 -398 147 626 770 234 415 338 -193 -204 -85 -724 -746 -64 -198 -63 678 1165 582 -124 -263 -589
3658e89o80R98J33j64K73R41m18%j84m41n25l21O56l5J04K07K01J88M43k67l97
3679A23k51m85p33L59Q35O9m15P46Rk54M97M9r69p85N54J30l66Q42O98K22p17
3700A58J75Q4l32l4l43n79P48M12L8K33Q32l40o50O2j36o67L18K82l83L18K70
3721D66L45j46O71l91q14o48K95l52M92L89j79p2P69K11o86M5j13j057l26L35
3741g66L52k23R51N3l18k8K20m48j45k15j82o40M29J109K12K77k23p95L3L71j52
3762a28r37J16L62r4M35O86l0j73J62p1r42L34j14j37M9N87L42R8L47l62l73o47
3784d90L27j44k74M62j99J61M09M70k12q0J81q98p09M08L04k04P49N47j52m15
3804B41L43k99n09J00J91p14J01J27L91N75P32j16j249J85J36l28j0m14k20K72
$$ plain form
3658 -589 -1269 -271 -138 -302 -29 912 494 494 310 -131 -656 -977 -321 -356 -252 -45 156 344 787 520 123
3679 123 -128 -613 -1346 -987 -152 -83 -498 248 257 3 500 549 -420 -1205 -651 -521 -887 -45 653 875 158
3700 158 333 417 85 51 -292 -871 -123 289 327 560 1392 1052 402 464 328 -339 -21 261 -122 196 466
3721 466 811 665 1336 945 131 -517 -222 -574 -82 307 128 56 825 1036 350 395 282 -775 -1101 -766
3741 -766 -414 -637 314 367 49 21 241 -207 -352 -567 -749 -1389 -960 149 361 638 415 -380 -347 24 -128
3762 -128 -1065 -949 -587 -681 -246 440 410 237 399 328 -614 -280 -394 -531 -482 105 447 545 892 530 157 -490
3784 -490 -163 -307 -581 -119 -318 -157 252 722 510 430 611 -287 -996 -588 -284 -488 261 808 656 241
3804 241 584 285 -224 -124 67 -647 -546 -419 -28 547 1279 1163 -86 99 235 -93 -103 -517 -737 -465
3824d65R97P14q99K56l95j21o8m0j98n95L46O93l44o2P00K92p98k01q72m7J218
3845A11J85p16j70N26K11N28L89j359n67M93n5P1K8P16K31JL93n41m13j35J31
3866E8m31J91L40m16J98O66L77l57J42o03o83R8K08j14k69M47L80j45P36k0j072
3887b69m64P08j15m70k30L80J39J65O29J6j54J43n18j041j85P08L20N35J25p61
3907c39j8J091K95r38m08m26j71N96Q13n47j4M77O79m8j078j9n83K70J81o2o7
3928c16J10N65k94J98L9l32n62M17n40j93K34J050l36jR52o57m07M5l09k59K35
3949c61J11O0J35L75L31l72M74l55m85n9m6m04O88K46M62l90K18k57k47K29K22
3970E75j052n93M97Q94K90l59J08m2L58J38r18m30j68L56J40K64K2j59P75M98
$$ plain form
3824 -465 532 1246 347 603 208 87 19 -21 -219 -814 -468 225 -119 -181 519 811 13 -188 -1060 -1107 111
3845 111 296 -420 -590 -64 147 675 1064 -295 -862 -369 -424 -353 -325 391 622 623 1016 475 62 -73 58
3866 58 -373 -182 158 -258 -60 606 983 626 768 165 -518 -420 -212 -326 -595 -148 232 87 823 803 -269
3887 -269 -733 -25 -140 -610 -840 -460 -321 -156 473 489 335 478 -40 -1081 -1266 -558 -238 297 422 -339
3907 -339 -357 734 1029 91 -317 -743 -914 -318 495 -52 -66 411 1090 1042 -36 -55 -638 -368 -187 -249 -316
3928 -316 -206 359 65 263 302 -30 -592 -175 -715 -908 -674 376 40 39 991 334 -73 -28 -337 -596 -361
3949 -361 -250 -190 -55 320 651 279 753 398 -87 -146 -192 -596 92 338 800 410 628 371 124 353 575
3970 575 -477 -1070 -573 321 611 252 360 318 676 814 -104 -534 -702 -346 -206 58 80 -79 696 1194
3990A194p30j237O89J30k60k88K07j55Q15N42K3r64M86m94k09M47k28p03R8J001
4010C64K11k06q9j70k8k00j44l14k09M16K97j03Q54l0n94m61k6N53q64K28l25
4031h40j29J160O43l91p01J61N5K86k44o80m80P79O40o40L73pN61l43k48n51k17
4052h13L45O99j66n70K16O87K54J71k52j363j82J101K56m30p13K41R68N88r8j060
4072a21l56N62k65m4l01K16J20N13M65m90o5M01j18q61p6q8j70J78Q12J66m5j14
4094C19p3n87L37l64j28J79L28o6K63K26K21l97K67qj114j49L51p4K58P39J78
4115G06q32K32O94n2j102m79K90M95M13j81o72K99J063L00p24m24m90MM63j70
4135a67j61o4O40J98j58j54j04j18K56j43o59n22R55O42K4j39j73q0j7K28q11
$$ plain form
3990 1194 464 -773 -84 46 -214 -502 -295 -450 365 907 930 -34 452 -42 -251 196 -32 -735 -637 364
4010 364 575 369 280 110 82 -118 -262 -576 -785 -369 -72 -175 679 649 55 -406 -432 121 -743 -515 -840
4031 -840 -969 191 834 443 -258 -97 -42 244 0 -680 -1160 -381 259 -381 -8 -15 546 203 -45 -596 -813
4052 -813 -468 231 65 -505 -289 398 652 823 571 -792 -974 127 383 -47 -760 -519 449 1037 939 -121
4072 -121 -477 85 -180 -224 -525 -309 -189 324 789 299 234 635 517 -344 -420 -508 -678 -500 312 478 433 319
4094 319 246 -341 -4 -368 -496 -317 11 -55 208 434 655 258 525 517 -597 -746 -395 -469 -211 528 706
4115 706 -126 106 800 748 -354 -833 -543 -48 365 184 -488 -189 874 1174 450 26 -464 -460 3 -167
4135 -167 -328 -392 248 446 288 134 30 -88 168 25 -634 -1156 -201 441 465 326 153 73 56 284 -527
4156e27m45M78M32J07L20m2n05N66N24q43o69MJ70P6L58k29mJ50L64O9n83R0l67
4179e06l11M75J07J40j29N87j57J73Q8l20j094M2P12k29J97K78k50N94L12n1o37
4200B1j07R5J92j80rk02J00O71N20n77m08K73J03o12j70k15p3Q05O33j77r94O44
4222C33J40q7l50o33j56L66M90K33n78M65L86Q9j27q81o49K79N18j0K61k3Q1N2
4244A99L78k32o16L5M2j81r9L40N68l52M01M38q53j63K1k56k41K57K87N7L8M21
4266D89k97p7J91m40l36p4N91m18Q8K56Q1N38J53n22o35M00J30j04o82K19K88
4287a61K53L72j19k61j73M82l21r84N57j98J57P75m2m27Q5M02k76j61p6k29n60
4308i05Q14J37k52L49J38L1m68K81q1l05q6Q9k30L75O13M9m83J39j09Q6k89M9
$$ plain form
4156 -527 -972 -494 -62 45 365 323 -182 384 908 65 -604 -600 -430 -354 4 -225 -229 -79 285 354 -229 -139 -506
4179 -506 -817 -342 -235 -95 -224 363 206 379 467 147 -947 -905 -193 -422 -225 53 -197 397 709 658 21
4200 21 -86 9 201 21 12 -190 -90 581 1101 524 116 389 492 -120 -290 -505 -578 227 860 683 -311 333
4222 333 473 386 36 -597 -753 -387 103 336 -242 223 609 698 571 -310 -959 -680 -162 -172 89 66 147 199
4244 199 577 345 -271 -236 -194 -375 -474 -134 434 82 483 921 68 -95 -74 -330 -571 -314 -27 30 68 489
4266 489 192 115 306 -134 -470 -544 47 -371 -283 -27 54 592 745 223 -412 -12 118 14 -668 -449 -161
4287 -161 92 464 345 84 -89 393 72 -912 -355 -553 -396 379 337 -90 -5 397 121 -40 -116 -345 -905
4308 -905 -91 46 -206 143 281 312 -156 125 44 -261 -347 -258 -488 -113 500 549 66 205 96 182 -107 -58
4330e8o08K54M90j64J29L34N4j17m77J32m11J03K29m1r5L13N83Nm86K38m02j58
4352a53N43p52j12J76P49L05j20k01k91l45O47k60o46J2L51O3J23K08k14R0L52
4373E25k51n17j92N41m55j28O44j07k29N59O5j36m72J8k03O0j30M00m92N83N17
4394F00l97k5J81j93n67L84o23L27J86M12J64J06Q9l9q31J85o3k53M7J78j6j19
4416b67P32m89j32J48m0l07k27K91l2m59J028L35m39j60q2j7j49j22k31K1N05
4437i3J72l2K98j59j28K1l5l79m8j11P04k15J34K75r0m9K24j43m40j52Ql09M88
4460e9J6J12J70K10l1l27L1q0j37l52J91J34J40K00N1r2J14K75m12o43L71M6J86
4483A14j12K45j71K45K98l24n64M35j19k23J36l7L60N9J23O0k85K01k5n69L19
$$ plain form
4330 -58 -666 -412 78 -86 43 377 431 314 -163 -31 -442 -339 -110 -151 -246 67 650 655 169 407 5 -153
4352 -153 390 -362 -474 -298 451 756 636 435 144 -201 446 186 -460 -448 -97 -34 89 297 83 173 525
4373 525 274 -243 -435 106 -349 -477 167 60 -169 390 455 319 -153 -135 -338 -278 -408 -8 -500 83 600
4394 600 203 178 359 166 -401 -17 -640 -313 -127 285 449 555 644 605 -226 -41 -104 -357 -310 -132 -148 -267
4416 -267 465 -24 -156 -8 -48 -355 -582 -291 -323 -782 246 581 142 -18 -100 -117 -266 -388 -619 -598 -93
4437 -93 79 47 345 186 58 79 44 -335 -383 -494 210 -5 129 404 314 265 489 346 -94 -246 -238 -547 -59
4460 -59 -43 69 239 449 418 91 122 42 -95 -447 -256 -122 18 218 269 177 291 566 154 -489 -118 -72 114
4483 114 2 247 76 321 619 295 -269 166 47 -176 -40 -77 283 342 465 525 240 441 416 -153 166
4504A66o31j39M27R36k75k7k73L83l58l31K36k67p5J72J72l98O91r3N5k44J44
4525B71l22j73j80k22L74M61L15l81R1k7l21k71L12j66j23k3L75k01J94J18l6
4546F5R7k06r0m66P4L39k67J59L38Q9J71l83L74o66j10N49k47r6K96N0p6K35K81
4569E10k62j98k83r3j26J13K80k1K04O2n5R0O5m30r0J92Mn37N14K63J96k81R6
4592B13M4l41R1j37q2On6J77J11L75j69m6j45O8k55j10J57m28P22l3J53k98L18
4615C35K51m48k18o2k38J31K89n8j6L81k56J40Lo0o0l09J68m71R1K94L79q5K93
4638D74l16k36m4m0J52l51k22M96Q2M3M22k2n20L09N5n36Q2l8J68j83K96K53k66
4661E8J50J76l35l68NR7m15O13K02l31M55r5j54j42K04m32k19m5M91L1k97P42
$$ plain form
4504 166 -465 -604 -177 759 484 457 184 567 209 -122 114 -153 -228 -56 116 -282 409 316 371 127 271
4525 271 -51 -224 -404 -626 -252 209 524 143 234 207 -114 -385 -73 -239 -362 -385 -10 -211 -17 101 65
4546 65 162 -44 -134 -600 -526 -187 -454 -295 43 132 303 -80 294 -372 -482 67 -180 -276 20 70 -6 229 510
4569 510 248 50 -233 -326 -452 -339 -59 -80 124 186 131 221 286 -144 -234 -42 -38 -575 -61 202 398 117 213
4592 213 257 -84 7 -130 -212 -206 -262 -85 26 401 232 186 41 109 -146 -256 -99 -527 195 162 315 17 335
4615 335 586 138 -80 -142 -380 -249 40 -18 -34 347 91 231 234 174 114 -195 -27 -498 -407 -113 266 181 474
4638 474 158 -78 -122 -162 -10 -361 -583 -87 -5 38 460 438 -82 227 282 -254 -172 -210 -42 -225 71 324 58
4661 58 208 384 49 -319 -314 -217 -632 -19 183 -148 307 212 58 -84 120 -312 -531 -576 -85 -54 -351 391
4683C91K3m78r3J48k91L04j26L6j69P3K73q6J41Q8L7k34k06k66M48k51L57k0J08
4706B07K27m25j14J81k7k80L9J10nR7L1l9J7L36j28k75j97J2j82M30j8j59K52
4729I0L90n9p4o4k99l34L56r1q4P5P2N80n23K96n8l07N4j25j59p1O65l35j32N13
4753C76J9k49q1o8k3j91K61M2m94K99L78n9l25L04o5m68n2M67k74J78L37k12j8
4776H2M15l15j16j01r7k74J68M50k25K34n9q7p9L14l76m47J81M5J89k49N98j26
4798A25k03K62k28m3j42N2M5k06K66j92L07J03K13r3j30l2k96m42M29K18l67J78
4820a76K35Q4j48J76M8l81j1j44j59J55M20j32j19M27j24j84mJ38l07N0k91K00
4842b47qL25M7L45j03K82p12k13J44j23M8q2M38j13J64l6j32l66L83j5k34K48
$$ plain form
4683 391 414 -64 -157 -9 -300 4 -122 -86 -255 -182 91 5 146 234 271 37 -169 -435 13 -238 119 99 207
4706 207 434 9 -105 76 49 -231 -192 -82 -87 10 41 2 19 355 227 -48 -245 -233 -415 15 -3 -162 90
4729 90 480 421 347 283 -16 -350 6 -85 -169 -94 -22 558 35 331 273 -34 20 -105 -264 -335 330 -5 -137 376
4753 376 395 146 65 -3 -26 -217 44 86 -408 -109 269 210 -115 189 124 -344 -396 71 -203 -25 312 100 82
4776 82 497 182 66 -35 -132 -406 -238 212 -13 221 162 75 -4 310 -66 -513 -332 -287 -98 -347 251 125
4798 125 -78 184 -44 -87 -229 -177 -132 -338 -72 -264 43 146 359 266 136 104 -192 -634 -205 13 -354 -176
4820 -176 59 143 -5 171 219 -162 -173 -317 -476 -321 99 -33 -152 275 151 -33 -37 101 -206 -156 -447 -247
4842 -247 -255 70 117 462 359 641 -71 -284 -140 -263 -215 -297 141 28 192 156 24 -342 41 26 -208 40
4864D0j32k09K56J19J94k66L20k40j95J25l7k47K34J6m1J34L15J54n14O2K1l17
4886b08k66P96l07K38pL6j99j74N62o35K3l8n9n9P4K17j15R0N27k43k68q0N6n71
4910f10O17k0j95K6K18M2j25j2J0l23J44M5o2o0M60N9j32M03k94m40k8L37j14
4933e4m01O88o4o65N98L52n68J12o5Lj17K14j57m16O19J8pMJ26l06p7K56k67r2
4957b66J74K00m53L00K33O8j07n7J39o61k5J56N4L3N17j42k42K97M8j36Ol56l6
4980b56j76J77N41k93j25L87l04J08m2M7l77J59n0L53r3J54k0j66M17n46K18m64
5002c51M59l30j08N20j47j94K87K7k16%K50m16j76K96O8L69j3R1m35N8n5L3k21
5025b04K68k46k5K87PK05j06J52j27J27m11j01l5L1L03j90o7K09N6J7j28j30m54
$$ plain form
4864 40 -92 -301 -45 74 268 2 322 82 -113 12 -25 -272 -38 -22 -63 71 386 540 26 88 109 -208
4886 -208 -474 322 15 253 246 282 83 -91 471 -164 -141 -179 -238 -297 -223 -6 -121 -31 496 253 -15 -95 -39 -610
4910 -610 7 -13 -208 -182 36 78 -47 -59 -49 -372 -228 -183 -245 -305 155 214 82 485 191 -249 -277 60 -54
4933 -54 -455 233 169 -496 102 454 -114 -2 -67 -64 -181 33 -124 -540 79 97 90 94 220 -86 -163 93 -174 -266
4957 -266 -92 108 -345 -45 188 256 149 92 231 -430 -455 -299 -245 -212 305 163 -79 218 266 130 136 -220 -256
4980 -256 -432 -255 286 -7 -132 255 -49 59 17 64 -313 -154 -204 149 56 210 190 24 441 -105 113 -351
5002 -351 108 -222 -330 190 43 -151 136 163 -53 -53 197 -219 -395 -99 -31 338 325 416 -19 39 -16 17 -204
5025 -204 64 -182 -207 80 87 292 186 338 211 338 -73 -174 -209 -178 125 -65 -132 77 133 150 22 -108 -562
5048e62K47K82m8j31L76j31K28rk25k70j7J26l30J41L52j88N6K88J14j98K7K4
5070A52k31j24k0l6K12j1J51K51l62P8P5Q9m53j05j13L34M8L56r0j16j9j86K73
5093A53K4l98j60K50O4J42J37j00r5M4N4l43P5Q0L8j21J26j19M96m9l96K52j13
5116D1r5m75K60L03j34p1K56J23n7k6J19m16j31L77l50L99m12L54K35k16K9J78
5138B91k18K57k17l14k06L16J75j1K32k50m2L35k53j66j60M9pP8K86R9j39k54
5160a19K40k20j3M31m86j92L75p9J77l2k0K16m00J12M1k87R9J60j32J61K57l22
5182c3J00K75K9q06N96p4k75j69J64K96n5J48J04k63l32N14l70J09l98N6L24L95
5204C35K8m14OJ1j47J62k1M5j65q5K54Q9m4r6J08K8o5j31j61L7K22r3r2L93J9
$$ plain form
5048 -562 -315 -33 -81 -212 164 33 261 252 27 -243 -260 -134 -464 -323 29 -159 -103 185 299 101 128 152
5070 152 -79 -203 -223 -259 -47 -58 93 344 -18 60 135 224 -229 -334 -447 -113 -65 291 201 85 66 -120 153
5093 153 177 -221 -381 -131 -67 75 212 112 17 61 115 -228 -153 -73 -35 -156 -30 -149 347 298 -98 154 41
5116 41 -54 -529 -269 34 -100 -171 85 208 151 125 244 -172 -303 74 -276 123 -289 65 300 84 113 291
5138 291 73 330 113 -201 -407 -91 84 73 305 55 13 348 95 -71 -231 -182 -189 -111 175 274 135 -119
5160 -119 121 -99 -112 319 -167 -359 16 -63 114 82 62 278 -122 -10 31 -256 -157 3 -129 32 289 -33
5182 -33 67 342 371 -435 161 87 -188 -357 -193 103 48 196 300 37 -295 219 -151 -42 -440 -384 -60 335
5204 335 363 -51 -45 -34 -181 -19 -40 5 -160 -245 9 98 54 -42 66 94 29 -102 -263 -226 -4 -97 -189 204 223
5229B23K4l49L41l29j68J92k24K50N7J97k00R5k02Q6Q6q2m09J68O4K7J2J90K05
5252B54q3m3q2k28J71K44k33k68L27q3J36J33P4k30m8Q8k90K42l59L04P6j3K51
5275C40k48k06P7J43j83M5j32po4J09N02l82j38L49l93KL31l50Q1P8K17j52PK24
5299B50p1k52K7j98N2K47K27n82K70K80K1m2l26K23l04J31M5J7m13N94k28R2M29
5322D89k95l08K46m58M2L30L57q7n43L32P6l23J62j59K13p5J53k62J1j20N54l03
5344C2J54O4m57K17J53o0j72K36k4j16J74k7R1m09L89j98k03r3K34j6N1l9J63
5367A44k07M64l15j89J77q7P0k7K3j28k04M24n5P7k1J66n49K15L8j20q1J20K83
5390B18k22L40l18j19K61k67J27j38M9J97k65K96R2j25J76p7j9l25j22L08j82
$$ plain form
5229 223 247 -102 239 -90 -258 -66 -290 -40 17 214 14 109 -93 -7 79 -3 -412 -244 -180 -153 -141 49 254
5252 254 171 128 46 -182 -11 233 0 -268 59 -24 112 245 319 89 41 129 -161 81 -278 26 102 89 340
5275 340 92 -114 -37 106 -77 -32 -164 -171 -235 -126 376 -6 -144 205 -188 -186 145 -205 -124 -46 171 19 26 250
5299 250 179 -73 -46 -244 -192 55 282 -300 -30 250 271 229 -97 126 -178 -47 -2 15 -398 196 -32 60 489
5322 489 194 -114 132 -326 -284 46 403 316 -227 105 181 -142 20 -139 74 -1 152 -110 -99 -219 335 32
5344 32 186 250 -207 10 163 103 -69 167 143 27 201 174 265 -144 245 47 -156 -249 -15 -31 20 -19 144
5367 144 -63 401 86 -103 74 -13 57 30 53 -75 -279 145 90 167 146 312 -237 -22 16 -104 -185 -65 218
5390 218 -4 336 18 -101 160 -107 20 -118 -69 128 -137 159 251 126 302 225 206 -119 -241 67 -115
5411a15q9N37l9k12l9J07k87K22j27o9l5R9M24m53K00P4k37J7j6k44k5K31K94
5434B18m56R2Q0p6J58O8Q4m76RN30l57K49N2k39r5K24j03P8j3j25L6m2J47j05
5458f2L40r0k18k18J20J90j57J58k58%J77M03l80PN0K64l67J39m37M49l08J77
5480b1K56k37j29J30J5o40Q40n11J49Q0j65n3m2N18k32J4%J80k71J50l0j59J02
5503e6L65l40k62K30L54k64l09K04J20j55J58k64J40J36K47j4j06j83k12K75k19
5524a55J4n1K53P7j44K24J9k70j6l00L02k27N54l88l5J70m21L09O8K07p5n3Q1
5547A43m6k53O2J92J63j3j78k9J5k19Q5l9J43j47J4j83L69k37j58M13o7k17J17
5570g0Q7j24K76k80O5K1l4L16m59J75Lj13J06Q6P2j69o5K60K29o48N95k11k22
$$ plain form
5411 -115 -204 333 294 82 43 150 -137 85 -42 -111 -146 -47 377 -76 124 198 -39 -22 -38 -282 -307 -76 218
5434 218 -238 -146 -66 -142 16 84 168 -308 -299 231 -126 123 175 -64 -159 65 -38 40 27 -98 -62 -104 43 -62
5458 -62 278 188 -30 -248 -128 62 -95 63 -195 -195 -18 385 5 12 62 326 -41 98 -339 110 -198 -21
5480 -21 235 -2 -131 -1 14 -626 214 -297 -148 -68 -233 -286 -328 190 -42 -28 -28 152 -119 31 1 -158 -56
5503 -56 309 -31 -293 -63 291 27 -282 -78 42 -113 45 -219 -79 57 304 290 184 1 -211 64 -155
5524 -155 -141 -192 61 138 -6 218 237 -33 -49 -349 -47 -274 280 -108 -143 27 -394 -85 -17 190 115 62 143
5547 143 97 -156 -94 98 261 248 70 41 56 -163 -78 -117 26 -121 -107 -290 79 -158 -316 97 30 -187 -70
5570 -70 17 -107 169 -111 -46 -25 -59 257 -202 -27 -24 -137 -31 55 127 -42 -107 153 382 -266 329 118 -104
5593a04K64l17K23j52O8j46O2J05L13n16m8J28j2J49%R3j81MK57k35J64K64m81
5616i8o4L0Q7j14J26O2j59J88n3K3Jk7J44l06n5J66j67J81K47l37K6N4J61k47
5640a31Q2K12l83J42J69k88R1J41M0j84j36L76l54M14j40m15L18K82k58J38k17
5661a01K89j34j93J50Q8k98J61L43k31l25L71J59m35o2J49j74K49k53Q4p0R3L75
5683B35l15J17j13N7P3N5j36O4K84j42l96J17L0j07K10q1L2j82J13O6J71j28J13
5706A37k31J05m1j72K02J88j18mj9k62J34L17N9m16n4j75L14k77O3J44k45K91
5728f0J30P2j69j59j05J11K76j14M7q9L24k93j0J89k44O4k88M13j30J73q2K02
5750B58j30Q1j19l34J19L82j40l17J21L10j4j30K16k05j38k86M66l70pK20m0R8
$$ plain form
5593 -104 160 -157 66 -86 -18 -164 -102 3 316 -200 -248 -120 -132 17 17 110 -71 -67 190 -45 119 383 -98
5616 -98 -162 -132 -45 -159 -33 29 -130 58 5 28 29 2 146 -160 -215 -49 -216 -35 212 -125 -99 -45 116 -131
5640 -131 -49 163 -220 -78 91 -197 -106 35 75 -109 -245 131 -223 191 51 -364 -46 236 -22 116 -101
5661 -101 188 54 -139 11 99 -199 -38 305 74 -251 120 279 -156 -218 -69 -243 6 -247 -163 -233 -140 235
5683 235 -80 37 -76 -19 54 109 -27 37 321 179 -217 -100 -70 -177 33 -48 -16 -198 -85 -19 152 24 137
5706 137 -94 11 -30 -202 0 188 70 66 47 -215 -81 236 295 -121 -175 -350 -36 -313 -250 -106 -351 -60
5728 -60 70 142 -27 -186 -291 -180 96 -18 29 -60 264 -29 -39 150 -94 -30 -318 95 -35 138 56 258
5750 258 128 209 90 -244 -125 257 117 -200 -79 231 217 87 303 98 -40 -326 140 -230 -237 -17 -57 41
5772D1L29l31j71M81j14m32J17J50j84J39k35M38K31j77j18l12K95j56k27j04
5792c40L71q3J21n2o5J56j31J54k90J04L25l33%L01j27j6M8Nn9l02K24M5J70m82
5816b56K66k9K68j1j76R6J03k82o7Q5j13q7M47k20K63j42j30L38l37j72Q9r4M3
5839a18J2K38k75K98N1M4l69N02q8n21L2K90l06L13j36K48R0k5l96R0K75l10j06
5862a67K92j84J12k97K63k88O5L21j38Mk50J39r5J72k78M69k07J41k19R0K4K23
5884A92k31L1J76k51J0K27j00j91J77jJk33L87k26KM9J92k15P4J49l10m6J99R6
5908A58l92K68K12k37K7P2l03J48J93o5J4q9l1j79K41J32M3m09J30L46k84j33
5930a38K32q6r6K17l2Q0p4L6k02K13k09j17j25L41Oj63j27J10m0r2J07J27m1j38
$$ plain form
5772 41 370 39 -132 349 235 -197 -80 70 -114 25 -210 228 459 282 164 -148 147 -9 -236 -340
5792 -340 31 -52 69 17 -48 108 -23 131 -159 -55 270 -63 -63 238 111 95 143 148 89 -213 11 56 226 -256
5816 -256 10 -19 249 238 62 158 261 -21 -88 -3 -116 -203 244 24 287 145 15 353 16 -156 -67 -161 -118
5839 -118 -106 132 -143 155 206 250 -119 383 295 -226 -194 96 -210 103 -33 215 305 280 -116 -26 249 -61 -167
5862 -167 125 -59 53 -244 19 -269 -204 117 -21 -17 -267 -128 -223 -51 -329 140 -67 74 -145 -55 -31 192
5884 192 -39 -8 168 -83 -73 154 54 -137 40 39 40 -193 194 -32 -30 19 211 -4 70 219 -91 -137 62 158
5908 158 -234 34 246 9 36 108 -195 -47 146 81 95 6 -25 -204 37 169 212 -197 -67 279 -5 -138
5930 -138 94 8 -88 129 97 177 103 139 -63 150 -59 -176 -301 40 46 -117 -244 -134 -174 -266 -159 -32 -73 -211
5954b11J62N1j32P0n9K33k00J48J10J30m27J9J3O9k38K71J61j25K62j67k54O0
5976e4j94P3L34l57J9L02J85n16L33l00M6J8K59j92k92N81l79Q8j29K86r6Q9n6
5999D8j61q2J00R4N1m8j30l3K76k17J9o5L99k35k15J83k44R3L13jn19N17l97K7
6023b27J76j00L38l99J09M86m54O3P7j13m4k3N3m3J9J94k37J61K39n5l62K0M0
6046h2k8j10O8J53Q7K3j8Kj70J23k97J98K99k49j94J28M4LL36k08J52j56p4Pk47
6071b10J86j5K3l23N43k58r4M00Pn01L31J75l56J40P3j71K43L0J8m08M23k07l38
6094b89K82J70j73l8J19K92k12O8jl47K9K06l17J97o4j63M64m34J58j36J79J6
6116FR3m35M11n6K61k10k13J71M9j13M5k27J61R0j9J69k7L5k72j8K02l39J48J08
$$ plain form
5954 -211 -49 2 -130 -60 -119 114 -86 62 172 302 -125 -106 -93 -24 -262 9 170 45 307 140 -114 -54
5976 -54 -248 -175 159 -198 -179 123 308 -208 125 -175 -129 -111 148 -44 -336 245 -134 -46 -175 111 15 104 48
5999 48 -113 -195 -95 -1 50 2 -128 -161 115 -102 -83 -148 251 16 -199 -16 -260 -167 146 145 -374 143 -254 -227
6023 -227 -51 -151 187 -212 -103 383 -71 -8 69 -44 -88 -111 -58 -101 -82 112 -125 36 275 220 -142 -122 -82
6046 -82 -110 -220 -152 1 88 111 93 95 -75 48 -249 -51 248 -1 -195 -67 -23 -20 316 108 260 104 30 37 -210
6071 -210 -24 -39 -16 -339 204 -54 -148 252 259 -242 89 264 -92 48 121 -50 193 223 241 -167 256 49 -289
6094 -289 -7 163 -10 -48 71 363 151 219 218 -129 -100 106 -211 -14 -78 -241 223 -211 -53 -189 -10 6
6116 6 99 -336 75 19 280 70 -143 28 77 -36 9 -218 -57 33 14 183 156 191 -81 -99 103 -236 -88 20
6140B0l92M52J98l17k62K78K68j49j79J38n22L14L14j62k43L21j12K2J59j87p8
6161a19J29P6k45M79j45k14K57j60J97M3n21M65j07n47L34K59k92K64K8J8k90
6182i1P8o8j59K50r5K07J3K16m39J18J30j38K16m63J84mq1L13k72P9q9k0k66N37
6206A56k74k3k57K74N3L4K74j36K5j11K54k05K0l73M06k95K50r3k62L44k29L66
6228A98j81K35j24m56N76r0l19J9L3K96l0J59Q6k52k83L9N6p4K80m9o6J12n6j8
6252I1o1J5q2j43L64J92m73J33r1K26k21K10j13k39J11M7j49J66R2k48o8L37P2
6275A68j33p4K9l78L12J76r4L1K4j3j62K40o2O0j89L15j94j9r7m7N5J90J71k99
6299A0K2j99j59L22j7KJ7l7R5m5lj33J83k75L57k23o2K26K29k93J36l35O2J05
$$ plain form
6140 20 -372 80 278 -39 -301 -23 245 96 -83 55 -467 -153 161 -1 -244 77 -35 -13 146 -41 -119
6161 -119 10 86 -159 320 175 -39 218 58 255 298 -223 242 135 -412 -78 181 -111 153 181 199 -91
6182 -91 -13 -81 -240 10 -85 122 135 351 -88 30 160 22 238 -225 -41 -45 -126 187 -85 -6 -95 -115 -381 156
6206 156 -118 -141 -398 -124 -71 -37 237 101 126 15 269 64 84 -289 117 -178 72 -21 -283 61 -168 198
6228 198 17 252 128 -328 248 158 -161 -142 -109 187 157 316 402 150 -133 -94 -38 -112 168 119 53 165 109 91
6252 91 30 45 -37 -180 184 376 -97 36 -55 171 -50 160 47 -192 -81 -34 -183 -17 75 -173 -241 96 168
6275 168 35 -39 -10 -388 -76 100 6 37 61 48 -114 126 64 124 -65 250 56 37 -60 -107 -52 138 309 10
6299 10 32 -167 -326 -4 -21 -19 -2 -39 56 11 8 -125 58 -217 140 -83 -145 81 310 17 153 -182 -120 -15
6323a5k0J84l87Q6N28k22j28k36L70K5j29N2K43l06p5K06l67N08k76j49K76J52
6345C20j24j11j71j57j06K87L51m36M7K34m1m21M64J16l29k0J66lJ4J79j56l49
6367b46O25l41L8l35j14J02K79M3j53J92j27%o1o8j6K20p6j4P1j80K58Q0j09J15
6391A83l27n1J69P8l92M08n3m3o9J73oL0r2L8n9j54J03O4j45k73O16l47J48K3
6415B2R7j32O9j84o5j17M68J22l09J09p4m54K50L19n2j96R2j48K9K30L07J4n78
6438a81J84J9J19j42Q0j70j90L77K74n40J75J6l7K10j86j51Q7Q7k17J03K00J46
6460B63k97K5K66k15Q9l07j61L30J56j98M09j35k73N4j29K93k11m7J62j64n7J16
6482c1K46k64K16k96L02m35K07M24o21K27j22N26l48j7J70k30K8k74K37l54L47
$$ plain form
6323 -15 -35 149 -238 -152 376 154 26 -210 160 185 56 108 351 45 -30 176 -191 317 41 -108 168 320
6345 320 196 85 -86 -243 -349 -62 289 -147 -100 134 93 -328 136 252 -77 -97 69 66 80 259 103 -246
6367 -246 379 38 76 -259 -373 -271 8 51 -102 90 -37 -37 -98 -166 -182 38 -38 -52 19 -161 97 177 68 183
6391 183 -144 -195 -26 52 -340 68 15 -28 -97 76 70 100 8 46 -13 -167 -64 0 -145 -418 198 -149 -1 22
6415 22 119 -13 56 -128 -193 -310 158 280 -29 80 6 -448 -198 121 69 -127 -35 -183 -154 76 383 397 -181
6438 -181 3 22 141 -1 79 -91 -281 96 370 -170 5 21 -16 194 8 -143 -56 31 -186 -83 117 263
6460 263 -34 -9 257 42 131 -176 -337 -7 149 -49 360 225 -48 6 -123 170 -41 -88 74 -90 -147 -31
6482 -31 215 -49 167 -129 173 -262 -55 369 -252 -25 -147 379 31 14 184 -46 -18 -292 -55 -409 -62
6503f2K53m03M48n8j03J8k94J15j50L0N05k24m5K42n57M91p8j18l4J25j45q6N93
6526D63j74l10J93j23j57J38K0l56J05M63j33j54o0K23k83K62K0o8k66J18J76
6547I7l32J50P0J00j32J89p7j14J0N4nJ00k82J86j7r4L73k73m0j06K50m07N04
6570B04j68n0O%J7R0J23r3O7j73K18l00J34n5K66j59k46K97l60K07j7J35k3k58
6594a38L01k80J87K0j65L15l04l1j31L52l23J15N4J60l02K37R1K96m03O4j51O1
6616B5k93K29k76K36J86k53K92r7kl31L35mj8R3j69K20m18M56k91N6Q5K48n3m98
6640b42L82l81M88l40l37M28L6J54l73K94N4l6J74j47R6l68K37J50k15l1j5m20
6662d12K35K77m0J48r9k3k56j4O1K06j35J63P4k30P8j92N6L82j36k98O1k15L34
$$ plain form
6503 -62 191 -212 236 178 75 93 -201 -86 -236 -206 299 75 30 272 -285 206 128 10 -24 101 -44 -130 463
6526 463 289 -21 172 49 -108 30 50 -306 -201 262 129 -25 -85 138 -145 117 137 69 -197 -79 97
6547 97 -235 -85 -15 85 -47 142 65 -49 -39 15 10 110 -172 14 -3 -97 276 3 -37 -143 107 -300 204
6570 204 36 -14 -8 -8 9 99 222 129 196 23 241 -59 75 20 286 127 -119 178 -182 25 8 143 120 -138
6594 -138 163 -117 70 90 -75 240 -64 -95 -226 126 -197 -82 -28 132 -170 67 158 454 51 115 -36 25
6616 25 -268 -39 -315 -79 107 -146 146 49 47 -284 51 47 29 122 -47 173 -245 211 -80 -24 61 309 256 -242
6640 -242 140 -241 247 -93 -430 -2 34 188 -185 109 163 127 301 154 250 -118 119 269 54 23 8 -412
6662 -412 -177 100 60 208 109 86 -170 -184 -123 83 -52 111 185 -45 33 -159 -103 279 143 -155 -94 -309 25
6685B5l77O9nK7K46M1m4j2j36K07m20K53L8O6J57K29j81K9k50K89n47K15j15j8
6709b14J58k5J77j41J34K35Mj39k28J83j88p0J84j07J0O37n52m9l2O1j51NJ70
6732F2J98k38r7r0j76L05j21O0J42j6k40k58O08J07l97P9L57j77p1qJ40k76p5
6755a82j08m0K22K10J9k29K12j1j50J63k77K33m1q3K01k71L63k10LQ2Q8m28M6
6778a88Q1K6j32L46K57l69k5o7J31m4k25K43J49j41Ro0K76j38J2l13J84j36LL7
6802h4Q9k93M17K6o0K15k14j16j08Q4m3P1j81L02l61K97J71k39J11j81J97n36
6824d36j9M03J1J8K13k26j44L67k15K94m20k7m1K23K8M0p9j68J75n8Q2J0k34m4
6848b47L39P8j29OK28m40LJ40j6j80J8l8L95Q4k5J29m01J33j35J44m14L47M4M2
$$ plain form
6685 25 -352 -283 -288 -261 -15 26 -18 -30 -166 41 -379 -126 -88 -22 135 364 183 212 -38 251 -296 -81 -196 -214
6709 -214 -56 -81 96 -45 89 324 328 189 -39 144 -44 -114 70 -37 -27 610 58 9 -23 38 -113 -108 62
6732 62 260 22 -75 -165 -341 -36 -157 -97 45 29 -211 -469 139 246 -151 -72 285 108 37 29 169 -107 -182
6755 -182 -290 -330 -108 102 121 -108 104 93 -57 106 -171 62 21 -62 139 -132 231 21 24 106 194 -234 -188
6778 -188 -107 -81 -213 133 390 21 -4 -71 60 16 -209 34 183 42 51 -9 267 129 141 -172 12 -124 -121 -84
6802 -84 5 -288 129 155 95 310 96 -20 -128 -44 -87 -16 -197 105 -256 41 212 -27 84 -97 100 -436
6824 -436 -455 -52 -41 -23 190 -36 -180 187 -28 266 -154 -181 -222 1 29 69 -10 -178 -3 -61 21 31 -203 -247
6848 -247 92 170 41 47 275 -165 -162 -22 -38 -218 -200 -238 157 241 216 345 -56 77 -58 86 -328 19 63 105
6872A05NJ54o0k80M12l10J42n67L91qK03l00j5P9L54j31k40l54K75l46M33J23
6894F5R2k95K97r8j3J92m28N08k36J15k49l17L62j0j59M3N36m72K02j4k58O1j30
6917b06J81j27L4J32J23k29K97m97L2K01n0p7K77k56J20K06M0l91O0L76k85j82
6939b21l9K9j79L58K67j85l55L38l7k44N06j19k63Q5j1p8J8L61k10K6o2J58j64
6962b1r2l5L14n1J45K05o55L35J69o49J41K77o2m06M11O0o7Q6J25m95L78k64N
6985a46j31K58k02J90k43M90l01J78K22l83m6J36Q0oj88K8K65k35O16n07O9l61
7007b17J84K6j95M07k43k71L39J76r6J6j45k25N8k5Kj78M39j60J28pP9p4l87M94
7031A25r1j19pJ21J24j52J95j94Mq7o1QK8J6q9J24j63J50K11J47n25J76P8J79
$$ plain form
6872 105 110 264 204 -76 336 26 168 -399 -8 -16 187 -113 -128 -49 305 174 -66 -420 -145 -491 -58 65
6894 65 157 -138 159 61 48 240 -188 320 84 199 -50 -367 -5 -15 -174 -131 405 -67 135 121 -137 -76 -206
6917 -206 -25 -152 -118 14 137 -92 205 -292 -260 -59 -109 -186 91 -165 -45 161 201 -190 -130 246 -39 -221
6939 -221 -260 -231 -410 -52 215 30 -325 13 -24 -268 238 119 -144 -59 -70 -148 -130 231 21 47 -15 143 -21
6962 -21 -113 -148 166 115 260 465 -190 145 314 -335 -194 83 21 -385 26 86 19 105 230 -265 113 -151 -146
6985 -146 -277 -19 -221 -31 -274 216 -85 93 315 -68 -114 22 102 96 -92 -64 201 -34 582 75 144 -217
7007 -217 -33 -7 -202 205 -38 -309 30 206 110 126 -19 -244 -186 -211 -209 -387 52 -108 20 13 92 18 -369 125
7031 125 34 -85 -92 29 153 1 196 2 6 -81 -142 -134 -106 -90 -179 -55 -218 -68 143 290 -235 -59 19 198
7055A98m98K58J37l40N88k58L8j67J96M1k92k99J03J03J30j2J34r1J16N6m6m50
7077c55J60J43L07k72j46P3K31K4j71j84J62K69k24k99L24m28M61L69j42m16L38
7098B24l17q7r5J51j0r0M84k38k08N20l62J3K00k55Q8j85J63j59oJ61l8M8M5J70
7122B17k7l2l60J36nRK4k30J62O56n52j45Q4J70k49M6q7L2R5K08k12qK5k1j05
7147a69K05P5k93J5K21n2L04l97P4L3l3J40l70J78P4J54jPK51m87J45J23n2j03
7171D2l29K25m31N13K3N5p0K09k07l16J33K41m95K43n5R1P8r2O95n44M5j37J46
7194F3j66J99j57l7K69o6j08j07J05j08k33J85K09l21O88l39M0N9K70m43J53k71
7216a16n0O2J38J6o5J91O9l86J92K13k77J02Q8j52M8j42j55L01Q3J7l59J93Q9
$$ plain form
7055 198 -300 -42 95 -245 343 85 123 -44 152 193 -99 -398 -295 -192 -62 -74 60 -31 85 141 95 -355
7077 -355 -195 -52 255 -17 -163 -90 141 165 -6 -190 -28 241 17 -282 42 -386 75 444 302 -114 224
7098 224 -93 -180 -275 -124 -134 -224 260 22 -186 334 -28 -15 185 -70 18 -167 -4 -163 -169 -8 -46 2 47 217
7122 217 190 158 -202 -66 -71 -62 -38 -268 -106 550 -2 -147 -63 107 -142 -96 -183 -151 -56 152 -60 -68 -43 -64 -169
7147 -169 36 111 -182 -167 54 2 306 -91 -17 16 -17 123 -247 -69 5 159 158 165 416 -71 74 197 145 42
7171 42 -287 -62 -493 20 43 98 28 237 30 -286 -153 88 -407 -164 -219 -128 -50 -142 553 9 54 -83 63
7194 63 -103 96 -61 -98 171 105 -3 -110 -5 -113 -346 -161 48 -273 415 76 116 175 445 2 155 -116
7216 -116 -166 -104 34 50 -15 176 245 -141 51 264 -13 89 177 25 73 -69 -224 77 160 177 -182 11 100
7239A00j78J51m7k4j84j01M43k4j41n9J57j9k36J92J36j36k8J10j44J18k95k6
7261b35J34L63k26n6j1J68Qo1p0j08j8MK73k79N1n9L24j34K93k21j28K41j81L6
7285A08j85P9j98p5M48k76RL26l76L9j8k20K80R6j87r0K38J82J0q4J81l40j46
7308a99J88k72K00l29M34L37j55O0k43M1J28l50k22L63j02J97j82Q7o6J83L47
7329D45l36J21j23k14J39J27n6O2Q7j51J50k14J31m05R3o9j40J76N2M42k25O0
7351A52J48n51L30k82K04j37J70p6P7K69l90pL89k36Rp6j77qL10j11j43K86M7
7374A97j93J8k9L27m12K10l03m1K83k38M60l1j38J95n32K05Q7l81J67P4n4L83
7396B54k88m1J22j10R4r9j87L16o5J15r9o9J77l29K80n2L1o6k80p6M32O9J6M1
$$ plain form
7239 100 -78 73 26 2 -182 -283 160 136 -5 -64 93 74 -162 30 166 30 2 112 -32 86 -209 -235
7261 -235 -101 262 36 -20 -31 137 145 84 14 -94 -112 -108 165 -114 -63 -122 202 68 361 140 12 253 72 108
7285 108 -77 2 -196 -271 177 -99 -90 236 -140 -101 -119 -339 -59 37 -150 -240 -2 180 190 106 287 -53 -199
7308 -199 -11 -283 -83 -412 22 359 204 264 21 62 190 -160 -382 -19 -121 76 -106 -19 -85 98 445
7329 445 109 230 107 -107 32 159 103 165 252 101 251 37 168 -237 -144 -213 -353 -177 -125 317 92 152
7351 152 300 -251 79 -203 1 -136 34 -42 35 304 -86 -93 296 60 69 -7 -184 -192 118 7 -136 150 197
7374 197 4 22 -7 320 -92 118 -185 -226 57 -181 279 248 110 305 -227 -22 65 -316 -149 -75 -129 254
7396 254 -34 -75 47 -63 31 -68 -255 61 -4 111 12 -57 120 -209 71 19 50 -16 -296 -372 60 129 145 186
7420A86Jn5k05Jk8l49M40NJ07k11n9M19r3l84M5Q4k84L6O9K16J62M7l36N06j56
7445A64j50l69J40J83n8p0K97k45K53l8l21N83j66k52n7J03n4j6J05K46k29k4
7467B5K59m86K33j64K35j24q3j49L23k43J43K66l40K12j50p0n5J52J98k50J01
7488C3o3K62k13K16p2m03N6o4j25K30J78k4k51K50R6j79Q1K8m31K54L07j75J40
7511A31M4O7k10K43n77L39Nj60j03K23j87J79j76M35p6r9j42k5P1nk38M73l51
7534a39L42m1k23M23j61o7n19M55j54M6j33K40j18K89k21j35j28K23j57o5N5L24
7556A36r3J74k21k5j33J07J26j61J8r1J11j6K23l17L98j17N7j95J08j04O4j21
7578g2J11j8N6J97k24N3J7Q8l95J62p2j97K22p8L50p9m1Qq5J04j37J95l26l1J64
$$ plain form
7420 186 187 132 -73 -72 -100 -449 -9 -4 103 -108 -167 252 159 -225 -180 -96 -380 -344 -275 -59 103 150 -186 320 164
7445 164 14 -355 -215 -32 -90 -160 137 -108 145 107 -214 369 203 -49 -106 -3 -57 -73 32 278 49 25
7467 25 284 -202 31 -133 102 -22 -105 -254 69 -174 -31 235 -105 107 -43 -113 -168 -16 182 -68 33
7488 33 -30 232 19 235 163 -240 -184 -248 -373 -143 35 11 -240 10 106 -73 8 36 -395 -141 166 -9 131
7511 131 175 242 32 275 -302 37 42 -118 -221 2 -185 -6 -182 253 177 78 -64 -89 -18 -23 -261 212 -139
7534 -139 203 162 -61 362 201 134 -385 70 -84 -38 -171 69 -49 240 19 -116 -244 -21 -178 -243 -188 136
7556 136 43 217 -4 -29 -162 -55 71 -90 -72 -163 -52 -68 155 -162 236 119 176 -19 89 -15 49 -72
7578 -72 39 21 77 274 50 103 120 208 -187 -25 -97 -294 -72 -150 200 121 80 88 3 107 -30 165 -161 -192 -28
7603b8L6J53k27R4R4j39k33O6J53j53K22m24N40j43K50P1L9l60M7K24l47K49l0
7626A54J25m66L26o0QK4m0k23J01K86l17K92j19n3K38R4n14K03Oj73j14K9J96
7649Cm7K31k07J34Q9k06R5j30J5j95K27r3l40O82l0j59p8K25m82L36j62R8o0j51
7673b05N59m07J54n0m00M88l49J36M0J37q5j83L48p3J59m49L7j48K52j95K71J32
7695A69j77j6K44J3m4j63k92K8R2J15j29L59j83P2j21J77k22J42k83J67j83P8
7717a57J73J8r2J6K3n2K94lm19J64k11K82j94O90m53J19K10p0l63j05m6J27j56
7740b05M50k08m4m8K19j06L1p2j54K02j72J91jk24lM57j9j51j39r5N1P5k26rK44
7765D4J13l4o4j55q7M02j60q5j64L7K07j39k05K62oj38K26m73L40j37j86M42O8
$$ plain form
7603 -28 8 161 -66 28 122 -17 -250 -184 -31 -184 38 -386 154 11 261 332 371 11 58 282 -65 184 154
7626 154 279 -187 139 79 87 111 71 -152 -51 235 -82 210 91 38 276 370 -144 59 65 -108 -222 -193 3
7649 3 -44 187 -20 114 203 -3 92 -38 -23 -218 9 -84 -424 258 228 69 -9 216 -266 70 -92 6 -54 -205
7673 -205 354 -53 101 51 -349 139 -210 -74 -34 103 18 -165 183 110 269 -180 -143 -291 -39 -234 37 169
7695 169 -8 -24 220 233 189 26 -266 -238 -146 -31 -160 199 16 88 -33 144 -78 64 -219 -52 -235 -157
7717 -157 16 34 -58 -42 -19 -71 223 220 -199 -35 -246 36 -158 532 79 198 408 338 -25 -130 -176 -49 -205
7740 -205 245 37 -7 -55 164 58 89 17 -137 65 -107 84 83 -141 -144 313 294 143 4 -91 -40 35 -191 -200 44
7765 44 157 123 59 -96 -183 219 59 -26 -190 -153 54 -85 -290 -28 -34 -172 54 -419 -79 -216 -402 40 108
7788A08N5l15J51N06o46l6J40j86J76j54k21J04L44n7j63R6L04j63j62O0Q3k10
7810a86L73k38K03M3m31L13j56J79lk89P2l28L27J50L12m00L6Q8k74P7P0J11l50
7833c01L77k2KJ5K87j54l68l7K65k44J3L01l20K49R3j34K59m64L46k61m3q1P9
7856a43J56N7O7k27J23K78j85j31l11L31k13J90J32j95P5J5L60n61L96l42k58
7877c86K92K96l82M11q0J13j59K8j39j66P2j28pJ19o0L77J08j56q5K26m50L80
7899B24k58l37J86J57J48k64L28K19j54j47K2m90K03J78l04J87J65J03j16J5q9
7920b4l68K56J62j71J67j72K32r6K12j60k37K10j5j12l53K82O3Q5Q1J63J34k22
7942A17q5k86J67k06n7M58j30J42j93M8J79r8j7Q8J46m69J15q7J75P1J26r7N5
$$ plain form
7788 108 163 -152 -1 505 -141 -177 -37 -223 -47 -201 -422 -318 26 -31 -194 -98 206 43 -119 -59 24 -186
7810 -186 187 -51 152 195 -236 77 -79 100 97 -192 -120 -448 -121 29 341 -59 -23 65 -209 -132 -62 49 -301
7833 -301 76 54 56 71 358 204 -164 -201 64 -180 -167 134 -186 63 156 22 281 -183 163 -98 -141 -222 -143
7856 -143 13 70 137 -90 33 311 126 -5 -316 15 -198 -8 124 -71 4 19 379 -182 214 -128 -386
7877 -386 -94 202 -180 231 151 264 105 133 -6 -172 -100 -228 -235 -116 -176 201 309 153 68 294 -156 224
7899 224 -34 -371 -185 -28 120 -144 184 403 249 102 124 -366 -163 15 -289 -102 63 166 50 65 -24
7920 -24 -392 -136 26 -145 22 -150 82 -14 198 38 -199 11 -4 -116 -469 -187 -124 -39 42 205 339 117
7942 117 32 -254 -87 -293 -350 108 -22 120 -73 -25 154 56 39 127 273 -196 -81 -168 7 78 204 107 162
7965A62Q1k24Q4k32N1j22J24JL27j01L8o8m01J36J08r0K0J55k05qL64j22Q3k87
7989a26M8R7k57O5O4m8O9N8k49p3M68l4k64L15k33K39k4l2l6k40K68j03K28l54
8013a54M25m69P2LJ34q5K9L18l27M51o22L00j46j08L3k57N10j54J66J35p3J33
8035C14j68J32l75l4J96l41J24K44L3p0K50k23j11K34l39r3O3J56k22K95R1M8
8057B04J11r7j03j39J41m96K54k9L63j11j72k8RL37n06L19m36Q4l6K12P3K9J32
8080A15k25R4j05l7l06N58o0l7k23J75P5j35J25J25l74k6K26j52j16L01pO3l9
8103A5K77m63L07j01k86M06m61L79K45l26J08l0L5N1j35L30n09J82l32L2M65M6
8125B35pj25J24n2l93M26l00m6K35jo1K69j83k19R7qj21J37m18K69k0P1L88l86
$$ plain form
7965 162 243 19 103 -129 -78 -200 -76 -75 252 151 189 121 -280 -144 -36 -126 -106 49 -156 -164 200 78 161 -126
7989 -126 -78 19 -238 -173 -109 -157 -88 -30 -279 -352 116 82 -182 133 -100 139 115 83 47 -193 75 -28 200 -154
8013 -154 271 -198 -126 -123 11 -74 -45 273 -54 397 -225 75 -71 -179 -146 -403 107 -47 119 254 181 314
8035 314 146 278 -97 -131 65 -276 -152 92 125 55 305 82 -29 205 -134 -227 -164 -8 -230 65 156 204
8057 204 315 218 115 -24 117 -379 -125 -154 209 98 -74 -102 -93 244 -262 57 -379 -295 -331 -119 -46 -17 115
8080 115 -110 -16 -121 -158 -464 94 34 -3 -226 -51 24 -111 14 139 -235 -261 -35 -187 -303 -2 -9 54 15
8103 15 292 -171 136 35 -251 155 -306 73 318 -8 100 70 105 156 21 351 -158 24 -308 -276 189 235
8125 235 228 103 227 175 -218 208 -92 -138 97 96 35 304 121 -98 -1 -9 -130 7 -411 -142 -162 -91 297 -89
8149h9M02l7j43L3k02l34J02L07m0K3m8L42O8m85j52K88J41j72M6k37J27j02l
8172a65O8O1L82m10k8j10J57l11N90l00N2J32j4J26j87j35Q8k76K90
$$ plain form
8149 -89 313 276 133 166 -36 -370 -268 39 -1 22 -26 316 384 -101 -253 35 176 4 50 -187 -60 -162 -165
8172 -165 -97 -36 346 -64 -92 -202 -45 -356 234 -66 -14 118 104 230 43 -92 -4 -280 10
8191A0
$$ Imaginary data points
##PAGE= N=2
##DATA TABLE= (X++(I..I)), XYDATA
0@%%%qJ6j6K4m0M8n6P4r3J15j44J78k12K53l05L62m26M99n81O76p85R01j031J180
27F29j342J520j721J942k183K450k744L062l411L802m226M685n196N758o373P056
43C708p815Q655r595J0661j1868J3245j4843J6721j8963K1697k5118K9543l5523
56a9495M4097n7518Q1687j38688N07252M50308r79379l37857M10331N45527j42056
67C64209l57628j02295K61596J41853r3098k03238m0564O3693J11621N5374k7228
78A74295j66870j63813k0591J84532J93994k9296k68009j20438K27910K11806
88B23520k25740l60229P0734M31436J66011l20704l54910R5306L97494J47517
98B70435k84953k70240J17194K60292m035j98122n8183J27431Q6816k7566r655
$$ plain form
0 0 0 0 0 -8 8 -8 16 -24 24 -32 42 -51 64 -80 98 -114 139 -166 196 -230 269 -312 364 -421 480 -551 629
27 629 -713 807 -914 1028 -1155 1295 -1449 1613 -1798 2004 -2222 2463 -2733 3025 -3348 3708
43 3708 -4107 4548 -5047 5614 -6254 6991 -7852 8869 -10094 11603 -13515 16028 -19495
56 -19495 24602 -32916 48771 -89917 417335 867643 -111736 -449593 -39262 506265 364209
67 364209 6581 -95714 165882 307735 214637 11399 -29165 34528 146149 201523 174295
78 174295 7425 -156388 -176979 7553 201547 172251 -95758 -216196 11714 223520
88 223520 -2220 -362449 -291715 139721 305732 -14972 -369882 -274576 122918 270435
98 270435 -14518 -284758 -167564 92728 88693 -109429 -167612 -40181 46635 19069 9414
109I414L4030p2333j53489L8799K52613O9591k81028k16071J94402L25628J7913
120B19469k71724k10265P1574K41554J02735j72316j97518P0044K21283L3214
130A08050j77101q4456J41141J37328p1385j43472J333P8971l178m874R9511M6963
142A28831j22488p9397J26755J17587j16152j86045L8990K40713J22289j84583
152H6500k59883L1413K92500J47030j85300k35710J3276J79628O8711j21626j22106
163a05567N1717J48368M7917r1028j11952m1703M1095Q5873M1242n6974p9053
174g0065j0443M4979N5949L3187m0840q2785R457J02454P769j29108n6999J23467
186a2978J21509m8029j14941P725J04609J6584j02819n4750O6231O7710p924k7291
$$ plain form
109 9414 43444 -28889 -182378 -143579 109034 178625 -102403 -318474 -124072 201556 219469
120 219469 -52255 -262520 -190946 50608 153343 -18973 -216491 -146447 74836 108050
130 108050 -69051 -153507 -12366 124962 53577 -89895 -88562 -9591 -12769 -17643 81868 128831
142 128831 6343 -73054 53701 171288 55136 -130909 -91919 148794 271083 86500
152 86500 -173383 -141970 150530 297560 112260 -123450 -110174 69454 138165 16539 -105567
163 -105567 -53850 94518 142435 51407 -60545 -102248 -61153 24720 65962 8988 -70065
174 -70065 -80508 -35529 20420 53607 12767 -70018 -60561 41893 49662 -79446 -136445 -12978
186 -12978 108531 60502 -54439 -46714 57895 74479 -28340 -83090 -16859 50851 42927 15636
198A5636j9143k4487J5605O7820K4021n8787n4247l889Q716J6774L5071J0256
210C3346l4213k4389K7936M0918j2052o8383m1783M7528O8304j1337n8069j0925
222d3119L5585K6987M204j1991j9809r285P96n363N83J4717N65p8L8058K8614
236F0464m9433o2008J8475N0758n082l2098L803K6060J963k5515j1595K8992M0509
249D5293k234m7042m7168j5420L4502O3581J4172o0562k9569N7889M1522m9438
261E526n5090J1761L3694J0894J777q231k2137m192L1745L3737n345l7437j9661
274b2959K3364J2709m0958k6610N3186O7503j0406n7303k6124J8271L1610R738
286C2021l3893l8254J4721M4950J2516k1842j8458K238K4885K2237k6604n5737
$$ plain form
198 15636 -3507 -27994 -12389 55431 79452 20665 -33582 -37471 -28755 -11981 23090 33346
210 33346 -867 -25256 2680 43598 31546 -36837 -78620 -31092 37212 25875 -32194 -43119
222 -43119 -7534 19453 23657 11666 -8143 -17428 -16632 -21995 -21412 -6695 -6130 -6208 31850 60464
236 60464 11031 -50977 -32502 18256 13174 -18924 -15121 10939 12902 -12613 -24208 4784 45293
249 45293 43059 -3983 -51151 -66571 -32069 31512 45684 -14878 -44447 13442 54964 5526
261 5526 -49564 -37803 -4109 6785 8562 331 -21806 -25998 5747 39484 34139 -3298 -22959
274 -22959 405 13114 -27844 -54454 -1268 66235 55829 -1474 -27598 -9327 22283 32021
286 32021 -1872 -40126 -25405 19545 32061 10219 -8239 -6001 18884 41121 14517 -41220
298d1220n039M8931K5139k3953k5464N739K6698K1658m492k5256k3089j5661k57
311c6266K9250K9784j0578k0842J5446J3926k4124j5433J9915R637j7002m876
323a1163R791k596q352N754J7358J9184O190j5419k4421k0938j5288J0101M1918
336A2119K8845r876j1506k343k6519k7925K6656N0565O46m3433k8322P432K2327
349a334J1808m386Q176K4690j076m4159l8941k031J8335L0869L4141j53l7237
362a298k3549J1345J5275j807j2633n353J3991J3131k0719l1272J2490M0016J7193
375B6810n567j1652k4853k2433O983J5936k937N111K8944J7028k0574l3789q381
388b9374K4953K6247j3607l2758M32K4482N503l149R117J494j0399O548J2084
$$ plain form
298 -41220 -46259 2672 27811 3858 -21606 -15867 10831 32489 27997 2741 -20348 -36009 -36266
311 -36266 -7016 22768 12190 -8652 6794 20720 -3404 -18837 1078 10715 -6287 -11163
323 -11163 -1372 -3968 -12320 -6566 10792 29976 36166 20747 -3674 -24612 -39900 -29799 12119
336 12119 40964 31088 19582 17239 -9280 -37205 -10549 40016 40662 -2771 -31093 -23661 -1334
349 -1334 10474 6088 14264 38954 37878 -6281 -45222 -47253 -28918 1951 36092 35939 -1298
362 -1298 -24847 -13502 1773 -34 -12667 -18020 -4029 9102 -11617 -42889 -30399 9617 26810
375 26810 21243 9591 -15262 -37695 -30712 -14776 -17713 -12602 16342 33370 12796 -20993 -29374
388 -29374 -4421 21826 8219 -24539 -24107 375 5878 2729 11846 13340 2941 9489 21573
401B1573j5050k3976p69J2520R023R805Q997L899o64j0720j6703k498P107m041
415a497l242J5643R167j0301l397Q412m698q404R088O990j6472k0929m795J2624
429a1811K0577N039j2155J774J7853r595l8117j4798J7202J4472M328N920n44
442A45p369k000N59j092L646K472m750l494n049j2394M572L2701K1186j2570j2244
457D319Q79q529j1527M134P713J811J0064J4845R50j0080q572j675Q614P569r966
472A0549j2371M039K654r380O433K4138N997j4092q406n919j4018o055O573O141
486c717N270P861R20o242l281m954m437P636L864j6137j0941J3115J1072l934
500c905K830J2104K239o622r030j0867m612M933M286N573J2492J228j2000J965
$$ plain form
401 21573 6523 -17453 -18222 -5702 3321 13126 22123 26022 25358 14638 -2065 -4563 2544 -1497
415 -1497 -4739 10904 20071 9770 6373 14785 10087 1683 10771 17761 1289 -19640 -24435 -11811
429 -11811 8766 13805 1650 3424 21277 11682 -26435 -41233 -24031 -9559 -5231 689 145
442 145 -7224 -9224 -8665 -9757 -6111 -3639 -8389 -11883 -16932 -29326 -24754 7947 29133 16563 4319
457 4319 5198 -3331 -14858 -10724 -3011 -1200 8864 23709 24659 14579 6007 4332 12946 20515 10549
472 10549 -1822 2217 4871 -4509 1924 26062 32059 17967 9561 3642 -10376 -16431 -9858 -3717
486 -3717 1553 9414 10334 4092 811 -4143 -8580 -944 2920 -13217 -24158 -11043 29 -3905
500 -3905 -1075 11029 13268 6646 -2384 -13251 -17863 -12930 -8644 -3071 9421 10649 -1351 614
514F14J2311r516j9385L357J2053p373j1265M278J1310P980L805m756q124l283
528g994o684o645M363M782l194N788J6523O01j1725K231P174p146p387M877R99
543c437k768O373J0874O047N159Q02o388k194o83q897n187J0565P691l045L738
558A8650Q920l287q018r25l480q562m281k234q07O101K435o954K378J2216m537
573G615j8421n246P90j0265m216J3541R370k736K88M518j11o089q302k889Q259
588a3894N824q034k856J2532P925k38P420M968j1607p982P077j528j2542K099
602a0836J7363J2478K742l841j0494n341L065o70n254M58N36l671M401P856l046
617E746k511Q647L735j1492j4414q732L07J5477J5021m786q860Q503R468o014
$$ plain form
514 614 12925 3409 -15976 -12619 -566 -7939 -19204 -14926 -3616 4364 8169 3413 -4711 -7994
528 -7994 -14678 -21323 -16960 -12178 -15372 -9584 6939 7540 -4185 -1954 5220 -1926 -9313 -4436 -3437
543 -3437 -6205 168 11042 17089 22248 23050 16662 14468 13785 4888 -299 10266 17957 14912 18650
558 18650 27570 24283 16265 15340 11860 3298 -983 -3217 -4024 2077 4512 -2442 -64 12152 7615
573 7615 -10806 -16052 -15262 -25527 -29743 -16202 -6832 -9568 -9280 -4762 -4873 -10962 -19264 -22153 -13894
588 -13894 -8070 -16104 -18960 -6428 1497 1259 8679 13647 2040 -5942 1135 -393 -12935 -10836
602 -10836 6527 19005 21747 17906 7412 2071 5136 4466 -788 -330 206 -3465 936 8792 5746
617 5746 3235 11882 15617 4125 -10289 -19021 -18714 -3237 11784 6998 -1862 6641 16109 10095
631A0095q672n748n472N949J4685j543j3495K694J7912P634p491j0683m670K137
645C332J28p360m397O601M885K852J0660J350k3025j4070J5109R109j9584j5605
659c0015Q540J6147Q851j743j1261q629N681O343m880p941l594J264Q177O448
673f612l380P96J4807Q591r065j2386q251o826Q465K2554J0008q962n032K920
687G627K977M214n59j2226n648J3712O521j5169j1267J1899J9180Q697o595j6419
701F944j1239j704j133R40O912K908q87P995O602j7153j8271R806J9154j074j3003
716c203j2225r184P132K6270J5535j3431j6208J892P484n160j6104o169J9318
729d053K2505n328k0207k713J3211Q846J069p882j8242q244J3531J1975m702l488
$$ plain form
631 10095 1423 -4325 -9797 -3848 10837 9294 -4201 -1507 16405 24039 16548 5865 1195 3332
645 3332 3460 -3900 -8297 -1696 3189 6041 16701 18051 -4974 -19044 -3935 5174 -14410 -30015
659 -30015 -21475 -5328 3523 1780 -9481 -18110 -12429 -6086 -10966 -18907 -22501 -21237 -13060 -6612
673 -6612 -9992 -9196 5611 14202 5137 -7249 -15500 -22326 -13861 8693 18701 9739 4707 7627
687 7627 10604 14818 14259 2033 -3615 10097 16618 1449 -9818 2081 21261 29958 23363 6944
701 6944 -4295 -5999 -7132 -6192 720 3628 2741 10736 17338 185 -18086 -8280 10874 9800 -3203
716 -3203 -15428 -24612 -17480 8790 24325 10894 -5314 -3422 4062 -1098 -17202 -23371 -4053
729 -4053 18452 13124 -7083 -9796 3415 12261 13330 5448 -12794 -21038 -7507 4468 -234 -3722
743c722N320N569N096j19j7745j8485Q090K1319K200j3781q495P570J6679P118
757A6614j0216j2170J996M980n580q171j143P395J8896J3532j2936k1689J825
770f667J3958O8m129R84p278j0459Q361J8614M287o515l060Q04l199j0510j0659
785a5400L084J5743Q116n196m381k286j185O923O689j2355j5941M795J0208m960
799f146m660P835O436K109M235l010j4794j0720K168P973Q037K076n867k052Q439
814B059M781o723m484K267K001j379r709j0694Q352K6449R929j6636j1492L686
828a593J299j502J903m522p515O651J3390K68o848J412O066J724o658j0488m467
843a0880O371O598Q32J221M91q98P653Q400j3165k2940K793J9135L596j0058k670
$$ plain form
743 -3722 1598 7167 12263 12144 -5601 -24086 -15996 5323 7523 -6258 -14753 -7183 9496 16614
757 16614 6398 -5772 -3776 1204 -4376 -12547 -13690 -6295 12601 26133 13197 -8492 -6667
770 -6667 7291 7359 3230 4214 -3064 -13523 -5162 13452 17739 11224 8164 8968 5769 -4741 -15400
785 -15400 -12316 3427 11543 6347 1966 -320 -1505 5418 12107 -248 -16189 -11394 -1186 -6146
799 -6146 -10806 -2971 3465 5574 9809 6799 -7995 -18715 -16547 -8574 -537 1539 -4328 -6380 2059
814 2059 6840 117 -4367 -2100 -99 -1478 -11187 -21881 -13529 12920 22849 6213 -5279 -1593
828 -1593 -294 -1796 107 -4415 -11930 -5279 8111 8379 1531 2943 9009 10733 4075 -6413 -10880
843 -10880 -4509 2089 2921 4142 4633 3735 11388 19788 6623 -16317 -13524 5611 9207 -851 -3521
858c521M672N090P023L59j0025o612K528R4m593l063K782R355J0660j742j1306
873A701l868M540J21l088k932o028r45J2380R448m867m781K344j501k894K911
888B541l426j2570j348J2932P973j326j02J468j444m394p393l530N012N584j511
903a534k108m07j300N507J3868L06j7721r911L227J66l0Q983N906m297l2O080
919F703k480r095l356L909M707k15q405m984Q845J1911J451k753j492l445k902
934a601k109p865n752J3145J9206J61j1046m733k301K36P324M476p228p553j120
949f760M08K492R364P256N79j256n751j3020r180L593J1878J1772J64j3157p577
964i195J1886R553p834p398L781j531q544m29M758P62M515Q888K322o242p407
$$ plain form
858 -3521 1151 6241 13264 13623 3598 -3014 -486 -392 -4985 -8048 -5266 4089 14749 13007 1701
873 1701 -2167 2373 2494 -594 -3526 -9554 -10499 1881 11329 6462 1681 4025 2524 -370 2541
888 2541 -885 -13455 -14803 -1871 6102 4776 4674 6142 4698 304 -7089 -10619 -5607 -23 -1534
903 -1534 -3642 -4049 -5349 158 14026 14332 -3389 -13300 -10073 -9907 -9937 -954 4952 655 623 6703
919 6703 4223 -4872 -8228 -4319 388 173 -8232 -13216 -4371 7540 8991 6238 4746 1301 -1601
934 -1601 -3710 -11575 -17327 -4182 15024 15185 4139 -594 -2895 -2659 4665 9141 1913 -5640 -6760
949 -6760 -6352 -3860 5504 12760 13339 12083 6332 -6688 -15868 -12275 -397 11375 11539 -1618 -9195
964 -9195 2691 12244 4410 -2988 793 -738 -9282 -9711 -4953 -4191 324 9212 11534 5292 -2115
979b115p852l838N846Q069P32k863k711k04O902O862n247p256L841J123j2323
994a1034o870R974J2223O972K579o416j2021l593O600M751K602j493r909p295
1008a2930Q999J4401L851l379k813k567l719o589q407K551J7425J1980n672r733
1022C398m710j928O586J0572l594j3778m197N091J3p38O235N607L997L274n482
1037A0346j7412j3753K643J6797J6849k06j7835r706R799Q880l389l381J332k363
1051a399l665l300o893j424J6701J8376n76j5482j4621p304O067J3224K850r229
1065f675l763N335N747J661m193o084K087R105k034j4676q023N600J1995J0929
1079G011K409j0542p324N751L244q287n398L645M351M404M148k946o676M272J1344
$$ plain form
979 -2115 -9967 -13805 -7959 110 842 -2021 -4732 -4936 1966 8828 3581 -3675 166 1289 -11034
994 -11034 -17904 -7930 4293 11265 13844 7428 -4593 -8186 -1586 3165 5767 4274 -5635 -12930
1008 -12930 -3931 10470 14321 10942 8129 5562 1843 -4746 -13153 -10602 6823 18803 13131 3398
1022 3398 -1312 -3240 3346 13918 10324 -3454 -7651 -2560 -2547 -3285 2950 8557 12554 15828 10346
1037 10346 -7066 -20819 -18176 -1379 15470 15264 -2571 -12277 -2478 6402 3013 -368 964 -1399
1051 -1399 -5064 -8364 -15257 -16681 20 18396 17820 2338 -12283 -19587 -13520 -296 2554 -6675
1065 -6675 -10438 -5103 644 2305 -1888 -7972 -5885 3220 1186 -13490 -21513 -15913 -3918 7011
1079 7011 9420 -1122 -8446 -2695 549 -7738 -13136 -9491 -5140 -736 3412 466 -6210 -1938 9406
1094I406K085r386j2591n054R781J4258J390q130m6N670L307O64m580r759j208
1109d193J1370L142r982l842J0593J1425L239o410j3446p022O612Q840j865o634
1123A827k401M311J0548O070j0373j3012L580J0002j227r564q595J17J2090J3225
1137A6598l436j2904q06P269r62q332p237j878P714J3218M20j2723o038P337Q611
1152F851J083p368j3101m945Q541Q941p01l327j130K239P491K361j4963j4718
1166b2746N854J3863J571o444k424Q14N196O819j402r413m752J511K801K337k657
1181i072o607L243J5168R406p294j2491p272P50J1014Q022q113r097O300J2412
1195F369K178n775l911J173O971K782j1411j3199M584J5602R487M34n431p495
$$ plain form
1094 9406 11491 2105 -10486 -15540 -5759 8499 9889 1759 1713 7383 10690 11354 6774 -2985 -4193
1109 -4193 7177 10319 337 -3505 7088 18513 21752 15342 1896 -5126 1486 10326 8461 1827
1123 1827 -574 3737 14285 20355 9982 -3030 550 10552 9325 -239 -8834 -8717 3373 16598
1137 16598 13162 258 -548 6721 5759 -2573 -9810 -11688 -3974 9244 9664 -3059 -9097 -1760 6851
1152 6851 7934 566 -12535 -17480 -8939 2 -699 -4026 -5156 -2917 4574 6935 -8028 -22746
1166 -22746 -16892 -3029 -1458 -7902 -10326 -9512 -4316 2503 1101 -8312 -13064 -11553 -8752 -6415 -9072
1181 -9072 -15679 -12436 2732 12138 4844 -7647 -14919 -14169 -3155 4867 -3246 -12343 -6043 6369
1195 6369 8547 2772 -1139 34 7005 9787 -1624 -14823 -10239 5363 14850 15284 9853 2358
1209B358p09O326K69p677l956L846Q179O417m387j3179l91J7403R860j0137j5183
1224i61o291J503Q045Q468K76k791M292K413o604q067j839J468M934N099k342
1239G603n767k379J230M819R034K543j3224j1922J770L878j250J254L673K138
1253C400K796N43q033q492O49L353K36m23j363l992J608P083J853l313j923j201
1269g219j305p84l891o101M421J3983M157p179m854J670M018M080l462j2720l580
1284a8766J2663J1067j655m386R72K111J464j215o047k482M848M133r5j269k793
1299a450k63Q968R310m693j0854l798j329k031L585Q078K960J080J808m466q151
1314a246j564M319K698O95q74m481k433K411K734L590N800J206p727o149l072
$$ plain form
1209 2358 1649 7975 8244 567 -3389 457 8636 15053 10666 -2513 -2904 14499 24359 14222 -961
1224 -961 -7252 -5749 2296 10764 11040 8249 12541 14954 8350 283 -1556 -88 4846 9945 7603
1239 7603 1836 -543 687 5506 14540 17083 3859 -8063 -6293 -2415 -3665 -2411 1262 3400
1253 3400 6196 6739 -1294 -9786 -9137 -5784 -5548 -5971 -7334 -11326 -9718 -2635 -782 -4095 -6018 -7219
1269 -7219 -8524 -9308 -13199 -19300 -14879 -896 3261 -3918 -8772 -7102 -3084 996 -2466 -15186 -18766
1284 -18766 -6103 4964 3309 -1077 -105 2006 3470 2255 -3792 -6274 -1426 2707 2612 1343 -1450
1299 -1450 -1713 7255 16565 11872 1018 -2780 -4109 -6140 -2555 5523 8483 9563 11371 6905 -1246
1314 -1246 -2810 1509 4207 4902 4028 -453 -2886 -475 2259 5849 11649 12855 5128 -1021 -4093
1329d093m672K13R189R972L230k193q939j1340J147J1684L916o684m896o21J086
1344c001L493K184j668L79O097K154q119j2365o659M848J5067R348o537p599J205
1359a173K241j789r52l249l744N135P436l925r342K504R642M591j845n619n841
1374e930j230K999j375k198M097N708L785P11m310p409j219N168r9l653N66J864
1390b525R76M845L463m650n348K660L019j094k354l204m117K817J0413N676k311
1405H266m349l322n81J982j632n760n18P058N946K044k011p632l990P447P711
1420A0659o755r793k33M120K520K394L16j723K594M532l878j0016n190K395O203
1435a855M210q52l135K354L858l374m875L4L80J37J922k234o819K158J0580M738
$$ plain form
1329 -4093 -8765 -8552 637 10609 13839 11646 2707 -8633 -7486 4198 8114 1430 -3466 -4087 -3001
1344 -3001 492 2676 1008 1387 7484 9638 1519 -10846 -17505 -12657 2410 11758 5221 -2378 -1173
1359 -1173 1068 -721 -1673 -4922 -8666 -3531 3905 -20 -9362 -6858 2784 7375 5530 -89 -5930
1374 -5930 -7160 -4161 -5536 -7734 -3637 2071 5856 6567 2257 -5152 -6371 -1203 -1302 -4955 -4389 -2525
1390 -2525 -1549 3296 6759 2109 -3239 -579 2440 1346 -1008 -4212 -8329 -5512 4901 10577 8266
1405 8266 3917 595 14 1996 364 -5396 -5914 1144 7090 9134 7123 -509 -4499 2948 10659
1420 10659 3904 -5889 -6122 -2002 518 2912 3228 1505 4099 8631 4753 -5263 -10453 -8058 -1855
1435 -1855 2355 1503 -1632 722 4580 1206 -3669 -3635 -3255 -3118 -1196 -3430 -10249 -8091 2489 7227
1451G227l571m062k222k873K27R20k468l68N701N407R8j593l623k260J557K160
1467B57j910j878N01j090J591O413L054k509r00Q62m006m471K275P72j924M424
1483A461P261k86n159p75J422K49o00k291k966J079K434L01J362L144J058q6m87
1500G121n744p434K012O750k50k649K518K325m63K36r25n478j774L932N17m081
1516c387l198N28M203O399K434n572n456j142n89q91q9j394J833O727K411o016
1532c199l610M065J075l509k54N49k897M3M196J353L44M160K316k572l292k545
1548c777k335J308L200K568L033K337j393j743K317k89n589j4M934m31l853J234
1564A507K696o54L146L530k347m036k155k876k443J586L611J210K095K214j430
$$ plain form
1451 7227 3656 -406 -2628 -5501 -5274 -4354 -6822 -7190 -1489 3918 4016 2423 -1200 -3460 -1903 257
1467 257 -1653 -3531 -3030 -4120 -2529 3884 6938 4429 3529 4391 385 -4086 -1811 -1039 -2963 1461
1483 1461 8722 8436 3277 2502 3924 4173 3573 1282 -1684 -605 1829 2130 3492 6636 7694 7608 7121
1500 7121 1377 -6057 -4045 2705 2455 -194 2324 4649 4186 4422 3497 -1981 -3755 177 694 -3387
1516 -3387 -6585 -6057 -1854 4545 6979 1407 -4049 -5191 -5780 -6671 -6760 -8154 -6321 406 2817 -3199
1532 -3199 -6809 -2744 -1669 -5178 -5432 -4883 -7780 -7737 -3541 -2188 -1844 2316 4632 2060 -1232 -3777
1548 -3777 -6112 -4804 -1604 964 3997 6334 4941 3198 5515 5226 -363 -377 4557 4126 273 1507
1564 1507 4203 3549 6695 10225 7878 3842 1687 -1189 -3632 -2046 1565 2775 4870 7084 5654
1579E654l275k808l646J10M742P98m115m1K548l32o39M001J404k844j513j906
1595a862n703k020N604N155J590K298n08m234l102j186r37p4K637O55N21K79k054
1612b941k120M209M282l124l051k85l257m191K524N653K070J861L432j678m913
1627a529k432o29j92K761L339L95M85J283m7K52J247j32k64J805j425o551l87
1644b021O115L291r5K459J548l571l304k530m501r05M932L317n44K18m64m022
1660g7k866J759J399j283j707l220j508J283L12K7M890N869l401p207j990j98
1676g918j983J276M431L276L449J944m295o401J562M856J219j530q65r23m34N27
1692a809J611M489N179j428o952j855N13k969k563L828N718K211L37k213n449
$$ plain form
1579 5654 2379 -429 -4075 -3965 777 1575 -2540 -2581 -33 -365 -1004 2997 4401 1557 44 -1862
1595 -1862 -7565 -9585 -3981 1174 2764 5062 4554 320 -2782 -3968 -4905 -4979 -2342 -1687 -1166 -887 -2941
1612 -2941 -5061 -852 3430 306 -2745 -3030 -6287 -10478 -7954 -2301 -231 1630 5062 3384 -1529
1627 -1529 -3961 -4590 -4782 -2021 1318 1713 2198 3481 3434 3686 4933 4801 4537 6342 4917 -1634 -2021
1644 -2021 4094 7385 7290 9749 11297 7726 4422 1892 -2609 -3514 1418 4735 4191 4409 3945 -77
1660 -77 -2943 -1184 215 -1068 -2775 -5995 -7503 -6220 -5908 -5881 -991 4878 1477 -5730 -7720 -7918
1676 -7918 -9901 -8625 -4194 -918 2531 4475 180 -6221 -4659 197 1416 -114 -979 -1902 -2336 -1809
1692 -1809 -198 4291 9470 8042 1090 -765 -252 -3221 -5784 -1956 3762 5973 6310 4097 -1352
1707a352r21L130p61k232J704n0l801k75N013L697j60j661j556O09q62m800l908
1724h186N034P712R77l003O56J168q64j243l289k352M301L942m185m338M706O023
1740G059j162l995j721p31J35n19k608j738J794J518K364L561K51o308m508J490
1756e118J222o45O4r35N96M854K696l971k533L929J482m271k454K203J867N8l43
1773a299J666N321M205m123o579l90L268j89j589M80K084K475K128l020k983K361
1789C816K301l973l994Q47O96j651K307K512J03J12J76k896k648j665j018N52
1805d423L265J175k352j43L457J706j531l052l914O52M878K95o195p73Q018M818
1821E881k180k429j596j320q34l52j393K679M326r9l495M73K364J184o13k475
$$ plain form
1707 -1352 -2273 857 96 -2136 -432 -482 -4283 -4558 455 4152 3992 2331 775 1384 522 -4278 -8186
1724 -8186 -3152 4560 5537 2534 3190 4358 3494 2251 -1038 -3390 911 4853 668 -3670 1036 7059
1740 7059 5897 1902 181 -550 -415 -934 -3542 -5280 -3486 -1968 396 3957 4208 -2100 -6608 -5118
1756 -5118 -3896 -4541 -4477 -5412 -4816 38 2734 -1237 -3770 159 1641 -2630 -5084 -2881 -1014 -956 -1299
1773 -1299 367 5688 9893 5770 -809 -1199 2069 1880 291 771 2855 5330 7458 4438 1455 3816
1789 3816 6117 2144 -1850 -1003 -307 -1958 349 2861 2964 3076 3252 356 -2292 -3957 -4975 -4423
1805 -4423 -1158 17 -2335 -2478 979 2685 1154 -1898 -5812 -5160 -282 13 -6182 -6955 1063 5881
1821 5881 3701 1272 -324 -1644 -2478 -2830 -4223 -1544 2782 2683 -812 -339 2025 3209 2596 121
1837A21l794k23K926m34k162K916L308R44O83j683n654l761K985L329k13k72J545
1854E61M53J103j63k585m43L602R48m706m534M43L259N553K588k437p27J531k222
1871B224p005j506N084L873P48r71k907j508M470L060k533l669j99R3j344o03
1887b693r05K130N274K890k450l175k125k098L9K000j78L03L474J803l797k385
1903a893L608K509j346k494k914k157L073L558n68m05K367J291j909k353j669
1918a302o72J831k37k987l23N443L531j465k397k502j491J080P93k889j168M720
1934c5L057l367k205J126K783K100q13n842m632J935M624M72l39J542K096J968
1950D470j812p538m515M657O061N54k141j670j266J691L860j6k674J945J863m420
$$ plain form
1837 121 -3673 -3896 -970 -1404 -3566 -650 2658 3602 4285 2602 -3052 -6813 -3828 -499 -712 -984 561
1854 561 1014 2117 1954 -631 -1074 2528 3476 -1230 -5764 -5321 -2062 3491 6079 3642 2915 4446 2224
1871 2224 -4781 -6287 -1203 2670 3418 2447 -460 -1968 2502 5562 3029 -640 -839 -746 -2090 -2693
1887 -2693 -3598 -1468 3806 6696 4246 1071 -1054 -3152 -3113 -1113 -1291 -988 2486 4289 492 -1893
1903 -1893 1715 4224 2878 384 -2530 -4687 -1614 1944 1376 971 3338 4629 2720 367 -1302
1918 -1302 -1974 -143 -380 -3367 -3690 1753 5284 3819 1422 -1080 -2571 -1491 -698 -3587 -4755 -35
1934 -35 3022 -345 -2550 -1424 1359 3459 2646 -3196 -7828 -5893 -1269 -797 -1136 406 2502 4470
1950 4470 2658 -4880 -9395 -4738 1323 1877 -264 -1934 -3200 -1509 2351 2335 -339 1606 3469 -951
1966i51o335p02M856P532M612k591o010j705R91o50o05J379K038J035K5l083k086
1983b250M041N332j115l908j430j936j777Q42J413R44M121L807k768o218k157
1998c059J108J442Q47r07j498J300J862j292j040K625J440j086l033l816k641
2013g748L398N949p3l549J358K931l72k704k165q87J226K143j654j970K527N028
2029C438J506k347l667j581J811K503j714l650J847L795J098o3l65r65R31K089
2045D666l171n313L2M533K445p31r2O60J440R57m157n537J015N366J867k844l528
2062b392k47L861N062j638n158j302K174j602l497l59K106L683L165j40n542j893
2078c719K859J164l020k271O07J848K720l88k505K40M240J112k875l591k581J444
$$ plain form
1966 -951 -7286 -7988 -3132 4400 9012 6421 411 -1294 -303 -953 -1558 -179 1859 2894 2919 -164 -2250
1983 -2250 1791 7123 6008 2100 670 -1266 -3043 -2201 -788 156 4277 8084 5316 -902 -3059
1998 -3059 -1951 -509 338 -569 -2067 -767 1095 -197 -1237 1388 2828 1742 -1291 -5107 -7748
2013 -7748 -4350 1599 1526 -2023 -665 2266 1894 -810 -2975 -3862 -2636 -493 -2147 -4117 -1590 3438
2029 3438 4944 2597 -1070 -2651 -840 1663 -51 -3701 -1854 1941 3039 2976 2611 1646 2577 4666
2045 4666 1495 -3818 -3786 747 3192 2461 2369 3029 4469 5426 1269 -4268 -3253 2113 3980 1136 -2392
2062 -2392 -2639 1222 6284 4646 -512 -1814 360 -1242 -4739 -5098 -2992 691 3856 3716 -1826 -3719
2078 -3719 -860 304 -2716 -4987 -4380 -2532 188 -200 -2705 -2465 1775 2887 12 -3579 -6160 -4716
2094d716L699J088k904J028N038J482m294l243r84J365K134O67k711j018L088
2109b81K085k68L44R31j491k687j552p18K344L042j45j215J899K499j183j478
2125B126j779k051J066L244K09k911o7M045J785p40j338j536p37N82j217l380
2141b699j22N402M190j032m972l898K138M731j298p141k463L991L978j074k738
2156c007j291K738N030l90p721o153L373N867J782j686k163N36M351K731l105
2171H92m460k46K876K449l61k596j279M591M904n83k413q77r24k001M7N11J23
2188F53L048K291k124l024J142K247j208j728j745j487j77O24O10J476K557o08
2204B547l214j419J37q26M79l89j612Q81M423Q04l621q09K992J570j943k751l111
$$ plain form
2094 -4716 -1017 71 -2833 -1805 3233 4715 421 -2822 -3806 -2441 -307 360 -2351 -3369 -281
2109 -281 1804 1536 1880 2811 1320 -1367 -2919 -3637 -1293 1749 1604 389 2288 4787 3604 2126
2125 2126 347 -1704 -638 2606 2815 -96 -163 3882 5667 4927 3589 2053 1316 1898 681 -2699
2141 -2699 -2821 2581 6771 5739 767 -3131 -993 3738 2440 -4701 -7164 -3173 805 -269 -3007
2156 -3007 -4298 -1560 3470 3080 -4641 -10794 -7421 -1554 228 -1458 -3621 -3085 1266 3997 892
2171 892 -3568 -3814 -938 1511 1150 -1446 -2725 1866 6770 6187 3774 2897 1973 -28 19 530 653
2188 653 3701 5992 3868 844 1986 4233 3025 1297 -448 -1935 -2112 -1488 -878 598 3155 2547
2204 2547 -667 -2086 -1949 -2775 -2296 -2685 -4297 -3416 1007 1811 -1810 -2619 373 1943 0 -2751 -5862
2221e862K57M760M183j429l059L86K147P64k036m477r00M383K707l066l251Q59
2237c634L266L501O51n125m999M27L376p46j694K583L385J238j653l376k234K903
2253b131M889r90m644k138K406L912K959m32j209J404J929k610l266m61J626K119
2269C363L464P20k763j112J932j28j387P68J90k399k148L89Q38K057K033q24j483
2286C510r22j840k971j098J168J030K174O14l118j893K738K536j692k782j746
2301d292q36J077K521k92j201K200L771q53m395k476M57L073J412k499k617J643
2317c307M474J020j523k060j083P95J935l087l671J011M862K303j168j113j399
2332b011j214J683P62j724j868R62R79O41J110O14Q15J108o47k955p99P85K63
$$ plain form
2221 -5862 -5605 -845 3338 1909 -1150 -764 1383 2147 111 -4366 -5266 -883 1824 -1242 -4493 -3634
2237 -3634 -368 3133 3784 -1341 -6340 -5913 -2537 -3283 -4977 -2394 991 2229 576 -2800 -5034 -2131
2253 -2131 2758 1768 -2876 -5014 -2608 1304 4263 3831 2622 4026 5955 3345 79 -382 1244 3363
2269 3363 6827 7547 4784 3672 5604 5476 4089 4857 5047 2648 500 889 1727 3784 5817 4993 3510
2286 3510 2588 748 -2223 -3321 -2153 -1123 1051 1665 -1453 -3346 -608 1928 236 -2546 -4292
2301 -4292 -5128 -4051 -1530 -1822 -3023 -823 2948 2095 -2300 -4776 -4319 -1246 166 -2333 -4950 -3307
2317 -3307 1167 2187 664 -1396 -2479 -1684 251 -2836 -6507 -5496 -634 1669 501 -612 -2011
2332 -2011 -3225 -1542 -780 -2504 -4372 -3410 -2431 -1790 -680 -66 749 1857 1210 -1745 -2544 -1759 -1496
2349a496J053K056P76k63J043k62j649N07K244j658l533M48K865J433R2nn76J277
2367D352P28k565l981o57K443J855Q19j448j717K000K576j219l245j086R75j97
2383c67m69j16p89Q18M550J157l283k858j70R00M97l38j507j24K455K285p05j251
2401F85n85L15L97p12k895r87K475J972l71N60R87q55j590L50j014j853P64Q80
2419a477j50KJ515P29p32K03n37p71q59j296j142J759K592J19o17N41R00m88n13
2438b22j121k291N44K226O48j476R17J968M57K88n51k632r62J755N41j094k06
2455a211J426K072J595p93k770j548J728R25j349q53k50N70L105J902k023k498
2471B8J737J586k441k656m58J431K219J347j374j518J491J475r86k027j366q15
$$ plain form
2349 -1496 -443 1613 2389 2126 3169 2907 1258 1765 4009 2351 -1182 -734 2131 3564 3656 3651 3075 4352
2367 4352 5080 2515 -1466 -2123 320 2175 2994 1546 -171 1829 4405 3186 -59 -1145 -170 -367
2383 -367 -836 -952 -1741 -923 3627 4784 1501 -1357 -1527 -627 -130 -468 -1975 -2099 356 2641 1936 685
2401 685 100 415 812 100 -2795 -3782 -1307 665 294 854 1841 986 -604 -254 -1268 -3121 -2357 -1477
2419 -1477 -1627 -1625 -110 619 -113 90 -447 -1218 -2077 -3373 -4515 -2756 -164 -45 -662 -121 779 291 -222
2438 -222 -1343 -3634 -3090 -864 -216 -1692 -775 1193 1650 1938 1387 -1245 -2207 -452 89 -1005 -1211
2455 -1211 215 2287 3882 3089 319 -1229 499 1424 75 -778 -1028 -458 2647 4549 2526 28
2471 28 1765 3351 910 -1746 -2204 -773 1446 2793 1419 -99 1392 2867 1881 -146 -1512 -2327
2487b327P78J478K42p26R37Q19l62M50l49l504k382K432J966m59j73J342K08Q3
2505D53J15j599q07N55L73j429j59J463N30J234J469m61j228p47j237n32J757
2522b50M40j661q5L749J887j816j631o18L29N37r8k257p48K518J807l13j60L12
2540A942J61k31j448j626r38J589Q95O7J361M54j584k28J936r30k832j002J004
2557a410O87J231J09p92O73J671o91j982m96N04n80j020m03O37K141K037j003
2574A313k031L30j12j565o88J070K73n97J181Q57QR10l2j637j170J060n5j534
2592b419L21J056P02J036J023J59j58j249k406j030J948J378o06p7J591K05k57
2609A217K28K11j161k58p8j757J15J830J358m77Q68O51q88o94p29r14p27K97J54
$$ plain form
2487 -2327 -1549 -71 171 -555 382 1201 839 1289 940 -2564 -4946 -2514 -548 -1007 -1180 162 370 453
2505 453 568 -1031 -1838 -1283 -910 -2339 -2498 -1035 -505 729 2198 1737 509 -238 -1475 -2007 -250
2522 -250 190 -1471 -1556 2193 4080 2264 633 15 344 881 783 -1474 -2222 296 2103 1790 1630 1942
2540 1942 2103 1872 424 -1202 -2140 -551 344 411 1772 2226 642 414 2350 1420 -1412 -2414 -1410
2557 -1410 -723 508 617 -175 498 2169 1478 -504 -1000 -496 -1076 -2096 -2499 -1862 279 2316 1313
2574 1313 -718 -388 -500 -2065 -2753 -1683 -1410 -2007 -826 31 39 949 917 -720 -1890 -830 -885 -2419
2592 -2419 -2098 -1042 -340 696 1719 1878 1720 471 -1935 -2965 -1017 361 -245 -322 1269 1474 1217
2609 1217 1445 1656 495 237 159 -1598 -1483 347 1705 1228 2096 2747 1859 1165 436 -478 -1205 -908 -754
2628g54Q31K283L62j201p10J09j041m32N37m42j251Q35R74l92J188J391o75j612
2646@j106q30n56R52J169m7L82L91N97j32L81j637j845J94J193O8N45N80p77L28
2666a50J934J166j398j323q06j214l72J912J568k76Q15O01j321m85J58l74o52
2683b17r1r85k95K219J379p79l8K63l21j490Q4o51j396L82J397Q81L34J186o26
2702A236j036m96n54j214J24J176L42m90J003k72R15J492p98j912j194M19l79
2719a638K64J362M74P6N80o1o39J60K54j825k186N46K406M97O38j13m11qM09l07
2739D78o69p65j119r61J977K175o6k7N92n05j377J39j71p43J82Q34m25J3J950
2758A512J347o93r86r27m03m2N27j132l35J657Q53o6L59o4r07p04m18p30r98J445
$$ plain form
2628 -754 77 2360 2722 1521 811 920 -121 -553 -16 -458 -1709 -874 100 -292 896 2287 1612 0
2646 0 -1106 -1936 -2492 -1540 -371 -418 -36 355 952 820 1201 -436 -2281 -2087 -894 -826 -281 299 -478 -150
2666 -150 1784 2950 1552 229 -577 -1791 -2163 -251 1317 1041 1856 2457 1136 651 809 435 -217
2683 -217 -308 -1293 -1588 631 2010 1231 1193 1456 1135 -355 -271 -922 -2318 -1936 -539 342 676 1862 1236
2702 1236 200 -296 -850 -2064 -1940 -764 -422 -912 91 -181 734 2226 1428 -484 -1678 -1259 -1638
2719 -1638 -1374 -12 462 538 1118 1057 418 578 832 -993 -3179 -2633 -227 270 908 795 384 376 785 478
2739 478 -191 -956 -2075 -3036 -1059 1116 1050 1023 1615 1110 -267 -128 -299 -1042 -860 -26 -451 -438 1512
2758 1512 2859 2166 1180 253 -150 -192 335 -797 -1132 525 1378 1312 1671 1607 700 -4 -422 -1152 -2150 -705
2778g05N53j51O66J015j081q13J176q3k481q33R9Q26J907J074q27l65M24K20p27
2797a06l31p47j171O80J793J28Q98J059n52j456J05N91j320k02P72o89n68Q82
2815b34K044N62L04r61k753j009J233R25r50N27J72K52J206k4j308q07J037K7
2833B43j677j99N81m19J067J896p2o44l4L29j874j301m46M15K007K223k22k146
2851b73o96O77J002L82m73j855q66Q69J34m2J728J662m54q55r26k051r52J739
2869a250J325n78K9N06K12L71R62j587j318K0R20k53J02m86q69K001K355J02j399
2888A165q59j144q55P05P60j61j37J881L34p46QM93j072k16j2j556n01J501J828
2907A416L63k65j222o06J310R40j242j929n42J13Q28K212R78j013m35L34r59j855
$$ plain form
2778 -705 -152 -303 363 1378 297 -516 660 577 -1904 -2737 -2638 -1812 95 1169 342 -23 401 621 -106
2797 -106 -437 -1184 -2355 -1675 118 246 1144 2203 1651 195 300 891 -429 -631 141 -548 -1116 -234
2815 -234 1810 2372 2676 1715 -1038 -2047 -814 111 -839 -312 -140 112 1318 1294 -14 -821 216 243
2833 243 -1434 -1633 -1052 -1471 -404 1492 1420 776 742 1071 -803 -2104 -2550 -2135 -128 2095 1873 -273
2851 -273 -969 -292 710 1092 619 -1236 -2102 -1233 -1099 -1141 587 2249 1795 940 14 -2037 -2989 -1250
2869 -1250 75 -503 -474 32 244 615 1577 -10 -1328 -1308 -388 -641 -539 -1025 -1894 107 2462 2564 1165
2888 1165 306 -838 -1693 -988 -228 -389 -526 1355 1689 943 951 1444 372 156 144 -1412 -1913 -412 1416
2907 1416 1779 1514 292 -314 996 1936 694 -1235 -1777 -1664 -836 1376 2354 1341 906 1240 281 -1574
2925a574r3J042J53O51Q06o74m81J174O73n59m44r51j158M21N66q38J30J849J418
2944B111K93l83k034k492J2J683J223j92L58m85q01O91Q54r5l27lo11j979l36
2963b513M64J740K099O28j654j125j76j82k66K29j77o04J347J405n23q30O61r7
2981D26l18J96l53j418p23J060Q45O96J038K15r99o31n27j499L75J094L02j74
2999c95N94q6K3J000P90j515j479J18o9K14Q45P62j058K81J419K6r52k23o45m97
3019h47j07Qr6J673J133N9r31o95k91m34Q62j93j579k19J937J054j57L40o77q47
3039gK16Q23j482j278M36Q21P52J090L72q23J26n48j119n14j0N22M19P66l41o59
3059d38R20J437m72j292m33n70p37N30J284L87k27O12J96m68K53p45j154k28K47
$$ plain form
2925 -1574 -1667 -625 -472 179 985 311 -170 1004 1677 1118 674 -277 -1435 -1014 -448 -1286 -1156 693 2111
2944 2111 2404 2021 -13 -2505 -2493 -810 413 221 579 94 -707 -16 838 743 416 413 -198 -2177 -2513
2963 -2513 -2049 -309 1790 2418 764 -361 -537 -719 -985 -756 -933 -1537 -190 1215 692 -138 523 426
2981 426 108 304 -49 -1467 -2190 -1130 -285 411 1449 1664 665 34 -493 -1992 -1617 -523 -221 -395
2999 -395 199 113 136 1136 1926 411 -1068 -950 -1019 -805 40 802 -256 25 1444 1470 518 295 -350 -847
3019 -847 -954 -946 -1042 631 1764 1823 892 197 -94 -528 334 141 -1438 -1657 280 1334 1177 1517 840 -7
3039 -7 209 1032 -450 -1728 -1292 -471 281 1371 1743 920 1046 498 -621 -1135 -1145 -623 -204 562 221 -438
3059 -438 482 1919 1447 155 -278 -848 -1585 -1055 229 616 389 1001 1197 729 982 237 -917 -1145 -898
3078h98L43K62O58K26kP93n69j707N18J63p54p58N97L55N12J970L06j902j311
3097a198K49K98J07r9l78q17J067J672rp91K60k22l82l21j209p80J485J657j53
3116D36J50L26k26o86Q5n01j209N28J296l16k74M77K24L93O79R5j354j240j0l43
3136a470L55J415O89J53N70m27j866Q1N84j0n65J65M02p32M63J396J62M6J47j076
3156D82j737K58L25k9N19P43R84r3J69j027j508M42P31n98j60K88n06M80J303
3175A066n7m88L47q9j402j115L06L48P49J096J84p57K36R11m14j360l80m27q1
3194a327R01O35k68P17P31q09p03O8o11q5M30n0j316Q90J770J31l11j9l41o90
3214b57k52o27o41O82J705O30m17j01j82o68pJ02o05k37R60o86l45M71Q04P56
$$ plain form
3078 -898 -555 -293 365 591 589 1382 813 -894 -376 -213 -967 -1725 -1128 -773 -261 1709 2015 113 -1198
3097 -1198 -949 -651 -544 -643 -1021 -1838 -771 901 892 101 361 139 -243 -564 -1773 -2553 -1068 589 436
3116 436 586 912 686 0 85 -416 -1625 -1097 199 -117 -391 86 310 703 1382 1477 123 -1117 -1127 -1470
3136 -1470 -1115 300 989 1142 1712 1285 -581 -500 84 74 -491 -326 76 -656 -193 1203 1365 1411 1558 482
3156 482 -1255 -997 -672 -701 -182 561 1545 1452 1621 594 -914 -472 259 -339 -499 -211 -717 -237 1066
3175 1066 1009 521 868 779 -623 -1738 -1432 -1084 -335 761 945 188 424 1335 921 -439 -819 -1246 -1327
3194 -1327 -426 209 -59 658 1389 580 -123 -55 -666 -751 -321 -371 -1687 -797 973 1104 793 774 433 -257
3214 -257 -509 -1136 -1777 -1095 610 1240 823 722 540 -128 -135 -33 -638 -875 85 -601 -946 -475 329 1085
3234A085N72o2j542j967K74M82j80J283J289j94l75n78n62k35P82j08r36O5j27
3253a034k63O21J564l5OK15o43j994j66N78k12J136Q36K39n27L36l24r76P0Q20
3273B47j13n07n37K28R11J234J20o91j82N7m97j214k52L16Q21J083L44j213J82
3292C37J054n65r58n84l96J54N94Q45m41n3J027K56m10o74o41n88Q07P00j294
3311h30k65J844Q91j04q3r18j175N15N95j004p77J454J444o19j3l32k81j4J57
3330D85m91q88K3J85k25J123R77n73j13K48j183p99J38j67l29J034J302l58m87
3349i8M86k65m42K64M4q43l62L12L33M89P64j47J26Q9j05j624q31Q72O18J86K41
3370A07j41k23J522K46j835r13R71K0n67n45j0N99J214Q52p83r94K2k01o63L51
$$ plain form
3234 1085 1657 1595 53 -1914 -1640 -1158 -1338 -55 1234 1040 665 87 -475 -710 72 -36 -972 -907 -1034
3253 -1034 -1297 -676 888 853 859 1074 431 -1563 -1729 -1151 -1363 -227 609 848 321 657 333 -643 -573 247
3273 247 134 -373 -910 -682 229 1463 1583 892 710 767 270 -944 -1196 -880 -59 1024 1368 155 337
3292 337 1391 826 -132 -716 -1112 -958 -364 481 40 -13 1014 1270 860 186 -455 -1043 -236 464 -830
3311 -830 -1095 749 1640 1536 1453 535 -640 -125 470 -534 -1311 143 1587 968 955 623 342 328 485
3330 485 -6 -894 -871 -686 -911 212 1189 616 503 751 -432 -1231 -1093 -1260 -1589 -555 747 389 -98
3349 -98 388 123 -319 -55 -11 -854 -1216 -904 -571 -82 682 535 661 750 645 -979 -1810 -938 -320 -134 107
3370 107 -34 -257 1265 1511 -324 -1237 -266 -246 -813 -1358 -1368 -769 445 1297 514 -480 -458 -659 -1322 -971
3390i71j64l87J166J153l89Or2jl80L49k43j412K33J677M27m50Q22N77l93q26
3410G02n44p41N76Q30k85k29O51Q12K5l49p14n33K79j58o60o60J361K84k11j41
3430B95J366j57j460l88k29m24L96R39l81p6O56N2J48N0m29p24k53N7j40J6N67
3451a19J94R51O85p68j880K16J021n19r41K0O06P75O79k04j104n4P23m95j172
3470a386J28L12m9J24O69j72R20K27p16j038M4k05l69N27Q00q6Q0O79q1k56n1
3491A01o69m76R3Q06j45j25M41K67o3M33L94m30n42q95o96P88J231k60j57N77
3511F73Q19o98q73k27n63L07J019Q7j353M31J423M52k98l32n26k92L9k3p89M0
3531f84R46N33M84M88q65j012J2K02o93J79Q23o5P1N0R3k67R15L10j707j033M43
$$ plain form
3390 -971 -1135 -1522 -356 797 408 414 322 321 -59 290 47 -1365 -1132 545 972 522 1344 1921 1528 702
3410 702 158 -583 -7 823 538 309 960 1772 1797 1448 734 201 480 322 -338 -998 363 647 436 295
3430 295 1661 1504 44 -344 -573 -997 -601 338 -43 -119 537 589 737 787 358 -366 -619 -562 -702 -686 -119
3451 -119 75 1026 1711 943 -937 -721 300 -219 -1160 -1140 -534 241 920 716 -388 -442 281 -214 -1386
3470 -1386 -1258 -946 -995 -871 -202 -374 546 773 57 -981 -937 -1142 -1511 -984 -184 -270 -190 489 408 152 101
3491 101 -568 -1044 -951 -145 -290 -415 26 293 230 663 1057 627 85 -810 -1506 -718 513 253 96 673
3511 673 1492 794 -79 -306 -869 -562 457 544 -809 -378 1045 1497 1199 867 341 49 88 65 -724 -684
3531 -684 262 795 1279 1767 902 -110 -98 104 -589 -410 413 348 419 469 562 295 1210 1520 -187 -1220 -777
3552g77K54L11L17J72Q9M80K56q16o44j44l12l52R70J78l40N66K23r9j2J31p54
3573c03o64K11P5l38J99Q27J55K38K40m97q30j15l83j36N56L39Q5K75M37L23o20
3594G4l31K8n14R0m0k56L56Q64K71n63N01P22o75j043K50q60K41J355P73q21q
3615D14K95m0L27k74r69q51P17K97j1J83N57l39K55M96l64j283k9L57n67J47M23
3636b59O91K98QN0r34j69K65m97r3K49pJ82M79L66l24L30j27r65j88J25J18l48
3658g50P12N71l27K23K99k29q90l6l36m40R48N08J56k30K43j13L7N46o27p16j54
3679f05r1k27N93J025M56r60L70j35k20l12R8m41l05N72J97K76P34K80n43n60
3699B02M33l05m35l7j39J71N34P67m07J03K44q07p23J17J47o75K59R03l11J58
$$ plain form
3552 -777 -523 -212 105 277 366 846 1102 286 -358 -502 -814 -1166 -196 -18 -358 208 431 332 320 451 -303
3573 -303 -967 -756 -681 -1019 -820 7 162 400 640 143 -687 -802 -1185 -1321 -765 -426 -341 -66 371 694 74
3594 74 -257 -229 -743 -653 -693 -949 -593 271 542 -21 480 1202 527 -516 -266 -1126 -885 470 1243 422 414
3615 414 709 669 996 722 -247 -1098 -381 -84 -95 88 645 306 561 1057 693 -590 -619 -262 -829 -682 -259
3636 -259 432 730 738 788 -146 -315 -50 -547 -640 -391 -398 -216 263 629 305 635 508 -457 -645 -520 -402 -750
3658 -750 -38 533 206 429 728 499 -391 -427 -763 -1203 -255 253 409 179 422 309 346 892 265 -451 -605
3679 -605 -696 -923 -330 695 1151 191 561 426 206 -106 -8 -449 -754 -182 15 291 1025 1305 762 202
3699 202 635 330 -105 -142 -281 -110 424 1191 784 887 1131 324 -399 -282 -135 -810 -551 352 41 199
3719A99L13J71p04m4j8r92N7M08Q2M53L47N2k14j27K46n71n41K23l90K37P26k1
3741a08J3J94K93q33L9J7L18r21Q1M52j11N63J162k80q18l65j52J70K25r9l81
3762e41K91M54L21K31j4l8p19J87j32p42K33N23j1P1O10L15l03N9m51p63J81j79
3784d17J12K22K58K56m25O29n3l36l65l17m16L0K41P42k3M18O61o48m79N6l82
3805b36j52J54K27N5m58N25M17L68M32j253p06m8N27j43o6K05p9M53Q62j64j137
3826b17M2J85m16k37J61J2j55P43M91o33K98J05m5r31q8m85Q27Q43K00p29p8M87
3848C80Q8L66m61p98n62M09J096l99M1N36j91N2J40m73q08L3M86j28m67N28K78
3869A46q6L72K51o01m78k83l06r3R08j9k49O01L04j68m4m26q77m46J075R6n44
$$ plain form
3719 199 512 683 -21 -65 -83 -1075 -1018 -610 -528 -75 272 324 110 -17 229 -342 -883 -660 -1050 -813 -87 -108
3741 -108 -95 99 392 -441 -402 -385 -67 -988 -907 -455 -566 -3 1159 879 61 -304 -456 -286 -61 -160 -541
3762 -541 -250 204 525 756 742 704 -15 172 40 -702 -469 54 43 114 724 1039 736 795 344 -419 -238 -417
3784 -417 -305 -83 175 431 6 635 582 246 -119 -436 -852 -822 -581 161 138 556 1217 569 90 146 -236
3805 -236 -388 -234 -7 48 -410 115 532 900 1332 79 -627 -675 -148 -291 -357 -152 -231 222 1084 920 -217
3826 -217 -175 10 -406 -643 -482 -470 -625 118 609 -24 274 379 334 -597 -685 -1170 -343 500 700 -29 -107 380
3848 380 468 834 373 -425 -987 -578 518 119 160 696 505 557 697 224 -584 -551 -65 -193 -660 -132 146
3869 146 60 432 683 82 -396 -679 -985 -1078 -170 -189 -438 163 467 299 255 -171 -1048 -1494 -419 -323 -867
3890h67L66N81K63K78Q2m75l40m8j62p42O12N70N33L71m90n71pN96K05r49p17
3911i11K38J13R20N48m62l20J53O18o58n11k80OJ21O88l27J29M49q0j27n87K42
3932c8j97m1j34oj17O21R79k60o37N50k33j042L97j93K09L52L77M0j51R2R5l84
3954B79j15J31p63n8L29K71J38O71L7o62k53j68m96M05M15r34l87Q86Q46K85n60
3975B97k35n6l9N96q40q66K99R83K37j41P7j1M5K74q16l55K46M65k81r8N14r1
3997B04K04M72l07p92l86K42j93N4K85k2M8O82J88n25p04K56j3k39J02m19K04
4018f59Q23K33k93L71K0o62j54j15J14j86O9L01J03O62M19o87p80M10K13k68l79
4039d45M8J61Q01M39n71m55M86P6m01n83L56p60Q27P30j9n76P0O61j60j78m96
$$ plain form
3890 -867 -501 80 343 621 703 228 -112 -160 -322 -1064 -452 118 651 1022 532 -39 -46 550 755 -194 -911
3911 -911 -673 -560 360 908 446 126 279 897 239 -272 -552 -546 -425 263 -64 65 514 434 307 -280 -38
3932 -38 -235 -276 -410 -416 -533 88 1067 807 170 720 487 -555 -158 -351 -142 210 587 627 476 568 663 279
3954 279 164 295 -468 -526 -197 74 212 883 920 258 5 -163 -659 -254 161 -773 -1160 -274 572 857 297
3975 297 62 6 -33 563 -277 -1143 -844 139 376 235 312 301 346 620 -196 -551 -305 160 -121 -219 295 204
3997 204 408 880 573 -219 -605 -363 -556 -502 -217 -239 -191 491 679 154 -550 -294 -307 -546 -444 -863 -659
4018 -659 164 397 104 475 495 -167 -321 -436 -322 -508 -439 -138 -35 627 1046 359 -421 -11 202 -66 -445
4039 -445 -397 -236 565 1004 433 -22 464 540 139 -444 -88 -848 -21 709 690 114 184 845 685 507 11
4060A1r26J81R38M75n46l48J51J064J98n00j345l81Q92L48m89R2K87L52Q0Q0o33
4081a9k12K04j16k55m6k1K50M57M50N0k25o71N9k13l7L62m18J90N75K64k16K5
4103D37L87j067j17K62n61J40M86L44J19L10l67l43j6K19j37p68k38N70L37O15
4123F12m07p70P75M62M3j026o50J15J12Q89J17n15R1P66K23j079o0k32j82N73
4143a43J00l98k6P86O00l86k01l17l02J31j35k01l08Q45N71l23J78m58j14N9M26
4164C84q57o39N54O07K1J35K84j57l66M53l19p55j15L99M41J83L78j76l27L27
4184D55K2J15l72j92q50J18O98O69J63j21n3l35L16j05q11o14P40P16m97m23O42
4205B81L2N50l03l54q15Q2M48j71k70J59L93M50L70r46l56K65M40n38l12p6%L64
$$ plain form
4060 11 -915 -734 204 679 133 -215 -64 1000 1198 698 -647 -1028 -136 212 -277 -185 102 454 534 614 -19
4081 -19 -231 -27 -143 -398 -444 -465 -215 242 692 742 517 -154 -95 -308 -345 17 -401 -211 364 628 412 437
4103 437 824 -243 -360 -98 -659 -519 -33 311 430 740 373 30 14 233 96 -672 -910 -340 -3 612
4123 612 205 -565 210 672 715 -311 -961 -846 -734 155 272 -243 -152 614 837 -242 -302 -534 -716 -143
4143 -143 -43 -441 -467 319 919 533 332 15 -287 -156 -291 -492 -800 45 616 293 471 13 -101 -42 384
4164 384 -473 -1112 -558 49 70 205 489 332 -34 419 100 -655 -770 -371 70 253 631 455 128 455
4184 455 477 592 220 28 -822 -704 -6 663 826 705 652 317 633 528 -283 -897 -157 559 62 -361 281
4205 281 313 863 560 206 -609 -527 -79 -250 -520 -361 32 482 852 -94 -450 -185 255 -283 -595 -671 -671 -307
4227c07P78j20l9l44M37m63j76l76l21Q17M08M5r6j15m0N7J03J50p05j23M82K7
4249G9l91N87M49o27j67K1J54n04j32j28N2M05N30J23l07k93L56k21J01m50j21
4270d84J06J75J0n5M97J13j78Q8k65q19K41N97q3m27L73M34j18L63j73p17M6L03
4292B7j28m73K0L84M35L18K1p22J13M47k88o94P8o2o6O01O04m36P3M13l30o41
4314c06l80L89n0p8M78R9p9R23m90p71J76j74J36nL5l09N90L88m3m90M84k64k97
4337c8l07J23k7m5L58N95l98q3N82l11k96j44l10J80P4m9k31N05L36m4l12r5k10
4360a47n42N54L4l95J17R31k46k17J21j58k84o3Q5j78l10K24J12K87L36Q2n5j79
4382A09j7k24p11N43K93l90J93K89j4K40K82n53k20j61J55l70L00N37j17M4L68
$$ plain form
4227 -307 471 351 312 -32 405 -58 -234 -610 -931 -114 294 339 243 128 88 145 248 398 -307 -430 52 79
4249 79 -312 275 724 97 -70 -49 105 -399 -531 -659 -607 -202 328 451 144 -149 207 -14 87 -363 -484
4270 -484 -378 -203 -193 -248 249 362 184 272 7 -812 -571 26 -57 -484 -111 323 205 568 395 -322 -276 27
4292 27 -101 -574 -554 -170 265 583 604 -118 -5 442 154 -540 -462 -524 -590 11 615 179 252 665 335 -306
4314 -306 -686 -297 -347 -425 53 152 73 996 506 -265 -89 -263 -127 -132 -97 -406 184 572 529 39 523 259 -38
4337 -38 -345 -222 -249 -294 64 659 261 178 760 449 153 9 -301 -121 -47 -96 -327 178 514 470 158 63 -147
4360 -147 -689 -135 -101 -496 -379 552 306 89 210 52 -232 -295 -210 -388 -698 -474 -362 -75 261 343 288 109
4382 109 92 -132 -843 -300 -7 -397 -204 85 71 311 593 40 -180 -341 -186 -556 -256 281 164 208 576
4403E76l84r8k44j0k60j33O5M34j20L61Pj86lJ38m16k58K65j10J89O2NPN03L00
4427F90m28k03l50N16o61K36Q4M6M30L72n18p2K95l08j79K23l57k30P51n0l3m67
4449b13Q81o2o24J37j73k50J15N4Q5j6K88k12J38J21j54m19lJ46J45oM5J9K29
4472B71L58q3k70k68Rl59M2J95J00j2K35L19l63J61k10k67j56J93J31k76L23k06
4494a33k00N48L32n04Q5k30m2o77K16M94K13K7K15k01j42j97J08j50m8L10k52
4515b28J71K74J87m59N04k92k81k18m3m6L47QP7m7L28p4j27j76J04P6m42K62Q7
4538hr0K99K45q0k22k23p3j48J25p5p2K1O31k51j24M22k65q7M71m67k80j21L76
4561DM6J14J28L11k48j24on08K16L8j44q4J96K11k61M50K10k09l6n75J17k54K62
$$ plain form
4403 576 192 94 -150 -160 -420 -553 -488 -54 -174 187 194 8 5 143 -273 -531 -266 -376 -187 -125 -120 -113 390 690
4427 690 262 59 -291 225 -436 -200 -116 -70 360 732 214 142 437 129 -50 173 -184 -414 337 287 254 -213
4449 -213 668 606 -18 119 -54 -304 -189 -135 -50 -66 222 10 148 269 115 -304 -307 -161 -16 -22 23 42 271
4472 271 629 546 276 8 17 -342 -300 -105 -5 -17 218 537 174 335 125 -142 -298 -105 26 -250 73 -133
4494 -133 -333 215 547 43 128 -102 -144 -821 -605 -111 102 129 344 143 1 -196 -88 -238 -286 24 -228
4515 -228 -57 217 404 -55 449 157 -124 -342 -385 -431 -84 -76 1 -46 282 208 81 -95 9 85 -357 -95 -8
4538 -8 -98 201 446 366 144 -79 -152 -300 -175 -250 -322 -301 330 79 -45 377 112 25 496 29 -251 -372 4
4561 4 50 164 292 603 355 231 225 -283 -67 -29 -173 -257 -61 150 -111 339 549 340 304 -271 -154 -408 -146
4584a46R2N3J53O64n06k49K75k05l46j42M23j09j12L28K22l7q8K28l01l00l9l83
4606e25J64L50M3J74J53j81l48m1O00m76l80M76j21l14O09J3n4Q4J33k61J69q13
4628e46J08J72k3J05r3L83K35m5l67R8l31J39j02K5M8k39M81M41j6k91p2l07J32
4651f5j17l0j32J17M63l67L73jm69J76n9l12K6L95N3q3J18K72k59K9K14k40j83
4674h1l17J57J09K3K92K4m32P39j28n05J47K7j27K9N2K79l11K65K14l70J94j48
4696A32l50n6M99l73PM43j45j6L25l3n36k84M64k33l58M07K17n3J17J22J25J07
4718E28j12m12r7l6P5l4J66L72l25J27l3Km14J12qk87Q0L66j41K02M30m08J65
4741C18L5n3p09K03N3N8k6L78NJ33j28r5j32m26K09KL2J3L79q7r0N93o89n2P1
$$ plain form
4584 -146 -54 -1 152 816 310 61 336 131 -215 -357 66 -43 -155 173 395 358 270 498 197 -103 -142 -525
4606 -525 -361 -11 32 206 359 178 -170 -211 389 -87 -467 9 -112 -426 183 196 142 226 359 98 267 -546
4628 -546 -438 -266 -289 -184 -277 106 341 296 -71 27 -304 -165 -267 -242 -194 -433 48 489 473 182 110 -197 -65
4651 -65 -182 -212 -344 -227 236 -131 242 241 -228 -52 -111 -423 -397 -2 51 -32 86 358 99 128 342 102 -81
4674 -81 -398 -241 -132 -109 183 207 -225 514 386 -119 28 55 -72 -43 9 288 -23 242 456 86 280 132
4696 132 -218 -274 225 -148 -141 302 157 141 466 433 -103 -387 77 -156 -514 -107 110 57 174 296 421 528
4718 528 416 4 -93 -129 -54 -88 78 450 125 252 219 221 -193 -81 -89 -376 -296 70 -71 131 561 153 318
4741 318 353 300 -409 -206 -153 -95 -121 257 262 395 267 172 40 -386 -177 -175 -143 -130 249 162 72 665 -24 -76 -5
4766ej34O1n58Q64l43j1K92Nk6K35j85l06k24J27l12N27L1J30l18R3M57m30j3
4789d3K11n09k3N2J72J46K10M43o33j06J31j26j10J3K28k35K79O8J54J14j85l30
4811g9R6j4r9q7J76Q9J16k62O73l44n40L10r3q7m0K71q6oL42q7j83J13N7m51J93
4836b2Q7k39k56O52j75KL3J84M6l18L61m44j52J49L5j89J91P15l43M6k97J87o45
4859c92K21L29k99R9J55j35K14J18o5l70K68k52j56J42L59j86j72K69K91j96l89
4880a47M82m37k60K46r1J5M5M54k83K03J84l49l25J34J94m89L22j35K20M43k47
4901A79j32N9p9K56j76l08j31J45o0N47k99J65p0J51j50k71r9p2QN32k11k21L77
4924A40J47l06L62j62m60k76O06j79r1K19R7o4p8Q0j13J69j57q3l07L87K37j56
$$ plain form
4766 -5 -139 -78 -636 228 -115 -126 166 171 145 380 195 -111 -335 -208 -520 7 38 168 -150 -57 400 -30 -43
4789 -43 168 -341 -364 -312 -140 6 216 659 26 -80 51 -75 -185 -172 56 -179 100 168 322 436 251 -79
4811 -79 17 3 -96 -183 -7 82 198 -64 609 265 -275 35 -58 -145 -185 86 0 -6 336 249 66 179 236 -215 -22
4836 -22 65 -174 -430 222 47 49 82 266 312 -6 355 -89 -241 -92 -57 -246 -55 660 317 363 66 253 -392
4859 -392 -171 158 -141 -42 113 -22 192 310 245 -125 143 -109 -265 -123 236 50 -122 147 438 242 -147
4880 -147 335 -102 -362 -116 -207 -192 -147 307 24 227 411 62 -263 -129 65 -424 -102 -237 -17 426 179
4901 179 47 106 27 283 107 -201 -332 -187 -247 300 1 166 96 247 97 -174 -273 -345 -337 195 -16 -237 140
4924 140 287 -19 343 181 -279 -555 51 -128 -219 0 97 33 -45 35 -78 91 -66 -149 -456 -69 168 12
$$ [...]
8191b05
##END NTUPLES=NMR FID
##END=
