##TITLE=1H_CA-8711-4
 DMSO, 8 sc, 
 4.6.2020
##JCAMPDX= 6.0         $$ Bruker NMR JCAMP-DX V2.0
##DATA TYPE= NMR FID
##DATA CLASS= NTUPLES
##ORIGIN= UXNMR, Bruker Analytische Messtechnik GmbH
##OWNER= root
$$ XWIN-NMR		Version 3.5
$$ Thu Jun  4 12:03:02 2020 Russian Standard Time (UT+4h)  she@DPX200
##.OBSERVE FREQUENCY= 200.1315
##.OBSERVE NUCLEUS= ^1H
##.DELAY= (6, 6)
##.ACQUISITION MODE= SIMULTANEOUS
##.ACQUISITION SCHEME= undefined
##.AVERAGES= 8
##.DIGITISER RES= 18
##SPECTROMETER/DATA SYSTEM= spect
##.PULSE SEQUENCE= zg30
##.SOLVENT NAME= DMSO
##.SHIFT REFERENCE= (INTERNAL, DMSO, 0, 15.7039)
##AUDIT TRAIL= $$ (NUMBER, WHEN, WHO, WHERE, WHAT)
$$ ##TITLE= Audit trail, XWIN-NMR		Version 3.5
$$ ##JCAMPDX= 5.01
$$ ##ORIGIN= Bruker BioSpin GmbH
$$ ##OWNER= she
$$ F:/spectra/data/she/nmr/H-F/1/audita.txt
$$ ##AUDIT TRAIL=  $$ (NUMBER, WHEN, WHO, WHERE, WHAT)
(   1,<2020-06-04 12:01:55.92 +0400>,<she>,<DPX200>,
      <created by zg, POWCHK disabled, PULCHK disabled
       configuration hash MD5:
       00 E9 B6 7A A2 85 ED C7 34 08 36 98 17 FE 4E 26
       data hash MD5: 16K
       EF 01 6C F1 34 5A 9E 72 E2 27 23 7F 1E B4 19 91>)
$$ ##END=
$$ 
$$ hash MD5
$$ 0F 5C D1 8C DB 07 DB 67 92 AC 43 76 59 1C 71 51
##$RELAX= 
##$RELAX= 
##$RELAX= 
##$RELAX= 
##$RELAX= 
##$RELAX= 
$$ Bruker specific parameters
$$ --------------------------
##$DU= <F:/spectra>
##$EXPNO= 1
##$NAME= <H-F>
##$PROCNO= 1
##$TYPE= <nmr>
##$USER= <she>
##$AMP= (0..31)
100 100 100 100 100 100 100 100 100 100 100 100 100 100 100 100 100 100 
100 100 100 100 100 100 100 100 100 100 100 100 100 100 
##$AQSEQ= 0
##$AQ_mod= 1
##$AUNM= <au_zg>
##$AUTOPOS= <>
##$BF1= 200.13
##$BF2= 200.13
##$BF3= 200.13
##$BF4= 200.13
##$BF5= 200.13
##$BF6= 200.13
##$BF7= 200.13
##$BF8= 200.13
##$BYTORDA= 1
##$CFDGTYP= 0
##$CFRGTYP= 5
##$CHEMSTR= <none>
##$CNST= (0..31)
1 1 145 1 1 1 1 1 1 1 1 1 1 1 1 1 1 1 1 1 1 1 1 1 1 1 1 1 1 1 1 1 
##$CPDPRG= <>
##$CPDPRG1= <>
##$CPDPRG2= <>
##$CPDPRG3= <>
##$CPDPRG4= <mlev>
##$CPDPRG5= <mlev>
##$CPDPRG6= <mlev>
##$CPDPRG7= <mlev>
##$CPDPRG8= <mlev>
##$CPDPRGB= <>
##$CPDPRGT= <>
##$D= (0..31)
0 1.2 0 0 0 0 0 0 0 0.06 0 0.03 0 0 0 0 0.0002 0 0 0 0 0 0 0 0 0 0 0 0 
0 0 0 
##$DATE= 1591257715
##$DBL= (0..7)
120 120 120 120 120 120 120 120 
##$DBP= (0..7)
150 150 150 150 150 150 150 150 
##$DBP07= 0
##$DBPNAM0= <>
##$DBPNAM1= <>
##$DBPNAM2= <>
##$DBPNAM3= <>
##$DBPNAM4= <>
##$DBPNAM5= <>
##$DBPNAM6= <>
##$DBPNAM7= <>
##$DBPOAL= (0..7)
0.5 0.5 0.5 0.5 0.5 0.5 0.5 0.5 
##$DBPOFFS= (0..7)
0 0 0 0 0 0 0 0 
##$DE= 6
##$DECBNUC= <off>
##$DECIM= 24
##$DECNUC= <off>
##$DECSTAT= 4
##$DIGMOD= 1
##$DIGTYP= 9
##$DL= (0..7)
0 120 120 120 120 120 120 120 
##$DP= (0..7)
150 150 150 150 150 150 150 150 
##$DP07= 0
##$DPNAME0= <>
##$DPNAME1= <>
##$DPNAME2= <>
##$DPNAME3= <>
##$DPNAME4= <>
##$DPNAME5= <>
##$DPNAME6= <>
##$DPNAME7= <>
##$DPOAL= (0..7)
0.5 0.5 0.5 0.5 0.5 0.5 0.5 0.5 
##$DPOFFS= (0..7)
0 0 0 0 0 0 0 0 
##$DQDMODE= 0
##$DR= 18
##$DS= 0
##$DSLIST= <SSSSSSSSSSSSSSS>
$$ [...]
##$SUBNAM2= <"">
##$SUBNAM3= <"">
##$SUBNAM4= <"">
##$SUBNAM5= <"">
##$SUBNAM6= <"">
##$SUBNAM7= <"">
##$SUBNAM8= <"">
##$SUBNAM9= <"">
##$SW= 24.9337058887773
##$SWIBOX= (0..15)
0 0 2 0 0 0 0 0 0 0 0 0 0 0 0 0 
##$SW_h= 4990.01996007984
##$TD= 16384
##$TD0= 1
##$TE= 0
##$TE2= 300
##$TE3= 300
##$TEG= 300
##$TL= (0..7)
0 120 120 120 120 120 120 120 
##$TP= (0..7)
150 150 150 150 150 150 150 150 
##$TP07= 0
##$TPNAME0= <>
##$TPNAME1= <>
##$TPNAME2= <>
##$TPNAME3= <>
##$TPNAME4= <>
##$TPNAME5= <>
##$TPNAME6= <>
##$TPNAME7= <>
##$TPOAL= (0..7)
0.5 0.5 0.5 0.5 0.5 0.5 0.5 0.5 
##$TPOFFS= (0..7)
0 0 0 0 0 0 0 0 
##$TUNHIN= 0
##$TUNHOUT= 0
##$TUNXOUT= 0
##$USERA1= <user>
##$USERA2= <user>
##$USERA3= <user>
##$USERA4= <user>
##$USERA5= <user>
##$V9= 5
##$VALIST= <valist>
##$VCLIST= <CCCCCCCCCCCCCCC>
##$VD= 0
##$VDLIST= <DDDDDDDDDDDDDDD>
##$VPLIST= <PPPPPPPPPPPPPPP>
##$VTLIST= <TTTTTTTTTTTTTTT>
##$WBST= 1024
##$WBSW= 4
##$XGAIN= (0..3)
0 0 0 0 
##$XL= 0
##$YL= 0
##$YMAX_a= 674859
##$YMIN_a= -470180
##$ZGOPTNS= <>
##$ZL1= 120
##$ZL2= 120
##$ZL3= 120
##$ZL4= 120
##$ABSF1= 10
##$ABSF2= 0
##$ABSG= 5
##$ABSL= 3
##$ALPHA= 0
##$AQORDER= 0
##$ASSFAC= 0
##$ASSFACI= 0
##$ASSFACX= 0
##$ASSWID= 0
##$AUNMP= <proc_1d>
##$AZFE= 0.1
##$AZFW= 0.1
##$BCFW= 1
##$BC_mod= 2
##$BYTORDP= 1
##$COROFFS= 0
##$CY= 11.3945322036743
##$DATMOD= 1
##$DC= 2
##$DFILT= <>
##$DTYPP= 0
##$F1P= 16.9975609425685
##$F2P= -3.02152046262296
##$FCOR= 0.5
##$FTSIZE= 0
##$FT_mod= 4
##$GAMMA= 1
##$GB= 0.15
##$INTBC= 1
##$INTSCL= 1
##$ISEN= 128
##$LB= 0.24
##$LEV0= 0
##$LPBIN= 0
##$MAXI= 10000
##$MC2= 0
##$MEAN= 0
##$ME_mod= 0
##$MI= 1.114404
##$NCOEF= 0
##$NC_proc= 0
##$NLEV= 6
##$NOISF1= 3.799351
##$NOISF2= 2.8
##$NSP= 1
##$NTH_PI= 0
##$NZP= 0
##$OFFSET= 15.70392
##$PC= 1
##$PHC0= -9798.386
##$PHC1= 18.20082
##$PH_mod= 1
##$PKNL= yes
##$PPARMOD= 0
##$PSCAL= 0
##$PSIGN= 0
##$REVERSE= no
##$SF= 200.130013532006
##$SI= 16384
##$SIGF1= 3
##$SIGF2= 2
##$SINO= 400
##$SIOLD= 16384
##$SREGLST= <1H.CDCl3>
##$SSB= 0
##$STSI= 0
##$STSR= 0
##$SW_p= 3612.71676300578
##$SYMM= 0
##$S_DEV= 0
##$TDeff= 0
##$TDoff= 0
##$TI= <>
##$TILT= no
##$TM1= 0
##$TM2= 0
##$TOPLEV= 0
##$USERP1= <user>
##$USERP2= <user>
##$USERP3= <user>
##$USERP4= <user>
##$USERP5= <user>
##$WDW= 1
##$XDIM= 8192
##$YMAX_p= 0
##$YMIN_p= 0
$$ End of Bruker specific parameters
$$ ---------------------------------
##NTUPLES= NMR FID
##VAR_NAME=  TIME,          FID/REAL,        FID/IMAG
##SYMBOL=    X,             R,               I
##VAR_TYPE=  INDEPENDENT,   DEPENDENT,       DEPENDENT
##VAR_FORM=  AFFN,          ASDF,            ASDF
##VAR_DIM=   8192,          8192,            8192
##UNITS=     SECONDS,       ARBITRARY UNITS, ARBITRARY UNITS
##FACTOR=    0.0002004,     1,               1
##FIRST=     0,             0,               0
##LAST=      1.6414764,     0,               0
##MIN=       0,             -470180,         0
##MAX=       1.6414764,     674859,          0
$$ Real data points
##PAGE= N=1
##DATA TABLE= (X++(R..R)), XYDATA
$$ [...]
2528A38j187O27p53R53J626m79j237o04J010n6N42L96j181p07j72J256P76Lr42
2547Ij522J024J417o49R35p14j695P65q08J727m04K12m95j088l18J383O94K37
2565G10j627j020J438Q3J943j050j249q02pK231J015j590l1m19K60N75P5m74m04
2584c43L50j37N2Q58O45p81o43o06J236p2J86n43Ln73M13J026n27N61j222p01
2604h18J83J172k84K94o55j497J161R75j377J393k86j457J11N90J413p70J399
2621A547k471l98J20J977J32o24n17j346L79Q92J46J95r69J187p21l65O65N90
2639D19q04j10l51n76J974P06m71k240R19Q79J334j554P59j359m99J312R83q45
2657D76m78K89o17k95R04M41n6J37j190l34J133R08l80r21N0j147J389N44j137
$$ plain form
2528 138 -1049 -422 -1175 -222 1404 925 -312 -916 94 38 580 976 -205 -912 -1084 172 948 951 9
2547 9 -1513 -489 928 279 1214 500 -1195 -430 -1238 489 85 297 -198 -1286 -1604 -221 473 710
2565 710 -917 -1937 -499 -416 1527 477 -772 -1574 -1581 650 1665 75 44 -375 -115 460 535 61 -343
2584 -343 7 -130 -78 780 1425 644 1 -605 631 559 745 202 205 -368 45 1071 544 1105 -117 -818
2604 -818 -635 537 253 547 -108 -1605 -444 531 -846 547 261 -1196 -1085 -495 918 148 1547
2621 1547 -924 -1322 -1202 775 907 283 -234 -1580 -1201 -309 -163 32 -937 250 -471 -836 -171 419
2639 419 -385 -495 -846 -1422 552 1258 787 -1453 -534 345 1679 125 884 -475 -974 338 1321 476
2657 476 -2 287 -330 -625 279 720 664 801 -389 -723 410 1318 938 17 67 -1080 309 853 -284
2676b84N72j988J388M91M26m35o47L56k3m84j7J774m62p19m95O06O34k7o18n55
2696e07p50J117K08O72m73Q5n44o83J168N47k39k42j499o5J686o57Q47k23k78
2715A70o58K3O2Q06J017k032P89q28J181L15j017p09L89J716p01P71j140m67p30
2734a043L87N00Q46m19m36m60J4P01l26O47j045N23l74L08J252n61Q89j600j288
2753a485R56O06O50p36j23l93l82J593r22O62j101P49M56n73L72R36j535j151
2771a421N26K67K03P30m74J06J02M4N12K96m30q81J76k40M07J254j126j18q4k98
2791d49R55k4l33N28j388k11J591J03J34j030m77r6R71L17n28N81j694j1K95J702
2811I36k33r53L58j195M63J736j70m36o59m93j37M76R7J92O4m15J42m1J079p9
$$ plain form
2676 -284 288 -1700 -312 179 605 170 -477 -121 -144 -628 -645 1129 667 -52 -547 59 693 666 48 -507
2696 -507 -1257 -140 68 740 267 352 -192 -875 293 840 601 359 -1140 -1205 481 -176 671 448 170
2715 170 -488 -465 -403 403 1420 -612 177 -651 530 845 -172 -881 -492 1224 523 1294 154 -313 -1043
2734 -1043 -656 -156 690 271 -165 -625 -611 90 -236 411 -634 -111 -485 -177 1075 514 1403 -197 -1485
2753 -1485 -529 77 727 -9 -132 -525 -907 686 -236 426 -675 74 530 -43 329 1265 -270 -1421
2771 -1421 -895 -628 -425 305 -169 -63 39 83 595 891 461 -420 -244 -484 -77 1177 51 -67 -151 -449
2791 -449 506 482 149 677 -711 -922 669 772 906 -124 -601 -697 274 591 63 644 -1050 -1061 -766 936
2811 936 703 -250 108 -1087 -624 1112 942 506 -153 -646 -783 -307 -210 -18 46 -369 -227 -268 811 732
2831G32n49m25o10P57J68P9N1j145P92J19J0J17l24rk4L43l15K21Q88j062M3k16
2853c59O79J1m89k10L5n9J049m60oJ01j010R11Q48k35J1o68k63L99j88K72p34
2874c65P38j475O00N21L38P92m47q48n24Q82M4Q86q42l32L40l41N15J28J20j96
2894E34j064K49J252n72j103J291n89R19o19K17r04pQ88n84M68N5j073J215j042
2913d69k36J853o72k76L8q72o9o57J653l52oj028l17Q11M96J63n37N04L61j429
2933a041J01J060P60q26m83m16J563J42O30k371m31O83J201J82m86n91m51l51
2951a125J029k0M49L51j024P66k12j258J495m15l11n90P48j07J488n69q74J62
2969a7l59J295n57J087p94n1J29j399J54J814q30o06k19M30N76K36O09r82o60
$$ plain form
2831 732 183 -242 -852 -95 73 152 203 -942 -150 -31 -21 96 -228 -237 -261 82 -233 -12 876 -186 -143 -359
2853 -359 320 331 -158 -368 -333 -392 657 197 191 292 -718 193 1041 806 817 149 -114 285 97 369 -365
2874 -365 373 -1102 -502 19 357 1149 702 -146 -670 212 256 1142 300 -32 308 -33 482 610 730 534
2894 534 -530 -281 971 399 -704 587 -2 917 298 515 -389 -396 492 -92 376 431 -642 573 -469
2913 -469 -705 1148 476 200 238 -634 -703 -1360 293 -59 -65 -1093 -1410 -599 -103 60 -477 27 388 -1041
2933 -1041 -940 120 880 54 -429 -845 718 860 1490 -881 -1312 -629 572 754 268 -323 -774 -1125
2951 -1125 -96 -116 333 684 -340 426 214 -1044 451 36 -275 -865 -117 -224 1264 695 -179 -17
2969 -17 -376 919 362 1449 655 604 733 -666 -512 1302 472 -134 -353 77 653 889 1498 516 -144
2988a44Q29K45o98r75L50j5N08J395r77R98j181n57o05L78L64n61N63L81j275
3007i77L61J032q00J92q17L26J41J391m67J5r00n22R50Q6j8k46l69J51j01L82
3027a90Q86n82j9j370R59M09L52n2j87l88o57J223j94N07q20j6k29Q06Q5Q9j583
3048i71J312o99J65P09L83n38q53L12P48j060P27kJ12k35k36K91r70J306q28j47
3068d74M08L2L19n4L70m41M72K43o39K09l64l09p40J537K34o64R62j251Q91j237
3088d96O98J258j096j03o93n94J184L11q24j02Q65j27K57M34r61r41N45k63K9
3107f19R17K04o72O78m77j02p5O80M97j568K00j31J461j300M16k50j123K337n35
3126E38L23n75J6J001q68q70j22J155n42p88K38M66q03j2J702q03o39P92j295
$$ plain form
2988 -144 685 930 232 -743 -393 -408 100 1495 518 1516 335 -222 -827 -449 -85 -646 -83 298 -977
3007 -977 -616 416 -384 -192 -1009 -683 -542 849 382 397 -503 -1025 -75 11 -7 -253 -622 -471 -572 -190
3027 -190 696 114 95 -1275 -316 93 445 393 206 -182 -839 384 190 697 -123 -139 -368 438 523 612 -971
3048 -971 341 -358 -193 516 899 361 -492 -180 568 -492 235 233 345 110 -126 165 -805 501 -327 -474
3068 -474 -66 -34 285 231 601 160 632 875 236 445 81 -228 -968 569 803 139 1101 -150 741 -496
3088 -496 202 1460 364 261 -432 -1026 158 469 -355 -457 408 281 538 972 11 -930 -385 -648 -619
3107 -619 298 502 -170 508 31 -71 -146 534 1031 -537 -337 -468 993 -307 109 -141 -1264 1073 538
3126 538 861 286 302 1303 435 -435 -557 598 56 -732 -494 -28 -831 -843 859 56 -583 209 -1086
3145a086P1J181l7n52J213K21K46j691j10M65l11k67M65Q09r94l3l09M00R51J87
3165H19j072J84p36O56k05R29k90l46j72j218J430lL37o77J50j53k54J327q66
3184a60n28K51J69n69J34J459j96q84k37J8Q00k59n00M29p77O13O79M21M61k323
3204i99J098QM83K98n19j045J480q27M80o53k82l3o99N91R15j43j20J232j465
3223b00J75q21J800q83l46O90j65q9K40Q06j923J65r0O17Q02r91q66J228j153
3242a004J510o02O2J88j310J792j857J660j044J476l77j116M91k86O12J028j182
3259D1m38J80R94n74k44J106r67m86K88l43j24K13J197j129l72J098Mm60R7k33
3279a52K73l49l6P48j259J091j332N97O96j26k37k41M6L44q14J668p66k27p22
$$ plain form
3145 -1086 -1015 166 129 -423 790 1011 1257 -434 -544 -79 -390 -657 -192 617 -377 -410 -719 -319 632 819
3165 819 -253 -69 -805 -149 -354 575 285 -61 -233 -1451 -21 -24 313 -364 -214 -367 -621 706 -160
3184 -160 -688 -437 -268 -837 -703 756 560 -324 -561 -543 257 -2 -502 -73 -850 -237 442 863 1324 -999
3204 -999 99 107 590 888 369 -676 804 -23 457 -196 -478 -511 -1210 -619 296 153 33 1265 -200
3223 -200 -25 -846 954 71 -275 415 250 161 401 1207 -716 -551 -641 -24 778 -213 -1079 149 -1004
3242 -1004 506 -96 -34 154 -1156 636 -1221 439 -605 871 494 -622 -131 -417 195 1223 41
3259 41 -397 -217 777 203 -41 1065 98 -388 -100 -443 -567 -354 843 -286 -658 440 444 -16 81 -152
3279 -152 121 -228 -264 484 -775 316 -1016 -419 277 151 -86 -327 -281 63 -751 917 151 -76 -798
3298g98R32L7N15q73m11M22K66m69K4Q49q08N04l7K27q2j55l87l22J204K85q52
3319G1N09j249N67K57N33n67O2J21M71j73n95p2O9O77j364o57J056L83j28k38
3339b67n95K53N18J13K89O7o98J75M36N04l52q51J244p66q64K13P25J37O8l89
3359d0K47O34m04m83m01P90j285J426j96J96j488J259m66o36Q23J18L36j269N17
3378c22r93J177N49P41k627J524k30K39O50j21p45n30O61r4O66k58j262O30M60
3397A15K09J81n23M89N44j248K14J007K08q82L09K70j290n56J438n1l36m98J406
3416A006l29m51l31j8j18m35K88J73L52n43J37O9l66J655j840J759j431M21M87
3435D85l39k53N21n9p16M94j80K255k344K43k7n81K91L46K22O8j025M11N75J6
$$ plain form
3298 -798 134 171 686 -187 -598 -176 90 -379 -355 494 -314 190 153 380 298 143 -244 -566 638 923 71
3319 71 580 -669 -102 155 688 121 183 304 775 602 7 -65 4 681 -683 -1340 -284 99 -29 -267
3339 -267 -862 -609 -91 22 311 378 -320 -145 291 795 443 -408 836 70 -794 -581 144 281 349 -40
3359 -40 207 841 437 -46 -447 343 -942 484 288 484 -1004 255 -211 -847 -24 94 430 -839 -322
3378 -322 -1315 -138 411 1152 -1475 49 -181 58 708 587 -158 -688 -27 -121 545 287 -975 -345 115
3397 115 324 505 -18 471 1015 -233 -19 988 1196 314 623 893 -397 -953 485 434 98 -400 1006
3416 1006 677 226 -105 -123 -241 -676 -388 -215 137 -406 -269 -200 -566 1089 -751 1008 -423 -2 485
3435 485 146 -107 414 355 -361 133 -47 2208 -136 107 80 -501 -210 136 358 426 -599 -188 387 403
3455D03n44J98j105N82J019J56n45k31L69r58l57K462j040j49j506K318j301p06
3473i35J840k02o82j30R66k677J792P05P7j503P77l89J83j32o32K82l64Q23m04
3492f05J170k71r72J883j584n48J065l42R87p12j63N36j71l53Q3L65l74K30j006
3511g82J805j688R5P44Q25n15J80j011J230m66j307L62J119Q25j810J066r57P24
3529D39m22p05l98J403l78J04j318K131o22L43j409Q51J026p66o02k8N69j82J054
3548A090j939J331j120L72O79L55j96j016n8K095q50K55J15k46m49l77o97P29
3566G3J479o60n51k80p19j47Q15k02l05K37j78M39J60R02j096k26p29M72O3O22
3586A69k14j69K70Q05r95P15n24K14j65m31L1J290p31o23k0OQ14M33J12q14m25
$$ plain form
3455 403 -141 57 -1048 -466 553 709 164 -67 302 -656 -1013 1449 409 260 -1246 1072 -229 -935
3473 -935 905 703 21 -109 857 -1820 -28 677 754 -749 28 -361 -178 -310 -942 -660 -1024 -201 -605
3492 -605 565 294 -678 1205 -379 -927 138 -204 783 71 -92 444 273 -80 3 368 -6 224 -782
3511 -782 1023 -665 -570 174 999 484 664 -347 883 417 -890 -528 591 1416 -394 672 -285 439
3529 439 17 -688 -1086 317 -61 43 -1275 856 234 577 -832 19 1045 279 -323 -351 218 36 1090
3548 1090 -849 482 -638 -266 413 768 572 -444 -502 1593 743 998 1113 867 418 41 -656 73
3566 73 1552 892 341 61 -658 -805 10 -192 -497 -260 -438 1 161 1063 -33 -259 -988 -516 -453 169
3586 169 -45 -214 56 861 -134 581 57 271 106 -325 -294 996 265 -358 -378 -372 442 875 987 173 -252
3607b52R4L65K52K28j206M78n2r4P41N0J2j387R60p86J531n88q35M31k08p17K50
3628g33N71K16K73m65M32l46L34l94J82p85J054m54O4l0j94K44N81k31j20k72
3648g3k18J99k4n10N85J18n19l9J4k77N77k08K7m87L95M51l2k9n58L35N49k40
3670C6r35R42l22N91j34l3m28O22o88J168l62j05q46N3L66m61R85j38o41M00K04
3691B74k93k25m42J320o17r0nM7J92j38J95N23n14O7o58M97k02M53n88L55l51
3712b00J05M0j32R87m30o87O8M17N11m68n19J41m34Q21j10o6K33j69r6M7o7K2
3734A4k08n65J021n55R7O30p98M56J48l0n54P38m56K78k10M03o37Q1M95l30m94
3755d76J81n5K34N06k49J28n58K25L17P0q6k9m82L14k45N00j34J21q5n68J41P65
$$ plain form
3607 -252 -158 207 459 687 -519 -41 -93 -187 554 604 616 -771 189 -597 934 346 -489 -58 -266 -983 -733
3628 -733 -162 54 327 -138 294 -52 282 -112 70 -715 339 -115 -51 -81 -275 -31 550 319 199 -73
3648 -73 -291 -92 -116 -626 -41 77 -442 -481 -467 -744 -167 -375 -348 -835 -440 11 -21 -50 -608 -273 276 36
3670 36 -899 43 -279 312 178 145 -283 339 -349 819 457 352 -494 -441 -75 -536 449 311 -330 70 274
3691 274 -19 -244 -686 634 17 -73 -78 -31 161 23 218 741 227 294 -364 133 -69 384 -204 151 -200
3712 -200 -95 -55 -187 800 370 -317 -249 168 679 211 -308 -167 -601 220 110 44 277 108 12 59 -8 14
3734 14 -194 -759 262 -293 -196 434 -364 92 240 210 -344 394 -62 216 6 409 -228 -147 348 18 -476
3755 -476 -295 -350 -116 390 141 269 -289 -64 253 323 237 208 -274 40 -205 295 161 282 197 -371 -230 535
3777E35k18K98j02m80J60j76k43L61Q10j803Q57M53l86L77p24J5p1R59q91N6k42
3798d55J207m74k85k6k18O71n02O20L23k92n79K11n25K79j38o29J314n74J02J67
3818A97l50K90R7l62M54k54R9K17k68l71m38O04N10l0l67K35q07L42L9L50K36
3839D23j47n57J36L40K68p19P12q24L30n2L92m55O35m13o0n8k06L74m34J97M6
3860g2j23P9K80j37r0J95l74M97k26P7J74k57P1jl79N71m0k30J20j58j14O17p37
3883b57K5j29L89M18m73L4j72l55O11j51O32k56j77J9P9p26P18J07l86K41j53
3904C8l50P39m94o1q5k0j88K94k64K98k25O65n13M19J62n55K75j81k07O12l36
3925B3L88r92N55n93J087k18k60j5k8q9K71J73q1N0j20k63K02l06J9K98L21p49
$$ plain form
3777 535 317 615 513 33 193 17 -226 135 945 -858 -1 452 66 443 -281 -266 -337 622 -269 -213 -455
3798 -455 752 278 -7 -33 -251 420 -82 538 861 569 -10 201 -324 -45 -183 -812 502 -72 30 197
3818 197 -153 137 234 -128 326 72 171 388 120 -251 -689 -85 425 395 28 263 -544 -202 -163 187 423
3839 423 276 -281 -145 195 463 -256 456 -368 -38 -90 302 -153 482 69 9 -49 -255 119 -315 -118 -72
3860 -72 -195 -116 164 27 -63 132 -242 255 29 106 280 23 94 93 -286 285 245 15 135 -23 -137 480 -257
3883 -257 -232 -361 28 446 -27 7 -165 -520 91 -60 572 316 139 158 237 -489 229 336 -50 191 38
3904 38 -312 427 -67 -128 -213 -233 -421 -127 -391 -93 -318 347 -166 253 415 -140 135 -46 -253 359 23
3925 23 411 -581 -26 -619 468 250 -10 -25 -53 -142 129 302 221 271 151 -112 90 -216 -197 101 422 -327
3947c27M23L61k00l7J83l06o23N28M7J44k93j55p3R10n93L25l23q2j13N0J12O4
3969B2N82k55%l2K51q18L88j55K86j49m66P71n86j47J35n24J258R8o90O1k25q7
3991b82O0J44l69M33q5Jl9Q7j38L70n3j019M70L22P21n79l49N33m90L50m51J47
4013b16L9L77j55l08J1L62m74M39k08N04m53N9J11K91j031R09o76p4J68N12k01
4034a4Q25n58k51J90o77K39K67O1j18J41M04q30J58K77m00K71m32O93k8N05m91
4055B32k36n09P8k06J81j76P10k01n53M74M43q4M6o16P22k87j98l80M38L59m63
4076b26N1P02p21O04l05R3q1J40k09L8K17m88q7N13Q4l85J76j92j31M49L20l0
4098E32m78n71Q97p45P56k04p42M72q9k39n6R56Q7p06K22q03P19P10j85k47o04
$$ plain form
3947 -327 96 457 257 220 403 97 -526 2 49 193 -100 -255 -328 582 -11 314 -9 -91 -204 -154 -42 22
3969 22 604 349 349 317 568 -250 138 -17 269 120 -346 425 -161 -308 -173 -697 561 659 -31 30 -195 -282
3991 -282 -222 -78 -447 -14 -99 -98 -137 -50 -188 182 129 -890 -420 -98 623 44 -305 228 -262 88 -363 -216
4013 -216 -177 200 45 -263 -252 110 -364 75 -133 371 -82 -23 88 379 -652 257 -419 -493 -325 187 -14
4034 -14 811 253 2 192 -485 -246 21 82 -36 105 509 -321 -163 114 -286 -15 -447 246 218 723 232
4055 232 -4 -513 -435 -641 -460 -636 74 -127 -680 -206 237 153 199 -417 305 18 -180 -560 -122 237 -226
4076 -226 -175 527 -194 410 105 198 117 257 48 86 303 -185 -272 241 325 -60 116 -76 -207 242 562 532
4098 532 54 -517 380 -365 391 187 -555 -83 -172 -411 -467 489 576 -130 92 -711 8 718 533 286 -318
4119c18J20m00J015n34P50r35K62p44K47K80J52k49J22R07q05L79k36N32l16K94
4139E23p97n4m1j76N73j08L88n0l07m29O1M92J67j12k52N50l63n40L32p3O05k46
4161A43m91n40L95M45K54m83K87K11L86q23m03Q82M43j67o34J14n37K43K05k00
4181b70M37O11q78M94n90J73J28j82L02l10m56P99j92l5n87N17k18L32m66j13
4201e04K41J75l1j77M20n88Q5L06l06J10P43n69l12R3N34m9O60j340N62m98R03
4222D58m05j041O45K12j22J9L72l94k36K79P64n05m1l16O34j02m46m38P7J65n30
4243i51J050j32N72k36m67Q82n96m77K74m09O27L53o03M79m40k42M46k31o68M94
4263b75K96p0K11k54j7k45L10L58l22J80K13p3o22L64l8O07r78Q66k76p2l72p6
$$ plain form
4119 -318 -198 -598 417 -117 633 -302 -40 -784 -537 -257 -105 -354 -232 675 -130 249 13 545 229 523
4139 523 -274 -328 -369 -545 28 -80 308 258 -49 -478 -417 75 242 130 -122 428 65 -475 -143 -216 389 143
4161 143 -348 -888 -493 -48 206 -277 10 221 607 -216 -619 263 706 539 -95 19 -518 -275 -70 -270
4181 -270 167 778 -100 394 -196 -23 105 -77 225 -85 -541 258 66 31 -556 -39 -257 75 -391 -504
4201 -504 -263 -88 -119 -296 124 -464 -379 -73 -379 -269 474 -95 -407 -314 220 171 831 -509 53 -445 458
4222 458 53 -988 -343 -131 -253 -234 138 -256 -492 -213 551 46 5 -311 323 221 -225 -663 -586 -421 -951
4243 -951 99 -33 539 303 -164 718 122 -355 -81 -490 137 490 -113 366 -74 -316 130 -101 -769 -275
4263 -275 21 -49 162 -92 -109 -354 -44 314 -8 172 385 312 -310 54 16 623 -355 511 235 163 -209 -285
4285b85j08O24n76K71R5L31r7p50L57M89j98l78J14p3j91K47r9L7k87J47J63Q7
4307h0K8o11J138k05m86k88K84p3n52O03M01m09N96j50K01j337J186n27L79l7
4327F1j22m7N41n19l13N85k01N59j91l45l42J052m59k73%J45o3k4j08N97l69J21
4349B85r23L64P09m9r7o86M2O86p6j015M15J057l22J43N48j205P2o08Q49j88M79
4370D80p99j48J610o66o34N1P04j021M21r5J78J025k002J164M60j689J910j230
4388b81J75Q74j071q28J459j109J211m17L67j200R00L03K48k73m82J25N82m74
4406A09k53J50j58J213r39o78J381r20n53J086j184Q56j212J210k5n35M06j77
4424b23K42o34K098k723J220J70l18O24n89N4Q8J87j038J159Kj25k55M69j334
$$ plain form
4285 -285 -393 231 -345 -74 21 352 255 -495 -138 351 153 -225 -111 -184 -375 -128 -227 -190 -477 -330 -167 -80
4307 -80 -52 -663 475 270 -216 -504 -220 -293 -845 -242 159 -250 346 196 397 -940 246 -281 98 61
4327 61 -61 -108 433 -86 -399 186 -15 544 353 8 -334 718 259 -14 -14 131 68 44 -64 533 164 285
4349 285 -638 -274 435 386 289 -397 -355 331 255 -760 -345 712 390 533 1081 -124 -52 -660 189 1 480
4370 480 -319 -467 1143 477 -157 -106 598 -423 -2 -97 81 1106 -896 268 728 -961 949 -281
4388 -281 -106 768 -303 -1131 328 -781 430 13 380 -820 80 383 631 358 -124 1 583 109
4406 109 -144 6 -152 1061 122 -556 825 -95 -648 438 -746 110 -1102 108 83 -452 -46 -223
4424 -223 19 -615 1483 -1240 -20 150 -168 456 -133 -79 9 196 -842 317 319 194 -61 408 -926
4443i26J045M54m85J50k40k32o62O92l04J632n21r44J029j043J094o32r2J94L77
4462E86l35R7n92l7K17j62k01O72p60j63N29L7K21r38R56N17q00j87l25R70m40
4483a38O95o13M31l54P60j588J818j123O9o62J812o76j513Q59l63J012q71P71
4501C26l79p2m97N29J173j360N2Q16n87K25J79R04o61K64j177j17N53N29k22j172
4521f94k08Q05R11o81l60N69M0n28o9J42O03j114P98q18J008j163J495n27J87
4540C96r88R9P39m48q10J412p03M95Q57j081L49K39j671M55P61R0P9p84J530p36
4560B80O0l32k83P5J302j037n96k39O08O89n09L67r30P13q06J258o88o31L30J75
4580a94O99p82P48P6q17O6M92p35R98l76J34j117P57J067j015L67k47o24j78Q20
$$ plain form
4443 -926 119 573 88 238 -2 -234 -896 -204 -508 1124 603 -341 688 -355 739 107 15 209 586
4462 586 251 348 -244 -281 -64 -226 -427 245 -515 -678 -149 -112 109 -829 127 644 -156 -343 -668 302 -138
4483 -138 557 -56 375 21 781 -807 1011 -112 -43 -705 1107 431 -1082 -223 -586 426 -445 326
4501 326 -53 -125 -622 -93 1080 -280 -228 588 1 226 405 1309 648 912 -265 -382 171 700 478 -694
4521 -694 -902 -97 814 133 -227 342 382 -146 -215 -73 530 -584 214 -604 404 -759 736 209 396
4540 396 -592 -493 246 -202 -1012 400 -303 192 1049 -32 317 556 -1115 -660 101 191 270 -514 1016 280
4560 280 340 8 -275 -200 1102 65 -531 -770 -162 527 18 385 -545 168 -638 620 -68 -699 -369 -194
4580 -194 505 -277 471 547 -270 -204 288 -447 551 175 309 -808 -51 1016 1 368 121 -503 -681 139
4600A39j61o26P26k84K1m9J112q35r34J92J368m08q72K45J00K02k24J32m12Q3
4620d85M86k46K41k88o18J262n22J207m38o54J13m10o3J394m35M71j116K56K50
4639D05p35R02k85km11L83j52N40m81M60q72L94L58p07R5L73o40M37q02J390q45
4660a95P04p10L2L61J83q4o05J37O36m03l8o18P10o52R7L97M38j029J137k85J83
4681C96J69p03N00r39L60R71o74K41k96n30J94k48L70k59K79N96l52J9K55l54
4701eJ63l64N57j05N3k91k95N23q82N31J11K11m26Q04j018L22Q03r76k64p7N57
4722f8K43KL76j452P92L32N2q53P61K3K85n64k04M57j071N10k73J220m93l00M80
4743B55k81K31K47O19j000Q8O53j46k74q3j76m58K41p02J628m97J3J81m14K59
$$ plain form
4600 139 -22 -648 78 -206 -185 -234 878 43 -891 -699 669 261 -611 -366 -266 -64 -288 -156 -568 -485
4620 -485 1 -245 -4 -292 -910 352 -170 1037 599 -55 58 -352 -415 979 544 1015 -101 155 405
4639 405 -330 572 287 285 -126 257 105 645 164 624 -248 146 504 -203 -108 265 -375 62 -740 650 -195
4660 -195 509 -201 -169 192 375 291 -314 -177 459 56 18 -600 110 -542 -445 -48 390 -639 498 213 396
4681 396 565 -138 362 -577 -217 754 80 321 25 -505 -311 -559 -189 -448 -169 427 75 94 349 -5
4701 -5 158 -206 351 246 299 8 -287 236 -646 -115 -4 207 -219 585 -433 -111 692 -284 -548 -625 -68
4722 -68 175 177 553 -899 -107 225 277 -576 185 208 493 -71 -275 182 -889 -379 -652 568 75 -225 255
4743 255 -26 205 452 1071 71 159 812 666 392 309 133 -325 -84 -786 842 345 358 539 125 384
4763C84r33P91k17J73k51J22M1k67P7m37J057o84J42P24j530J478j340N43N28
4782D01k2N93j077R6M20p7m85P18r98N93r7n8J47L47j373L74N76N38n86J066q58
4803B38k53k52K47j110R68O23q7N44j228L47j227J076J17m91J29l75N69R8j09
4822a76K47J18l26n14K57J76K98pp7N90m37r0n90P48k32n15N13J2M84J7j092O96
4844A00L3K47J26p95K23O32p16N99n82P36n75k82L93m50J04M68k73m54N43l59
4864b82K61j35J44j12j41J69n0L96l10l59K20L68n0L44o20j32M03m63Q1M30m3
4885A19K99j11J73j24l41Q15o46k31O3l03P29q72P73j545J224l45J34o68J051
4904A94L45J33o99k66Q51m04M2K0j064J001r75Q70J68j002J055k58J144n14J66
$$ plain form
4763 384 -549 242 25 198 -53 69 110 -157 -80 -517 540 -144 -2 722 -808 670 -670 -127 401
4782 401 379 972 -105 -9 411 334 -151 567 -431 162 65 7 154 501 -872 -498 78 616 30 1096 238
4803 238 -15 -267 -20 -1130 -162 461 374 918 -310 37 -1190 -114 3 -488 -359 -734 -165 -67 -176
4822 -176 71 189 -137 -651 -394 -218 80 73 -4 586 149 59 -531 217 -15 -530 -17 -5 479 496 -596 100
4844 100 133 380 506 -289 -66 566 -150 449 -133 603 28 -254 139 -311 -207 261 -12 -466 77 -282
4864 -282 -21 -156 -12 -124 -265 -96 -146 250 -60 -419 -199 169 119 463 -157 -289 114 -349 -268 162 119
4885 119 418 307 480 356 15 830 184 -47 16 -287 442 -430 343 -1202 22 -323 -189 -857 194
4904 194 539 672 -27 -293 558 154 196 216 -848 153 -822 48 216 -786 269 11 1155 641 807
4923H07j217M96k56O64j388J716j082N75J87K07j080J340k071J470j301J596k50
4940D13o71p8Q30N76l11r64n22J062j101J272j009Q8n19O43K76k07q69L66J352
4959F27J81J50j755J932r38M45o64J153j203l35K01l0O42q08J567j196O6l81L92
4978D6qj21J064j605q8K15r8K86j44J110l97k45L65j81K46k04m9k72j185J436
4998A71j84J046j279M56K10o01O87j053j04P78o23k07R75jN10r39k37J257p94
5017F8m39O18o08P16j699J377l32k19J302j285N30K38p82O20l20l19J02n91N22
5036e01J108j154J103n87n58L41j019J398%L37o02K60r44J508m06q79K11Q34j482
5055a032O64K24L7l54m2o56J433m42M96k91K06q30J184m54r53J583l86l10q41
$$ plain form
4923 807 -410 86 -170 494 -894 822 -260 315 502 709 -371 969 -1102 368 -933 663 413
4940 413 -258 -336 494 1070 759 -205 -727 335 -766 506 -503 -415 -934 -291 -15 -222 -1091 -725 627
4959 627 808 958 -797 1135 197 642 -22 1131 -72 -407 -206 -236 406 -402 1165 -31 35 -346 46
4978 46 38 -83 981 -624 -712 -497 -595 -309 -453 657 260 15 380 199 445 241 192 -80 -1265 171
4998 171 -13 1033 -246 210 420 -181 506 -547 -651 127 -496 -703 272 271 781 -158 -395 862 68
5017 68 -371 247 -361 355 -1344 33 -299 -518 784 -501 29 267 -515 105 -215 -534 -432 -1023 -501
5036 -501 607 -547 556 -31 -589 -248 -1267 131 131 468 -134 126 -818 690 284 -595 -384 450 -1032
5055 -1032 -368 -144 -107 -461 -503 -1159 274 -168 328 37 243 -587 597 143 -810 773 387 77 -764
5074g64q53R37jl06J086j41k95R43p44N17o1O25j254N76M30j172R02m55n24M32
5094a22r08N16J119M19m45n92o80J162j74r16L97P35q90j1p4L26J24l12k74P48
5114A48j22l54Q25j35k35K13r45Q57J6Mn91l32L17q46J445n80K69N59q64L35m63
5135d79L42K1q85J738j96j99n14k55n6j095J123j0J782j506r0Q12O00k004J293
5154D22O67q59k86k0L17l40K38J038r41n02Q40p66K56P16j006Qj64J211j111m54
5174g36Q70r2o48P98L6j60k55M12J12l42k41Q23k5n85l96M43j41P66l18q79O7
5195d91J93l36O83j66M94l31o65N11j384O63N21L98j61r2p2ko09J632r46m1J8
5216a83j274J264r9j65j11J085n38m14O22j3j19r73Q42K86j23J43l73m73Q40m41
$$ plain form
5074 -764 -1617 -680 -681 -987 99 -42 -337 606 -138 379 318 943 -311 265 695 -477 425 -30 -554 -122
5094 -122 -1030 -514 605 1024 579 -13 -693 469 295 -621 -224 511 -379 -390 -464 -138 -14 -326 -600 148
5114 148 26 -328 497 362 127 340 -605 252 268 272 -319 -651 -334 -1180 265 -315 -46 513 -351 -16 -479
5135 -479 -137 -116 -1001 737 541 342 -172 -427 -483 -1578 -455 -465 1317 -189 -279 533 1133 -871 422
5154 422 1089 230 -56 -76 241 -99 139 1177 236 -266 574 -192 64 780 -226 -218 -382 829 -282 -736
5174 -736 134 42 -606 192 228 68 -187 225 337 -5 -246 577 552 -33 -429 14 -127 639 321 -558 -491
5195 -491 -298 -634 49 -117 377 46 -619 -108 -1492 -829 -308 90 -71 -163 -235 -237 -846 786 -160 -201 -183
5216 -183 -1457 -193 -292 -457 -568 517 -21 -435 187 174 55 -918 -76 210 87 230 -143 -616 224 -217
5236b17Q70j044j11j99K04J628L85j729M45j433J301k30M2M63j57j24q78N49k29
5255d64N41L02p39p90R46J14j52L21J88q1o35K43M64L62j317N87J167j177P56
5274F36j193L73j62J389j239J52L17j113R96P56k89J10l76j48j92l48N80j87N61
5293F23k53n7p12l74L75k24q44K334M72j726l69M31r64J013R52R3k76j532J592
5312E54n53K4l12l27Q16r94P87N5M76p87J17R61L56r94m8k19j15L87p65J5J11
5333d55K68q0K05L93k63q23J261q97N43J44r72J052r31J154p03N10l65J57K30
5352D28j075J442k06l58k13K59p26J86Q4M61K83p98P78Q2j508J265p54K82l54
5371d42k20O61l0K4P3L89j163J197L16n90r01J047l93P54o02n75R04m17j87J9
$$ plain form
5236 -217 653 -391 -502 -701 -497 1131 1516 -213 232 -1201 100 -130 -88 375 218 94 -784 -235 -464
5255 -464 77 379 -360 -1150 -204 -90 -242 79 267 186 -449 -206 258 620 -697 -110 1057 -120 636
5274 636 -557 -184 -346 1043 -196 -44 273 -840 156 912 623 733 357 209 17 -331 249 62 623
5293 623 370 313 -399 -773 -398 -622 -1466 868 1340 -386 -755 -324 -1288 -275 677 770 494 -1038 554
5312 554 1 25 -287 -614 202 -792 -5 50 526 -261 -144 817 1173 179 131 -88 -203 184 -581 -566 -455
5333 -455 -187 -267 -62 331 68 -755 506 -391 152 296 -676 376 -555 599 -104 406 41 198 428
5352 428 -647 795 589 231 18 277 -449 -263 -179 282 565 -233 545 627 -881 384 -370 -88 -442
5371 -442 -662 -1 -31 -7 66 455 -708 489 805 215 -686 361 -32 722 120 -455 449 32 -155 -136
5391a36M08n42N86l62K77m98K93M11K69K81j561P07o38O24o20K54k44J66N10n79
5411c94J34M78p10K37l7M55m71qK46M35J59j209J191r33j48O82M35n38l39N03
5431A68k92n05J177k09l73J2j04K24J67l82k42O58n78M8N3J06k54Q53j263J036
5451C00o17J07J29PQ2J07J7m55M58j34J70m30M91k13n49K95oM37l71p7L88p70
5473f34O39N60o29k98R7M0M4L00l3Q6j60K6l59N54N9p0o28N76m04o9J83N22j26
5496B76o0l41J55K42k29j3k23j15L16R0o4M3k24J51l13O1L1L86j25j93K60q2p5
5519d6K0J41J03j02Ro2K65m99J38J64J70q2j07k08K66j98k63L17j3Jj74K04P0
5542A14m01P16n36N08n75K85K6r5j1M24n83j27K94j40K3K76l71J10J70r0K83l81
$$ plain form
5391 -136 272 -270 316 -46 231 -267 26 437 706 987 -574 133 -505 119 -501 -247 -491 -325 185 -394
5411 -394 -260 218 -492 -255 -292 163 -308 -316 -70 365 524 -685 506 -427 -575 107 542 4 -335 168
5431 168 -124 -629 548 339 -34 -22 -126 98 265 -117 -359 299 -279 -231 -178 -72 -326 527 -736 300
5451 300 -317 -210 -81 -74 8 115 132 -323 135 1 171 -259 232 19 -530 -235 -241 196 -175 -252 136 -634
5473 -634 5 565 -64 -362 -265 -225 -181 119 86 172 12 38 -321 233 292 222 -406 170 -234 -303 -120 402 276
5496 276 216 -125 30 272 43 30 -193 -308 8 98 34 77 -147 4 -309 -248 -217 169 44 -149 111 29 -46
5519 -46 -26 115 218 116 125 63 328 -171 -33 131 301 219 112 -96 170 -28 -291 26 13 14 -160 44 114
5542 114 -287 429 -107 401 -174 111 137 42 31 455 -128 -255 39 -101 -78 198 -173 -63 107 17 300 -81
5564h1L16k36M3k4lj93J27J52L6M23o06j81L48L1j17J38n69R6J48j2L46k42J50
5587I0L5l24K79J05k99M9M81p14L75j85j5k5m4k40L99k2r5J14nk54M19o4m23J96
5611a67o2O36n45l2M02l30K72J24k09l29L10k00K59P8j90l40J79k8L22k82n5M16
5633B29l01Q5J1j14N06o98L38J26l81L93j71k45RM38m23R0L6J0j76M93n41J04
5655a82L35J25j94J7J06m56K19k95K17k27J23N8K82m87J70j87N14l16J79q9k81
5676c69J83L46o9N1J5j14n15J16L66j15L91L3n78L35Nk40J8O93o22N8J42K11m89
5699a48j46N32k3pl12N59r08L80K70n39L65O92o31Q7m82M61j33J92l00j64L49
5720I4N01p40K6J19N1r4k63K68j54M02k1j67j71N42l39J52M9m37n7k19Q89K74
$$ plain form
5564 -81 235 -1 42 18 15 -178 -51 101 137 560 -46 -227 121 152 35 173 -396 -300 -152 -164 182 -60 90
5587 90 125 -199 80 185 -114 -65 416 -298 77 -108 -123 -148 -192 -432 -33 -55 -150 -36 -41 -295 124 60 -363 -167
5611 -167 -229 407 -138 -170 232 -98 174 298 89 -240 70 -130 129 207 17 -323 -144 -172 150 -132 -187 229
5633 229 -72 13 24 -90 416 -282 56 182 -199 194 23 -222 -213 225 -198 -108 -72 -62 -238 255 -286 -182
5655 -182 153 278 84 101 207 -249 -30 -325 -108 -335 -212 -154 128 -359 -189 -376 138 -178 1 -88 -369
5676 -369 -186 160 91 142 157 43 -472 -356 10 -105 286 319 -259 76 81 -159 -141 552 -70 -12 130 341 -148
5699 -148 -294 238 215 208 -104 455 -453 -73 197 -342 23 715 84 171 -311 150 17 209 -91 -255 94
5720 94 595 -145 -119 0 51 -43 -306 -38 -192 210 189 22 -149 393 54 206 255 -182 -239 -458 431 705
5742G05q53J27m5J5k99L77l65M92j23K12K12o65K77KK99q38jJ076m95J55o16K83
5764f8K95o48O62j82J1j73L34j52o5L32l61L4K93L89p75J32m2o13Q75l49K25k79
5786a25O56m48q21Q01L95o5p08j63M39K09k99k23L86K58m00L62m46n0L39L11o25
5807b17M49l91j27J00j46J016j069J14K83j42J61L69n3k07o51M08n4k32P96n4
5827C53n19J91N30q80m6L00l79P96n15l4M50o59N16J61o03M89M0o09Q86n59k1
5848a12j48L33K42k76L12K22p98Q45r11j9R24r66J28j34J202j201L45m7m6j87
5868b92R02q64L01l07O50n79M45q9K04l32N15k12m38k1k97K8K93M36o97M37J58
5889B41m05J89n22M65mK26m09K5J07j67P00k82l45j43l68M72O53k84Q2r0K03j49
$$ plain form
5742 705 -148 -21 -66 -51 -350 27 -338 154 31 243 455 -210 67 69 368 -470 -471 605 110 265 -351 -68
5764 -68 227 -421 241 59 70 -103 231 79 14 346 -15 19 312 701 -74 58 16 -597 278 -71 154 -125
5786 -125 531 83 -738 63 458 393 -315 -478 -39 170 -129 -352 34 292 -108 254 -192 -242 97 408 -217
5807 -217 232 -159 -286 -186 -332 684 -385 -271 12 -130 31 400 347 140 -511 -103 -157 -389 407 353
5827 353 -166 25 555 -325 -371 -71 -450 346 -169 -203 247 -412 104 265 -338 151 191 -418 468 -91 -112
5848 -112 -260 73 315 39 351 573 -225 620 -291 -310 614 -352 -224 -358 844 -357 -12 -59 -105 -292
5868 -292 610 -254 47 -260 390 -189 256 167 371 39 554 342 -96 -117 -414 -386 -93 343 -354 83 241
5889 241 -164 25 -497 -32 -36 190 -219 -194 -87 -254 446 164 -181 -324 -692 -220 433 149 231 141 344 195
5911A95n23K40l23O2O56k52l99j87k08R96m44j89R31l78o22P18q16K12J51O2L23
5932B05m02K47n3n6k2L12l56M73l81j89O88nn94K51n6m85M61P4j31m71M16l61
5954d35p2l00R73o74n04J077o01O45J02q70K89o0L55J84k83M14n64N94n06J37
5974i9L36n71O39L53p64j04J90m3k35N32m7J91l84J106j299L44J12jJ15l82n36
5995e47L89j19Q01L2k42k92R0j03m21O85K48j114J083j75j064J021Kk07n61M52
6015d2j04k46M35M42l02l17m4J21n11M49M63L68j419R87j56L36n68M94j62N12
6035G36p24j26Qk14O38l28n04N76O5Q9j2q27P6M2Q07J361j813j68N84m79J100
6056H87q41K06m53p7j58j53Q14n55O66p89L15O46q17M82J12j007j68J350p77P4
$$ plain form
5911 195 -328 -88 -411 -349 307 55 -344 -531 -739 257 -187 -376 555 177 -445 273 -543 -331 -180 -118 205
5932 205 -197 50 -3 -59 -81 231 -125 348 -33 -222 466 461 -133 118 62 -423 38 112 -19 -490 -74 -435
5954 -435 -507 -807 166 -508 -1012 65 -536 109 211 -659 -370 -430 -75 109 -174 240 -324 270 -236 -99
5974 -99 237 -334 305 658 -106 -210 -20 -63 -298 234 187 378 -6 1100 -199 145 257 256 371 -11 -547
5995 -547 -158 -277 524 556 314 22 112 9 -412 273 521 -593 490 315 -749 272 274 67 -494 -42
6015 -42 -146 -392 43 485 183 -134 -178 -57 -568 -119 344 712 -707 280 124 460 -108 386 224 736
6035 736 12 -114 -106 -320 318 -10 -514 62 127 216 204 -623 -547 -505 302 1663 -150 -318 266 -213 887
6056 887 46 252 -201 -278 -436 -589 225 -330 336 -453 -138 508 -309 173 285 -722 -890 460 -317 -243
6076b43M10J62j319J471p28J7N08j0k45n10R08o83M10r1J12L63n14k80K51m97
6096e08P54k63J42R9o72J195j124l12J587q36m92R48q4l44M89o64n96R83j015
6115g13P00l80N77J94m31j37m61L15p3J166j035l23R29n9k04p42K44J037m23m20
6135b39J101m17j171K17j22Q97l79J71j66R3L7p26O90L72l68k84R82m95K01j370
6155i76N54J043p75P61o58r9j20P7l06P79r00N80J13p5L32p86n3J132n89J15m61
6176c12N26j50K18j107J688j57j204N74j0K32l6n73M11J70N8m41J197r84L08k64
6196A44l82N10j0M13j329J507q42N36n58M16L9n35j076N70J55J01P55r98Q21k4
6216B13n66M76O85j026J96N07q9o30n45J091j115Q11K28m25k46P55l39M45l42
$$ plain form
6076 -243 167 329 -990 481 -247 -230 278 268 23 -487 421 -262 148 57 169 532 18 -262 -11 -508
6096 -508 246 -17 125 224 -448 747 -377 -689 898 62 -430 518 434 90 579 -85 -681 302 -713
6115 -713 -13 -393 184 378 -53 -190 -651 -336 -409 757 -278 -601 328 269 65 -677 -433 604 181 -239
6135 -239 862 445 -726 -509 -631 266 -113 58 -108 -15 22 -704 -14 358 -10 -294 688 193 394 -976
6155 -976 -422 621 -154 607 -51 -150 -270 -193 -499 280 -620 -40 73 -2 330 -456 -509 623 34 149 -312
6176 -312 214 64 282 -825 863 706 -498 76 66 298 262 -311 100 270 328 -113 1084 100 408 144
6196 144 -238 272 262 675 -654 853 11 547 -11 405 444 -91 -1167 -597 -442 -341 414 -584 237 213
6216 213 -353 123 808 -218 -22 485 396 -234 -779 312 -803 8 236 -189 -435 320 -19 426 84
6235H4K63k4n26N03O4q09P38p53M46l46J045n04l54n29M83N58k71q92L76O79n
6256B26J23n4p15L20j50L32j24J79l87M81k23n06R28m40L6m57N10p39J37N26p20
6277g17K91j79Q29K66q84K52n41M86K49j46M90J52j670J347k16n15O8O74k31O8
6297G3j73K88l96P25m6r31N83k65L5P8J78k69O3L7K17j61J59m79J15L93m4p4m45
6320c39O58o2m26K71n9L45q26J456n57n25m0J20J14J01m62Q0K62l15J34L81m5
6341B66m16l33N46J98p21J77J01j92L96Nk97J025q63Q5k45L42k94J31l71N40l78
6362b98K33M22j206K24N68K32r33Q51o59n07J252K55k55m95Q24k83k25L45p27
6381c82O19L96k65n33l6P31j023N62OK17k09j40K33K48j1J59m04m59N74k41K84
$$ plain form
6235 84 347 323 -203 300 364 -445 293 -460 -14 -360 685 181 -173 -702 -219 339 68 -824 -448 231 226
6256 226 349 295 -420 -100 -250 82 -42 137 -250 231 8 -498 430 -10 26 -431 79 -660 -523 3 -717
6277 -717 -426 -605 224 490 -394 -142 -683 -197 52 -94 396 548 -1122 225 9 -506 -438 236 5 73
6297 73 -100 188 -208 517 471 -460 123 -142 -107 -29 149 -120 -57 -20 197 36 195 -284 -169 224 180 106 -339
6320 -339 319 257 -169 102 43 388 -438 1018 461 -64 -104 16 130 231 -231 -151 111 -204 -70 311 266
6341 266 -150 -483 63 261 -460 -283 -182 -374 22 27 -270 755 -108 -23 -268 74 -220 -89 -460 80 -298
6362 -298 -65 357 -849 -625 -57 175 -758 93 -566 -1073 179 434 179 -316 508 225 0 345 -382
6381 -382 237 633 368 -165 -201 530 -493 69 75 292 83 -57 176 424 413 572 168 -291 283 42 326
6402C26n97K81J44q95O68L35m58N5j54j40N75q0Q45j464P51j018J551m70n92J061
6422G24m1j104R09r92L24P72o42J66o45m3Q59q68K49N63K02r15R34r92k22Q58
6442I6l91J40o30J702r23j2O7L49m50J131j389N10Q4O5o4mp48M80N62o71l1N35
6464D08J17L47j611J361m94l68N7m32Q33r1m53M77m51j28L81q1m5K46k65n45K94
6485d43Q26J41j34p42l01j18L41O73l27L78P83j653O5K66l48K84P1M32k86K89
6505A97O81j248P32l29k41l2L27M88K93p33j81k4O86p6m79K40o17J036j78j003
6525d61K82Q0K52l46l04M56q4R26o60N35n67J64n91L66j87J004o53l23J0M7J76
6546A22l23q1K46J23K68r39R02K0r66P74Q32m62m86J55q55N18m93P54o91J169
$$ plain form
6402 326 -271 10 154 -741 -73 262 -196 -141 -295 -435 140 60 905 -559 192 -826 725 255 -337 724
6422 724 683 -421 488 -504 -180 592 -50 116 -529 -572 287 -581 -332 231 433 -482 452 -540 -762 96
6442 96 -295 -155 -785 917 -6 -18 49 398 -52 1079 -310 200 284 349 285 281 -467 13 575 -96 -127 408
6464 408 525 872 -739 622 128 -240 -183 -615 218 127 -326 151 -300 -428 -47 -128 -173 73 -192 -737 -443
6485 -443 383 524 390 -352 -653 -771 -430 243 -84 294 1077 -576 -511 -245 -593 -309 -238 194 -92 197
6505 197 878 -370 362 33 -208 -240 87 575 868 135 -46 -70 616 540 61 301 -316 720 542 -461
6525 -461 -179 -99 153 -193 -497 -41 -125 801 141 676 109 273 -318 48 -139 865 212 -111 -101 -54 122
6546 122 -201 -282 -36 87 355 -584 318 338 -628 146 978 516 30 185 -670 -152 -645 109 -582 587
6566E87m13l08P86n95N8Q43r68O65L9l54K42j20j552Q63qL09l2n5P91p48J40j014
6588h44J823o61L35k60j298M54O79K68n04J20n38L35k28R66j156o6M45K19j77
6607h8l34l0J485q46L58n41J15R5q2Q3N5l94j46M49J41n53N43m00q00R22m38L73
6629c3o46J165q42O24j87K35L04R6j376O59P3L50o66j30l19N55N91K3k98n32R04
6650E50N6q83L45O45q51J20L47J85M57r40k2o11l5J232K0j183L37P49l76l46L10
6671A06j67K4J9m4l51Q65o88J6o7J293j087L75q87L11R24o96l16O86p71J113p71
6692a13m76O02o4K5o39L16N26l20L83n77Q9M58M60k48m43O45k89J74q74N05k68
6713a28Q41j185M56l1l51J44l06N50R46j016M53q22J047m42n45L81K79j002J043
$$ plain form
6566 587 174 -134 652 57 115 958 -10 655 694 340 582 462 -1090 -227 -235 74 42 -13 778 30 170 -844
6588 -844 979 318 653 393 -905 -451 228 496 -8 112 -426 -91 -319 647 -509 -575 -130 89 -88
6607 -88 -422 -452 1033 187 545 4 119 214 132 215 270 -124 -270 179 320 -233 310 -90 -890 32 -406 -33
6629 -33 -679 486 -356 268 81 316 620 716 -660 -1 72 422 -244 -374 -693 -138 453 476 178 -354 550
6650 550 606 -277 68 713 -138 -18 329 514 971 31 9 -602 -637 595 615 -568 -231 518 142 -204 106
6671 106 -61 -37 -18 -62 -413 452 -236 -220 -287 1006 -81 294 -593 -282 642 -54 -370 316 -455 658 -113
6692 -113 -589 13 -51 -26 -665 -349 177 -143 240 -337 -248 210 670 422 -21 624 335 509 -365 140 -128
6713 -128 713 -472 -16 -47 -398 -254 -560 -10 936 -80 373 -449 598 156 -389 -8 271 -731 312
6732C12j25p91j15J025o63K93O10k14l99r4Q59j290M04J024j100N9l65O73N80
6751F83q68J021j152J249n90p73K37J240p90n23L49j59n1M2m44L55M76l87k00
6770b85j76J172o70O11m34N16p02n3J63k40N97n98j011J147K73k72M22q21J14
6789b47K5k22J021j19J16j176P85l85L80O79j81n01J48j63m32N78K4o05L65P60
6809H50q63l79N29k36O39l63j0j22L79j014Q90n05O6M26m22l58L16L22L97o83
6829a41k80n6N59j60R18p92o08R23o75L97j13j88J94m5K95m57L7L42l27J180j527
6850e24Q17j96k80P42j210P81o12R19m9q01P22j22n78P01j29O8l13K15p83J205
6870E73o03K9o1J6K05l47l50R03n04m93J27L01J29l34Q65M30j222N36j25j44L00
$$ plain form
6732 312 187 -604 -719 306 -357 -64 546 332 -67 -161 698 -592 -188 836 -264 -205 -570 103 683
6751 683 -185 836 -316 933 343 -430 -193 1047 257 -266 83 -76 -127 -85 -529 -174 302 -85 -285
6770 -285 -461 711 41 652 218 734 32 -21 142 -98 499 -99 -1110 37 310 38 460 -361 -247
6789 -247 -222 -444 577 458 574 -602 183 -202 178 857 676 175 323 160 -272 306 330 -275 90 850
6809 850 -13 -392 137 -99 540 177 167 45 424 -590 300 -205 -139 287 -135 -493 -177 145 542 -141
6829 -141 -421 -477 82 -78 840 48 -560 363 -312 85 -28 -216 -22 -67 228 -229 -192 150 -177 1003 -524
6850 -524 293 97 -183 559 -651 130 -482 437 388 -413 309 187 -391 310 181 249 -64 151 -632 573
6870 573 -30 -1 -62 -46 159 -188 -538 365 -139 -632 -505 -204 -75 -409 456 886 -336 200 75 -69 231
6891B31j3N8m1J57k08j78O55o04L37m11K49p37J059o23n1Q55q16J54J02m95K29
6912i1l4O1R6m4N27l04o34Q77j45l98l46O24K14o37K49m47N38Q22q70j63K85J12
6934B92k12m98Q3j2J118r25n41L15M80L53k82N47k70k21j000P57j85p7P36n74
6954a16M54j46m15O65n25K34n81j32O00K85k7q41L21L85P44n46l56j28r8L12n23
6975d34L57q0j32j55M56J31L19m92K88q77R91r77J019q6o88M02J41q43J33N12
6995a5J52j222J357q37M81Ml60K71k1N35p60K08q78J333m44Q68n17j92O04j581
7015a014R24JK07q36n0O40k36n39M20P01L3J04o71P6L97L60j196M29N37n47m30
7036f90R93K22k52K10r23O18l92J43M54n33P6j57J10NJ431p52j27m61j83R23J
$$ plain form
6891 231 218 276 235 392 184 6 661 57 394 -17 232 -505 554 -69 -120 735 -81 73 175 -320 -91
6912 -91 -125 -64 32 -12 515 211 -423 454 309 -89 -435 189 403 -234 15 -432 106 928 58 -105 180 292
6934 292 80 -418 -335 -347 771 -154 -695 -380 100 453 171 718 448 227 -773 -16 -201 -278 458 -116
6954 -116 338 192 -223 442 -83 151 -430 -562 38 323 296 -545 -224 161 905 359 3 -125 -223 89 -434
6975 -434 -77 -157 -289 -444 12 143 462 -30 258 -619 372 -605 414 328 -360 42 183 -660 -527 -15
6995 -15 137 -1085 272 -565 -84 -80 -440 -169 -190 345 -415 -207 -1085 248 -196 672 155 -37 567 -1014
7015 -1014 -90 -89 118 -718 -768 -128 -364 -903 -483 218 251 355 -316 -240 157 517 -679 -250 287 -260 -690
7036 -690 303 525 273 483 -440 178 -214 -71 383 -150 -74 -231 -121 -116 1315 563 436 -25 -208 715 716
7057G16q47O04j022N41J00n30J157j433J034p79J401n0q78j18M72p75K38n73J5
7076g27J229j934P04R18M59j016N19J79J55N44o59o17l04Q16K44l15K34o80o8
7095c19L01m33K28N70m42L82n03J19K52J51j006M62R95r41j1j09J97O45M11q09
7115A40l44N9Q24p15J022q87m41O63o24P95l11J4O3J87r29l81N84O72k33N05m60
7136B03l59M50j12J60L44j174M66O2l3n60N25L50p55m98P30l36rJ049j169J377
7156G11q35Q69j346L02M89k73l15J525j52p45j69M15n71j51J172p03j006J212
7174D29k95r88J772j049J38k49p77J601m94m10M12k92q45J168Q96r38J29p03K06
7193b89K70k04K91o28J231j201O27J77n97P7N07n78P49o73Q61n83k28L22o11J67
$$ plain form
7057 716 -131 473 -549 -8 92 -438 719 -714 320 -459 942 892 14 -104 368 -407 -169 -742 -727
7076 -727 502 -1432 -728 190 649 -367 152 331 486 1030 371 -246 -550 266 510 195 429 -251 -319
7095 -319 -18 -451 -223 347 -95 287 -216 -97 155 306 -700 -238 757 -184 -195 -304 -107 538 949 140
7115 140 -204 -145 679 -36 986 99 -342 321 -303 492 181 195 258 445 -484 -865 -281 391 158 663 203
7136 203 -156 294 182 342 686 -488 -22 40 7 -553 -28 322 -433 -931 -201 -537 -546 503 -666 711
7156 711 -124 745 -601 -299 190 -83 -398 1127 975 230 61 476 -95 -246 926 223 -783 429
7174 429 134 -854 918 -131 7 -242 -1019 582 88 -322 90 -202 -1047 121 1017 79 208 -495 -289
7193 -289 -19 -223 68 -560 671 -530 97 274 -323 -246 261 -317 432 -241 620 37 -191 131 -480 -313
7213c13k03l44R89O98j299J018o04J04m24L85N26j03r22m5N17M63m0r86O52k8
7233D1M02j469M96M09K40J16j018R37m69l83m86J397q37J191m46l94n06J404P1
7252F96p79r0m57Q82m89k83N69J0J340k180N06J139j992R40M99L65p48j67J91
7271d8R4L38m76J092k23j67j85j38j059P60K20n7O70o01k25L03m30o4J207o14
7291C97q10L63k0k49o40J75M57N85n34O47K55j350J393q89p4j353J087J99K74
7310h7K5J70m60M70m43N26J043j192N15r1q84J043n51O52q06k71M25n09M16l06
7330c15O77k24m17R9l35Q63J8j075O1J241l44k74k31M26l40J15o76Q76j94J88
7350A39r53J476j371J084o43N71q44J5K2O88O46o69k41j45N15j112L58q07J225
$$ plain form
7213 -313 -516 -860 129 827 -472 546 -58 46 -378 7 533 430 -492 -537 -20 443 403 -583 69 41
7233 41 443 -1026 -530 -121 119 235 -783 154 -315 -698 -1184 213 -624 567 121 -273 -779 625 696
7252 696 -83 -173 -630 252 -237 -520 49 59 1399 -781 -275 864 -1128 -188 311 676 -72 -239 -48
7271 -48 46 384 -92 1000 777 610 425 287 -772 -12 208 151 821 220 -5 298 -132 -196 1011 397
7291 397 -413 -50 -70 -319 -959 -784 -327 258 -276 371 626 -724 669 -220 -294 -1647 -560 -361 -87
7310 -87 -62 108 -352 118 -325 201 1244 52 567 476 -408 635 84 736 -70 -341 84 -425 -9 -315
7330 -315 362 138 -279 -180 -515 348 366 -709 -648 593 249 -25 -256 170 -170 -55 -731 145 -49 139
7350 139 -814 662 -709 375 -268 303 -541 -526 -504 184 830 161 -80 -225 290 -822 -464 -1271 -46
7369d6L29l39j98l46M09J55j134J182k82M53m41R43j55o97k70o77J344j61o96
7388f27O91q07L19R16n15PK45K23p82J275j678J01L62O27j415J479m82N94l5j32
7408C66p59l99K54J364l81q84O71q76O25Q61m64j537J086j02l39nQ74j403J203
7427A55M3l80Q90j023m28J816m41p46k17O89M9r89K187j789J196j839O13Q33m30
7446A89j047Q60J50k79J14K03m35R38L47m80j06n78O13m42j50n94J104n18o53
7465g64M95K93l23l53J097j30l06j71P62j569M96N62N34k9k56n98P74K67j418
7484f37P24O55q03n64L75l29K65n7O33n9N57j199R26o51k55O07k23L10j234K14
7504g45J252q70J2L92o05M35O76M67n21o64K038k150J81Q6L75k14J10N4j121R25
$$ plain form
7369 -46 283 -56 -254 -600 -191 -36 -1170 12 -270 183 -258 685 530 -167 -437 -1114 230 69 -627
7388 -627 64 -743 -424 492 -23 -16 229 452 -330 945 -733 -632 -270 357 -1058 421 -61 533 498 366
7408 366 -393 -792 -538 826 445 -439 232 -644 -19 842 378 -1159 -73 -175 -514 -519 355 -1048 155
7427 155 198 -182 708 -315 -743 1073 632 -114 -331 358 407 -582 1605 -184 1012 -827 -214 619 189
7446 189 -858 2 152 -127 -13 190 -245 693 1040 560 454 -124 489 47 -103 -697 407 -111 -764
7465 -764 -269 24 -299 -652 445 315 9 -162 600 -969 -473 89 623 594 338 -260 514 781 -637
7484 -637 87 742 -61 -625 -250 -579 -314 -371 262 203 760 -439 487 -164 -419 188 -35 275 -959 -745
7504 -745 507 -363 -351 41 -564 -129 547 1014 493 -171 1867 -283 -102 -16 359 145 255 309 -812 113
7524A13q38O09j97K69j272J105L3J023m3j066P55o11N71l4j375J245J27O6j277
7543g97J046j328J183J243p53l10l37L85j70L01q81N7R76n18k39K29K03k56r43
7562i09N90L17n93P3P31L03l22l97K71j89L93o6r81K76m8J158q50N33o17O5k59
7583e21N01N05m4p55K58K4L93l29p16R16r70K20j82M83n69J342l32j59L89r7r95
7604f38N84O69q68O67k82j08K84p21R48K59j481K97L08J135j910R97L34r88J62
7623c52L85N87p47o7L79N28j715J458N3K62j118K90P32p35O11r06P24k05N8o10
7643c88L08j7L09n35K98q99J200L95j178L57k49J18L47J9J97K53o06KL52r6M86
7664F73p78o6q6R9j06L05M4p9L78k22n31M29k47P07o68K38k38l58P21k7m84O48
$$ plain form
7524 113 -725 -116 -313 -44 -1316 -211 -178 845 802 -264 491 -120 451 417 -958 287 414 480 -797
7543 -797 249 -1079 104 1347 594 284 -53 332 162 463 -418 -361 615 97 -142 87 290 34 -909
7562 -909 -319 -2 -595 -522 209 512 190 -207 64 -125 268 202 -779 -503 -551 607 -243 290 -327 -262 -521
7583 -521 -20 485 441 -314 -56 -32 361 32 -684 232 -738 -518 -700 -217 -786 556 224 65 454 357 -638
7604 -638 -54 615 -253 414 132 24 308 -413 535 794 -687 -390 -82 1053 -857 140 474 -514 -352
7623 -352 33 620 -127 -194 185 713 -1002 456 509 771 -347 -57 675 -60 551 -355 369 164 222 -388
7643 -388 -80 -97 212 -323 -25 -924 276 671 -507 -150 -399 -281 66 85 282 535 -71 -69 283 187 673
7664 673 -105 -171 -257 -158 -264 41 85 6 384 162 -369 60 -187 520 -148 90 -148 -506 215 188 -296 352
7686C52n23l08R81o21j5n10o16J016K96M47j54j129R71M8K33j2j81J73j040R03
7706C11l28j13n1J94L54l00N85n50m64pP27k0j8l99Q78j6q53m66K22j09l32N9
7728f96L72N8L57L17P9r78K71L75j44P57q24j21n05J410j168R38l79P2j97N86
7748E80q24N34q3m01j11k80Q47k28L26o53Q07n71o4n03J333m33j53Q48q48k07
7768h4P92j548l95N06M70P01n45M2M03K95n29O15p07O82q00J159r38m2l02L85
7788A60K95p49L63R0n13M16M03l53j5J9K4K64n01Q02N41j090l18M75Lq19L81r6
7810b18M23J03j09j055J323k47J04J48mk64j66L06k92K47m02l08J81j23Q02q53
7830d04K58l96O08L9J02n30M08M85J38n82j52J65m80O15J53l21k42l74L33O4J14
$$ plain form
7686 352 -171 -479 502 -119 -134 -644 -1260 -244 52 499 345 -784 187 235 468 456 275 448 -592 311
7706 311 -17 -130 -181 13 367 67 652 102 -362 -369 358 338 320 -79 799 783 -70 -536 -314 -423 -755 -696
7728 -696 -324 -266 91 408 487 -491 -220 155 11 768 -56 -177 -682 728 -440 498 119 191 -6 580
7748 580 -244 290 207 -194 -305 -585 262 34 360 -293 514 -57 -121 -624 709 276 123 971 123 -84
7768 -84 708 -840 -1235 -729 -259 442 -103 -61 342 637 108 723 16 698 -102 1057 119 77 -225 160
7788 160 455 -294 69 159 -354 62 465 112 97 116 140 404 -97 705 1246 156 -162 313 316 -503 -122 -218
7810 -218 205 308 199 -856 467 220 324 472 468 204 38 344 52 299 -103 -411 -230 -353 449 -404
7830 -404 -146 -542 66 105 207 -323 85 570 708 126 -26 139 -341 274 427 106 -136 -510 -177 -113 1
7851AN22m96k74M03Q3r0k73J07O7k47J17J22j16j66N82k51k33L08n09K03K78o73
7873e35L96k14L18L62p33L22l03J50J52L32p21m7O65K54j283K32Q43j219J245
7892B16L37l33m39k16O21k44J20L1N26n60l11N76j086M84L83M82q04M63J29j068
7912f93P14j05Oj10J015o74l04M04j61N29p55L96k83J08O13r01J50l66N43K28
7932C54l48j334J145M91n24L36m23L02K06l78k31N40j00j22k37L01k26O37m68
7951g9k00pk79P66m38O58l54k8J34j89L14p11J38N90k15Jq0l61Q9J87O70l4p83
7974b11R36r19J5J56O20l57J42m58j83k74O91Q2j79N47K6J0p61l39M45J2l00P6
7996b23L65n1n04L16L21j036J339O6q06l08p2R41l5q6N8r02J131n26N97p32n29
$$ plain form
7851 1 523 27 -247 156 239 149 -124 -17 50 -197 -80 42 -74 -240 342 91 -142 166 -343 -140 138 -535
7873 -535 -139 -353 -35 327 -406 -84 -387 -237 -85 247 -474 -521 144 398 -885 -653 190 -1029 216
7892 216 553 220 -219 -435 186 -58 62 93 619 59 -252 324 -762 -278 105 587 -217 246 375 -693
7912 -693 21 -84 -78 -188 827 153 -151 253 92 621 -134 262 -21 87 700 -201 -51 -417 126 354
7932 354 6 -1328 -183 308 -216 120 -303 -1 205 -173 -404 136 36 -86 -323 -22 -248 389 -79
7951 -79 -279 -286 -565 201 -237 421 67 39 173 -16 298 -413 -275 315 100 101 21 -340 -251 -64 606 572 -211
7974 -211 725 -194 -179 -23 597 240 382 -76 -259 -533 158 240 61 608 634 644 -117 -456 -11 1 -299 -223
7996 -223 142 91 -413 -97 224 -812 527 593 -213 -521 -593 348 313 227 285 -617 514 -12 585 -147 -676
8017f76N6O34m54O39k37l2K56m75N58n12L15p2k68K86L46P0J02n25q9k38N80r94
8039g30R04j48l82L29r93N67N0J49Q90j115J73R92n88N98r18j16J46M74o58L43
8059c3M34k17K49p30N84j17PK31j89J29o80P97l92J25k7k53O62n72Q0j74k80P92
8081D26p14jK87J18k24O30o13L8j3L13n28j63L13L69l7k0l53J02J42j76K79j103
8103i28O53J5K53J82l43O71m79L4k82N20r3p54O53l35O98q08O09m25K31M40o23
8124a11N91m22O6L58p55L99R9n01n3J149p52P7K86o76Q4K38l44O94M40j489R34
8145C12l78l78L28K4L48j95N4L96K43j000K80O16q55j44M81o81N47j63L87O0m40
8166a58N75P4j0j15j27m77L58L63K54p06j57J80L44m43K0L87o13N71j93M15m34
$$ plain form
8017 -676 -620 14 -440 199 -38 -70 186 -289 269 -243 72 0 -268 18 364 434 536 11 -78 -316 264 -730
8039 -730 174 26 -356 -27 -1020 -453 -403 -254 636 -479 -306 686 98 696 -222 -338 -192 282 -376 -33
8059 -33 401 184 433 -297 287 170 177 408 219 348 -332 465 73 198 171 -82 580 8 88 -86 -366 426
8081 426 -288 -289 -2 116 -108 522 -91 -53 -66 247 -281 -444 -131 238 201 181 -172 -70 72 -104 175 -928
8103 -928 -275 -260 -7 175 -168 503 24 58 -224 296 203 -551 102 -233 465 -343 266 -159 72 512 -111
8124 -111 480 58 124 482 -273 126 225 -276 -329 820 68 145 431 -245 -161 77 -267 427 867 -622 312
8145 312 -66 -444 -116 -92 256 61 115 511 754 -246 34 650 -205 -349 132 -549 -2 -165 222 282 -158
8166 -158 417 491 481 366 239 -238 120 483 737 31 -126 54 398 -45 -25 362 -251 320 127 542 108
8187A08l46N73J7j37
$$ plain form
8187 108 -238 335 352 215
8191B15
$$ Imaginary data points
##PAGE= N=2
##DATA TABLE= (X++(I..I)), XYDATA
0@%%%qJ6j6J6k4M0m8O0p6R6j20J44j76K10k50K99l55M16m84N63o51P47q57R81
27E23j116J262j429J617j815K033k280K546k835L158l512L896m320M787n299N867
43C083o496P196p980Q861r861J1008j2334J3893j5754J8019k0853K4514k9458
56a6162L6540m7603O7474j14179M16142L32647q08233k62046L83610N31441r3198
67D26433l50650j30210J84156L4270j23278m1321J48541K4884j38223r3494P3785
78A4893J1434q9529l353J57220J4089k43657j61619K58429L37165j43399n06119
89c54446j15734M98899M29154k42440n43238j03798L95443K89373j29002k21058
99i6847J8995R6374o9551r4631J08529J67053m5556j83392m5020J06431L6371
$$ plain form
0 0 0 0 0 -8 8 -8 8 -16 24 -24 36 -40 56 -64 80 -96 114 -136 163 -192 224 -260 303 -348 399 -458 523
27 523 -593 669 -760 857 -958 1075 -1205 1341 -1494 1664 -1848 2048 -2272 2515 -2784 3083
43 3083 -3413 3783 -4197 4664 -5197 5811 -6523 7370 -8384 9635 -11218 13296 -16162
56 -16162 20378 -27225 40249 -73930 342212 674859 -133374 -395420 -11810 519631 426433
67 426433 75783 -54427 129729 163999 40721 -600 147941 172825 34602 -58892 14893
78 14893 26327 -63202 -66555 90665 104754 -138903 -300522 -42093 295072 151673 -354446
89 -354446 -470180 28719 457873 215433 -327805 -431603 -36160 253213 124211 -96847
99 -96847 -77852 18522 -51029 -145660 -37131 129922 84366 -99026 -144046 -37615 -1244
110a244p0545J0032J12005k1353k03436o2446K52426K10799j98239l51478L1577
121b91902M01020K10029k53179l28343L8518K75471J03248j10344m0282P8310
131H2546l2293j58689n642K21922J49122j37419k18384k880J57394M9661q5770
142A9568j8365P2434k9880j42517j0847J78919Q9557j75746j99866P3914K42909
153A00080O0128j89160j45383P1961J11454j3004j9169Q9650M1977j52043j63604
164b07113R7893K75717R5071k02577k05001N7995J85297M6245q3293k3984M5140
175H1390k0593p4766J7514J10869L0023j18182r9365O5798J20876j0284j04428
186a148l2664L7283j5064m2792O0474J20977k8714k11956j30718J55218K57958
$$ plain form
110 -1244 -71789 -61757 50248 28895 -174541 -236987 15439 226238 27999 -323479 -291902
121 -291902 109118 319147 65968 -262375 -223857 51614 154862 44518 4236 82546
131 82546 50253 -108436 -114078 107844 256966 119547 -98837 -101717 55677 105338 19568
142 19568 1203 73637 43757 -98760 -109607 69312 158869 -16877 -216743 -142829 100080
153 100080 160208 -28952 -174335 -102374 9080 -3924 -23093 66557 108534 -43509 -207113
164 -207113 -109220 166497 261568 58991 -146010 -88015 97282 143527 60234 36250 81390
175 81390 60797 -13969 3545 114414 144437 26255 -73110 -7312 113564 103280 -1148
186 -1148 -33812 3471 -11593 -54385 6089 127066 98352 -113604 -244322 -89104 168854
197A68854J8757k34707j64224Q6335J59708K6655o7761k7519J3568k0808l4283
208g5425L2804P4898K403q4293m1675N7938N2532k5588l1292J9303R36n9795k1060
221i8314J04021J14640o4520k03667p4363J80765K09187k6076j99667j09158P8996
232h8156J24884L4813l3145k6646j6505k8129k227O1407N7841k7348o7964o328
244a7503M7681J7761k0792J557K4799j9094o6134o720J05026Q5996q3756j72593
256a03772l1979J57759J44126m0831j55046q5685M8320R1662M2490r919l4788
267B2337n4568m1749K9612P9410L0340n2617n5915Q543L7060M115j5483J3039
279D124K5991k8199o6072O505J03865O1557q5839j32076n408J29982J05719l5230
$$ plain form
197 168854 187611 -47096 -211320 -124985 34723 61378 -6383 -33902 -20334 -41142 -75425
208 -75425 -42621 32277 34680 -49613 -91288 -33350 19182 -6406 -37698 -18395 -17459 -77254 -98314
221 -98314 5707 120347 55827 -147840 -222203 -41438 167749 141673 -57994 -167152 -88156
232 -88156 36728 71541 38396 11750 -4755 -32884 -35111 26296 84137 56789 -11175 -17503
244 -17503 30178 47939 27147 28704 53503 34409 -31725 -38445 66581 152577 68821 -103772
256 -103772 -135751 22008 166134 125303 -29743 -115428 -67108 24554 67044 57125 22337
267 22337 -32231 -73980 -44368 35042 65382 12765 -43150 -34607 2453 6568 -8915 4124
279 4124 30115 1916 -64156 -57651 46214 107771 21932 -110144 -115552 14430 120149 84919
291H4919j20423o7189L3863P3656N2136Q586m4958p5465l1927N4998P9049J2223
303E9468n6264m5691J0060K9540J024n842K4220J6301m5611n7143K9410R3842
315E3314L2462q2467r8543J1548J08607P4390l8812r0410m5242K2209N5950N5154
327E8160J5728m9740p5670k2391N6790P3421J1084n1421m4248L029J9285P307
339A334J6213K6215j2539n9052l1745M8164P7023M737q2097o9434L0485Q6987
351C6291L6673m0872n9336k8808R463L9722M8257J5621m2894o9909k6056N0350
363c1498P2508J4384m6712m7347j1929J4399K9371L5544R074m0532n3775l428
375e9941O1008N8226j9205p3251l2700M3581N6790J1440k5923l0366j8055j16
$$ plain form
291 84919 -35504 -102693 -68830 4826 56962 65548 20590 -54875 -86802 -31804 47245 59468
303 59468 3204 -42487 -32427 -2887 -1863 -7705 16515 32816 -12795 -69938 -40528 53314
315 53314 85776 3309 -95234 -83686 24921 99311 60499 -29911 -75153 -52944 3006 58160
327 58160 73888 24148 -51522 -73913 -17123 56298 67382 15961 -28287 -25258 -5973 1334
339 1334 17547 43762 31223 -27829 -59574 -11410 65613 70350 -11747 -81181 -50696 36291
351 36291 72964 32092 -27244 -56052 -46589 -6867 41390 57011 14117 -55792 -81848 -31498
363 -31498 41010 55394 8682 -38665 -50594 -36195 -6824 28720 37794 -2738 -56513 -59941
375 -59941 1067 59293 40088 -33163 -65863 -22282 34508 45948 20025 -10341 -28396 -28512
387b8512K6375M5627K5920l3482p0971k8077N2019P3683J7134m4629n5691k2939
399d3543K4130M9450L2877j4839n3105m3567J5504O0839L2188l6000n5001j0010
411d1077L1176K7782L254j1837j6536k1125j4849J7659N0588K9354m0324p3303
423e9238j9679N4762O9348J4593m7710n9265j6464L6786N2451K4520k3175n1790
435b4861k9569K7237N1182J6486k7117l3391q145J5862J9699J0976K196j2973
447G582l0514k0128K8682N7477J7610m9236o2865p068N6498O0598M159n0898m9118
460c7221o113L5322M4100J9768k4894m7024k1915K2377L7878J6895j5766l1762
472h355j8990N360J9983K0217M678k5659m1683j1317M0241M6810j262n0799m8755
$$ plain form
387 -28512 -2137 43490 69410 35928 -35043 -63120 -11101 62582 79716 35087 -20604 -43543
399 -43543 -19413 30037 62914 48075 -5030 -48597 -33093 27746 59934 23934 -31067 -41077
411 -41077 -9901 17881 21135 9298 -7238 -28363 -43212 -25553 25035 54389 14065 -59238
423 -59238 -78917 -24155 45193 59786 12076 -47189 -63653 -26867 25584 50104 26929 -24861
435 -24861 -54430 -27193 23989 40475 13358 -20033 -28178 -12316 7383 18359 20555 7582
447 7582 -22932 -43060 -14378 43099 60709 11473 -51392 -58460 -1962 58636 62795 11897 -37221
460 -37221 -43334 -8012 36088 55856 30962 -16062 -37977 -15600 22278 39173 23407 -8355
472 -8355 -27345 -21985 -2002 18215 22893 -2766 -44449 -55766 -15525 31285 30023 -20776 -69531
485f9531N709N2281M2985p063l9570l3463l782K8469M2143K0550j8779l8000k0317
498c8368J8019M2118K8490r760l4139k1492P325L1277L0629ml6243l5285M952
511a2481M0130L3494j0897m6064l4728J1057L8330K3821p673k9803l2070j1848
523c8732K1466L6843J7412j9409m3060k8605J8350M5947K5645j6909l9081k4161
535d4294J0715L8303K7562j1225l5850k4703J0960L5735K4659j2495l5373k0746
547c6752R401K5946K1547P72k3808l2130j2021K1712L8743K0748k2817m7317k1639
560e7615K6534M6271K0839j8883l8338j9541J9153L7734K2242j0821k8216j9376
572b0017J1293L3000K1234j0002k5209j7219K832K2953K4225K091k4791l2611
$$ plain form
485 -69531 -63822 -11541 31444 24381 -15189 -48652 -52434 -23965 18178 38728 19949 -18051 -38368
498 -38368 -20349 21769 50259 40499 6360 -15132 -7807 23470 54099 54095 17852 -17433 -12481
511 -12481 27649 61143 50246 4182 -30546 -19489 18841 42662 34989 5186 -26884 -38732
523 -38732 -17266 19577 36989 17580 -25480 -54085 -35735 10212 35857 18948 -20133 -44294
535 -44294 -33579 4724 32286 21061 -14789 -39492 -28532 7203 31862 19367 -16006 -36752
547 -36752 -27351 -1405 20142 20914 -2894 -35024 -47045 -25333 13410 34158 11341 -35976 -57615
560 -57615 -31081 15190 36029 17146 -21192 -40733 -21580 16154 38396 27575 -641 -20017
572 -20017 -8724 24276 45510 35508 10299 -6920 -4088 18865 43090 45181 20390 -12221
584a2221j2288K1481L8896J2587l2018m6686j4618K4542L7705J2403k4157l8483
596c2857j5982J5665K8851J8198r737k9309j9898J0615K8371J9953m554k2266
608a2950j9041N217K5880K4460L297k0557k8381p052K8751L7630P847k9741l5221
621a9861r226K5996L5597J0517k3451l2076j5187J4048K8631J8829j2217l0582
633h982j8765R774K4832J9797o434k6709j6736N118K2997K0538Q10k0764k6857
646b1381j790K5417K9242N140k4908l1302q671K4305L2269Q692k0716l2407j7148
659c3258J4923L2850J6267j7824l0544j7702J0707K6598J5217j1067k3699j3001
671c0533N577J7946J8608J71j9266j9658k487K1452K6707R034k2047k9590o263
$$ plain form
584 -12221 -24509 -3028 35868 48455 16437 -30249 -44867 -20325 17380 29783 5626 -32857
596 -32857 -48839 -33174 -4323 13875 4138 -25171 -45069 -34454 -6083 13870 9316 -12950
608 -12950 -31991 -26774 -894 23566 26863 6306 -22075 -29127 -376 37254 45101 15360 -19861
621 -19861 -29087 -3091 32506 43023 19572 -12504 -27691 -13643 14988 33817 21600 -8982
633 -8982 -27747 -17973 6859 26656 20222 -6487 -23223 -18105 4892 25430 26240 5476 -21381
646 -21381 -23171 2246 31488 36628 11720 -19582 -28253 -3948 28321 37013 16297 -16110 -33258
659 -33258 -18335 14515 30782 12958 -17586 -35288 -24581 2017 17234 6167 -17532 -30533
671 -30533 -24956 -7010 11598 11769 -7497 -27155 -29642 -8190 18517 27551 5504 -24086 -30349
684c0349K4567L2397J0947j9643l3911j2925K1303L3469J1467j8166k9980j3899
696b4723J4984K4912R971j1002j9836j3789K672J6420J4881j321j6027j9080o650
709b8588J7832K6433O421k1965k8625o722K3167L2730R286k5131l1305n140K2460
722i147L0040Q809j7594k7053q076J5305K1288J0428p770j7895j3588M271J6926
735E944J3290J620j4046k1574n121J8566K4980L455j9884k8190n498K5506K9506
748B8554L030k5563k5938k930J9764K5907N765j7454k2116o962R818K0682J3182
761B5739r178k0239j3858N534J6316J4886j417j8021j8252j819J6727K0842L157
774B0417k1038k5388j493K3030K2688j159j9386k2440l426J9186K1307M918j2645
$$ plain form
684 -30349 -5782 26615 37562 17919 -15992 -28917 -7614 25855 37322 19156 -10824 -24723
696 -24723 -9739 15173 25144 14142 -5694 -19483 -16811 -391 14490 13169 -2858 -21938 -28588
709 -28588 -10756 15677 22098 133 -28492 -35214 -12047 20683 29969 4838 -26467 -31607 -9147
722 -9147 20893 29702 12108 -14945 -23021 -7716 13572 24000 16230 -1665 -15253 -10982 5944
735 5944 19234 20854 6808 -14766 -19887 -1321 23659 27114 7230 -20960 -26458 -952 28554
748 28554 31584 6021 -19917 -22847 -3083 22824 28589 11135 -10981 -17943 -8125 12557 25739
761 25739 16561 -3678 -17536 -12002 4314 19200 17783 -238 -18490 -20309 -3582 17260 20417
774 20417 -621 -26009 -27502 -4472 18216 17057 -2329 -24769 -28195 -9009 12298 17216 4571
787D571k1601j0944R627K5647J3476j0919k1531j3112O991K0943J4199m449j8230
800e332j3538J256J6492J9012M10k0394j8667K266J8775J7589K00j7224j6637
813a5792k098J2342J8097R978q484k4584j4999J3326K6444J4176j2928k6068j2018
826b2608J3562K1835J0435r108j6030j1917K756J6903J5044k940j7869j3472O64
839a2745J7230J3281j310j2441j1947n892O794J8186J4849j1085k5561j5729J5157
852a1213K6972J3153j6940k6835q887J5867J9502O426r126j6324j0562N550J6275
865C858J0057m155j4323j1328J628J3922R846j669o551j2122q536O484K0303J3642
879B1056j0967k6697j3427J5666K9865J0375k0199k3549n032J5117J9810O907
$$ plain form
787 4571 -17030 -27974 -18347 7300 20776 9857 -11674 -24786 -17795 3148 17347 12898 -5332
800 -5332 -18870 -17614 -1122 17890 18300 -2094 -20761 -18495 280 17869 18069 845 -15792
813 -15792 -17890 -5548 12549 22527 14043 -10541 -25540 -12214 14230 28406 15478 -10590 -22608
826 -22608 -9046 12789 23224 14116 -1914 -13831 -11075 5828 20872 17932 63 -13409 -12745
839 -12745 4485 17766 16456 4015 -7932 -13824 -7030 11156 26005 14920 -10641 -26370 -11213
852 -11213 15759 28912 11972 -14863 -23750 -7883 11619 18045 8919 -7405 -17967 -12417 3858
865 3858 13915 9760 -4563 -15891 -14263 -341 9505 7836 1285 -10837 -19373 -12889 7414 21056
879 21056 10089 -16608 -30035 -14369 15496 25871 5672 -17877 -22909 -7792 12018 18925
891A8925j1076j6527p722P819J4841R234m826j4826p614M999R977N506K886l745
905G851j3025j0882Q089J9107J3342j1128k8200j1290J9484K7470L268j9189k1016
918a6119l009J4210J7512L636j0670j4032o901M219J6469Q151o391j2593n918
931a1436K458P803O551L920o308j2197q190O975K1037J1249j3899k5861o519J9721
945d696K1111K140j6210j8585q21J2314J4071N212o422j5550r567Q248J5683Q118
959A5046p862j1568n984J717R753Q889K110p391j1421r383J0268K0461O236j5924
973D947k0873q00J7473J6963P53j5101j3567j029Q827J2921O458n318j6969j0296
987a5611R159J6286P179o942j2368q240L207J0943P401K644q699j5247l331J2200
$$ plain form
891 18925 7849 -8678 -16400 -8581 6260 15494 10668 -4158 -11772 -6773 3204 8710 11596 7851
905 7851 -5174 -16056 -7967 11140 24482 13354 -14846 -26136 -6652 20818 24086 4897 -16119
918 -16119 -19128 -4918 12594 16230 5560 -8472 -15373 -11154 5315 13466 7075 -5518 -11436
931 -11436 -8978 -1175 5376 9296 2988 -9209 -17399 -10424 10613 21862 7963 -17898 -24417 -4696
945 -4696 16415 18555 2345 -16240 -17061 -4747 9324 14536 8114 -7436 -17003 -8755 6928 15046
959 15046 7184 -4384 -10368 -8651 1102 9991 12101 4710 -6711 -16094 -5826 14635 20871 4947
973 4947 -15926 -16726 747 17710 18463 3362 -10205 -11234 -2407 10514 16972 11654 -5315 -15611
987 -15611 -6452 9834 17013 10071 -2297 -10537 -7330 3613 11014 13658 4959 -10288 -13619 -1419
1001a419J7666l46j4572j4317q27J4422J2306j606j0631q105n635N638J3363Q105
1015A4042p049j6027q554O095J7537P886q561j4216n435L191J0707R206r59j1183
1029c320j2415Q4J2814J1572m67j2297j2825K405J0878Q904Q90o149r500p815
1043a7241Q458J2532R829p794j7152q792R650J6957P670q924j2936n631M501J3304
1057D431P745k261j2084p949J457J3541J0376k903j1457p021J703P424Q423K979
1071A4404n272j1254n755N557J2575J0056o786j7535p095R398J5387O162r509
1084A0333j3514n898O066J1491O651m579r916r417L215J1143P308m718q551o306
1098f692p42P391P532J130n224j0420n185M367J3843P580q313j5398n506Q082
$$ plain form
1001 -1419 16247 15901 1329 -12988 -13815 607 12913 11307 676 -7429 -13064 -7426 5937 14042
1015 14042 6993 -9034 -17588 -11493 6044 13930 5369 -8847 -14282 -11091 -384 8822 7863 -3320
1029 -3320 -15735 -15651 -2837 8735 8268 -4029 -16854 -14449 -3571 5333 6223 74 -9426 -17241
1043 -17241 -8783 3749 13578 5784 -11368 -20160 -10510 6447 14117 5193 -7743 -13374 -8873 4431
1057 4431 12176 9915 -2169 -10118 -8661 4880 15256 12353 896 -6125 -4422 3002 11425 14404
1071 14404 9132 -2122 -7877 -2320 10255 20311 13525 -4010 -11105 -1707 13680 19842 10333
1084 10333 -3181 -9079 -3013 8478 15129 10550 634 -8783 -5568 5575 12883 8165 -386 -6692
1098 -6692 -7434 -43 7489 8619 3395 -7025 -12210 -7843 6000 13580 5267 -10131 -15637 -7555
1112g555J3166O130p477j3996o262N704J1594N318l109j3251o936L981J1390O152
1126D849l231q572p826J814N839Q483J877n776r355o208Q773J2793M587p364j4153
1141a3470m926J0263J2554O089p738j1736l903O073J0588Q354m426j1680o394
1154a0352M143J0845P037j728r027o658N03P191Q362K858o027j1506k452Q414
1168A603J0030M045q133j0340l225R058J0525L355p006r299m521L959J1345O472
1182A7868o213j0142o187K778R159P314k480j0443p063J489O602O266J521q423
1196B046r381j902P373P702K862r123j0637p64O476Q542K374o851q083m681M935
1211i112Q694N497l092j1156o229L729J0113O430m025p035m907j206R470Q377
$$ plain form
1112 -7555 5611 11741 4264 -9732 -15994 -10290 1304 6622 3513 -9738 -16674 -12693 -1303 4849
1126 4849 1618 -6954 -14780 -12966 -7127 1356 3233 -2543 -11898 -18106 -9333 3460 8047 683 -13470
1141 -13470 -18396 -8133 4421 10510 2772 -8964 -12867 -6794 3794 12148 7722 -3958 -10352
1154 -10352 -6209 4636 11673 9945 918 -5740 -5237 1954 10316 13174 7147 -4359 -6811 1603
1168 1603 11633 15678 7545 -2795 -6020 3038 13563 16918 9912 613 -3908 51 11396 17868
1182 17868 11655 1513 -4674 -1896 7263 14577 12097 1654 -5409 -3920 2682 8948 10469 2046
1196 2046 -7335 -9237 -1864 5838 8700 -423 -11060 -11824 -5348 3194 5568 -1283 -9366 -14047 -9112
1211 -9112 -418 5079 1987 -9169 -15398 -11669 -1556 4874 849 -6186 -11093 -12299 -2829 5548
1225E548j987p241q260l95Q311R319J901r177q146j059O377O904L066m530q934
1240h303l128N274R466M419k962j0457n729N928R082O633k029r235o773K321R716
1255D223P312k879n086p711j56R062O439N53p419o539j073N633P680K724n430
1270G333q659l233M492Q892M263o948p667n235M947Q182M861m625p686m822J873
1285d032O804P732j061j0100n876Q83O022O416R15p354o718o63N020P453R02n003
1301A340p876l236M717Q831J632n120o361m680K347R332M750m803p429l785K627
1316g714O014O889k682o453n723N02O662N603J042o221o927k22O496P339j53l342
1332A110q083j339M217P345L314m149q564k464M686O990M648l506o910m806L188
$$ plain form
1225 5548 3561 -3680 -11940 -12335 -4024 5295 7196 -1981 -10127 -11186 -4809 2095 5161 631 -8303
1240 -8303 -11431 -6157 3309 7728 4766 -5691 -11420 -5492 3590 10223 8194 -1041 -7814 -5493 4223
1255 4223 11535 8656 3570 -4141 -4297 4765 11204 11757 4338 -2201 -3274 2359 10039 12763 7333
1270 7333 -1326 -4559 -67 8825 13088 6140 -1527 -6762 -1815 6367 11228 6603 -1083 -5905 -4032
1285 -4032 2772 10504 9443 -657 -6533 -5650 372 6788 7703 349 -6369 -7032 -2012 5441 6343 1340
1301 1340 -6536 -9772 -5055 3776 5408 288 -6073 -10753 -8406 926 5676 873 -6556 -10341 -7714
1316 -7714 -1700 5189 2507 -3946 -9669 -9167 -2505 3098 4140 -2081 -9008 -9230 -2734 4605 4452 1110
1332 1110 -6973 -8312 -4095 3250 6564 2415 -6149 -8613 -3927 3063 7711 4205 -2705 -7511 -4323
1347d323O597N287j655n372o348M10O335Q879k446o475n238M82P632M290J87n174
1363C068n749k058M322Q230J712m813p645j930K632Q485L122m154o860m538L646
1378b530O457N025j311p743n320J067O241M944l12n458o702J026O539L307M85
1393E715n348n438j150K886P442J984n522o254l100M474O486J705k905o598k167
1408g790J360P218K921j875n808n311K085N435P781j941o927o071L245M421M314
1423C057K285n218n172r95L667O874P78l017n541l544N845P703M09m058o033j717
1439d677J831O530M264k666m863o269K654P524L714k694n753l609n3N419M823
1454F175j512l086m988j308K935P184L50n004n191q75M391M613J591k595o371
$$ plain form
1347 -4323 2274 7561 5906 534 -5814 -5404 931 9810 7364 889 -4349 -3867 3765 8055 8242 3068
1363 3068 -2681 -4739 -417 7813 9525 4712 -2933 -4863 -2231 6254 9376 5222 -1638 -6176 -2530
1378 -2530 3927 8952 7641 -102 -5422 -4355 1886 6830 6518 1060 -5642 -4616 1923 5230 5715
1393 5715 367 -5071 -6221 -3335 4107 6091 569 -5685 -8785 -4311 2175 3880 975 -5623 -7790
1408 -7790 -6430 788 3709 1834 -3974 -9285 -7200 -1765 6016 4075 -2852 -8923 -5678 -1257 3057
1423 3057 5342 124 -5048 -6043 -2376 4498 5276 2259 -3282 -6826 -981 6722 7131 3073 -2960 -4677
1439 -4677 -2846 3684 7948 5282 419 -5850 -3196 4328 8042 5348 -405 -4014 -4067 1352 6175
1454 6175 4663 1577 -3411 -4719 -1784 5400 5750 746 -4445 -5320 -929 3684 5275 2680 -3691
1469c691l059J956N689K675j186n362m999K592N599M647k269o295k672J012M984
1484c79M051k85k848m428k347M527O676K791o850n350l13M664O023Q97l791n198
1500b160m44K432L939L295j595o328l885K941N528K651jo580m622K315N151K403
1516E040L85m458n261l34M596N343p60l759n293j879N198L319J276l149m119k306
1532f161J845N656K556k473o346k461L570N661J949k443n474o85R34K290N265
1547C683m10m171m589J214M944M668J782o835k992r57M009M880M34k696l642k605
1563c283J439P346J587k557n694l513K641N002K599l687m589j255m03M205M494
1578D332k217l664k371j541L828N139J270o225k593j417N184L163R57l953l789
$$ plain form
1469 -3691 -6750 -4794 895 3570 2384 -2978 -7977 -5385 214 4861 2592 -3703 -6375 -5363 -379
1484 -379 3672 3387 539 -3889 -6236 -1709 4967 7758 908 -4442 -4755 -91 5932 6829 3038 -2160
1500 -2160 -2604 -172 3767 7062 5467 -861 -4746 -1805 3723 6374 6373 -207 -4829 -2514 2637 5040
1516 5040 5425 967 -4294 -4628 -32 5311 4551 792 -4501 -6380 -1182 2137 3413 264 -3855 -6161
1532 -6161 -4316 1340 3896 1423 -4923 -7384 -3814 1847 3796 1353 -4121 -4806 -3872 -1582 3683
1547 3683 3273 -898 -5487 -4273 671 5339 7121 286 -2706 -3663 346 5226 5660 2964 -678 -3283
1563 -3283 -1844 5502 7089 4532 -1162 -4675 -2034 2968 5567 1880 -2709 -3964 -4367 -162 4332
1578 4332 2115 -1549 -3920 -5461 -1633 3506 4776 -1449 -4042 -5459 -275 2888 3845 -108 -3897
1593c897j772M660K805J840l125l263k335K126M603K394k268m587j809J427J861
1608a340N130k261l395l068j00N443M241j323l154l829K247Q29M462J498k747
1623B633l209k042L895M234K171k924m492l541L285L581L729m238m364k700J521
1638b461N614j028j26l583n482K743K884K594M9n140k437N48K490M541j71l166
1654b131j591j958L473N096P62k758n928J467K342M642J978j997l776r44P98K562
1670B037L400k92n860j821J231K474M808k811l722k837M07K314J845K481l538
1685A16l633j581M233K257J599j561m818j889N400J294Q61q20k604k979R35N834
1701B644K243k297l840k193k69N151K113k018j167k421o08J951J948J318k425
$$ plain form
1593 -3897 -5669 -1009 1796 3636 511 -2752 -5087 -2961 1642 4036 1768 -2819 -4628 -3201 -1340
1608 -1340 3790 1529 -1866 -4934 -5034 409 4650 3327 173 -3656 -1409 -580 3882 5380 2633
1623 2633 -576 -2618 1277 5511 7682 4758 266 -3275 10 3591 7320 3082 -1282 -3982 -2461
1638 -2461 3153 2125 1999 -1584 -7066 -4323 -1439 1155 1204 -3936 -6373 -5825 -3335 1206 1035 -2131
1654 -2131 -3722 -5680 -2207 2889 3651 893 -5035 -3568 -1226 3416 5394 3397 -379 -1323 -525 2037
1670 2037 5437 5145 -715 -2536 -1305 1169 5977 3166 -556 -3393 -2986 -672 1173 3654 116
1685 116 -3517 -5098 -865 1392 2991 1430 -3388 -5277 123 1417 2278 1458 -1146 -4125 -3190 2644
1701 2644 4887 2590 -1250 -3443 -3712 1439 3552 1534 367 -2054 -2662 -711 1237 2555 130
1716A30m105k305M452K707J440l478l606n90L348K788K03J296m646j141K315J789
1732E97L316p91l652j809J217M360J626j615j316k365MJ593L149L17k965n045
1748c379O87L408L184l00l700k871J26K966K290l17r99l914j606K359K576J928
1764B438Rn292j411J758L800K178p10l519k352J535K123L195j34k911m211P26
1780b778K428L045J206l946j204j477J843K362M84r90k444l311R87M938J979m280
1796a158j443j718Q77L489K120m67m577k074R10L198L322M49l760l211R81L344
1812B82K569j285k976j480J500R13K886Q84k63m435j788L077K581q3p58k521j564
1829b461J976O89L529k366k023j398o57L400K956j65l043k496Q8K645K407m22
$$ plain form
1716 130 -3975 -6280 -1828 879 2319 -1159 -4765 -5355 -2007 781 984 2280 -2366 -3507 -1192 597
1732 597 3913 3122 -530 -2339 -1122 3238 4864 3249 1933 -432 -428 1165 4314 4631 1666 -3379
1748 -3379 -2692 716 3900 3600 -100 -2971 -2845 121 2411 2094 1095 -2819 -4425 -2066 510 2438
1764 2438 2447 -2845 -4256 -2498 1302 3480 2770 -749 -3101 -1566 557 3752 3618 707 -3504 -2778
1780 -2778 -350 2695 3901 -45 -1249 -2726 -883 1479 1963 973 -1471 -4782 -3795 1143 3122 -1158
1796 -1158 -2601 -4319 -3442 47 2167 1700 -2877 -4951 -4041 -843 2479 2928 -832 -4043 -3062 282
1812 282 2851 1566 -1410 -2890 -1390 -477 2409 3293 3030 -1405 -3193 -116 2465 2382 1624 -897 -2461
1829 -2461 -485 204 3733 1367 -656 -2054 -2711 689 3645 3480 437 -2059 -1971 674 3081 2659
1845B659j998k029N39J201J557K454k219k853k036K906K469L81j744k156j918
1860b787J337L705J70r09l241n26N52L067J155j128l049M05j430K915J999n67
1876A668k394j746J0K909J390M16k031l790J75J596L776K38k392j892j083K477
1892f73K393o72L27k006j568n10K180M067p95m917j236J798K391J291j33j567
1908C70k368j559K598K462J032k504l282J234J064J784M53j470j379L96j164K430
1924I7K364r02l690q31l31M923J016l55l203j862K840P79J574O28k777j010m83
1941a223K005K051l8p25l869J716K173J610M17q21l117m85J435Q63M73N42j965
1958A042l159K469J369N19j118j747j519Q67J386K468p76l165j172L57J158K486
$$ plain form
1845 2659 661 -1368 -829 372 1929 4383 2164 -689 -2725 181 2650 3031 1287 -869 -2787
1860 -2787 -1450 2255 2425 1516 -1725 -2251 -1699 1368 2523 1395 -1654 -1249 -2679 236 2235 1668
1876 1668 -726 -2472 -2462 447 1837 2253 222 -3568 -3393 -1797 1979 2217 -175 -2067 -3150 -673
1892 -673 1720 1048 1375 -631 -2199 -2709 -529 3538 2743 -2174 -3410 -1612 779 2070 1937 370
1908 370 -1998 -3557 -959 1503 2535 31 -3251 -2017 -953 831 1284 -186 -1565 -1169 -2333 97
1924 97 2461 1559 -2131 -2962 -3293 1630 2646 2291 -912 -2774 66 845 2419 3047 270 -740 -1223
1941 -1223 782 2833 2795 2070 -1799 -83 2090 3700 4117 3296 179 -306 1129 1992 2465 3007 1042
1958 1042 -2117 352 1721 2240 1122 -625 -2144 -1277 109 2577 1801 -1364 -2536 -2179 -1021 1465
1974A465l39j443k416P50p0K856O84j394k634k46J034J068J315J046l096j329
1990b749J133J632J681j723j345k245J959J675M66J179k174n37o03J207K766l61
2006A961j48l549k32K678J206J537l053j106j491L225J471J701l034k286q87K628
2022F21J634j44j562n90j628N28R44K724p81k392j098p3J330J075J266l444o66
2039b256j083J768K468J13k663m22l26O08K403K43j088j102j285K123J122J871
2055B494r42k278j210K44K411J281J33k915r96o4K459K218j52j232l614K278J197
2072A312J149j47j902r39n99J855J421K8j564q85q92M29K675k37o15k255K49j874
2090b791L323J484j120j559k017Q31Q59K020J298k620k024Q30N84K362lj422j378
$$ plain form
1974 1465 1126 -317 -2733 -1983 -2053 803 1487 93 -2541 -2787 -1753 -685 630 1676 -1420 -2749
1990 -2749 -1616 16 1697 -26 -1371 -3616 -1657 18 484 1663 -511 -1048 -1651 -444 2322 1961
2006 1961 1813 -1736 -1968 710 1916 3453 400 -706 -2197 1028 2499 4200 1166 -1120 -2007 621
2022 621 2255 2111 549 -41 -1669 -1141 -197 2527 1746 -646 -1744 -1817 -487 588 1854 -1590 -2256
2039 -2256 -3339 -1571 897 1010 -1653 -2075 -2401 -1793 610 853 -235 -1337 -2622 -499 623 2494
2055 2494 1552 -726 -1936 -1692 719 2000 2133 -782 -1778 -1842 617 2835 2683 1451 -2163 115 1312
2072 1312 2461 2314 412 -527 -1126 729 2150 2178 614 -271 -1163 -734 1941 1704 1089 -1166 -917 -2791
2090 -2791 532 2016 896 -663 -2680 -1849 -990 1030 2328 -292 -2316 -1486 -902 1460 1457 35 -1343
2107a343k13L90K622P11j745j006j672K181N38J111M96k454j996J699J127J251
2123A697r70j429o01L77K079p3l47j941o90L73K582l39k44p78n53q06K152J493
2141A982k46j233j980n42K084P83J613j754k383P18n49K296R83j457j253l32j16
2158a386L60K404K14k681r86l49J918P70l8m87k229O80K318o35J251m56j849K24
2176i57J133J690M13j339j024J54R53J687M65j587m63j001k83J606J128m66j751
2193C58j248P7J279K227o80k422r85j52Q83K480m35j218j957K47J309j75J452
2210A040n59j839r53J715K122m37m29p12j888P45J251J748n40j839j183k33J920
2227g1J131j360oj274m33J480O61J127k439j657n15J377K615p67l90j348o86J174
$$ plain form
2107 -1343 -1556 -1166 1456 2167 422 -584 -2256 -75 463 1574 2070 -384 -2380 -681 446 1697
2123 1697 727 -702 -1303 -926 1153 1080 733 -1208 -1898 -1525 1057 718 474 -304 -857 -1663 489 1982
2141 1982 1736 503 -1477 -2019 65 848 2461 707 -1676 -958 -1507 789 1772 315 -938 -1270 -1386
2158 -1386 -1026 1378 1592 -1089 -2075 -2424 -506 264 226 -261 -2490 -1810 508 -127 1124 668 -1181 -957
2176 -957 176 1866 2279 940 -84 70 1023 2710 3175 1588 1125 124 -159 1447 2575 2109 358
2193 358 -890 -813 466 2693 2013 -409 -1394 -1546 -663 1817 1382 164 -1793 -1546 -237 -412 1040
2210 1040 481 -1358 -2311 -596 1526 1089 660 -52 -1940 -1195 56 1804 1264 -575 -1758 -1991 -71
2227 -71 1060 -300 -306 -1580 -2013 -533 128 1255 -1184 -2841 -3356 -1979 636 -131 -521 -1869 -2555 -1381
2245a381J050K436j214p03k544J525K194R96l49k867J57m54K526P45q76j686m53
2262h98j09J738J255m52l70j598n29J619J758p92r41j012r22P02P33K145j366
2279I61k085R7J01K060R50M2k313N33m11M22Q11R26j273j163M30J317N67L72j018
2298A326r79j224J969J86J058k008j196l7J023J34P01p40j471j014J584J377j87
2315E02q15j407J58J69J311Q30j61k452M91q21J486J329n52o72j137j28J950J141
2333A222j218m66j476M89P34J478J128r96k172k40J99R60J333n32j165m59L9J086
2351e6K561k319l09q58o61J585K627p21j949r21k62J963J87O51j145j395R09R42
2369H29L45P58m88j135j093k15K032P01p30r85o75M56K127l28n37j014j013J218
$$ plain form
2245 -1381 -331 2105 891 188 -2356 -831 1363 2359 2010 -857 -700 -1154 1372 2117 1241 -445 -898
2262 -898 -1007 731 1986 1534 1164 -434 -963 656 2414 1622 681 -331 -1253 -551 182 2327 961
2279 961 -1124 -1027 -926 1134 2084 2126 -187 346 -65 357 1168 2094 821 -342 88 1405 1972 2344 1326
2298 1326 347 -877 1092 1278 2336 328 -868 -905 118 252 953 213 -1258 -2272 -688 689 502
2315 502 -313 -1720 -1562 -1393 -82 748 587 -1865 -1374 -2195 -709 620 68 -604 -1741 -1869 81 1222
2333 1222 4 -462 -1938 -1449 -715 763 1891 895 -1277 -1517 -1318 -358 975 443 -722 -1181 -1142 -56
2351 -56 2505 186 -123 -981 -1642 -57 2570 1849 -100 -1021 -1283 680 867 1518 373 -1022 -113 829
2369 829 1174 1932 1444 309 -784 -999 1033 1734 1004 19 -656 -200 1927 1599 1062 48 -965 253
2387B53k59J778n79j802L05K66Q02m05R81j378K46j342J021P42L46k55j406j69
2405h55N13N63K25j13j544k2p2J762m35M50k263J11j68K285k5k97p69j2j74P15
2425a25K63q17M66j247J61Q73O77Q18q71j342j153K321O64Q41j306j051m5n06
2443a379J512J64o55k31L7l43L39J606l23j032K05m49K25K718j063j326K02M22
2461F29m50J721N89k473q12M29J328j252K101l61j913Q41J69K54p7q05N08j421
2479i95O10O65L30n32j47r98j34K309n76Q25j490q99M22J343M46M75j959n36o34
2498a475J417J208L9j002p15j99K13K55Q00O26o34j711O29R54L99j00j171j70
2516f37k26J331R00j573r34K16p81J512L68Q86j454L41p78L87l06K035j441l92
$$ plain form
2387 253 -6 1772 1193 -609 -304 -38 764 359 1340 -38 208 -1134 -113 629 975 720 -686 -855
2405 -855 -342 221 446 333 -1211 -1233 -1305 457 22 472 -1791 -1680 -1848 437 412 115 -654 -666 -840 -125
2425 -125 138 -679 -213 -1460 -1299 -426 251 1069 198 -1144 -2297 24 688 1529 223 -828 -873 -1379
2443 -1379 133 297 -358 -589 -552 -895 -556 1050 727 -305 -100 -549 -324 2394 1331 5 207 629
2461 629 179 1900 2489 16 -796 -367 961 -291 1810 1449 -464 377 546 800 723 -82 426 -995
2479 -995 -385 280 610 78 -69 -1067 -1201 1108 532 1357 -133 -1032 -610 733 1179 1654 -305 -841 -1475
2498 -1475 -58 1150 1189 187 -528 -727 -514 -259 541 1167 533 -1178 -549 405 804 704 -467 -637
2516 -637 -863 468 1368 -205 -1139 -923 -1704 -192 176 1062 -392 -51 -829 -442 -748 1287 -154 -546
2534e46m90J132R74J60j012j971R06M41N96n4L53j015o10Q40Q60k07q39RJ59K95
2554a9Q39l94N41j848N51Q3m90J913q44M30q81j371J601Q55M13M40r18n49j314
2573i62K014L31l61r48j232J122O67L17N60j240O06j320M72Q16l63M37j784J20
2591g48O55N40J175j393j230O50M38J593j002m77j069J81L10J376o96p3n29p09
2609a008J305k24P36r62j66l69O79Q9L60J92q80o87J82O18P38K69o45j377O19
2628e31k12R90J263j566J77m9L05K69N5J28j772J08n29J399N93M03p98j084J05
2647g46J064J251l74j340q53P12Q26J66p20R70j462n56P41J073J07o43j15q66
2665g65M21M98M49j52j685K79j81J197J127j18j692p87Q75J130L97j539k18R41
$$ plain form
2534 -546 -1036 96 1070 1230 218 -1753 -847 -406 190 136 489 -526 -1136 -296 564 357 -482 -473 -314 -19
2554 -19 820 426 967 -881 -330 -247 -737 1176 332 762 -119 -1490 111 966 1379 1819 901 352 -962
2573 -962 1052 1383 1022 74 -1158 -36 631 948 1508 268 874 -446 26 842 479 916 -868 -748
2591 -748 -93 447 1622 229 -1001 -351 87 1680 678 201 -868 -687 -377 999 303 230 -299 -1008
2609 -1008 297 73 809 -153 -319 -688 -9 80 440 632 -248 -935 -753 -135 603 872 227 -1150 -531
2628 -531 -743 247 1510 -56 121 72 377 646 701 829 -943 -835 -1364 35 628 1031 233 -851 -746
2647 -746 318 1569 1195 -145 -998 -286 540 706 -14 956 -506 -1062 -321 752 859 216 101 -765
2665 -765 -344 154 603 451 -1234 -955 -1136 61 1188 1070 -622 -1409 -534 596 993 -546 -764 177
2683A77m41M39o47Q93p1r37n30M37N99P51m63r48J71L78N66K24n85k25n90J503
2703G01J102j700M16m87K46J18J131j031O62j240o53n41J406Q83l78r09K2m63
2721g15M64j96R03q8p34l32j99R96J97P48j336r0O96O93o77J3r32m52O80N16m0
2742A15Q45o37r57j31P75K84M62j139K79J00o3P87J49j647J89k64J467J3L9q09
2762a43n63K31P68q92N64K11o19M86p53J086R10k65q39o43O8O22K45L08n73j225
2782a016J676q56L94J69n02m18k46P46K37R5k55o64n89P69N80l45m30N88J59L12
2802D04j99M24M68j718n79M18o04K231l12q51k94P79p1J63m18m78l2M19K37N20
2822E07m01R52k387J043k42L32J127n24j88o90l48J840j60l58j745J065J48O63
$$ plain form
2683 177 -264 175 -472 421 350 -587 -1117 -680 -81 670 207 -741 -570 -192 374 598 13 -212 -802 701
2703 701 1803 103 519 32 278 396 1527 496 1158 -82 -735 -1276 130 1013 635 -274 -252 -715
2721 -715 -251 -447 456 368 -366 -698 -897 99 296 1044 -292 -382 314 1007 330 343 -589 -1041 -361 155 115
2742 115 960 323 -634 -765 10 294 756 -383 -104 -4 -67 720 869 -778 -589 -853 614 627 666 -143
2762 -143 -706 -475 293 -599 -35 176 -443 43 -710 376 1286 1021 182 -461 -393 229 474 782 209 -1016
2782 -1016 660 -196 198 367 -135 -553 -799 -53 184 279 24 -640 -1229 -460 120 -225 -655 -67 92 404
2802 404 205 629 1097 -621 -1200 -782 -1386 845 533 -318 -612 167 96 259 -159 -637 -669 -250 -13 507
2822 507 106 1058 -1329 -286 -528 -196 931 407 219 -471 -819 1021 861 503 -1242 -177 -29 634
2840F34P02j313J63q43J155l22J20k89L41p08k92R13O32J82n43q47o55J569N39
2859A138o05q6l10p86N79l2O20j38m94j77j80O95K00l15n21J64J45l08J051K3
2879F63j969J343r51O13K127o25j360o82J8J094O8n33L53m95p31J036L19N75j169
2898c06j68j35P57j07RM32O32j341k3J481j608j32l36K8Q19O22N85o43m95q75
2918h04K91P19Q39M7j377K2K61K66k60O37k31p92kJ64M26L44q26K79k76K30j26
2939a69O38l03j325J045K13N05k20P66j504N64j15L8j01M43K0j589P84J156l98
2958D48m77J231j586k63P07q5k56J255j654J057l54L4K4M68l96lJ117p85m14Q34
2978I02j733M62J91K53n71J777r50j681O15Q91Q37J77r5j406o1M27n2j12j27L7
$$ plain form
2840 634 1336 23 186 -657 498 176 296 7 348 -360 -652 261 893 1075 532 -315 -970 599 1138
2859 1138 533 447 137 -649 -70 -102 518 380 -114 -291 -471 224 424 109 -412 -248 -103 -411 640 663
2879 663 -1306 37 -914 -301 1826 1201 -159 -841 -823 271 339 -194 159 -336 -1067 -31 288 863 -306
2898 -306 -474 -609 148 41 50 482 1114 -227 -250 1231 -377 -509 -845 -817 2 624 1209 566 71 -804
2918 -804 -513 206 1045 1092 -285 -263 -2 264 4 641 410 -382 -384 -220 206 550 -276 3 -273 -43 -169
2939 -169 469 166 -1159 -114 99 604 384 1150 -354 210 95 133 32 475 495 -1094 -310 846 448
2958 448 -29 1202 -384 -647 60 -25 -281 974 -680 377 23 57 81 549 153 150 1267 482 68 902
2978 902 -831 -369 -178 75 -496 1281 331 -1350 -735 156 993 1170 1075 -331 -392 35 -17 -129 -256 -219
2998b19j562K776j508r3P44K97P0p05N36k86J77l59p40J58J311M0n76K36j244
3017i47N59l32R24l57j002J341n76k47J062J240j992j36K86M20R23k29j27j184
3035c74Q68q5J13J02j99j25n10Q65n20J11K77j065k84k50J206O0J19O9r81M44
3055a59J73Q54m59p97jj39oO78O86j271K98l80M36O66j101K71k44N42M57k29m9
3076B26K09r18J12J09O60L61k03n24q23M79J055n90j10P9l26r9J94N4J604k421
3096h72L46R3R88q54Q78j173K55N30j102J977l30o80r65p95J564L76L84q00k61
3115d41K87J88M54J86k39L62j628J330K79j15p55r03Q63o41J819n7K49j588K08
3134a42m84O79k65Q9P77l16Qp79K87Q12r07Q36j316N7j42K192j630Q01p45O04
$$ plain form
2998 -219 -1781 995 -513 -606 138 435 505 -200 336 50 227 -132 -872 -714 597 637 61 297 -947
3017 -947 -388 -720 204 -153 -1155 186 -390 -637 425 1665 -327 -463 -177 243 1166 937 810 -374
3035 -374 494 409 522 624 425 300 -210 655 135 246 523 -542 -826 -1076 130 190 309 378 -603 -159
3055 -159 14 868 409 -388 -389 -528 -534 144 830 -441 -143 -523 -87 579 -522 -251 -495 47 504 275 226
3076 226 435 -483 -371 -262 398 759 556 32 -791 -312 743 153 43 122 -204 -303 -109 -55 1549 -872
3096 -872 -526 -433 555 -299 579 -594 -339 191 -911 1066 736 56 -909 -1704 -140 236 620 -180 -441
3115 -441 -154 34 488 674 435 797 -831 499 778 663 -92 -995 -132 -773 1046 989 1238 -350 -142
3134 -142 -626 53 -212 -123 654 338 346 -433 -146 666 -241 595 -721 -664 -806 1386 -244 557 -188 416
3154D16n08j27J74n9J047j002o19R64J88r50j50N65K26J08j77J311o66j313n61
3173a133O15j93P98q30O27l65O00j03N99j474l18J037O48K14j044n90J098p7k31
3192a22k07J00Q55j303l54O29O85P26j027L46q37J44M42M50l11n27P64r34P46
3211B65o70K59K48j92l64j91M94L29m73k35J2l02Q24O20k64o87J029r84l58P52
3231A12m82n23J545j078L2J023p82p46J240L94j421J126j125l59L12N24k84Q37
3249C45j26M01o41j77j112K78J087j123P01N60l0nj07Q80j621J11O73l60k22L36
3269a52k07j29r0P5J139r80Q59m91n55O79j039J658n15J12o44n9J569j628Q00
3288D02j290K090k43J66j289L41R6N76n81k74L62M50l81j845K110m1r09P49M10
$$ plain form
3154 416 -92 -219 -45 -104 943 -59 -678 286 474 -476 -626 -61 165 273 96 1407 741 -572 -1133
3173 -1133 -518 -711 87 -743 -116 -481 119 16 615 -859 -1177 -140 508 722 -322 -912 186 109 -122
3192 -122 -329 -229 626 -677 -1031 -402 283 1009 -18 328 -509 -365 77 527 216 -311 453 -481 265
3211 265 -405 -146 102 -90 -454 -645 -151 178 -295 -530 -518 -820 4 624 360 -327 702 -282 -640 112
3231 112 -370 -893 652 -426 -394 629 -153 -899 341 735 -686 440 -685 -1044 -732 -208 -492 345
3249 345 219 620 -21 -198 -1310 -1032 55 -1068 -367 193 163 158 51 931 -690 -579 94 -266 -488 -152
3269 -152 -359 -488 -578 -503 636 -344 515 24 -531 148 -891 767 252 364 -280 -339 1230 -398 402
3288 402 -888 1202 959 1125 -164 177 273 849 268 -6 356 806 425 -1420 690 649 -260 489 899
3307H99j477J908j067M70J5n89p56L23J88J87l4l01M25q61Q83j68K16l01q79O01
3327c18M33K8q57J144q58J55J173n53o16J31NK90l23n16R44j59N57j713R67l1
3347a17R29q49J87P70j326q7J812n23j334k72K85J037M02R5j233o61R17j26O03
3366E09K48r27O79Mj309J283o13M26L31q00M6J073j456p50J984j7k85J055j176
3385C05L24n95j055L61J3N23N29J62l81L7J72R5M53p85q36M08M66L5q35J038p57
3406c23J56O74q73O04j149Q05K04m2p91K5J296j168K68n62J036P6k10k95n71Q12
3426b8K48J59o16K91o37Q06p04M16j22j138J197K04p07J202k10r47Q15r41L75
3445c37R63j030J972l040J867k87m90M15J011J70j540r56J388r17L22M15O4l69
$$ plain form
3307 899 -578 1330 263 733 748 159 -597 -274 -86 101 67 -234 191 -670 213 45 261 -40 -919 -318
3327 -318 115 143 -714 430 -428 -273 900 347 -269 -138 -133 157 -166 -682 262 103 660 -1053 -86 -117
3347 -117 812 -37 150 920 -406 -493 1319 796 -538 -810 -525 512 914 1009 -224 -885 32 -94 509
3366 509 757 -170 509 513 -796 487 -126 300 631 -169 -123 950 -506 -1256 728 711 426 1481 305
3385 305 629 34 -1021 -660 -647 -124 405 567 186 223 395 490 943 158 -678 -270 196 231 -604 434 -323
3406 -323 -167 507 -366 238 -911 -106 98 56 -735 -710 586 -582 -314 -876 160 236 26 -269 -840 -28
3426 -28 220 379 -237 54 -583 223 -481 -65 -187 -1325 -128 76 -631 571 361 -586 229 -712 -337
3445 -337 626 -404 1568 -1472 395 108 -382 33 1044 1214 -326 -1282 106 -811 -489 -74 -10 -379
3463c79l50K46J478j747J12J114j268J902nr88M71r94l05P50q74J213R90j557
3481a91j859J489P70m27P44n3j748P20J109M82k85j274J323j016O95k72L62l82
3499A87K43K52j150L31m9p50O90O1j81m60L50l15Q88p31M71p65M86J277q82L16
3519B69p91K75K121j921N46r23J47L14p30K75l48O29L01r50Q53Q37j200r60j04
3538a360M90K92P28o5n96P11m32J407j372J234o62r78J678k259Q27J274k04n46
3556A67O26P44j080N69m64p85L08j92k12L43j14l02L44j333K079r0j523J645k35
3575D95o42R5J8J368j146l12N92J1J71o01K83k92L63k96n7j330Q76L50P7k63P1
3596a69Q94k69l40q06J111m55M15n56K44l8k42j43J53M41n90K8P71Lr2n70R55
$$ plain form
3463 -379 -729 -483 995 -752 -640 474 -794 1108 1103 115 586 -408 -713 37 -837 376 1366 -191
3481 -191 -2050 -561 209 -218 526 473 -1275 -555 554 1036 751 -523 800 -216 479 207 569 187
3499 187 430 682 -468 -137 -186 -936 -246 -185 -366 -826 -476 -791 97 -634 -163 -928 -442 835 -47 269
3519 269 -522 -247 1874 -47 499 -424 -277 37 -693 -418 -766 -137 164 -786 67 904 -296 -1256 -1360
3538 -1360 -870 -578 150 85 -511 200 -232 1175 -197 1037 375 -603 1075 -1184 -357 917 713 167
3556 167 793 1537 457 1026 562 -223 85 -107 -319 24 -90 -392 -48 -1381 698 608 -915 730 495
3575 495 -147 -52 -34 1334 188 -124 468 479 650 49 332 40 403 107 50 -1280 -404 -54 23 -240 -169
3596 -169 725 456 116 -690 421 -34 381 -175 69 31 -211 -354 -201 240 -350 -322 449 452 360 -210 745
3617G45j933J507L1L29K75j362J69j14P8k9O62J0l26L96m88M61j93k76Q2o82J154
3638D96l48L19n63j64l48P65M67L08j202k71L71O09p9j17K5N2m65J65N06m33r6
3659cJ06j58J42R9k5K26q78M75r7M18l6N47j070K83J51K68o19l04N52l94J42M05
3681B30p4l63J18L46p69J52J188k05l58k77k45j66O96l97N2J81k17J033r02N25
3701E48n17L86n51K77L94j088O25L36j60m9j89o1M86k27o01K28N48o40Q83o21
3721GO0K02m35K19L0m01K58K42L7M11k16m4r96L28K48r8O35l03K32n49M09n11
3743b35L26Q2m31K94m57J65L52j29L14n55M35Ql43M18n53k55M06KP6J36K35l74
3765h3j18M10n61M39j35L36m89k15N95P0M58p29m14Q0K58m27R78o53k44M06n05
$$ plain form
3617 745 -1188 319 350 679 954 -408 -239 -353 -275 -304 358 368 42 438 -50 411 218 -58 24 -658 496
3638 496 148 467 -96 -260 -608 157 624 932 -270 -541 -170 439 360 243 268 320 -145 20 526 93 -3
3659 -3 103 -55 87 186 161 387 -491 -16 -113 305 269 816 -254 29 180 448 -171 -475 77 -317 -175 230
3681 230 156 -207 -89 257 -512 -360 828 623 265 -12 -257 -423 273 -124 -72 109 -108 925 23 548
3701 548 31 417 -134 143 537 -551 74 410 250 201 12 -49 437 210 -391 -163 385 -255 628 7
3721 7 67 269 -166 53 83 -318 -60 182 219 630 414 370 -626 -298 -50 -148 487 184 416 -133 276 -235
3743 -235 91 173 -258 36 -421 -256 96 -33 281 -274 161 169 -174 244 -309 -564 -158 -156 -80 56 291 -83
3765 -83 -201 209 -352 87 -48 288 -201 -416 179 249 707 -22 -436 -356 -98 -525 453 -200 -444 -38 -543
3786e43R73m2p5n57Q47j19o93l26J016K88n57k59k31J043n68l14l86N61l61N84
3806B81q41N71m07K83l89R01K2o11r4K46l28L18p7j03j87K2M60k28P29q04L55
3827A19J7j7k18L5J64M4j34k63J53j49Q73m55q89O33K34n64M74N6j35q1L29o46
3849d20P46n56P2K48p9N8j55J02J7j09q0l0M96L0l47n19K81L99j34L77k42p12
3871e57L81J81K46m81M87m39L9n1n7K94J18o17K97L75j82l38K20L56m45n75Q76
3892A28J38j33o0m0n3k75l1j45N26J02n40R6L49n28R42m71n07Q67Ro34K7K07k44
3915b70J55K75JJ87o86o4M27M26R0q13K38J81o03P98p7P5j11k08J98k02M65o56
3937a74L93J18l10O03j010M68m3j31L1l68R2P6O58q08J59K05L69k12J68l71R6
$$ plain form
3786 -543 430 388 313 -244 603 484 -209 -535 481 769 212 -47 -278 765 197 -117 -503 58 -303 281
3806 281 -560 11 -396 -113 -502 399 421 -190 -284 -38 -366 -48 -125 -228 -415 -393 67 -161 568 -236 119
3827 119 136 119 -99 -64 100 144 10 -253 -100 -249 624 169 -720 -87 147 -417 57 113 -22 -103 226 -420
3849 -420 326 -230 -158 90 11 69 -86 16 33 -76 -156 -186 310 340 -7 -526 -245 154 20 397 155 -557
3871 -557 -176 5 251 -230 257 -182 -143 -194 -251 43 161 -456 -159 216 34 -304 -84 272 -173 -748 128
3892 128 266 133 73 33 -20 -295 -326 -471 55 157 -383 -287 62 -466 476 5 -502 365 374 -260 -233 -26 -270
3915 -270 -115 160 161 348 -338 -402 25 451 541 -272 -34 147 -456 342 265 340 229 21 219 17 482 -174
3937 -174 219 337 27 630 -380 88 45 -86 -55 -423 -331 -255 403 -405 -246 -41 328 116 284 -87 9
3958Il60o33P82L81K4K4p69L85L08rm06P3lP24j85Q8l91L53n05k09J89M67l6k66
3982C5j03j87k15L00j8J7m20L92j88J153j66q02M80m73J56m52M21J67n29J26N90
4003B84n08j89M54k15j66k69M16n63O23m22O60q14K96J56N2L39m11K32J85j1k32
4024a03l46K00L49M47n25J51M00K1o11M08M39k14q08j45L36N5m29L52J11l26j84
4045d22P09l11k52P00n03J82l40j59K04K04K32m15M75k0m07P59l1n97p47O54R9
4066A4l85K07L8n8q02J332L01n35J77o7l02k21%L07j82qJ60l00R7k67N32j71J59
4089B6J69m9K07n11Q09p48J28O12Q5q42J77k58m70M62L47R3r52O53P49q63L28
4110A52M02p09J72o02K83Q64j94K33l85J69m44l42J81l5O11m56l00N25n24L46
$$ plain form
3958 9 -351 -984 -202 179 203 227 -542 -157 151 142 -264 -191 -194 530 345 433 42 395 -110 -319 -130 337 301 35
3982 35 -68 -255 -470 -170 -188 -171 -591 -199 -387 766 600 -202 278 -195 -39 -491 -70 97 -432 -306 284
4003 284 -224 -413 41 -174 -340 -609 -193 -756 -133 -555 105 -709 -413 -257 -205 134 -277 -45 140 129 -103
4024 -103 -449 -249 100 547 22 173 573 594 -17 391 830 616 -192 -337 -1 54 -375 -23 88 -238 -422
4045 -422 287 -24 -276 424 -79 103 -237 -396 -192 12 244 -171 304 284 -123 636 605 8 -739 -85 14
4066 14 -371 -164 -126 -184 -986 346 647 112 289 222 -80 -301 -301 6 -176 -184 -24 -324 -227 -494 38 -133 26
4089 26 195 146 353 -158 651 -97 31 643 728 -114 63 -195 -665 -203 144 237 -715 -62 687 -176 152
4110 152 554 -155 17 -585 -302 562 368 601 216 385 -59 -401 -220 -255 356 -100 -400 125 -399 -53
4130e3J69k0l42L34k60K93Q02j081M0N50J78m60k0k11P1K35j13j54M60m58n6J56
4152F0m51K65j67J50m52P93l54Q74j030o6J218k93m79L36J71m27k56J123j424
4171d09J011n39m53L84p3J75j95k6M23j136Q35m52O17J15j76m8j35j51J052j007
4191a88O09j14k96J21l93Q31j039J83O6N36L08k44k88O7l12L38K07k87n54j7K26
4212b40N27k46O98p50n7J62k62m67J070Lq00P72j040O98J09m06L90J34j024O00
4232a29O32l44L78j395J089K48q60r2L66r5M13o55O0O88j86P57n88n31J72oK95
4253B17J4n06o65R57M95o98J99o57M84O05k45k64O2l02M17p38Q78j19L70m93O1
4274G2K12l36k11J67m8K20m06j86K25O39r9m24J29j60P54l28j90J17j59k84O53
$$ plain form
4130 -53 116 96 -246 88 -172 121 923 -158 -118 432 610 150 130 -81 -10 225 112 -42 418 -40 -96 60
4152 60 -391 -126 -293 -143 -595 198 -156 718 -312 -378 840 547 68 404 575 148 -108 1015 -409
4171 -409 602 63 -390 -6 -79 96 -99 -125 298 -838 -3 -455 162 277 101 53 -82 -233 819 -188
4191 -188 421 307 11 132 -261 570 -469 -286 -220 316 624 380 92 159 -153 185 392 105 -449 -466 -240
4212 -240 287 41 739 -11 -68 94 -168 -635 435 438 -362 410 -630 68 177 -229 161 295 -729 -129
4232 -129 503 159 537 -858 231 479 -381 -473 -107 -202 211 -444 -384 304 118 875 287 -244 -72 -78 217
4253 217 231 -275 -940 17 512 -186 13 -644 -160 445 200 -64 -2 -304 113 -625 253 134 504 11 72
4274 72 284 -52 -263 -96 -144 76 -330 -516 -291 348 249 -175 -46 -206 548 220 30 147 -12 -296 357
4295C57m20N78k95k29n68L02Ol0L92l20Q2j53N72p90J60K68P3k27j35r7O9K23
4317a82j71M36J52o94O71n30m1M28p3N04p85l28J74m16J275p41M91J76j036J148
4337D58n82K44p5j65N01q3K84j51n27L51l68K00j41L42k82K62q31O38k58K01L69
4358C87L9p8m92M86j010R23r15M08J39J01k39r0L20q36J340l95l10N38k38N55
4378F33j378L00L47P95r85K52j28N49j029O57k73m49R45l49p25J046l27j87J22
4397a84j91Q83N4O05p92K12k2j68j5k7j499J804p52o67J531r94P33j179M20N10
4417B62n2n41j6L57j82j13M99j13o1k56q58J419j009Q23J23j261J20M25L0r5J125
4438F26j28q74P7K22O03r85L12p3n0M56j71r6p49q10K265o34k24M36j29Q45n06
$$ plain form
4295 357 -63 515 220 -9 -577 -275 -269 -299 93 -227 -145 -298 274 -516 -356 -88 -15 -242 -377 -474 -405 -182
4317 -182 -353 83 235 -459 212 -318 -359 69 -4 500 -285 -613 -439 -855 420 -321 170 346 -690 458
4337 458 -124 120 45 -120 381 298 582 431 -96 255 -113 87 -54 288 6 268 -563 75 -183 18 387
4358 387 426 348 -144 342 -668 255 -660 -252 -113 -12 -251 -341 -21 -857 483 88 -222 316 78 633
4378 633 -745 -445 -98 697 -288 -36 -164 385 -644 13 -260 -709 236 -113 -838 208 -119 -306 -184
4397 -184 -375 508 562 1167 375 587 565 397 382 355 -1144 660 -92 -759 772 -222 511 -668 -248 262
4417 262 210 -331 -347 10 -172 -285 214 101 40 -216 -1074 345 -664 159 282 -979 -859 -434 -404 -499 626
4438 626 498 -376 -299 -77 526 -459 -147 -220 -270 186 15 -81 -830 -1640 625 -9 -233 203 74 919 413
4459D13j374J667j772J33K040j881J481j46N41j261J039j105M22l91J475k022
4475g41J392R2j458Q05k62J99J26l69K25L25k52q9m84Q04p02M94K98J08l88J1
4495A34m3oJ419j199n4L87q43O07m65o0l89N55R0o79l62J417m26P89j091J206
4515I87j390L85k39J918j230j110J165r50k05J021n86r75J875j158M22o39O08
4532a01J104J66j269p04J46R53o1N7n11M41Q78p71l96q8k1J075j012k69r8J390
4552I09j939J079j69L82N3l2M09q43J102m26j071N75om65M94n17O15K32j708P42
4572e84J193m60J49j095O43j67O75P9n73K17o65J175m59q86L49R07p90M16L1j91
4592c6j28O46p05lP89r82J049p10N07j220M78L67k01Q05o94l7P39K31j215j27
$$ plain form
4459 413 -961 706 -1066 -933 1107 -774 707 561 1102 -159 880 -225 197 -194 1281 -741
4475 -741 651 743 -715 90 -172 27 153 -216 9 334 82 -7 -491 313 -389 105 403 511 123 134
4495 134 91 85 1504 305 251 638 -205 402 -63 -123 -512 43 133 -546 -908 509 83 872 -219 987
4515 987 -403 -18 -257 1661 431 -679 486 -464 -669 352 -234 -1209 666 -492 -70 -709 -101
4532 -101 1003 1169 -100 -804 -658 295 234 291 -220 221 1099 328 -68 -156 -177 898 -114 -383 -481 909
4552 909 -1030 49 -120 262 315 283 692 -151 951 525 -546 29 23 -442 52 -465 150 382 -1326 -584
4572 -584 609 149 298 -797 -154 -321 354 433 -140 77 -588 587 128 -758 -409 498 -292 124 155 -36
4592 -36 -164 482 -223 -226 563 -419 630 -80 427 -793 -315 52 -149 656 -38 -75 664 895 -320 -447
4612d47j18R66O1j94q33M01M90j115N03J39k29m39J389k38M57l76q14k63R82l30
4632hL01p53M59j32M15J74j470J346J68n94J2J06n52J147n08j87k82N12m20k01
4652d67P20p64R32l4o9J58p57J67J67K35l35q93J366O7j54l84J01J62l39K68m5
4673A02j10o6k14J32M53m76N56l8j614M64Q51K99m76l59K78L11L62m98l47N83
4693A93k91O96n75l06m18J470m20K04m73j31k30Q82m67q71O35Q6R5n05j46O39
4713F7n01K90Q64k36M12j92r12M58n6n45R21l34K72K49n4r61K11L96l87o27R70
4734C05p01J99R07p47o68Q79j034L79J009l80j86K28o3n91R03n44k76l49L36j62
4754e56Q21k43j09k61L78k56N01m98K36m11Q43N1j94K27p05R3O84j29P3n32N05
$$ plain form
4612 -447 -565 401 462 268 -565 -164 326 -789 -286 -147 -376 -815 574 336 793 417 -397 -660 322 -8
4632 -8 293 -460 -1 -133 282 456 -1014 332 500 -94 -82 24 -528 619 111 -76 -358 154 -266 -467
4652 -467 253 -511 421 387 318 476 -281 -114 53 288 -47 -940 426 493 339 -45 56 218 -121 147 102
4673 102 -8 -74 -288 -156 297 -179 377 339 -1275 -811 40 339 -137 -496 -218 93 455 -43 -390 193
4693 193 -98 598 23 -283 -701 769 349 553 80 -51 -281 601 134 -737 -102 -16 79 -426 -572 67
4713 67 -434 -144 720 484 896 704 -208 250 194 -351 570 236 508 757 703 -258 -47 349 -38 -665 305
4734 305 -396 -197 710 -37 -705 174 -860 -481 528 148 -38 190 127 -464 439 -105 -381 -730 -394 -556
4754 -556 265 22 -87 -348 30 -226 275 -223 13 -398 445 496 302 529 -176 -83 601 472 545 13 518
4775E18o63m75J236l77L7q24M94K83J30j057J47N82K23l51J66m51l6PP09k65j95
4796a62k97Q9J13Q15L21j310K61l41P31r47j24J135k57j3j31J46L74K17L88r62
4816D6O14n78J34n77J020m7L4k29p33L97K32k42r7Q32n10q23r5L48L43k77K83
4837G5k8O15l56p8j53N38l30Jl27K95O7m64O06n29O80l99m06k21j71L10q7M86
4859A24M11p95k83J56M37N11l40K04q27k8K38K07L67j81L57l35L63l15n45N97
4879C23k53n87N05j3k06j26j9Q55o28k66K70L1p9o7J226l80r46N78P4p68K20K27
$$ plain form
4775 518 -145 -620 616 239 276 -548 -54 229 359 -698 -551 31 254 -97 69 -382 -418 -411 298 33 -162
4796 -162 -459 -370 -257 558 879 -431 -170 -511 220 -727 -851 284 27 14 -117 29 403 620 1008 46
4816 46 660 82 216 -361 659 612 646 417 -316 81 313 71 -26 806 296 -527 -622 -274 69 -208 75
4837 75 47 662 306 228 75 613 283 284 -43 252 319 -145 461 -68 612 213 -193 -414 -585 -275 -362 124
4859 124 535 -260 -543 -387 50 561 221 425 -402 -430 -192 15 382 201 558 223 586 271 -274 323
4879 323 70 -517 -12 -25 -231 -357 -376 479 -149 -415 -145 -114 -193 -260 966 586 -360 218 292 -476 -256 -29
$$ [...]
8191D79
##END NTUPLES=NMR FID
##END=
