##TITLE=1H_CA-8711-2
 DMSO, 8 sc, 
 1.6.2020
##JCAMPDX= 6.0         $$ Bruker NMR JCAMP-DX V2.0
##DATA TYPE= NMR FID
##DATA CLASS= NTUPLES
##ORIGIN= UXNMR, Bruker Analytische Messtechnik GmbH
##OWNER= root
$$ XWIN-NMR		Version 3.5
$$ Mon Jun  1 12:43:13 2020 Russian Standard Time (UT+4h)  she@DPX200
##.OBSERVE FREQUENCY= 200.1315
##.OBSERVE NUCLEUS= ^1H
##.DELAY= (6, 6)
##.ACQUISITION MODE= SIMULTANEOUS
##.ACQUISITION SCHEME= undefined
##.AVERAGES= 8
##.DIGITISER RES= 18
##SPECTROMETER/DATA SYSTEM= spect
##.PULSE SEQUENCE= zg30
##.SOLVENT NAME= DMSO
##.SHIFT REFERENCE= (INTERNAL, DMSO, 0, 15.7039)
##AUDIT TRAIL= $$ (NUMBER, WHEN, WHO, WHERE, WHAT)
$$ ##TITLE= Audit trail, XWIN-NMR		Version 3.5
$$ ##JCAMPDX= 5.01
$$ ##ORIGIN= Bruker BioSpin GmbH
$$ ##OWNER= she
$$ F:/spectra/data/she/nmr/H-F/1/audita.txt
$$ ##AUDIT TRAIL=  $$ (NUMBER, WHEN, WHO, WHERE, WHAT)
(   1,<2020-06-01 12:42:13.07 +0400>,<she>,<DPX200>,
      <created by zg, POWCHK disabled, PULCHK disabled
       configuration hash MD5:
       00 E9 B6 7A A2 85 ED C7 34 08 36 98 17 FE 4E 26
       data hash MD5: 16K
       19 F3 4E 5F E3 E3 35 B7 16 AD 81 5B 96 F6 B3 37>)
$$ ##END=
$$ 
$$ hash MD5
$$ 02 6A 5D 4F A5 FD CD 6A 66 2D B0 C6 C4 AB BB 9A
##$RELAX= 
##$RELAX= 
##$RELAX= 
##$RELAX= 
##$RELAX= 
##$RELAX= 
$$ Bruker specific parameters
$$ --------------------------
##$DU= <F:/spectra>
##$EXPNO= 1
##$NAME= <H-F>
##$PROCNO= 1
##$TYPE= <nmr>
##$USER= <she>
##$AMP= (0..31)
100 100 100 100 100 100 100 100 100 100 100 100 100 100 100 100 100 100 
100 100 100 100 100 100 100 100 100 100 100 100 100 100 
##$AQSEQ= 0
##$AQ_mod= 1
##$AUNM= <au_zg>
##$AUTOPOS= <>
##$BF1= 200.13
##$BF2= 200.13
##$BF3= 200.13
##$BF4= 200.13
##$BF5= 200.13
##$BF6= 200.13
##$BF7= 200.13
##$BF8= 200.13
##$BYTORDA= 1
##$CFDGTYP= 0
##$CFRGTYP= 5
##$CHEMSTR= <none>
##$CNST= (0..31)
1 1 145 1 1 1 1 1 1 1 1 1 1 1 1 1 1 1 1 1 1 1 1 1 1 1 1 1 1 1 1 1 
##$CPDPRG= <>
##$CPDPRG1= <>
##$CPDPRG2= <>
##$CPDPRG3= <>
##$CPDPRG4= <mlev>
##$CPDPRG5= <mlev>
##$CPDPRG6= <mlev>
##$CPDPRG7= <mlev>
##$CPDPRG8= <mlev>
##$CPDPRGB= <>
##$CPDPRGT= <>
##$D= (0..31)
0 1.2 0 0 0 0 0 0 0 0.06 0 0.03 0 0 0 0 0.0002 0 0 0 0 0 0 0 0 0 0 0 0 
0 0 0 
##$DATE= 1591000932
##$DBL= (0..7)
120 120 120 120 120 120 120 120 
##$DBP= (0..7)
150 150 150 150 150 150 150 150 
##$DBP07= 0
##$DBPNAM0= <>
##$DBPNAM1= <>
##$DBPNAM2= <>
##$DBPNAM3= <>
##$DBPNAM4= <>
##$DBPNAM5= <>
##$DBPNAM6= <>
##$DBPNAM7= <>
##$DBPOAL= (0..7)
0.5 0.5 0.5 0.5 0.5 0.5 0.5 0.5 
##$DBPOFFS= (0..7)
0 0 0 0 0 0 0 0 
##$DE= 6
##$DECBNUC= <off>
##$DECIM= 24
##$DECNUC= <off>
##$DECSTAT= 4
##$DIGMOD= 1
##$DIGTYP= 9
##$DL= (0..7)
0 120 120 120 120 120 120 120 
##$DP= (0..7)
150 150 150 150 150 150 150 150 
##$DP07= 0
##$DPNAME0= <>
##$DPNAME1= <>
##$DPNAME2= <>
##$DPNAME3= <>
##$DPNAME4= <>
##$DPNAME5= <>
##$DPNAME6= <>
##$DPNAME7= <>
##$DPOAL= (0..7)
0.5 0.5 0.5 0.5 0.5 0.5 0.5 0.5 
##$DPOFFS= (0..7)
0 0 0 0 0 0 0 0 
##$DQDMODE= 0
##$DR= 18
##$DS= 0
##$DSLIST= <SSSSSSSSSSSSSSS>
$$ [...]
##$SUBNAM2= <"">
##$SUBNAM3= <"">
##$SUBNAM4= <"">
##$SUBNAM5= <"">
##$SUBNAM6= <"">
##$SUBNAM7= <"">
##$SUBNAM8= <"">
##$SUBNAM9= <"">
##$SW= 24.9337058887773
##$SWIBOX= (0..15)
0 0 2 0 0 0 0 0 0 0 0 0 0 0 0 0 
##$SW_h= 4990.01996007984
##$TD= 16384
##$TD0= 1
##$TE= 0
##$TE2= 300
##$TE3= 300
##$TEG= 300
##$TL= (0..7)
0 120 120 120 120 120 120 120 
##$TP= (0..7)
150 150 150 150 150 150 150 150 
##$TP07= 0
##$TPNAME0= <>
##$TPNAME1= <>
##$TPNAME2= <>
##$TPNAME3= <>
##$TPNAME4= <>
##$TPNAME5= <>
##$TPNAME6= <>
##$TPNAME7= <>
##$TPOAL= (0..7)
0.5 0.5 0.5 0.5 0.5 0.5 0.5 0.5 
##$TPOFFS= (0..7)
0 0 0 0 0 0 0 0 
##$TUNHIN= 0
##$TUNHOUT= 0
##$TUNXOUT= 0
##$USERA1= <user>
##$USERA2= <user>
##$USERA3= <user>
##$USERA4= <user>
##$USERA5= <user>
##$V9= 5
##$VALIST= <valist>
##$VCLIST= <CCCCCCCCCCCCCCC>
##$VD= 0
##$VDLIST= <DDDDDDDDDDDDDDD>
##$VPLIST= <PPPPPPPPPPPPPPP>
##$VTLIST= <TTTTTTTTTTTTTTT>
##$WBST= 1024
##$WBSW= 4
##$XGAIN= (0..3)
0 0 0 0 
##$XL= 0
##$YL= 0
##$YMAX_a= 491506
##$YMIN_a= -362796
##$ZGOPTNS= <>
##$ZL1= 120
##$ZL2= 120
##$ZL3= 120
##$ZL4= 120
##$ABSF1= 10
##$ABSF2= 0
##$ABSG= 5
##$ABSL= 3
##$ALPHA= 0
##$AQORDER= 0
##$ASSFAC= 0
##$ASSFACI= 0
##$ASSFACX= 0
##$ASSWID= 0
##$AUNMP= <proc_1d>
##$AZFE= 0.1
##$AZFW= 0.1
##$BCFW= 1
##$BC_mod= 2
##$BYTORDP= 1
##$COROFFS= 0
##$CY= 11.3945322036743
##$DATMOD= 1
##$DC= 2
##$DFILT= <>
##$DTYPP= 0
##$F1P= 16.9975609425685
##$F2P= -3.02152046262296
##$FCOR= 0.5
##$FTSIZE= 0
##$FT_mod= 4
##$GAMMA= 1
##$GB= 0.15
##$INTBC= 1
##$INTSCL= 1
##$ISEN= 128
##$LB= 0.24
##$LEV0= 0
##$LPBIN= 0
##$MAXI= 10000
##$MC2= 0
##$MEAN= 0
##$ME_mod= 0
##$MI= 1.114404
##$NCOEF= 0
##$NC_proc= 0
##$NLEV= 6
##$NOISF1= 3.799351
##$NOISF2= 2.8
##$NSP= 1
##$NTH_PI= 0
##$NZP= 0
##$OFFSET= 15.70392
##$PC= 1
##$PHC0= -9797.126
##$PHC1= 20.60082
##$PH_mod= 1
##$PKNL= yes
##$PPARMOD= 0
##$PSCAL= 0
##$PSIGN= 0
##$REVERSE= no
##$SF= 200.130013532006
##$SI= 16384
##$SIGF1= 3
##$SIGF2= 2
##$SINO= 400
##$SIOLD= 16384
##$SREGLST= <1H.CDCl3>
##$SSB= 0
##$STSI= 0
##$STSR= 0
##$SW_p= 3612.71676300578
##$SYMM= 0
##$S_DEV= 0
##$TDeff= 0
##$TDoff= 0
##$TI= <>
##$TILT= no
##$TM1= 0
##$TM2= 0
##$TOPLEV= 0
##$USERP1= <user>
##$USERP2= <user>
##$USERP3= <user>
##$USERP4= <user>
##$USERP5= <user>
##$WDW= 1
##$XDIM= 8192
##$YMAX_p= 0
##$YMIN_p= 0
$$ End of Bruker specific parameters
$$ ---------------------------------
##NTUPLES= NMR FID
##VAR_NAME=  TIME,          FID/REAL,        FID/IMAG
##SYMBOL=    X,             R,               I
##VAR_TYPE=  INDEPENDENT,   DEPENDENT,       DEPENDENT
##VAR_FORM=  AFFN,          ASDF,            ASDF
##VAR_DIM=   8192,          8192,            8192
##UNITS=     SECONDS,       ARBITRARY UNITS, ARBITRARY UNITS
##FACTOR=    0.0002004,     1,               1
##FIRST=     0,             0,               0
##LAST=      1.6414764,     0,               0
##MIN=       0,             -362796,         0
##MAX=       1.6414764,     491506,          0
$$ Real data points
##PAGE= N=1
##DATA TABLE= (X++(R..R)), XYDATA
$$ [...]
2167a188j872J772K853K129o40l265j982J100K342J367L59k170l107o02K606K398
$$ -1188 -3060 -1288 1565 3694 3054 -211 -2193 -1093 1249 2616 2975 805 -2302 -2904 -298 2100
2183B100L8k006l149j132K597L093k9k257k110j212J137L571Q81j301k770j187
$$ 2100 2138 132 -3017 -4149 -1552 1541 1512 -745 -2855 -4067 -2930 641 1522 221 -2549 -3736
2199c736J069L214K097j358k899j353N78K517K476L07l183k592P73K313K071P31
$$ -3736 -2667 547 2644 1286 -1613 -2966 -2388 129 2605 2912 -271 -2863 -2090 223 2294 3025
2215C025l264k678K64K095K081p5j386k314o42J777K066P69o90k562j476J256
$$ 3025 -239 -2917 -2653 -558 1523 1448 62 -2252 -2894 -1117 949 1718 1028 -1534 -3010 -1754
2231a754L539J611j291k194j607R15L518K095j175k593j771O37K765K433p34k635
$$ -1754 1785 3396 2105 -89 -1696 -781 2737 4832 3657 1064 -707 -70 2695 5128 4394 1759
2247A759j810M46J437J924N8k046k206l45N82J510J814j253l894j546J676K898
$$ 1759 -51 395 1832 3756 3814 1768 -438 -783 -201 1309 3123 1870 -2024 -3570 -1894 1004
2263A004R69j854k843j208J439K876P49q90j998k038R24K881J671r05k041j486
$$ 1004 1973 119 -2724 -3932 -2493 383 1132 242 -1756 -3794 -2870 11 1682 777 -1264 -2750
2279b750O4K304J871j99j685j809r86J086L287R39k281l198m11J900K266J086
$$ -2750 -2686 -382 1489 1290 -395 -2204 -3190 -2104 1183 2122 -159 -3357 -3768 -1868 398 1484
2295A484k487k427k13J690J737R25o00k392j092J239J913J361J17j805j922L41
$$ 1484 -1003 -3430 -3643 -1953 -216 709 109 -2283 -3375 -2136 -223 1138 1255 -550 -2472 -2131
2311b131K652K186j48j726k069m25K292K780Q0k005k319k97K428K493l03k346
$$ -2131 521 2707 2559 833 -1236 -1661 631 3411 3491 1486 -833 -1130 1298 3791 3488 1142
2327A142j395n3J035J456J198j448j678j165K78K051K096n22k778j799Q26J904
$$ 1142 -253 -306 729 2185 3383 1935 257 -908 -630 1421 3517 2995 217 -1582 -756 1148
2343A148J828J89k805k284O51K884J284n14k102k126M69J724J622o59j380j259
$$ 1148 2976 3165 360 -1924 -1273 1611 2895 2381 279 -1847 -1378 346 1968 1309 -71 -1330
2359a330q47O12K076J044j116j836j888J99L048J703j460k606j244R94K364J623
$$ -1330 -2177 -1565 511 1555 439 -1397 -3285 -3086 -38 1665 205 -2401 -3645 -2651 -287 1336
2375A336r74l004p47J006J643J568o23j598q83K90J151J083N68p47j944p51J441
$$ 1336 362 -2642 -3389 -2383 -740 828 205 -1393 -2276 -1986 -835 248 816 69 -1875 -2626 -1185
2392a185K012J176r38l016r25J530K920P84j257k341p88J274K649P09j722j242
$$ -1185 827 2003 1065 -1951 -2876 -1346 1574 2358 1101 -1240 -2028 -754 1895 2604 882 -360
2408c60o74M94J729J212o26j425o47m38J017K317L47j901k193o15J625K660N22
$$ -360 -1034 -540 1189 2401 1775 350 -297 -735 282 2599 2946 1045 -1148 -1763 -138 2522 3044
2425C044j976k942p1K103J700K03j148j945n26J529J682K88o75j252j121L40J683
$$ 3044 1068 -1874 -1945 158 1858 2061 913 -1032 -1558 -29 1653 1941 1266 14 -1107 -767 916
2442I16J318k27j142j792m83K220K277o55k158j968k80K308K145m32k716j293
$$ 916 2234 2007 865 -927 -1410 810 3087 2432 274 -1694 -1974 334 2479 2047 -669 -1962
2458a962M24J008J217L23j610j143K07o0J070J089j02k146j377P73J627J571P6
$$ -1962 -1538 -530 687 1010 -600 -1743 -1536 -1596 -526 563 461 -1685 -3062 -2289 -662 909 985
2475I85k233k061J048K085J832q50k151j178P61K169R26q67j195r32r4J666P16
$$ 985 -1248 -3309 -2261 -176 1656 806 -1345 -2523 -1762 407 1333 466 -729 -1661 -1755 -89 627
2492F27K40j145j61j450O28J748J377q60k072j087Q30K003K028j044k648r58J634
$$ 627 867 -278 -439 -1889 -1261 487 1864 1004 -1068 -2155 -1325 678 2706 1662 -986 -1944 -310
2509c10J878J062j013k121m95J695J048K70K06j141j039l55J316O16N37l96j884
$$ -310 1568 2630 1617 -504 -999 696 1744 2014 2220 1079 40 -315 1001 1617 2154 1758 -126
2526a26j451J087K033N98j218k508r13J548K234M25j991j479l27J147J022Q06
$$ -126 -1577 -490 1543 2141 923 -1585 -2498 -950 1284 1709 -282 -1761 -2088 -941 81 887
2542H87r55j350k58M71O63J245J61j557j025q7J197J572P49j363k263m4J863J583
$$ 887 -68 -1418 -1676 -1205 -542 703 864 -693 -1718 -1805 -608 964 1713 350 -1913 -1957 -94 1489
2560A489O51j732k049l25K404J149k40r64j297l28Q76Q76N89k33j013j302k24
$$ 1489 2140 408 -1641 -1966 438 1587 1347 383 -914 -1242 -366 510 1099 866 -147 -1449 -1673
2577a673J725K102r53j681j229M8J832K055n81k301r29L15J479J429l31j415j221
$$ -1673 52 2154 1201 -480 -1709 -1661 171 2226 1645 -656 -1585 -1270 209 1638 1307 -108 -1329
2594a329M73R82O45L89o25j433m29M91P48J566k21j887j463N36K212R10m96j984
$$ -1329 -856 126 771 1160 535 -898 -1327 -836 -88 1478 1257 -630 -2093 -1557 655 1565 1069 -915
2612i15j397J288J979Q80j641q64q41P01J078Q83j24j156j86o30M43J477P60r14
$$ -915 -2312 -1024 955 1835 194 -670 -1511 -810 268 1151 1027 -129 -315 -945 -502 975 1735 821
2630H21j517m69L22J429J678j006k688n55J405K088L91j012k426J80J383R86j90
$$ 821 -696 -1165 -843 586 2264 1258 -1430 -1985 -580 1508 1899 887 -1539 -1359 24 1010 820
2647H20k04n68j357L18R90P59j49j97j459o50J128J652L20j066j563n40O73K628
$$ 820 616 48 -1309 -991 -1 758 609 412 -1047 -1697 -569 1083 1403 337 -1226 -1766 -1093 1535
2665A535K18j784j519J23J042J561L88j928n82J18R64N9O58K05p70j139K5Q04
$$ 1535 1753 -31 -1550 -1427 -385 1176 1564 -364 -946 -828 136 195 853 1058 288 -851 -826 -22
2683b2J279M65j451j994M81J627J069j48j056j797J20J896Q93k77j307o47l46
$$ -22 1257 1722 271 -1723 -1242 385 1454 1306 250 -1547 -1427 469 1362 1085 -222 -869 -1215
2700a215P73J470m77p01l03m74k59J438J061m13j164j152Q0J418J879n86k287
$$ -1215 -442 1028 551 -150 -453 -927 -1186 252 1313 900 -264 -1416 -1336 82 1961 1375 -912
2717i12o26O18J577Q69m88j614p02R39O86L28Q6p79p29k3P47K40L53J06j002j300
$$ -912 -1538 -920 657 1526 1038 -576 -1278 -339 347 675 761 -18 -747 -770 -23 217 570 676 -326 -1626
2737a626Q00J450O01l31j404j442Q19K563K97j272j440m87Q66J356M76q07j019
$$ -1626 -826 624 1225 894 -510 -1952 -1133 1430 1727 455 -985 -1472 -606 750 1226 419 -600
2754f00K71J79K44N96M58l03j149l82l4J252J278p75j959o68J228J268P37q78
$$ -600 -329 -150 94 690 1148 845 -304 -686 -720 532 1810 1035 -924 -1592 -364 904 1641 763
2772G63k498PJ677J399o09o64o10n01R21O99k30j64q5o86o25Q37J787j78o90j133
$$ 763 -1735 -1728 -51 1348 739 75 -535 -1036 -115 584 354 190 105 -581 -1206 -369 1418 1240 550 -583
2792e83p11Q53K040Q4j657j444L4J466J492J67j574j485O79R53Q5K23l30q25j9
$$ -583 -1294 -441 1599 1683 26 -1418 -1384 82 1574 1741 167 -1318 -639 314 399 622 292 -533 -552
2811e52M83lN01J43k61j560k03J495J102o5q99j682oJ984J118r43j292l02p5J402
$$ -552 -69 -72 429 572 311 -1249 -1452 43 1145 1080 181 -1501 -1507 477 1595 652 -640 -942 -1017 385
2831C85R60p56j075m7k41O62P23O18j264j81l70l63P93J362j90j725p47K54J269
$$ 385 1345 589 -486 -533 -774 -112 611 1229 -35 -216 -586 -949 -156 1206 1016 -709 -1456 -1202 67
2850F7J489p22j792q25R24J599J40m33r00m59M92O85L48m10k4n32m99N98Q43K49
$$ 67 1556 834 -958 -1783 -859 740 880 447 -453 -912 -420 265 613 203 179 -353 -852 -254 589 838
2870H38k78j085m25L88J300Q89r00j432n05Q55J332L39j099r43K36N73M85M32
$$ 838 560 -525 -950 -562 738 1627 727 -705 -1210 -355 977 1316 217 -726 -490 83 568 1000
2888A000n84o44j60O5M08O96N25n70j299l67J303K94Q17r37j278o45J526J077
$$ 1000 416 -228 -388 -323 85 781 1306 736 -563 -930 373 667 1484 547 -731 -1376 150 1227
2906A227q4q15p98p09J209R84l77m25o29l5R1L68N88j66r35k01k29N50J154K25
$$ 1227 1143 328 -470 -1179 30 1014 637 212 -417 -452 -361 7 595 429 -506 -707 -936 -386 768 993
2926I93j083j121k3P52J093M41j424j233M71J152J15L92o79q56NN04N67J6J07
$$ 993 -90 -1211 -1234 -482 611 1052 -372 -1605 -1134 18 133 525 -154 -1010 -1005 -501 66 82 189
2945A89n75r95P22M95Q76oo93q60k82J431R44l81r43r77j01J327J053l53j313
$$ 189 -386 -1381 -659 -164 712 706 13 -847 -1129 302 1246 865 -78 -1055 -1156 171 1224 871 -442
2964d42l6Q4L26R07J06j015k49N0kO72R30n93q63l60K99R44Q87n24j349n75P71
$$ -442 -478 -394 -68 839 945 -70 -319 -269 -271 401 1331 738 -125 -485 -186 758 1645 1121 -228 -803 -32
2985c2J086M23o96r36o74O92P71M54o46l65k53m04R26O78l57m34o48l97Q50O58
$$ -32 1054 1477 781 -155 -829 -137 634 1088 442 77 -176 -580 346 1024 667 233 -415 -812 38 696
3005F96N93j038o05o21O25J144N94j203j085j06Q87L22N38m76j011n7K83J89J43
$$ 696 1289 251 -354 -975 -350 794 1388 185 -900 -1006 -119 203 741 265 -746 -803 -520 -331 -188
3024a88P28q74q34p5J096K74M55n67j085j34Q22Q49j28n35p73n83J532J151n93
$$ -188 540 -334 -1168 -1243 -147 127 582 15 -1070 -1204 -382 467 339 -196 -969 -1552 -20 1131 538
3043E38r29m4O3K55O84K77n97m76j60K06L44P10J45j277m62K4O79J239j55j285
$$ 538 -391 -435 -372 -117 567 844 247 -229 -389 -183 161 871 1016 -261 -723 -699 -20 1219 1064 -221
3063b21r82N71R31M54n2p17r02O75R33J21j43j57n45n56M55O78K11l3l29r67J59
$$ -221 -1203 -632 299 753 701 -16 -918 -243 690 811 668 511 -34 -590 -135 543 754 721 392 -575 -416
3084d16R37P05m45p30o69J72J056N33p52q93p0J64Q47J25J08r42n90L50L51J57
$$ -416 521 1226 781 51 -618 -446 610 1143 391 -502 -572 -408 439 564 672 -270 -860 -510 -159 -2
3104bN77p12l23n97Q01K52N37J2j338l39O61R99K21l30j066l09N68J053j28o33
$$ -2 575 -137 -460 -1057 -256 -4 533 545 -793 -1132 -471 528 749 419 -647 -956 -388 665 537 -96
3124i6m92J97o06J099K64j75m08pn70J02R66K77q08k07k31J60Q31P50j058n99
$$ -96 -588 -391 -997 102 366 191 -217 -224 -794 -692 274 551 -257 -464 -695 -535 296 1046 -12 -611
3144f11n0N87M66N9L9q44j79L05N64J04P4n03l13J85N17J81L9m62m41n90J252
$$ -611 -661 -74 392 451 490 -354 -533 -228 336 440 514 11 -302 -117 400 581 620 158 -283 -873 379
3165C79L39j32k67p42r7M73R71l70n17n98LK84P96k94j45l91j25J97J73O33P3
$$ 379 718 586 319 -423 -520 -47 924 554 37 -561 -558 -274 522 228 83 -308 -433 -236 -63 570 643
3186F43q50m15K47L32N63N25j506m03K15O33M85j54m71n72N34P1L95L8n58k55
$$ 643 -207 -622 -375 -43 520 1045 -461 -864 -649 -16 469 315 -156 -728 -194 -123 272 310 -248 -503
3206e03m8N73N36l99q6k14l84Q8Q97P7l92l75l30j8Q11O96r17l08j42K73L35P84
$$ -503 -551 22 558 159 73 -141 -525 -437 460 537 145 -230 -560 -578 233 929 12 -296 -438 -165 170 954
3228I54n50p96r5N35n9M32J82q31j37j03J63K63P36k2r72l83P07L29O0n1p09m20
$$ 954 404 -392 -487 48 -11 421 603 -228 -365 -468 -305 -42 694 672 -300 -683 24 353 413 362 -347 -767
3250g67K42Q77M79q18j18l13K42M54L12o80j21k13k5M05O13m12m51k97j45K39
$$ -767 -525 352 831 13 -105 -418 -176 278 590 -90 -211 -424 -449 -44 569 157 -294 -591 -736 -497
3270d97Q48L15q97n46L74K01M50L91p77m50j31Q92M15j21l31l80l48M12O98l98
$$ -497 351 666 -231 -777 -403 -202 248 639 -138 -588 -719 173 588 467 136 -244 -592 -180 518 120
3290A20J02r7n74J43M12M82j73j00p04k7N89O20n75j48n84K59K47P16m18n19Q9
$$ 120 222 125 -449 -306 106 588 415 315 -389 -416 173 793 218 70 -514 -255 -8 708 290 -229 -140
3311a40Q5r6K01O32m01o31K64M92j02K88K24r35j57P5M69M10pq15l16m0N44O25
$$ -140 -55 -151 50 682 281 -350 -86 406 304 592 816 -119 -276 -201 268 678 671 -144 -460 -500 44 669
3333F69o29j34r4n02Q58K11l64j61k95K2J74O21o8l28m42J31m63O19M15j66m17
$$ 669 40 -94 -188 -690 168 379 15 -146 -441 -419 -245 376 308 -20 -462 -331 -794 -175 240 74 -343
3354c43j13kL74K00j3m15l26L73o3k0P70o70n91N47L50K06o8j01p66JP54L1L46
$$ -343 -456 -458 -84 116 103 -312 -638 -265 -328 -348 422 -248 -839 -292 58 264 196 95 -671 -670 84 115 461
3377D61m02m63j65J75R27l16O0l95k36J60M48K23l27j94l43K56N16L28j55n42
$$ 461 59 -404 -569 -394 533 217 277 -118 -354 -194 254 477 150 -44 -387 -131 385 713 558 16
3397A6k02J42r2M59K58m25o34L18Q4M55O37q05k84k45N20M17k9J28p59k00M37
$$ 16 -186 -44 -136 323 581 156 -478 -160 -76 379 1016 211 -73 -318 202 619 590 718 -41 -241 196
3418A96J80K54j29n89j70m12J050J35j49l72k15l70J031J68n04k15k42j0K34N40
$$ 196 376 630 501 -88 -258 -670 380 515 366 -6 -221 -591 440 608 104 -111 -353 -363 -129 411
3438D11j32k47o37K20J17K46K87l19o01n6P42j93M6L22q09j27M16J05M81o1n84
$$ 411 279 32 -605 -385 -268 -22 265 -54 -655 -711 31 -162 -116 206 -603 -730 -314 -209 272 211 -373
3459c73n31L97O51M5l89j95m7j88N89J12k5l0k79l77N43L65k9m58o0l3J76L09
$$ -373 -904 -507 144 189 -200 -395 -442 -630 -41 71 46 16 -263 -640 -97 268 239 -219 -279 -312 -136 173
3481A73N88m96j03k23M72J42L67k91o33K2N49K8krn58k38K26L97K0n9n37j63j9
$$ 173 761 265 162 -61 411 553 920 629 -4 18 567 595 593 584 26 -212 14 411 431 372 -165 -328 -347
3504c47O61J81j00m78r0r9N1J306q64j50j58J7k18Q10L50o39m94r0J57L76L49
$$ -347 314 495 395 -83 -173 -272 -221 1085 221 71 -87 -70 -288 522 872 233 -261 -351 -194 182 531
3525E31l44j46k65l3M00K23m44m44k86M16p2L34L83l41n30k5N41K55p4k36k69
$$ 531 187 41 -224 -257 143 366 -78 -522 -808 -392 -464 -130 253 -88 -618 -643 -102 153 79 -157 -426
3546d26m38N70L20j53K30k63m00L09N89J18k40l21J11l96O37K06J28p43K11j61
$$ -426 -864 -294 26 -127 103 -160 -560 -251 338 456 216 -105 6 -390 247 453 581 -162 49 -112
3566a12M44j23J35l76o23M14K63J92m6m06m36L22L16Q4K72l63j54j30K43M56j97
$$ -112 332 209 344 -32 -655 -241 22 214 168 -238 -674 -352 -36 48 320 -43 -197 -327 -84 372 175
3587A75j46j44K4k4M20N4K04k28n70L59L95J90n00k03LJ11K0L37r8l73j65J60
$$ 175 29 -115 -91 -115 305 359 563 335 -235 124 519 709 209 6 9 120 140 477 379 6 -159 1
3609An69N04L69l54p1r1k79L99L33l57k72PQ6J46M98k82j83l42L62M06l98N89
$$ 1 -568 -64 305 -49 -120 -211 -490 -91 242 -115 -387 -380 -294 -148 350 68 -115 -457 -95 311 -87 502
3631E02k31m90J50N35N3j84k91k30j8J00K01m6j84j20p7K29L55j3m01m88J33K12
$$ 502 271 -219 -69 466 519 335 44 -186 -204 -104 97 51 -133 -253 -330 -101 254 241 -160 -648 -515 -303
3653c03J41L45l49m17K30J99M76k40L95k84m97J63K61L21Q9m60J58k93L10K95
$$ -303 -162 183 -166 -583 -353 -154 322 82 477 193 -304 -141 120 441 530 70 228 -65 245 540
3673E40j16j14m57r7L36L36n33L6l0j89L40R1K93l31m71MJ69M36m5l08M4J3Q6
$$ 540 424 310 -147 -244 92 428 -105 -69 -99 -288 52 143 436 105 -366 -362 -193 243 198 -110 -66 -53 33
3696C3j74P16j94l24m54M72j65L37J0Ol74j21K85K00k53M0l25j18K56R7J09q7
$$ 33 -141 575 381 57 -397 75 -90 247 257 263 -111 -232 53 253 0 40 -285 -403 -147 -50 59 -28
3718b8j23n07L63N80l47L04k91q2k39M67r9R9k32j96m4L57N12m22m04j25M68N5
$$ -28 -151 -658 -295 285 -62 242 -49 -131 -370 97 -2 97 -135 -331 -375 -18 494 72 -332 -457 11 66
3740F6Q6k29Q5n10L33M19k49K35L21j043M22k57O97j79J19m71k95K30Q05m93M1
$$ 66 152 -77 8 -502 -169 250 1 236 557 -486 -64 -321 376 197 316 -155 -450 -220 585 92 133
3761A33m13o7N9O13j32m20K30k68Q5L99j12J2q6k54O9m5P28k45k10n43M11M3j4
$$ 133 -280 -347 -288 325 193 -227 3 -265 -180 219 107 119 33 -221 -152 -197 531 286 76 -467 -56 -13 -27
3784b7L18m43J38l01M00J20o8l4j48j88J54qJ73J91n16R2K8K01J61J2k54m88J04
$$ -27 291 -152 -14 -315 85 205 137 103 -45 -233 -79 -87 86 277 -239 -147 -119 82 243 255 1 -487 -383
3807c83N37j20j98N95o70J26j06K62L54m95m1P7j71K64L4j38j11R4K47j65J45
$$ -383 154 34 -164 431 -239 -113 -219 43 397 -98 -139 -62 -233 31 65 -73 -184 -90 157 -8 137
3828A37J53l15l86M39J35J68p1j45m95L66K11p4JJ3k37k47K74r4K24j06o3k31
$$ 137 290 -25 -411 28 163 331 260 115 -380 -14 197 123 124 137 -100 -347 -73 -167 57 -49 -112 -343
3850c43J98M86j10j44l30k75K54K40L80k26j43J43j51J2M52k76l40M48n9l42R2
$$ -343 -145 341 231 87 -243 -518 -264 -24 356 130 -13 130 -21 -9 443 167 -173 275 216 -126 -34
3871c4J72k48J8O3j56K82J38m69R7q0J44N6J75M9l33j68J82J97K4m70L03j01J6
$$ -34 138 -110 -92 -29 -185 97 235 -234 -137 -217 -73 -17 158 207 -126 -294 -112 85 109 -361 -58 -159 -143
3894a43M12j10k85p6j93K82M62j26j53j91K8j71j13P75Kn27k60L18k42N83l6l22
$$ -143 269 159 -126 -202 -395 -113 349 223 70 -121 -93 -264 -377 398 400 -127 -387 -69 -311 272 236 -86
3916h6j50J05Q6L04K0k11k35j8j07J74L39j23j45k64M77J13j74K23m89q6L1K40
$$ -86 -236 -131 -45 259 279 68 -167 -185 -292 -118 221 98 -47 -311 166 279 105 328 -161 -247 -216 24
3938B4M08l66j24j37QL00J17r8l9m36J30N89l41K89k02m29L07P2J58K16l00n01
$$ 24 432 66 -58 -195 -187 113 230 132 93 -343 -213 376 35 324 122 -307 0 72 230 446 146 -355
3960c55L45nR3k0K69l26m60M40M27n63j47L32l75q9N13Q9k03R4k27q4J06L34r8
$$ -355 -10 -15 78 58 327 1 -459 -19 408 -155 -302 30 -345 -434 79 168 -35 59 -168 -252 -146 188 90
3983I0k3L1m35K49K87j0k20Qm6J0j23L80J54l69j94M38k22M02k71j45m24R84k36
$$ 90 67 98 -337 -88 199 189 -31 -23 -69 -59 -182 198 352 -17 -211 227 5 407 136 -9 -433 551 315
4006C15l43J67k04j1q1O5K29Jm2j31j95L72k23n4j1o9k51J33M11j30k6j24M9o
$$ 315 -28 139 -65 -76 -157 -92 137 138 96 -35 -230 142 -81 -135 -146 -215 -466 -333 78 -52 -78 -202 -153 -159
4030a59K88J72l39r5PL51Q7l31M29l17k80J83j41L49j21n8j67M9K6K52J25k62
$$ -159 129 301 -38 -133 -126 225 312 -19 410 93 -187 -4 -145 204 83 25 -142 -93 -67 185 310 48
4052D8n84L15q9M17k02K02m03J04J65JO52n19k74j17J00N06l25K67k43J32M0L41
$$ 48 -536 -221 -310 107 -95 107 -296 -192 -27 -26 626 107 -167 -284 -184 322 -3 264 21 153 193 534
4074E34pn00Qn5R4K3J16k29K8k31j01J67K92k14J32m49j67L08rN3L76n52M4nK58
$$ 534 527 27 35 -20 74 97 213 -16 12 -219 -320 -153 139 -75 57 -392 -559 -251 -260 -207 169 -383 -339 -344 -86
4099h6o7N4k5m6K05j19L04o4k32k54K83J59N7K1k17j70K60k92N38r4l98k08L01
$$ -86 -153 -99 -124 -170 35 -84 220 156 -76 -330 -47 112 169 190 -27 -197 63 -229 309 215 -183 -391 -90
4122i0j95L59J71n26k07K26N39l77M45k45j38P7O5K82m20L00l01r4J80K77K7p1
$$ -90 -285 74 245 -281 -488 -262 277 -100 345 100 -38 39 104 386 -34 266 -35 -129 51 328 355 284
4144B84K5k52o0p7J81k06K77k54K59k7r2L9j76n0K79n9k17J34O4l79J00P9j41
$$ 284 309 57 -3 -80 101 -105 172 -82 177 150 58 97 -79 -129 150 91 -126 8 72 -307 -207 -128 -269
4167b69N96k62m26L73j22J03j0R8J3l26L57J74k00J86l05R0L7p5N4J20Rm01j75
$$ -269 327 65 -361 12 -110 -7 -17 81 94 -232 125 299 99 285 -20 70 107 32 86 206 215 -186 -361
4190c61J67N0J38k00K10j89o4R0J89j13j4j72M9j89M3O29m46J88l6j55N89m44
$$ -361 -194 -144 -6 -206 4 -185 -249 -159 30 -83 -97 -269 -220 -409 -366 263 -183 5 -31 -186 403 -41
4212d1j65L43j88m2L5j0K11m23L86k13K87J06k01r8m8J75N0l1k88K25m92J87K49
$$ -41 -206 137 -51 -93 -58 -68 143 -280 106 -107 180 286 85 -13 -61 114 164 133 -155 70 -422 -235 14
4235A4k3k85L64k67K56lL79m10k69J87K9J10N1n9Mm5PJ62j14J91n6j75l2pJ33
$$ 14 -9 -294 70 -197 59 56 435 25 -244 -57 -28 82 133 74 78 33 40 202 88 279 223 48 16 9 142
4260A42J51j75m09L30J26j08k5L17j53k0l83O9K02j22J42m19L82o2L27l98k04
$$ 142 293 118 -291 39 165 57 32 349 196 176 -207 -138 64 -58 84 -335 47 -15 312 -86 -290
4281b90J85K27j04J16J17l62Q2N2NpJ35J80l24P1PQ2j43q7R4m8j47J36J36q8j63
$$ -290 -105 122 18 134 251 -111 -29 23 28 21 156 336 12 83 90 172 29 -58 36 -12 -159 -23 113 25 -138
4306a38k43R1K17j5M84m06k65J36N14j14k85k18J96J7l7N61m04k03K07r7j95K64
$$ -138 -381 -290 -73 -88 396 -10 -275 -139 375 261 -24 -242 -46 -29 -66 495 91 -112 95 -2 -197 67
4328F7M34l82l19K23J48n1m8j58j90K26l8K15j26L29k22k60l6Q7p9L26j76j7P2
$$ 67 501 119 -200 23 171 120 72 -86 -276 -50 -88 127 1 330 108 -152 -188 -101 -180 146 -30 -47 25
4351B5j06L4j9J24j52N0K93Pl58L51j21k00R0J44p2j43R0O1j83K10j80K09k84
$$ 25 -81 -47 -66 58 -94 -44 249 256 -102 249 128 -72 18 162 90 -53 37 98 -85 125 -55 154 -130
4374a30j42L44J48j0j58j29J57J05k74K67J36k77r1j22J37K00k40M45l47q4L35
$$ -130 -272 72 220 210 52 -77 80 185 -89 178 314 37 -54 -176 -39 161 -79 366 19 -65 270
4395B70m16J52L44m90L3j62M94j75J58j77j29J00j91J50M2L0k52J14J74M5j0M4
$$ 270 -146 6 350 -140 -107 -269 225 50 208 31 -98 2 -189 -39 3 33 -219 -105 69 114 104 148
4417A48j86j66K22M7J67j84k58L47J89o85M22K6k49J79p2lK9n2J04m02M29k7M7
$$ 148 -38 -204 18 65 232 48 -210 137 326 -359 63 89 -160 19 -53 -56 -27 -79 25 -377 52 25 72
4440G2Q8j09m40Q7K57L5k7K0J52m01N71k68r2J32k29J96K1k7j18K36K23k46j41
$$ 72 160 51 -389 -302 -45 -10 -37 -17 135 -266 305 37 -55 77 -152 44 65 38 -80 156 379 133 -8
4463hK32k38m1j76K06J2J0RK22j27k40M57n38K80Q2r3M0L8Q4k99mn6M5L55k11
$$ -8 224 -14 -55 -231 -25 -13 -3 6 228 101 -139 318 -220 60 142 49 89 127 211 -88 -92 -148 -103 252 41
4488D1J99r9l45P9k25K75K03K10n62M30n9k58L11j37J06q2Q5r7q6L19K7o87L65
$$ 41 240 141 -204 -125 -350 -75 128 338 -224 206 147 -111 200 63 169 87 172 75 -11 308 335 -352 13
4511A3K55N4k63J89k18k88L42K75j87j89j18j58J43K54r9k38j2M33l65L39r3n7
$$ 13 268 322 59 248 30 -258 84 359 172 -17 -135 -293 -150 104 5 -233 -245 188 -177 162 69 12
4533A2L4j98O1P7j44M62m55M0j9J47J7M7M4k29k75L90m9K97k96j43J99O9p6p2
$$ 12 46 -152 -91 -14 -158 304 -151 -111 -130 17 34 81 125 -104 -379 11 -38 259 -37 -180 19 88 12 -60
4557f0J54j51l33L16N4K5J91j51J24j54L78l73M8j95Q1L9k13N76l35l57N95k63
$$ -60 94 -57 -390 -74 -20 5 196 45 169 15 393 20 68 -127 -46 -7 -220 356 21 -336 259 -4
4579dj01K13P9j06j31K68j69l8M7K0o0O9p1O8j8j70M1k03pL86N7j70N6r8p8j91
$$ -4 -105 108 187 81 -50 218 49 11 58 78 18 87 16 84 66 -104 -63 -266 -273 113 170 0 56 -42 -120 -311
4605c11K10mJ73J14l59K09k40L13l65O4J10j03j48L22j33K3n6J18J90m5K7R7l67
$$ -311 -101 -105 68 182 -177 32 -208 105 -260 -196 -86 -189 -337 -15 -148 -125 -181 -63 127 82 109 206 -161
4628a61L08o0p7k45K57k86L12k7J23k33j06K66r7k8Q1k27L28j83k74N30K7p9j13
$$ -161 147 87 10 -235 22 -264 48 21 144 -89 -195 71 -26 -54 27 -200 128 -55 -329 201 228 149 36
4651C6K39L0j54q9j0jK3r2k09K85k10K75k30j02J75l12N51q7M5N0j88lj86L54
$$ 36 275 305 151 62 52 51 74 -18 -227 58 -152 123 -107 -209 -34 -346 205 118 163 213 25 22 -164 190
4675A90l70MP0Q7Q6j27L46l45n1k07J84J14Q7M2k32K14m26L43k92Q55j44n82L16
$$ 190 -180 -176 -106 -19 67 -60 286 -59 -110 -317 -133 -19 68 110 -122 92 -334 9 -283 572 428 -154 162
4698A62P9o71O03j47j6l24J77M68l98l4J74J34l28j1K04j39R7P5p6j88O5J89j4
$$ 162 241 -430 173 26 10 -314 -137 331 -67 -101 73 207 -121 -132 72 -67 30 105 29 -159 -94 95 81
4721H1J04m8m21J77N8Q1K1oj63J60j33L26k37J03j90J23J11K3k14J71J84l11j05
$$ 81 185 137 -284 -107 -49 32 53 47 -116 44 -89 237 0 103 -87 36 147 170 -44 127 311 0 -105
4744a05J03PQj90p6M55o5k12K45l07K61O7k75j04R9L9K07R9k29j58r9L76q7j47
$$ -105 -2 5 13 -177 -253 202 137 -75 170 -137 124 191 -84 -188 -89 -50 157 256 27 -131 -230 146 59 -88
4768h8p9K96k61L68j94j26L4J20k5r7M5K11l73J20K15m11L61M4M3k04o5j61N62
$$ -88 -167 129 -132 236 42 -84 -50 70 45 -52 -7 204 -169 -49 166 -245 116 160 203 -1 -66 -227 335
4791C35p9j04j75J15l1J16k24j84K67j94L41k70k8m2J87j73J97j17l6j8J97P4
$$ 335 256 152 -23 92 61 177 -47 -231 36 -158 183 -87 -115 -157 30 -143 54 -63 -99 -117 80 154
4813A54l12O3L38m34K0K52K47j16j61k09L3N11m02J86P4k28p6n2j5J31k94K24
$$ 154 -158 -95 243 -191 -171 81 328 212 51 -158 -125 386 -16 170 244 16 -60 -112 -127 4 -290 -66
4835f6J03j02r2J62j81N2N09k41l78L85j48M4K0j58K15p2L2K46l04k08P5o8J47
$$ -66 37 -65 -157 5 -176 -124 385 144 -234 151 3 47 67 -91 124 52 84 330 26 -182 -107 -175 -28
4858b8j0J64j39J62j92O4Q5j63K42O9k75M4K38l46K55m67j3N00l03K79k01K4o4
$$ -28 -38 126 -13 149 -43 21 106 -57 185 254 -21 23 261 -85 170 -297 -310 190 -113 166 -35 -11 -75
4881g5K40m46j41M72l5q3J06J31k95K21M8l29L4jK43r0k84L52J5k7n5j16n9K11
$$ -75 165 -281 -422 50 15 -68 38 169 -126 95 143 -186 -152 -153 90 0 -284 68 83 56 1 -115 -174 37
4905C7j39M1R6k45J92O5J04r2m0L5J40l09j00J51k07J79K27l37L30K55m22k6J34
$$ 37 -102 -61 35 -210 -18 47 151 59 19 54 194 -115 -215 -64 -271 -92 135 -202 128 383 -39 -65 69
4928F9J01j63J28M5q8J7J19j99nl49L96k81L36J37l30r8N88o33K80J64k10j30
$$ 69 170 7 135 180 92 109 228 29 24 -325 71 -210 126 263 -67 -165 423 -210 70 234 24 -106
4950a06J43j48n9J80j4q5J13L8nk88K66K23k17K48j84j82K25k29J87j02r4K99
$$ -106 37 -111 -170 10 -4 -89 24 62 57 -231 35 258 41 289 105 -77 148 -81 106 4 -90 209
4972B09Q9l52j02K64k69m4K56P6k4k69J06J19m7J61l3n5R3j47q8qRR5j53J10k15
$$ 209 298 -54 -156 108 -161 -205 51 127 103 -166 -60 59 12 173 140 85 178 31 -57 -65 -56 39 -114 -4 -219
4997b19J1J42K70j50m3j01K03K9k00j80K3K47j07j27N15k18l10J81k42L51j68
$$ -219 -208 -66 204 54 11 -90 113 142 -58 -238 -215 32 -75 -202 313 95 -215 -34 -276 75 -93
5018i3J52k58J35J89l61M70k31j23L25j97R8j44K48L6k42L96n69p0L45J27jk06
$$ -93 59 -199 -64 125 -236 234 3 -120 205 8 106 -38 210 246 4 400 -169 -239 106 233 232 26
5040B6K38k46n7J98k89J43J51l04J04k03K58n6N9o0J79r1m2K33j34j23K00k35
$$ 26 264 18 -39 159 -130 13 164 -140 -36 -239 19 -37 22 -38 141 50 8 241 107 -16 184 -51
5062e1j1L57l16O4j28L2O8P7l29K85K07l63K23j75l1K57q7j10j11M45k32J58j42
$$ -51 -62 295 -21 43 -85 -53 15 92 -237 48 255 -108 115 -60 -91 166 79 -31 -142 303 71 229 87
5085H7p1j62M00j64l54K1M81j57k11J74J57k88mJ80l5p3k7Q0J78k90m5J5J34j7
$$ 87 16 -146 254 90 -264 -243 238 81 -130 44 201 -87 -91 89 54 -19 -46 34 212 -78 -123 -108 26 9
5109Ir7K34q5j1j3n5K88K2r3j18n7K98j29l33J8m2J08K09k35K63k39k50M47j90
$$ 9 -88 146 61 50 37 -18 270 292 199 81 24 322 193 -140 -122 -164 -56 153 -82 181 -58 -308 139 -51
5133e1J18j65J54r1Q3K5j40p0K39m0k28J29n2L7j02J89j58J11j89J76k2kJ55r3
$$ -51 67 -98 56 -35 48 73 -67 -137 102 62 -166 -37 -89 -52 -154 35 -123 -12 -201 -25 -47 -49 106 13
5157A3J4J73k21n6k5K1P5K2j40O0M1P9qm0Q7l37K64M6j38Q4m4M6J11n4k6k20L34
$$ 13 27 200 -21 -77 -102 -81 -6 16 -124 -64 -23 56 48 8 95 -242 22 68 -70 14 -30 16 127 73 47 -173 161
5184A61j01J80l42M03R3l92m1J37K1l3j6o01O00j01%J59k60J57j22J35k06J29
$$ 161 60 240 -102 301 394 2 -39 98 119 86 70 -531 69 -32 -32 127 -133 24 -98 37 -169 -40
5206d0K85q4k33K2O5P7p8J30m1L14k60P4k15q6l2J53J2N2o0K61m73L05j04q4K48
$$ -40 245 161 -72 -50 15 92 14 144 103 417 157 231 16 -70 -102 51 63 115 55 316 -157 148 44 -40 208
5231B08k48J3K23m72M49k40j93L26j31Ko1K03r1j23Q2q2mr1K32q9l8J70p5M7l
$$ 208 -40 -27 196 -276 173 -67 -260 66 -65 -63 -124 79 -12 -135 -53 -135 -139 -230 2 -87 -125 45 -30 17 14
5256A4j15K30%l34K21j72J06K28k80J71J99k45J6j23O6j2J9P8L4j61K1J98k11
$$ 14 -101 129 129 -205 16 -156 -50 178 -102 69 268 23 39 -84 -18 -30 -11 67 101 -60 -39 159 -52
5279e2k7K73j01j9l3J18k22K1k6K59k21N1J92l0l90K29J33l09L00j55l3k27K67
$$ -52 -79 194 93 74 41 159 -63 -42 -68 191 -30 21 213 183 -207 22 155 -154 146 -9 -42 -269 -2
5302bJ88K05l37M17n68j47J05K94k86J55n9j06j5N1m9L91l51J02k1q7J23K14k34
$$ -2 186 391 54 471 -97 -244 -139 155 -131 24 -35 -141 -156 -105 -154 237 -114 -12 -33 -120 3 217 -17
5325a7k8J34l48P9J38k39M00m28K06L5J5M9k20K44p7J8K47j69j01m4l9K74l54
$$ -17 -45 89 -259 -180 -42 -281 119 -309 -103 -68 -53 -4 -224 20 -57 -39 208 39 -62 -106 -145 129 -225
5348b25K85j00l3K2j22J62o2N6J17j6l3k07L97m26J28k5j49L90j65J44j39J60
$$ -225 60 -40 -73 -51 -173 -11 -73 -17 100 84 51 -156 241 -185 -57 -82 -231 159 -6 138 -1 159
5370A59p5lj15J08j94R2n7J38Q5k40M5k5LJ7l5K2j69K75r4O3O3J75M9l91P0o3
$$ 159 84 81 -34 74 -120 -28 -85 53 138 -102 -57 -82 -79 -62 -97 -75 -244 31 -63 0 63 238 287 -104 -34 -97
5396i7k01L74k25K91l70K52j35k8L80l09o3O4M4M5nj19K02n6r6m3j21J75J26J73
$$ -97 -298 76 -149 142 -228 24 -111 -139 241 -68 -131 -67 -23 22 17 -102 100 44 -52 -95 -216 -41 85 258
5420B58j39j06K30k84j07J12j23L74j82k08N0j14K23R5K2p7M4n4q9J71K32k37
$$ 258 119 13 243 -41 -148 -36 -159 215 33 -175 -125 -239 -16 79 101 24 68 14 -75 96 328 91
5442I1J1k01J54n4L5K43l03K4k10K49j36M35k36o6l6R7K9l75K67k04J43J29l23
$$ 91 102 -99 55 1 36 279 -24 0 -210 39 -97 338 102 36 0 97 126 -249 18 -186 -43 86 -237
5465b37J91N7R6j39pj60J8K44l63J02R9l8j09L84k28J1o5K66j72r0N4J36k00J69
$$ -237 -46 11 107 -32 -39 -199 -181 63 -300 -198 -99 -137 -246 138 -90 -79 -144 122 -50 -140 -86 50 -150 19
5489A9j65L78j57n0k08M90m69L68o5J52m59j8Q1J11j92m4K80QK43r5k74l0O7o0
$$ 19 -146 232 75 25 -183 307 -162 206 141 293 -166 -184 -103 8 -184 -228 52 60 303 208 -66 -96 -29 -89
5513h9K34j68J70j31J18k81K97j47j14J48J64p8p6L2J0j29J80j27k50O30m81R9
$$ -89 145 -23 147 16 134 -147 150 3 -111 37 201 123 47 79 89 -40 140 13 -237 393 -88 11
5535A1J51n7j12j82L5K99NK14k47l65M70r2j63n1m8m8J58K5K77j55m92K41M11
$$ 11 162 105 -7 -189 -154 145 150 364 117 -248 222 130 -33 -84 -132 -180 -22 3 280 125 -367 -126 285
5558B85l42P9j52L64l85L93k67kp7K03J68l00J25k95K76J52l86j79N14k03N3O
$$ 285 -57 22 -130 234 -151 242 -25 -27 -104 99 267 -33 92 -203 73 225 -161 -340 174 -29 24 30
5580C0J03j58J98j36k4k43k4k3J83L94qj17l33K43n7m6j6k40K50k9k10J79J63
$$ 30 133 -25 173 37 13 -230 -254 -277 -94 300 292 175 -158 85 28 -18 -34 -274 -24 -53 -263 -84 79
5603G9j3j19j55M2P30n28k11L47k38j0jK72k90L96j94J31o7R7k58j74J79n0J27
$$ 79 66 -53 -208 -166 564 36 -175 172 -66 -76 -77 195 -95 301 107 238 171 268 10 -164 15 -35 92
5626I2j89J65m23K69k52N74m93J54J56j89o8m1K68q4L24k92N9j37N13n80M13l11
$$ 92 -97 68 -355 -86 -338 236 -257 -103 53 -136 -204 -245 23 -61 263 -29 30 -107 406 -174 239 -72
5648g2o5J63p4O3J94l81J40J38n7j35L8k26K70r3J13p1L20m39J28M07o09K50L4
$$ -72 -137 26 -48 15 209 -172 -32 106 49 -86 -48 -274 -4 -97 16 -55 265 -174 -46 361 -248 2 36
5671C6l85L57Rq0j38M6J57j64J35k2R6k6Mj20J13r9N2Q9j36K41l42L37R4k88m7
$$ 36 -349 8 17 -63 -201 -155 2 -162 -27 -49 47 21 25 -95 18 -81 -29 60 -76 165 -177 160 254 -34 -81
5696h1r9j06J70J08k99K11J87j84L34p3m50M37j89k3j09Q3J24Q8l92M46P5J8n88
$$ -81 -180 -286 -116 -8 -307 -96 91 -93 241 168 -282 155 -34 -57 -166 -83 41 129 -263 183 258 276 -312
5719c12L73j86K56j64J01K20j92J23l52J51m3L17n10L57J07l83J71j27P3M4j14
$$ -312 61 -125 131 -33 68 288 96 219 -133 18 -25 292 -218 139 246 -137 34 -93 -20 24 -90
5740i0p3N00m04J32O6j24J18k04j71K34m34M81%J17k66L36j78M1j42q6K85j06
$$ -90 -163 337 -67 65 131 7 125 -79 -250 -16 -450 31 31 148 -118 218 40 81 -61 -147 138 32
5762C2mJ09k60Q3J5L32k38j00J58j58K39m15K92j5j34K76k23J04K48m91J05L1
$$ 32 28 137 -123 -40 -25 307 69 -31 127 -31 208 -207 85 70 -64 212 -11 93 341 -150 -45 -14
5784a4J56j64L10q7p7n22J58J06l9K96l43L68j09r2L20j27P2J33l81K01m9j71
$$ -14 142 -22 288 201 124 -398 -240 -134 -173 123 -220 148 39 -53 267 140 212 345 -36 165 116 -55
5806e5K0L29k45j23k26R1K87k38J44J41j79o3L11o46L46L33j34L31l44j88K92
$$ -55 -35 294 49 -74 -300 -209 78 -160 -16 125 -54 -117 194 -452 -106 227 93 424 80 -108 184
5827A84k55L4L9O0N0m7R6k24K1l1j78J06k29M06J98k76k76K79K2L86m38j3R7N4
$$ 184 -71 -37 2 62 112 65 161 -63 -42 -73 -251 -145 -374 32 230 -46 -322 -43 -21 365 -73 -86 11 65
5851F5l48N6L49k5k61J59k82L10n2K23l20j39N13k05r7j35J33n0J2Q7k19J78l08
$$ 65 -283 -227 122 97 -164 -5 -287 23 -29 194 -126 -265 248 43 -54 -189 -56 -106 -94 -7 -226 -48 -356
5874c56L24N7j84l8J07p7J95R6m05L33o0J57k07J8j38L61j65j11K69m2l88J75
$$ -356 -32 25 -159 -197 -90 -167 28 124 -281 52 -8 149 -58 -40 -178 183 18 -93 176 134 -254 -79
5896g9K41p9l61K72O0j19J63l42K2J63j29J34k07M13j57j33L0O2J22KL4q0J20
$$ -79 162 83 -278 -6 54 -65 98 -244 -222 -59 -188 -54 -261 152 -5 -138 -108 -46 76 78 112 32 152
5919A52l42L83j80j03K2M65m44K36q7K05n58M64m10K26R6m9jj9k20K23K19l81
$$ 152 -190 193 13 -90 -68 397 -47 189 102 307 -251 213 -197 29 125 76 75 56 -164 59 278 -103
5941a03j73j02N52j06K98k72j63J25j25r0O4K04j62n3M56n15K3K18k0j17P4j42
$$ -103 -276 -378 174 68 366 94 -69 56 -69 -159 -95 109 -53 -106 350 -165 -142 76 56 -61 13 -129
5963a29N3R4J27j07k58L22j6k5J00p3J4j46P1J4j40N1K84j78M2j26K35l17K57
$$ -129 -76 18 145 38 -220 102 86 61 161 88 102 -44 27 41 -99 -48 236 58 100 -26 209 -108 149
5986A49l09l6RP8K21J5l0pk4l52M75n18L10q7j30K35J1K95n67L93j80K82j77l11
$$ 149 -160 -196 -187 -109 112 127 97 90 66 -286 189 -329 -19 -106 -236 -1 10 305 -262 131 -49 233 56 -255
6010b55J86j37K01j55J07P0K76k23J01l06q6J30q8J43l1J33j28j29K63%l53K93
$$ -255 -69 -206 -5 -160 -53 17 293 70 171 -135 -221 -91 -179 -36 -67 66 -62 -191 72 72 -281 12
6032A2P3O7l71lO5R1j15J03j9k41K99r7J68k9j41J6O6L31m74N10j65l7l41K47
$$ 12 85 152 -219 -222 -157 -66 -181 -78 -97 -338 -39 -136 32 3 -138 -122 -56 275 -199 311 146 109 -232 15
6056A5o2k79J88P4J84l3j80K6j71N71n83R2J61L3o8R3j94K21j32QN4o5O2k35Q8
$$ 15 -47 -326 -138 -64 120 87 -93 -67 -238 333 -250 -158 3 36 -32 61 -133 88 -44 -36 18 -47 15 -220 -132
6081a32L10M4l61J23J37K1K3M5k28pk55J45K30j11J37j26J02l9j15L29l62N08
$$ -132 178 222 -139 -16 121 142 165 210 -18 -25 -280 -135 95 -16 121 -5 97 58 -57 272 -90 418
6103D18m59k5r2N44m09J05k87K61l19L01n3J57l76O6R4P6k09K9L92m49J74P1R4
$$ 418 -41 -66 -158 386 -23 82 -205 56 -263 38 -15 142 -234 -168 -74 2 -207 -178 214 -235 -61 10 104
6126A04Jj54m9J57J2j31l0N6R6q3k5K83k7j77K9N3j62J32n8m2J06r6m3o6M0j7
$$ 104 105 -49 -98 59 71 -60 -90 -34 62 -21 -46 237 210 33 62 115 -47 85 27 -15 91 -5 -48 -114 -74 -91
6152i1l43L44K19j66K7K6q6P4j71J31k40N96J1m62L00l43J60j54L41k27K53j76
$$ -91 -434 -90 129 -37 -10 16 -70 4 -167 -36 -276 320 331 -131 169 -174 -14 -168 173 -54 199 23
6174B3R1k63N1L52k42m20N62n22L54J0k3j0O3q1K17l43k1J04m8Q4K13J23m26L60
$$ 23 114 -149 -98 254 12 -408 154 -368 -14 -4 -27 -37 26 -55 162 -181 -202 -98 -146 -62 151 274 -152 208
6198B08j57J60j06J9n1j25K82j20m2K00l99J83j79L57j31j33p5K56k35J84k35
$$ 208 51 211 105 124 73 -52 230 110 68 268 -131 52 -127 230 99 -34 -109 147 -88 96 -139
6219a39M16j06j82O6k68L78j64r2J88m4k26K89j59J35j70k29M05k96PK56K5l5
$$ -139 277 171 -11 55 -213 165 1 -91 97 53 -173 116 -43 92 -78 -307 98 -198 -191 65 90 55
6241E5l3m3j67J02P0k9j00J35P4Q3Lj40Q6M7m34K98K67k54l02L47N7J9p5p6J56
$$ 55 22 -21 -188 -86 -16 -45 -145 -10 64 147 150 10 96 143 -291 7 274 20 -282 65 122 141 66 -10 146
6266A46n6J59l84R5R9p9l1J48J70k26N4n2k24J77j82J60k63M0K19Q0K03j64jJ34
$$ 146 90 249 -135 -40 59 -20 -51 97 267 41 95 43 -181 -4 -186 -26 -289 -249 -30 50 253 89 88 222
6290B22j40k78K28J45k99P1K24j59j37J23j82%K50j64P1J37j67j7K56m23J53K93
$$ 222 82 -196 32 177 -122 -51 173 14 -123 0 -182 -182 68 -96 -25 112 -55 -72 184 -239 -86 207
6312B07j94J56K7j43k6pJ52J59l33j63L26l09L20m78M82M1l29J62o4K14l48J2
$$ 207 13 169 196 53 27 20 172 331 -2 -165 161 -148 172 -306 176 217 -112 50 -14 200 -148 -136
6334a36J03LJ92j96P2n4L32l14R3l2j05O7J46j62J22j27r0K25k88nJ34O2M2k40
$$ -136 -33 -30 162 -34 38 -16 316 2 95 63 -42 25 171 9 131 4 -86 139 -149 -154 -20 42 84 -156
6358a56J18j10L75j55j05%J99l0l12J97P5k83K46l45j2L96j80L1J30k5m5k9n9
$$ -156 -38 -148 227 72 -33 -33 166 136 -176 21 96 -187 59 -286 -298 98 -82 -51 79 54 9 -20 -79
6381g9J56K8q0K65m59M02m6j07k14M02m04K27J25k87L46m08k9O6k3J2J86K29n4
$$ -79 77 105 25 290 -169 233 187 80 -134 268 -136 91 216 -71 275 -133 -162 -96 -119 -107 79 308 254
6404B54j82Q4K8j64K30k45j25J40m5K01j02J34j16J32l32J39o7O7l9P7p9Q9k19
$$ 254 72 156 184 20 250 5 -120 20 -25 176 74 208 92 224 -108 31 -36 31 -8 69 -10 79 -140
6427a40L8p2K86Jq1l13O3J73Q0l6Ok28K52J9m1O1K3k72J99k35K08nj93K79j23
$$ -140 -102 -174 112 113 32 -281 -218 -45 35 -1 5 -223 29 48 7 68 91 -181 18 -217 -9 -14 -207 72 -51
6452e1K45k75lJ75n5j65M8K4O4k19J97j1KJ35j90J27J3k1pm06L16O9Rrk3o2m1
$$ -51 194 -81 -84 91 36 -129 -81 -57 7 -212 -15 -26 -24 111 -79 48 61 40 33 -373 -57 12 21 12 -11 -73 -114
6479a14p5L10q2j61J0K87l44K07J2J80j27k64J17j54R0j84K59j7p9J09j48N7L39
$$ -114 -189 121 39 -122 -112 175 -169 38 50 230 103 -161 -44 -198 -108 -292 -33 -50 -129 -20 -168 -111 228
6502B28k90J59J14j58o1J32j02K75k68l15K77L77n5k19k84K06J36j25J91l86k2
$$ 228 -62 97 211 53 -8 124 22 297 29 -286 -9 368 313 94 -190 16 152 27 218 -168 -190
6523a90M49k0nj50j41J37n5K36P2l21J15m3p5r4j34J96k40M23k02r6J77Kl67M57
$$ -190 259 239 234 84 -57 80 25 261 333 12 127 84 9 -85 -219 -23 -263 160 -42 -138 39 41 -326 131
6547A31p7l50M62k82K19O8m22J92p7MK51r9j70K72m44K60L04k81r9J41np1n4K4
$$ 131 54 -296 166 -116 103 171 -251 -59 -136 -132 119 20 -150 122 -322 -62 242 -39 -138 3 -2 -73 -127 -103
6571a03K28j10j60O9J04K24k79J61n0J67q0j92Q2M7q5lJ61l51L51p2J67j43m7
$$ -103 125 15 -145 -76 28 252 -27 134 84 251 171 -21 61 108 23 20 181 -170 181 109 276 133 86
6594H6O4j85J08R3j1j61Mj7O2m3P7j71J4j55N1Q0j16K77q9Q0j57M78n93J37J36
$$ 86 150 -35 73 166 155 -6 -2 -19 43 0 77 -94 -80 -235 -184 -104 -220 57 -32 48 -109 369 -224 -87 49
6619D9m3N7l8k05K30j81K06p3J2o5M0j84m8R4O0j28J49qJ94n0m3M7P4j13k36K26
$$ 49 6 63 25 -180 50 -131 75 2 14 -51 -11 -195 -243 -149 -89 -217 -68 -76 118 68 25 72 146 33 -203 23
6645B3O8k18K56j2J50o3j56k38k3J41M7j00L92k02k49l5J42o7Q3J22p9K30l05
$$ 23 91 -127 129 117 267 204 48 -190 -213 -72 -25 -125 267 65 -184 -219 -77 -144 -61 61 -18 212 -93
6668i3j92L41J21j61J01k1j57n5J20j49J59Pj15K75l64L79m13K59k03N4J08J7
$$ -93 -285 56 177 16 117 96 -61 -116 4 -145 14 21 -94 181 -183 196 -217 42 -161 -107 1 18
6690A8n5j11R6L16n05M03k38j52R6J58J91j46m7M4j18M2M8j49K25k73J59j83J17
$$ 18 -37 -148 -52 264 -241 162 -76 -228 -132 26 217 71 24 68 -50 -8 40 -109 116 -157 2 -181 -64
6713f4j86L93j49M33m51l08L68K86l99K04M4l77K51P5M3k82J03j79K33q7l5Q3
$$ -64 -250 143 -6 427 -24 -332 36 322 -77 127 171 -206 45 120 163 -119 -16 -195 38 -49 -84 -1
6735al5JJ7J73j28J80j98j59M02k66J45k05K75o3J11J21p09L30j62L51j87k6K54
$$ -1 -36 -35 -18 155 27 207 9 -150 252 -14 131 -74 201 138 249 370 -339 -9 -171 180 -7 -33 221
6758B21l60J23j6M9l8J8j8M2Q8l06K80n6R2m75M08j44r4P48n68R2J96l35J70j52
$$ 221 -139 -16 -32 17 -21 -3 -21 21 109 -197 83 27 119 -356 52 -92 -186 562 -6 86 282 -53 117 -35
6782c5k3J05j88P1j5j02J05K39k58j13J96j8m9J04J16J22j23j64j80J20k66M33
$$ -35 -58 47 -141 -70 -85 -187 -82 157 -101 -214 -18 -36 -85 19 135 257 134 -30 -210 -90 -356 77
6804G7J4R0j36q5J61P4jl47J39K44j60R1l21K01j31L19l67J63J19l35rN19k60
$$ 77 91 181 45 -40 121 195 194 -153 -14 230 70 161 -160 41 -90 229 -138 25 144 -191 -200 319 59
6827E9l08l5J07J16J2L73j8l51R0p9k00R0r8L26k61K93j80K33m99M31j17q7o3
$$ 59 -249 -284 -177 -61 -49 324 306 -45 45 -34 -234 -144 -242 84 -177 116 -64 169 -330 101 -16 -103 -166
6850a66K90J1RJ67l34L67j70l52j9R8Q9N4j43J77j99K87l34N4J87j33J87J06k84
$$ -166 124 135 144 311 -23 344 174 -178 -197 -99 -10 44 -99 78 -121 166 -168 -114 73 -60 127 233 -51
6873e1K49m10K22K13j43n5J49lk92K77m12j24k6j9N54l53J12j26J77p4J46L26
$$ -51 198 -212 10 223 80 25 174 171 -121 156 -256 -380 -406 -425 129 -224 -112 -238 -61 -135 11 337
6895C37l88k11J13nJ12P1r5k81M28k7j73J77r3J87k47K17Kj74l05M46j69M6R4
$$ 337 -51 -262 -149 -154 -42 29 -66 -347 81 54 -119 58 -35 152 -95 122 124 -50 -355 91 -78 -32 62
6918F2j68k6K13J88k11j81J59M62o08K03k10K19j40J37N8k83L35l26P0K15o16
$$ 62 -106 -132 81 269 58 -123 36 498 -110 93 -117 102 -38 99 157 -126 209 -117 -47 168 -448
6939d48O25J1j12j54N6%k91J03L63j84K1l2J78r3M09m16n7L05l62Q7J39m4k31
$$ -448 177 188 76 -78 -22 -22 -313 -210 153 -31 -10 -42 136 43 452 36 -21 284 -78 9 148 104 -127
6962a27J65j69J16o2P2k2J6K05j67J36o70M78K21j69J4L90j66m84J17l64M67j
$$ -127 38 -131 -15 -77 -5 -27 -11 194 27 163 -507 -29 192 23 37 427 261 -223 -106 -470 -3 -4
6984dL82m48k36J33J55j05J71J67m84K78p6P2J03O4j30l24J43J86j30p7M2J62
$$ -4 378 -70 -306 -173 -18 -123 48 215 -269 9 -67 5 108 172 42 -282 -139 47 -83 -160 -118 44
7006D4p9K1J58l6J34j19j24o7J91jj08J98j85l48k15M62K39j17k18J76J09j42
$$ 44 -35 -14 144 108 242 123 -1 -68 123 122 14 212 27 -321 -536 -74 165 48 -170 6 115 -27
7028b7m8j26M27j27J2nn01L86j73J80J0J09k17J61k21P0Nl0k5L6J69j9J03j55
$$ -27 -75 -201 226 99 111 106 -395 -9 -182 -2 8 117 -100 61 -160 -90 -85 -115 -140 -104 65 46 149 -6
7052fL1N8o5N4O7n4p3L3M6K31l41j11K8N4KJ80o4k55K01r1J37rn2j07L67P6j20
$$ -6 25 83 18 72 139 85 12 45 91 322 -19 -130 -102 -48 -46 134 70 -185 16 -75 62 53 1 -106 261 337 217
7079B17m71K62n5P9k41q4L41k5K77j61l82L17j1lQ3O3l50N2j2r4J43J65j64P8
$$ 217 -254 8 -47 32 -209 -293 48 23 300 139 -243 74 63 60 143 206 -144 -92 -104 -198 -55 110 -54 24
7103B4l93L90K74j39k63L8J23k6J69j76o0K19k75N8LK76K23m24N1l44K63J30j83
$$ 24 -369 21 295 156 -107 -69 54 28 197 21 -39 180 -95 -37 -34 242 465 41 92 -252 11 141 -42
7126d2jK5M0j10J16j53M3L5Jj7J14n1k27M36j84j21K06j27l37L36K60k38j99J31
$$ -42 -43 -18 22 -88 28 -125 -82 -47 -46 -63 51 0 -227 209 25 -96 110 -17 -354 -18 242 4 -195 -64
7150f4K8j22j22P7L42k63J08K32l3k02JQ5j55P6N8j9q5j27J44k62K30J86j34R4
$$ -64 -36 -158 -280 -203 139 -124 -16 216 183 -19 -18 67 -88 -12 46 27 -58 -185 -41 -303 -73 113 -21 73
7174G3n8L69l88p0K46k48K5Q6j80K65j59k09J59J59k3r0P3m2k20L97r1j66J02
$$ 73 15 384 -4 -74 172 -76 -51 35 -145 120 -39 -248 -89 70 47 -43 30 -12 -232 165 74 -92 10
7197A0O2q7K1JQ6q6q5j19K46N2k01O2o1k8j13L20j05J65k03J59k28J71K41n48
$$ 10 72 -15 6 7 93 7 -78 -197 49 101 -100 -38 -99 -127 -240 80 -25 140 -63 96 -132 39 280 -268
7221b68J91J01j27L7L68l18k5J88n3j56o7M9J96k41L3m4mk3L22k67J11P7J18q9
$$ -268 -77 24 -103 -66 302 -16 -41 147 94 -62 -129 -80 116 -125 -92 -136 -140 -163 159 -108 3 80 198 109
7245A09Q2j69k4k01K01J40j38K35k42nL3k36M48k23j48K99rJ06j38k85J56N0j07
$$ 109 191 22 -2 -203 -2 138 0 235 -7 -12 21 -215 233 10 -138 161 152 258 120 -165 -9 41 -66
7268f6j02M16M4m17MOJ96j98M34m68Q3n2K41J4j33J57r8j25O1r4J42Q1k65J63
$$ -66 -168 248 292 -125 -121 -115 81 -117 317 -151 -68 -120 121 135 2 159 61 -64 -3 -97 45 126 -139 24
7292B4P9N2j52L54m30J99j29p3r3J3K37j09p7m3J86P5k50O31m36k20m2N34j88
$$ 24 103 155 3 357 -73 126 -3 -76 -169 -156 81 -28 -105 -148 38 113 -137 494 58 -162 -204 330 142
7315A42j40L33o59L63k04o9N16k22J76k31O9J68k05N6J89l24J93q0j54J76j67
$$ 142 2 335 -324 39 -165 -234 282 60 236 5 74 242 37 93 282 -42 151 71 -83 93 -74
7336g4P6q1K66j03j49qJ3o0J56J78O4k50K54j09k7k50k54J91o7M67l25kPP2PK28
$$ -74 2 -79 187 84 -65 -73 -60 -120 36 214 278 28 282 173 146 -104 -358 -167 -234 233 -92 -94 -87 -15 -8 220
7362B20j93J25k36j6l5p9L96j71r1R2K10q3j65m2K6K59k30j3j55J86k44K42k35
$$ 220 27 152 -84 -100 -135 -214 182 11 -80 12 222 139 -26 -68 -42 217 -13 -26 -181 5 -239 3 -232
7385b32Q6O1K64j1l65P7N9K09K9k15J09J2r9o3P1K50k14J7J60r5l6j14J50j91
$$ -232 -146 -85 179 168 -197 -120 -61 148 177 -38 71 83 -16 -79 -8 242 28 45 205 110 74 -40 110 -81
7409h1L61j94j68J49j27l9K49k78RnL38j62k90L37k3K67m96J77m4lK65j32q3j67
$$ -81 280 86 -82 67 -60 -99 150 -128 -119 -124 214 52 -238 99 76 343 -153 24 -20 -23 242 110 27 -140
7433a40l1K15j13L60k11k09j25K33j18L17n1q0k30J31M5P9j59L8O8Kl7j85M76
$$ -140 -171 44 -69 291 80 -129 -254 -21 -139 178 127 47 -183 -52 -7 72 -87 -49 19 21 -16 -201 275
7456B75k38j24N3m4J9K54k97R6j73N50n06j0K79L6j34N6m4K0R1j68J69m95K38
$$ 275 37 -87 -34 -78 -59 195 -102 -6 -179 371 -135 -145 134 170 36 92 48 68 159 -9 160 -335 -97
7479i7J16K1m33P91n61M3l6N5j21J46p5M22j43k86K84l10L74O0J18n49K67R6k60
$$ -97 19 40 -393 398 -163 -120 -156 -101 -222 -76 -151 271 128 -158 126 -184 190 250 368 -181 86 182 -78
7502g8K02j94O6R1j97J07m2k8P3J11m75M43k17K78P7j84j88p4L33lj68PJ49Q5
$$ -78 124 -70 -4 87 -110 -3 -45 -73 0 111 -364 79 -138 140 217 33 -155 -229 104 101 -67 -60 89 174
7526A74Q1o69N38q8M4k43J6L96o89L79j33J88R8k18j12J02o5O8M49o10L81m9p0
$$ 174 255 -414 124 36 80 -163 -147 249 -440 -61 -194 -6 92 -126 -238 -136 -201 -133 316 -294 87 38 -32
7549c2j16K83l85K61k15M37j42L27k10R6m75K21N9j2O4Jm76M33p8j46K31k32M36
$$ -32 -148 135 -250 11 -204 233 91 418 208 304 -171 50 109 97 161 162 -314 119 41 -105 126 -106 330
7572C30n54K70j92K16N1k43J48k53K12j50J8p8N65n93L3l7N8J66K5Rk39M01n3
$$ 330 -224 46 -146 70 121 -122 26 -227 -15 -165 -147 -225 340 -253 -220 -257 -199 -33 -8 1 -238 163 110
7595A10o2j22N8J21P5l69m9J90L3M8Q6o2j90J08J84k33J00J54J12J23k39rl03
$$ 110 48 -74 -16 105 180 -189 -238 -48 -15 33 119 57 -133 -25 159 -74 26 180 292 415 176 167 -136
7618a36P3p4K36k15K21J30n07L43k63K79k75J80J69R2n23M8m5K62j09J3K64j58
$$ -136 -63 -137 99 -116 105 235 -272 71 -192 87 -188 -8 161 253 -270 -222 -267 -5 -114 -101 163 5
7640Eo7J29l68K38j7K0l56K61K36j42J32j85O0j03K25n1M1N8R6l67K59j69P2O3
$$ 5 -62 67 -301 -63 -80 -60 -416 -155 81 -61 71 -114 -54 -157 68 17 58 116 212 -155 104 -65 7 70
7664G0q8J61L5k15K40j3J76j04m72M85l85M04l31K24l35L61j27m3L76o09N3J82
$$ 70 -18 143 178 -37 203 190 366 262 -210 275 -110 294 -37 187 -148 213 86 43 419 -190 -137 45
7686D5J83m72J88K17k17r5K99q3j23p9J73l36L60P3K7j00j98K92j92j47K67r0
$$ 45 228 -244 -56 161 -56 -151 148 65 -58 -137 36 -300 60 133 160 60 -138 154 -38 -185 82 -8
7708hr4K1J86k16K34j20J67j76O3K3k58PN76m04j8j58K59j84K79j30j5J9kj42
$$ -8 -102 -81 105 -111 123 3 170 -6 57 80 -178 -171 405 1 -17 -175 84 -100 179 49 34 53 51 -91
7732i1J51j09l7L08k69k1J54j28k6L84m74p1k80N12k22K48j41P6k62M75j46L6
$$ -91 60 -49 -86 222 -47 -68 86 -42 -68 316 -158 -229 -509 3 -219 29 -112 -36 -298 177 31 67
7754F7j90M1M07k47j70K54l15J09Q1k32K02k83J96K32k29J0M6P0lQ7m8j83L4O5
$$ 67 -123 -82 325 78 -92 162 -153 -44 37 -195 7 -276 -80 152 -77 -67 -21 49 46 133 85 -98 -64 1
7778AJ31o2O1k23J93R0k69J36k7j69J11l1r8k0qJ85K8j82K03m3Q4k46J27j4k8
$$ 1 132 70 131 -92 101 191 -78 58 31 -138 -27 -58 -156 -176 -184 1 29 -153 50 7 91 -155 -28 -42 -70
7803g0P5J9N1m8j4O8j85k89K60J81j85J14J28k4K5j95J48J1l40L82R5j65K22j89
$$ -70 5 24 75 27 13 81 -104 -393 -133 48 -137 -23 105 81 106 -89 59 70 -270 112 207 42 264 75
7827G5k03K31k96L18p2M2J90m51J78L9j69J16P0r8N5j92J69m1J0k28K48p2j3O2
$$ 75 -128 103 -193 125 53 95 285 -166 12 51 -118 -2 68 -30 25 -167 2 -39 -29 -257 -9 -81 -94 -32
7851c2k9K41j4l6j33Q8l63K48K9J36q4j70Q1k23J4L91j88L90j35k87J22L32l6
$$ -32 -61 180 166 130 -3 85 -278 -30 -1 135 51 -119 -38 -261 -247 144 -44 346 211 -76 46 378 342
7874C42l17j95R8J28k29K74l04K45j5K4O2L8q8j70P8r3N0J93k70J86K67r7l99
$$ 342 25 -170 -72 56 -173 101 -203 42 27 51 113 151 63 -107 -29 -122 -72 121 -149 37 304 207 -192
7897a92q2K58K1k43L08j80j05K69L5Nk16J03q8K46k51J16j47O2K26k70m5J64o
$$ -192 -274 -16 5 -238 70 -110 -215 54 89 94 -122 -19 -107 139 -112 4 -143 -81 145 -125 -170 -6 -12
7920a2J97k80R0K40n40M83j12j19Q7jj71J52k61L29m8k36J99K08m16J16pn4M01
$$ -12 185 -95 -5 235 -305 178 66 -53 34 33 -138 14 -247 82 34 -202 -3 205 -211 -95 -102 -156 245
7943B45o0l03L8PQ5M32n36K08n4j49J89Nk04L44k28K1J37k17j50R2pLQL37o1j98
$$ 245 185 -118 -80 -73 12 444 -92 116 62 -87 102 107 -97 247 19 40 177 -40 -190 -98 -105 -102 -94 243 182 -16
7969a6j9n6J29j87J47J37m23R2L27kj88L51l48o0K06j63p6L30k05J81j89o0j25
$$ -16 -35 -91 38 -149 -2 135 -288 -196 131 129 -59 292 -56 -116 90 -73 -149 181 -24 157 -32 -92 -217
7992b17j62L66K19k12j23K56O1Rk5k22R3l20K52k29K83k61J01J08j39L19m58J72
$$ -217 -379 -13 206 -6 -129 127 188 197 172 -50 43 -277 -25 -254 29 -232 -131 -23 -162 157 -301 -129
8014a29p0K95k1L4j53r1O6m9M34m15J66R2j13j86L6j48M08j23n06M68N3j71J74
$$ -129 -199 96 75 109 -44 -135 -69 -118 316 -99 67 159 46 -140 -104 -252 156 33 -473 -5 48 -123 51
8037E1j31j41K70J89j78l6M0k80K09Q1p4k8K23k65K48j35j54K31o5P6k01k04L32
$$ 51 -80 -221 49 238 60 24 64 -216 -7 74 0 -28 195 -70 178 43 -111 120 55 131 -70 -274 58
8060E8j11P5k92L68kp1j11k3N7L34r0N3k88J93k51M9KK53l30K32N7k05K88j45
$$ 58 -53 22 -270 98 96 25 -86 -109 -52 282 192 245 -43 150 -101 -52 -50 203 -127 105 162 -43 245 100
8084A00j43nM17o08L09j11R0Jm2N3l5m43N29j71K54m7j75O5j55L57m02L00O7n16
$$ 100 -43 -48 369 -239 70 -41 49 50 8 61 26 -417 112 -59 195 148 -27 38 -117 240 -162 138 205 -311
8108c11J27Q5j14L51m2p5j20O4q3j28K06R1J26k26K22k79k3J91N0qN3j30q3O0
$$ -311 -184 -99 -213 138 96 21 -99 -35 -118 -246 -40 51 177 -49 173 -106 -129 62 112 104 157 27 -56 4
8132DJ11j52J83j84l0n4K08j11r1O3l08L02j56j39M71J52l32J71k13L06j68j44
$$ 4 115 -37 146 -38 -68 -122 86 -25 -116 -53 -361 -59 -215 -354 117 269 -63 108 -105 201 33 -111
8154a11L0J09k28K5R2M1KK9L08n55J58q2K91j83P0j8J25r9J62k45j66M53l40J42
$$ -111 -81 28 -200 -175 -83 -42 -40 -11 297 -258 -100 -182 109 -74 -4 -22 103 4 166 -79 -245 208 -132 10
8178A0J41k32M40k09p7j73K50m29L43J44j40m95P48
$$ 10 151 -81 359 150 73 -100 150 -279 64 208 68 -427 321
8191C21
$$ Imaginary data points
##PAGE= N=2
##DATA TABLE= (X++(I..I)), XYDATA
0@%%%qJ6qQk4L2l2M0n6P2q8J04j20J44j76K08k44K84l32L88m48N16n92O76p72
$$ 0 0 0 0 -8 8 0 8 -16 16 -16 24 -32 40 -48 56 -64 80 -96 112 -132 152 -180 208 -240 276 -316 360 -412
28d12Q75r87J117j254J401j574J762j959K181k427K691k983L307l661M052m485
$$ -412 463 -524 593 -661 740 -834 928 -1031 1150 -1277 1414 -1569 1738 -1923 2129 -2356
44b356M968n508O117o809P602q520R595j0882J2449j4408J6945k0370K5281l2963
$$ -2356 2612 -2896 3221 -3588 4014 -4506 5089 -5793 6656 -7752 9193 -11177 14104 -18859
58a8859M6786p9393K91928K51044n59594k34238K07638L88547K9671j90418j51616
$$ -18859 27927 -51466 240462 491506 -68088 -302326 -94688 293859 323530 133112 -18504
69a8504L2029J0418j4425M0358J12877k5202j51101r4331P3045P8874K278k2252
$$ -18504 13525 23943 9518 49876 162753 137551 -13550 -107881 -34836 44038 46316 24064
81B4064P850n7244j17186q453K11606J77427j65449l62678n0906L75880L14320
$$ 24064 31914 -25330 -142516 -150969 60637 238064 72615 -290063 -340969 34911 349231
92C49231j61111l93556j20289K43255K38919j8557j37033m4996L607n1333j3439
$$ 349231 188120 -205436 -325725 -82470 156449 137892 859 -44137 -40530 -91863 -105302
103a05302J28137J24236o7213j78525o2965R6643J01966P146l2538k1181n7723
$$ -105302 22835 147071 79858 -98667 -161632 -64989 36977 44123 11585 -9596 -67319
114f7319q0969M5179J96560R0595j98832k52239N4208L09024J64410j74396k58331
$$ -67319 -148288 -103109 93451 184046 -14786 -267025 -212817 96207 260617 86221 -172110
125a72110k0616J82298J18383k5117k8827J175p2968j06768M4205J97057J06134
$$ -172110 -192726 -10428 107955 82838 54011 55186 -17782 -124550 -80345 116712 222846
136B22846j29841k02108k8682J43978J08803k5917o4073k9700m2957m1863O5013
$$ 222846 93005 -109103 -137785 6193 114996 89079 25006 -4694 -47651 -89514 -24501
147b4501J36493J3209j70046j46614P4683K03934P0979j34463j44040O857Q3084
$$ -24501 111992 125201 -44845 -191459 -116776 87158 158137 23674 -120366 -113509 -30425
158c0425M3060L3470N1380k9119j48112r6439J17881K25095N9457j82334j88851
$$ -30425 12635 46105 97485 68366 -79746 -176185 -58304 166791 226248 43914 -144937
169a44937L1946J72870Q5881m8262o4189k8330k6546n211O4450Q4652j3063j23230
$$ -144937 -112991 59879 145760 97498 33309 4979 -21567 -26778 37672 122324 109261 -13969
181a3969r0200O0647J29783K9703q4300p6557j6755N922L3212Q4702N7774q2511
$$ -13969 -104169 -43522 86261 115964 31664 -44893 -61648 -55726 -22514 62188 119962 37451
193C7451j74694o1774J58311K05846n230k07678j43008P0634J51403N4685m5709
$$ 37451 -137243 -199017 -40706 165140 159910 -47768 -190776 -120142 31261 85946 40237
204D0237n7606l4084j9161J1831O3472O6847k1677j04700n7914O0701R0626J8489
$$ 40237 -17369 -51453 -70614 -58783 4689 71536 49859 -54841 -112755 -52054 38572 57061
216E7061m2713m9031l8275j0292N3602R9144M0219j01495j58558j7706J73537
$$ 57061 14348 -34683 -72958 -83250 -29648 69496 109715 8220 -150338 -168044 5493
227E493J61313m5411j78204r2559O8068J19754N3052k6406n3769m6235k4371K7602
$$ 5493 166806 121395 -56809 -149368 -81300 38454 91506 65100 11331 -34904 -59275 -31673
239c1673Q4271N6946m7886r9133k7868O2779O7492J3774l1625m6596l7127m488
$$ -31673 52598 109544 61658 -37475 -65343 -2564 64928 78702 47077 481 -36646 -41134
251d1134N2548Q5844K1209j06389j30599J2279J50102J08903n1912j40449p6955
$$ -41134 11414 97258 118467 12078 -118521 -106242 43860 152763 100851 -39598 -116553
262a16553M5488R9090N6935j3635n9411p1653l1838N6779R9962K7876p5735q5763
$$ -116553 -71065 28025 84960 71325 11914 -59739 -91577 -34798 65164 93040 17305 -68458
274f8458n449O2348N5081K692l1464l3271k8209q514M8360Q1100R985j00351r9627
$$ -68458 -73907 -11559 43522 46214 14750 -18521 -46730 -55244 -6884 74216 84201 -16150 -115777
287a15777K3632J23834Q7157m2422j19978o9132M0285R2144O1709n848p2434q6621
$$ -115777 -92145 31689 118846 76424 -43554 -112686 -72401 19743 81452 75604 3170 -83451
299h3451j2153Q4457R0418N75q0485o9324P999O0620M1019l298j9398k5567l7397
$$ -83451 -95604 -11147 79271 79846 -639 -69963 -61964 -1344 39675 36377 16979 -8588 -45985
312d5985r497N8776P3856n555r3165q0013K9237J13559P0674m9542j06841n1288
$$ -45985 -55482 3294 77150 71595 -21570 -101583 -72346 41213 111887 62345 -44496 -95784
324i5784L9154Q2701O1872j1391q3597p6911P913Q4496P4170r007p6319n8722
$$ -95784 -56630 26071 87943 76552 -7045 -83956 -76043 8453 82623 73616 -2703 -61425
336f1425J3759M9981L2542Q853j1410m1783m6804O341P0315O2093k2105r5049
$$ -61425 -47666 2315 34857 43710 32300 -9483 -56287 -49946 20369 82462 60357 -34692
348c4692o3505M7911J04529M0353n8516q4633l4366L6645P3857M8342k1697p3826
$$ -34692 -98197 -50286 54243 94596 36080 -48553 -82919 -46274 27583 75925 54228 -19598
360a9598o0173R319P3951O7218j0224p0206n2423N270M1921M6449K2840k5859
$$ -19598 -79771 -70452 3499 70717 60493 -9713 -62136 -56866 -14945 31504 54344 28485
372B8485o1151l9051K9055P8247M7570m4478r2097l0059O4670P9507J3621n0579
$$ 28485 -32666 -71717 -42662 35585 83155 38677 -53420 -83479 -18809 60698 74319 23740
384B3740o0619k0289L3630N8414L5954j3660n9231n8803N661P2955O4254j0247
$$ 23740 -36879 -57168 -23538 34876 70830 57170 -2061 -60864 -55203 17752 82006 71759
396G1759o5920n8331l210N2130O1734J3957m8469o7787k5142M6737P6906K1009
$$ 71759 5839 -52492 -55702 -3572 58162 72119 23650 -44137 -69279 -22542 54364 75373
408G5373o3384p3118l460N6305N2043K509m0187m5161j5029K1148M2799L9687
$$ 75373 11989 -61129 -64589 -8284 43759 46268 6081 -39080 -54109 -32961 9838 49525
420D9525n126o2159o0277J1853P4269O0437j0496p0650o2480P807O7687N9350
$$ 49525 44399 -17760 -78037 -66184 8085 68522 58026 -12624 -75104 -67297 390 59740
432E9740q92n6333o1849p302N8912O4052j250n6517m7846K003M2955M1147N194
$$ 59740 58848 2515 -59334 -66636 -7724 56328 55078 -1439 -49285 -47282 -4327 36820 42014
445D2014k8761l5282k0777J1888M9814M7106j3910o9320n1061K2673P5330N4734
$$ 42014 13253 -22029 -42806 -30918 18896 66002 52092 -17228 -68289 -45616 29714 84448
457H4448k3368p6941m9425K3200O4831M6078r234n8627n2933N020N4260M3961
$$ 84448 61080 -15861 -65286 -42086 22745 68823 59589 962 -51971 -46951 7309 51270
469E1270m016m4101m4183n537L4578L8454Q957k3867m3796l0814K0081O0298L6695
$$ 51270 47254 3153 -41030 -46567 -11989 26465 35422 11555 -32241 -63055 -42974 17324 54019
482E4019l0017o7985l7707L3559P5129L7564l6606o4926k8153K7336N6693M0096
$$ 54019 24002 -43983 -81690 -48131 26998 64562 27956 -36970 -65123 -37787 18906 59002
494E9002j1671n1003l8851Q498M5203M4753M678m1069m5627n147L5224M3756J5549
$$ 59002 47331 -3672 -42523 -34025 11178 55931 60609 19540 -26087 -31234 3990 47746 63295
507F3295l0965n5052k3588L5505N7164J9487l9128o3441k4059M0670N9431J5241
$$ 63295 32330 -22722 -46310 -10805 46359 65846 26718 -36723 -60782 -20112 39319 54560
519E4560l7195n0474k4159K0726M8887L1463j3127m5382l9036J485M6266M8965
$$ 54560 17365 -33109 -57268 -36542 12345 43808 30681 -14701 -53737 -52252 -5986 42979
531D2979Q74m6656m5378l051M0491M9544J0083m3251n1057o801M0328M9196R941
$$ 42979 43853 -2803 -48181 -51232 -10741 38803 48886 5635 -45422 -52223 -11895 37301 47242
544D7242m1860n1866p744L9268M2850J0840k6840m3445k2924K1061M5048L0759
$$ 47242 5382 -46484 -54228 -14960 27890 38730 11890 -31555 -54479 -33418 11630 42389
556D2389r315m5719m2656Q432N5490M6064o860m7524m2358L827M9948M5949k877
$$ 42389 33074 -12645 -55301 -46869 8621 54685 47825 301 -42057 -38230 11718 57667 54790
569E4790m2896l8478p35L8499M3409K598m0372l8965m629K8711L6543J1835k7266
$$ 54790 11894 -26584 -27319 11180 54589 57187 16815 -22150 -26779 1932 38475 50310 23044
582B3044m3918k2280J7800M2335K9904j6642n6042l8928J8048N2549L4955j4705
$$ 23044 -20874 -43154 -25354 16981 46885 30243 -25799 -64727 -46679 5870 40825 26120
594B6120n1185l7765J3835M7738L3341p097l6279l4355J607M0044L7983K24l1474
$$ 26120 -25065 -62830 -48995 -1257 32084 24987 -11292 -45647 -44040 -3996 33987 34211 2737
607B737l2900n705L0297M0323J1248k6689l9037j8619K2117M7789K6624k7334
$$ 2737 -30163 -35868 -5571 34752 46000 19311 -19726 -38345 -16228 31561 58185 30851
619C0851n1896k5613K3135M8123K8887k1524m9186k7685J6503L9674K8617o286
$$ 30851 -21045 -46658 -23523 24600 53487 31963 -17223 -44908 -28405 11269 39886 33600
631C3600l8186l3666M957L6480L2502J714l2223l5966k929L3902L5843N528k6514
$$ 33600 -4586 -38252 -33295 3185 35687 37401 5178 -30788 -33717 185 36028 41556 15042
644A5042l8485j4852K8744M4419J4027k8577m3949k0505K2886M5729K1029k4539
$$ 15042 -23443 -38295 -9551 34868 48895 20318 -23631 -44136 -21250 24479 45508 20969
656B0969m2870k4234J2834L9369K9102j1641m0901k9689O995L5862L2710k740
$$ 20969 -21901 -46135 -33301 6068 35170 23529 -17372 -47061 -40066 -4204 28506 25766
668B5766l7059l1146N130L2531L0635M520k7258l4411n284K9520L6180J2061k2661
$$ 25766 -11293 -42439 -37309 -4778 25857 30377 3119 -31292 -36576 -7056 29124 41185 18524
681A8524l9888j6508K5929M1952J8196k0436m1010k5683J7479M3805K4718j7486
$$ 18524 -21364 -37872 -11943 30009 48205 27769 -13241 -38924 -21445 22360 47078 29592
693B9592m0343k7155J0163L9162K7449j2304l6757k3930N781K8977K6892j194
$$ 29592 -10751 -37906 -27743 11419 38868 26564 -10193 -34123 -28342 635 27527 26333
705B6333k8137k7047k853K2451L1965J2985k4505l7600j2253K4729L8469J9452
$$ 26333 -1804 -28851 -31704 -9253 22712 35697 11192 -26408 -38661 -13932 24537 43989
717D3989k1285m4628k0538K4984M2797J9715k0037m0468k2126J8424L7955J9005
$$ 43989 22704 -21924 -42462 -17478 25319 45034 24997 -15471 -37597 -19173 18782 37787
729C7787j3969l0907k2209O956L0089K2224n477k3757k3587m918K1871L2087Q499
$$ 37787 23818 -7089 -29298 -22342 7747 29971 24494 737 -22850 -27768 -5897 26190 34689
742C4689k5047l3724j2401K3847M0590J5741k8401m2085j2963K6679L9298J5106
$$ 34689 9642 -24082 -36483 -12636 27954 43695 15294 -26791 -39754 -13075 26223 41329
754D1329k4510l9002j3642K0482L0923J5854j1640l1391k0707R766K7807J8823
$$ 41329 16819 -22183 -35825 -15343 15580 31434 19794 -11597 -32304 -22538 5269 24092
766B4092m205k3578k5265k249K5374K7389M478k3550l2968j0016K8603L8178O960
$$ 24092 19887 -3691 -28956 -31205 -5831 21558 26036 2486 -30482 -40498 -11895 26283 33243
779C3243k9601l4863q147K6942L6834R614k5123l1275r647J6974L0114J8180j3317
$$ 33243 3642 -31221 -39368 -12426 24408 34022 8899 -22376 -32023 -15049 15065 33245 19928
792A9928l1670j7334J0821K8194K1140o355k8160k1915N071K3812K3984K812k5143
$$ 19928 -11742 -29076 -18255 9939 31079 24724 -3436 -25351 -20280 3532 27516 30328 5185
805E185l1477k116K9433K9766K420k7125l1360m029K7234K8869M270j9624k7134
$$ 5185 -26292 -28408 1025 30791 33211 6086 -25274 -29303 -2069 26800 31070 11446 -15688
818a5688j2890J5452L2109J5767j5107l1518j8524J2261L3069J9145j4428k8763
$$ -15688 -28578 -13126 18983 34750 19643 -11875 -30399 -18138 14931 34076 19648 -9115
830i115j6260O800K4092K2370k988k7442k4177K876K6003K4683n54k6779k5169
$$ -9115 -25375 -18575 5517 27887 24899 -2543 -26720 -23844 2159 26842 26288 -491 -25660
843b5660R96K2191K1855O506j6107k8555j3065J7371L1088J5216j5853l4684j8038
$$ -25660 -24664 -2473 19382 25888 9781 -18774 -31839 -14468 16620 31836 15983 -18701 -36739
856c6739J9478L4288J2478j7541k6572j4440J0154K6091J7452q758k4572j8138
$$ -36739 -17261 17027 29505 11964 -14608 -29048 -18894 7197 24649 15891 -8681 -26819
868b6819M152K5182K1809n905k3615j7586J730J6901K1069Q068j6328k6830j1198
$$ -26819 -22667 2515 24324 18419 -5196 -22782 -21052 -4151 16918 24986 8658 -18172 -29370
881b9370J6541L1587J6929k0023l6788j2035K3868L1051R801j8102k7520j1130
$$ -29370 -12829 18758 35687 15664 -21124 -33159 -9291 21760 31561 13459 -14061 -25191
893b5191J4778K4806J1766q884k3131j7430Q025K5507J4061q170j8551j4419r72
$$ -25191 -10413 14393 26159 17275 -5856 -23286 -15261 10246 24307 16137 -2414 -16833 -17805
906a7805J5856K0247N207j5426k5139j3135J7514L4278J1995k5599l3357o746
$$ -17805 -1949 18298 23505 8079 -17060 -30195 -12681 21597 33592 7993 -25364 -32110
918c2110K3088K9362P037k1081k6145n761J4840K1486J1818j0070k4705j3110
$$ -32110 -9022 20340 27377 6296 -19849 -25610 -10770 10716 22534 12464 -12241 -25351
930b5351J2429K1411J0649o216j7006j3980J545J5540J7340O039j4087k6620j0123
$$ -25351 -12922 8489 19138 12922 -4084 -18064 -16519 -979 16361 22400 8313 -18307 -28430
943b8430K2787L1268N595k4710k8836m365K4371K7190K304k0633k1223n687J3273
$$ -28430 -5643 25625 31220 6510 -22326 -26691 -2320 24870 27174 6541 -14682 -20369 -7096
956g096K3012J0529j4154k3349q830J1191K0058J0399q118j7884j0980K760J3149
$$ -7096 15916 26445 12291 -11058 -19888 -8697 11361 21760 13642 -4242 -15222 -12462 687
969F87J7162N843j8446k6159l706K3215K5864J983k4223k6439l88K4229K1048
$$ 687 17849 23692 5246 -20913 -24619 -1404 24460 26443 2220 -24219 -24607 -378 20670
982B0670n2j6665k0466p159J4900K2799P308j4008k1566q965J1284K0991Q534
$$ 20670 20618 3953 -16513 -23672 -8772 14027 21335 7327 -14239 -23204 -11920 9071 17605
995A7605j0364j5915r797J663J5660J8147K84k1078k0381o2K2432K2877j523k5188
$$ 17605 7241 -8674 -18471 -16808 -1148 16999 17283 -3795 -24176 -24238 -1806 21071 19548 -5640
1009e640j9458M310J9303J6740K431j5811k0173n037J5785K0476P398j3082k2603
$$ -5640 -25098 -20788 -1485 15255 17686 1875 -18298 -23335 -7550 12926 20324 7242 -15361
1022a5361q257J5195K0244O155r177j5890j1222N312J9285J4420m277j8941j6747
$$ -15361 -23618 -8423 11821 17976 8799 -7091 -18313 -13001 6284 20704 16427 -2514 -19261
1035a9261L184K3148J8404o731k0706j3419L315J6310J6665J379j5940j7312m041
$$ -19261 -16077 7071 25475 18744 -1962 -15381 -12066 4244 20909 22288 6348 -10964 -15005
1048a5005J3523K1085P763j6271k2476m589J5094J8418O171j0458j9422r103R479
$$ -15005 -1482 19603 27366 11095 -11381 -15970 -876 17542 23713 13255 -6167 -15270 -5791
1061e791J7306J0875n915j9833j4910P227K0999J0728p485j6846j2890K238J5686
$$ -5791 11515 22390 16475 -3358 -18268 -11041 9958 20686 13201 -3645 -16535 -14297 1389
1074A389J4049q10j4026j6939n869J4928K1758L547j7754j9878l817J4176J9204
$$ 1389 15438 14628 602 -16337 -22206 -7278 14480 18027 273 -19605 -23422 -9246 9958
1087I958N393j4029j7977n673R433J7563J0176r273k0021r256J0233J7092R274
$$ 9958 15351 1322 -16655 -22328 -12895 4668 14844 5571 -14450 -23706 -13473 3619 12893
1100A2893n950j6134j0473M866J4015J2015N27j2684j8094k739J7620J9086J628
$$ 12893 6943 -9191 -19664 -14798 -783 11232 11759 -925 -19019 -21758 -4138 14948 16576
1113A6576j5879j8724l123J6936J8640K278j3525j5521n079J0965J8638P456j1757
$$ 16576 697 -18027 -21150 -4214 14426 16704 3179 -12342 -17421 -6456 12182 19638 7881
1126G881j6421n965R121J6636Q759p360j5144p491M587J2816J2668P3j5307j5611
$$ 7881 -8540 -14505 -5384 11252 20011 12651 -2493 -9984 -5397 7419 20087 20160 4853 -10758
1140a0758R11J6150J6104R96j7031j8146O52J6321J4618P86j2422j6804m673J2708
$$ -10758 -9847 6303 22407 23403 6372 -11774 -11122 5199 19817 20603 8181 -8623 -13296 -588
1154e88J6481L312j0926j5653o339R068J5944N246q377j3006q408L293J4215J1839
$$ -588 15893 19205 8279 -7374 -13713 -4645 11299 16545 8168 -4838 -13246 -9953 4262 16101
1168A6101l691j6023j2934J835J5284J5544k526j8339j4085K267J4286J3163N58
$$ 16101 12410 -3613 -16547 -14712 572 16116 13590 -4749 -18834 -16567 -2281 10882 11440
1181A1440j4307j5495j257J2081J3439L516j0947j6366m275J0861J3997M260p050
$$ 11440 -2867 -18362 -19619 -7538 5901 9417 -1530 -17896 -22171 -11310 2687 6947 -103
1194a03j3560p935O553J5426Q633m251j3718j1567M150J7529J2554m741j4854
$$ -103 -13663 -21598 -15045 381 9014 4763 -8955 -20522 -16372 1157 13711 8970 -5884
1207e884j0173L039J4595J3465j261j3194j1316n21J1519J4243L449j1977j4009
$$ -5884 -16057 -13018 1577 15042 13781 587 -10729 -11250 269 14512 17961 5984 -8025
1220h025k235J0171J3233N320q489j4863n368Q443J2825P665n386j5055r947P408
$$ -8025 -10260 -89 13144 18464 9975 -4888 -10256 -1813 11012 18677 13291 -1764 -11711 -4303
1234d303J5290Q295n242j3396j0530L809J4484R808k689j1660j1424j475J2381
$$ -4303 10987 19282 14040 644 -9886 -6077 8407 18215 15526 3866 -7558 -9033 3348
1247C348J3595j15j2392j2285l050R621J4193L251j1681j3771l979P613J2741
$$ 3348 16943 16828 4436 -7849 -10899 -1278 12915 16166 4485 -9286 -13265 -5652 7089
1260G089O569q553j5190n923O724J2387P406n151j4758p834N138J1714Q710j623
$$ 7089 13658 5105 -10085 -16008 -9284 3103 10509 5358 -9400 -17234 -12096 -382 8328 6705
1274F705j1782j2050J594J3182J0992l65j0838j2409k175J2890J2585P98j0042
$$ 6705 -5077 -17127 -15533 -2351 8641 8276 -2562 -14971 -17146 -4256 8329 9127 -915
1287i15j1337l735R689J3147L234q616j1284m857O338J2988P158o806j2761n906
$$ -915 -12252 -15987 -6298 6849 10083 1467 -9817 -14674 -8336 4652 11810 5004 -7757 -13663
1301a3663M809J1686R336l290j2864q752L243J1748J0282J65j2050j1677J894
$$ -13663 -8854 2832 12168 8878 -3986 -12738 -9495 2253 12535 12700 650 -11027 -9133
1314i133J1641J0869O85r524j2310j176J0590J0959J608o869j1279n271P614J2699
$$ -9133 2508 13377 14062 4538 -7772 -8948 1642 12601 14209 7340 -3939 -9210 -1596 11103
1328A1103M475o646j1440o891N003J3286O937o214j1591p337K640J0953R816l024
$$ 11103 15578 8932 -2508 -9399 -4396 8890 15827 9613 -1978 -9315 -6675 4278 14094 11070
1342A1070j2798q546J681R966J0111K3j1595j0415Q05Q928Q709K628q106j2050
$$ 11070 -1728 -10274 -8593 1373 11484 11507 -88 -10503 -9698 -770 7939 10567 2461 -9589
1356i589l140Q560J0478M022o538j2782n450Q356J1553M185n737r969p178M150
$$ -9589 -12729 -4169 6309 10331 3793 -8989 -14439 -6083 5470 9655 3918 -6051 -13229 -9079
1370i079J2162O932l690j0653p618J514J1530R559k714j0280q254L05Q396R958
$$ -9079 3083 10015 6325 -4328 -11946 -10432 1098 10657 7943 -2337 -10591 -10286 -1890 8068
1384H068J679r510r680k274P378J1306L687q813j2132j837Q138R542L910n776
$$ 8068 9747 237 -9443 -11717 -4339 6967 10654 1841 -10291 -12128 -3990 5552 9462 3686
1398C686j0558n006N606R882O032k837j0552p932L556J2036O903k747q821q053
$$ 3686 -6872 -11878 -6272 3610 9642 6805 -3747 -11679 -8123 3913 10816 8069 -752 -8805
1412h805R93J0085Q741p46p837q647k154Q334J1515J182r657r003j471P337R071
$$ -8805 -7812 2273 11014 10268 2431 -6216 -8370 -36 11479 12661 3004 -5999 -7470 -133 8938
1427H938L280o847r395l513M156R392O690m461j2037o138M973J0081N829k906
$$ 8938 12218 5371 -4024 -7537 -3381 6011 12701 8240 -3797 -9935 -4962 5119 10948 8042
1441H042j0208p332K911R055O259p06q016r944K13R494Q520p52q099q651j131
$$ 8042 -2166 -9498 -6587 2468 8727 8021 5 -9939 -9726 -232 8288 7536 -563 -9214 -10345
1456a0345P575Q570P54o314p174m381M360J0792N258o250j0484m086M565J0375
$$ -10345 -2770 5800 6554 240 -6934 -11315 -6955 3837 9095 2845 -7639 -11725 -7160 3215
1470C215N804n119r191m413L024Q070P423p83r176p649J882Q720P556M54q257
$$ 3215 9019 3900 -5291 -9704 -6680 1390 8813 8030 -1146 -8795 -6913 1807 9363 9817 1560
1485A560q358K02Q541O645J205m967q953l731O587R796K854n938r772m496N802
$$ 1560 -6798 -6596 1945 8590 9795 4828 -4125 -7856 -1269 8527 11381 5443 -4329 -8825 -3023
1500c023J0217K832n530q023m424K182Q133O627l364r281n922J136Q228P387j563
$$ -3023 7194 10026 4496 -3527 -7951 -5769 2364 8991 5627 -3654 -9576 -8440 -212 7175 5612
1515E612r234o259P24O447O620J893o744q441j068O072Q644L104n620r893k628
$$ 5612 -3622 -9881 -9157 -2710 3910 5803 -941 -9382 -10450 -4378 4266 7370 1750 -8143 -10771
1530a0771P754Q577J833m011o981m627L919R478M572k437p941o187K380R213O334
$$ -10771 -3017 5560 7393 3382 -3599 -8226 -4307 5171 9743 7306 -635 -6822 -4442 4771 11105
1545A1105l208p171n671L44P034P167k21p203o991j262N554Q461J674p757q836
$$ 11105 7897 726 -4945 -4601 2433 9600 9379 2176 -4815 -6077 -523 7938 9612 1855 -6981
1560f981l24N890O650K444m792q070l261L937P415M700k454r095n782M261Q534
$$ -6981 -7305 -1415 5235 7679 2887 -5183 -8444 -4507 2908 7608 5154 -3941 -9723 -5462 3072
1575C072L993k429o859n777J728P404N337j079o190o669j091O977Q162n94p157
$$ 3072 7065 4636 -2223 -8000 -6272 1132 6469 5390 -800 -7469 -8560 -1583 6579 5985 -1172
1590a172o599p62N431P658J856o019o476j868L728P949N030n000q517k795M752
$$ -1172 -7771 -8533 -3102 4556 6412 393 -6083 -7951 -4223 3726 8756 3756 -4761 -7556 -2804
1605b804P325M536k492p671m213K965O694M765n4o948p285J042P148N733o73o409
$$ -2804 4521 9057 6565 -1106 -5319 -2354 4340 9105 9051 2103 -5182 -4140 3008 8741 8068 1659
1621A659p380l67O168N676L0n451o309l402M076Q137K282n385p386k497L308P915
$$ 1659 -5721 -6088 80 5756 5786 335 -5974 -9376 -5300 2837 5119 -266 -7652 -10149 -6841 1074
1637A074L830m280o340k607K524O109O081j229p094n127K600O265N952Q0o924
$$ 1074 4904 624 -5716 -8323 -5799 310 6391 5162 -1932 -7059 -4459 1806 7758 7838 914
1652I14n747J274O027M530J200m926o756j938N571O310J067m437p444l002N287
$$ 914 -4833 -3559 2468 6998 8198 3272 -3484 -5422 149 6459 7526 3089 -4355 -7357 -2070
1667b070O817J274l988n415l462J989P306M268k959o182m097J647P148N521k128
$$ -2070 4747 6021 2033 -3382 -6844 -4855 2451 6719 3760 -2422 -6519 -4872 2276 7797 5669
1682E669o861l601J477M678N380M20n421o417l96M737N709J829n395q014j064
$$ 5669 -1192 -4793 -3316 1362 6742 7162 1741 -4676 -5072 -335 5374 7203 1808 -6206 -7270
1697g270N332M925J270l421o250l887M000O531K884k732o290m273L198P695L599
$$ -7270 -1938 2987 4257 836 -5414 -9301 -5301 1230 4114 1382 -4908 -9181 -5983 1712 5311
1712E311k682n329k504R46N738N086j63n043m444p95N371P105P53o681n754K92
$$ 5311 2629 -2700 -5204 -4258 1480 6566 6403 1360 -3084 -3879 1492 8597 9350 2669 -3085 -2793
1728b793L917N654J156m582o508j378K843M986K988l063q042l429M294N358J937
$$ -2793 1124 6778 7934 3352 -3156 -4534 -1691 3295 6283 3220 -4822 -8251 -3957 1401 3338
1743C338k040n272l856J835N277L868l00m182n500m80O882O020p52n414m501k75
$$ 3338 1298 -3974 -7830 -5995 -718 3150 2850 -1332 -6832 -7312 -430 5590 4838 -576 -5077 -5352
1759e352N086N574N02m156m639k005L023O151K875m391o846j614L703N101K394
$$ -5352 -266 5308 5810 1654 -2985 -4990 -1967 4184 7059 2668 -4178 -5792 -2089 3012 5406
1774E406l283n578k167J792M344L807N0n923n100J971N950M432j168m521m988
$$ 5406 2123 -3455 -5622 -3830 514 4321 4371 -1552 -6652 -4681 1269 5701 4533 12 -4976
1789d976J241N439L694n8k545m902k250M442O258R30m259n460j528L525N774J214
$$ -4976 -3735 1704 5398 5340 2795 -2107 -4357 85 6343 7273 3014 -2446 -3974 -449 5325 6539
1805F539l845m378k065J212M191M271j723o476l300J221N547M153j556n467l830
$$ 6539 2694 -1684 -3749 -2537 1654 5925 4202 -2274 -5574 -4353 1194 5347 3791 -1676 -5506
1820e506J813L909L365Q36l772n422p35M913N004P24l951n930q62M725M495J99
$$ -5506 -3693 216 3581 4417 645 -4777 -5512 -599 4405 5129 1178 -4752 -5614 -889 3606 3805
1836C805l083l919k601K003N493K422k298n290l369J600O034L666k823n094k120
$$ 3805 722 -3197 -5798 -3795 1698 4120 1822 -3468 -6837 -5237 797 4463 1640 -3454 -5574
1851e574R95L485M124K2m428l671k27M251N031Q51m814n203J035M286L234J037
$$ -5574 -4579 -1094 3030 3052 -1376 -5047 -5274 -1023 4008 4859 45 -5158 -4123 163 3397 4434
1867D434k172m578j671K707M852K219j677n534k888L200N711J629k547l657k789
$$ 4434 2262 -2316 -3987 -1280 3572 5791 4114 -1420 -4308 -1108 4603 6232 3685 28 -2761
1882b761Q89M576L189n94l972l802o84M653M933q30n248l564L12L271L416R93
$$ -2761 -1872 2704 5893 5299 1327 -2475 -3159 1494 6427 5597 349 -3215 -2903 368 3784 4777
1898D777l581m251j321K083M206L093l167o079j931L620M226J416j898m531k383
$$ 4777 1196 -3055 -4376 -2293 1913 5006 1839 -4240 -6171 -2551 1675 3091 1193 -3338 -5721
1913e721K075L777K848p18l135m672R83N512L679j317l991l004L7M395L518k23
$$ -5721 -3646 131 2979 2261 -874 -5546 -4563 949 4628 3311 -680 -3684 -3647 748 4266 4043
1929D043l172l041j612K468N282J167l921m294q82K281L847K019l248m285j319
$$ 4043 871 -2170 -3782 -1314 3968 5135 1214 -3080 -3962 -1681 2166 4185 937 -3348 -4667
1944d667J671L322L364j141n268k902J929M090K807q50l781l575J315L737K610
$$ -4667 -2996 326 3690 2549 -2719 -5621 -3692 398 3205 2355 -1426 -5001 -3686 51 2661
1959B661J13k403l920r47L869M107K80k803l977j597L646M013J236l295l240j487
$$ 2661 2774 371 -3549 -4496 -627 3480 3760 957 -3020 -4617 -971 3042 4278 983 -2257 -3744
1975c744J286M281K850k007m501k070J703L878L282j423m392k001J667K830K955
$$ -3744 -2458 1823 4673 2666 -1835 -3905 -2202 1676 4958 3535 -857 -2858 -1191 1639 4594
1990D594L82l458l735O1L779L478L94k756m615n34L768L230p3k170m068j668K493
$$ 4594 4976 1518 -2217 -2156 1623 5101 5495 2739 -1876 -2410 1358 4588 4515 2345 -1723 -3391 -898
2007h98L595J197k513l685k482J476M315J875k278l415k221L46L390L306o52m066
$$ -898 2697 3894 1381 -2304 -4786 -3310 1005 2880 602 -2813 -5034 -4688 -1298 2008 1356 -2710
2023b710k667M06L188L546L41l720l147O55L027K886Q00k061l623o60L067L156
$$ -2710 -5377 -4971 -1783 1763 2104 -1616 -4763 -4108 -1081 1805 2605 544 -3079 -3739 -672 2484
2039B484J171j173l895j688K332L583J633j426l142k461J149M005K408j361l184
$$ 2484 3655 2482 -1413 -3101 -769 2814 4447 3021 -121 -2582 -1433 2572 4980 3619 435
2054D35k796L62L768L123j483l188k032m74K634L616j02l735k708m20J820L454
$$ 435 -2361 -1999 1769 4892 3409 221 -1811 -2285 349 3965 3863 128 -2580 -3000 -1180 2274
2070B274J335k643m211q15K118L026J527j594l819k196K177L415J701p35l942
$$ 2274 3609 966 -3245 -4060 -1942 1084 2611 1017 -2802 -4998 -2821 594 2295 1560 -2382
2085b382k475J511L494K431j150k312k890j07L737K910m48k697k295q92K842L186
$$ -2382 -4857 -3346 148 2579 1429 -883 -3773 -3880 -143 2767 2319 -378 -2673 -3565 -723 2463
2101B463J024k815k532j314J974L891J682k554l463o16J806L082J738j404l343
$$ 2463 3487 672 -1860 -3174 -1200 2691 4373 1819 -1644 -2260 -454 2628 4366 2962 -381
2116c81j356J471K743J791q1l277k955R25L153J993L6k635l262m72K952K891l63
$$ -381 -1737 -266 2477 4268 4187 910 -2045 -1120 2033 4026 4062 1427 -1835 -2307 645 3536 3173
2133C173k055l233j651K405L890j36k645k829j178J664L236J175k224k568r45
$$ 3173 1118 -2115 -3766 -1361 2529 2393 -252 -3081 -4259 -2595 641 1816 -408 -2976 -3921
2148c921Q45K666K636r01l255j647R77K694K989n63l386k204J200K204K617O42
$$ -3921 -3076 -410 2226 1325 -1930 -3577 -2600 94 3083 2520 -866 -3070 -1870 334 2951 3593
2164C593k794l231k24L084K328J34j964l078j037K027K690K61j324k582j955R44
$$ 3593 799 -2432 -2656 428 2756 2890 926 -2152 -3189 -1162 1528 1789 465 -2117 -4072 -3128
2180c128L433J666j757k332k383P64L974K356j530k919j186O77K466K469o6k775
$$ -3128 305 1971 214 -2118 -4501 -3737 237 2593 1063 -1856 -3042 -2365 101 2570 2504 -271
2196b71j787J13K352K563O16k411k798j69K258J718J210j155l632j340K113K972
$$ -271 -2058 -1945 407 2970 3586 1175 -1623 -1792 466 2184 3394 2239 -1393 -2733 -620 2352
2212B352J152j581l328j648J854L562N15j192k260j410N64L046J525n33j541j772
$$ 2352 3504 1923 -1405 -3053 -1199 2363 2878 1686 -574 -1984 -1420 1626 3151 2618 1077 -695
2228f95m55J979L570ok880k026m53J722K682J117k762k942o39J745K411R19k635
$$ -695 -1150 829 4399 4393 1513 -513 -966 756 3438 4555 1793 -1149 -1788 -43 2368 3287 652
2245F52l292q57J991J949L97r50k702j101N94J756J350L6j857k970M52K996K625
$$ 652 -2640 -3497 -1506 443 840 -110 -2812 -3913 -3319 -1563 -213 -177 -2034 -5004 -4552 -1556 1069
2262A069k85k526k165L50K625K686n3k422j647o97J855L013O81k406j949m03J267
$$ 1069 784 -1742 -3907 -3557 -932 1754 1701 -721 -2368 -3065 -1210 1803 2484 78 -1871 -2274 -1007
2279a007K085J148j113k257r26J28J895K115M1l092k301J211K908J702j28l050
$$ -1007 1078 2226 1113 -1144 -2070 -1942 -47 2068 2109 -983 -3284 -2073 835 2537 2409 -641
2295f41j942J322K601J318Q4j520j710m89K340K103o4j589j662o74J433K399P77
$$ -641 -2583 -1261 1340 2658 2742 1222 -488 -977 1363 3466 3402 1813 151 -523 910 3309 4086
2312D086j271k119j354J30K913J874j573l045j269Q80K584J564j751k512j087
$$ 4086 2815 696 -658 -528 2385 4259 2686 -359 -1628 -748 1836 3400 1649 -863 -1950
2327a950J102J356J090r2j512k186J51J369J780J125j760k677p86J730K313K58
$$ -1950 -848 508 1598 1506 -6 -2192 -2041 -672 1108 2233 473 -2204 -2990 -1260 1053 1311
2343A311j007k333j644J866K593P06j568k266j160J157K752M80j915j383l40K09
$$ 1311 304 -2029 -3673 -1807 786 1492 -76 -2342 -3502 -2345 407 887 -1028 -2411 -2751 -2542
2359b542J549J572l30j460j681j05J589K437Q79k186k648J74K008K303O49j950
$$ -2542 -993 579 249 -1211 -2892 -2997 -1408 1029 1908 -278 -2926 -2752 -744 1559 2208 258
2375B58k550o6K260K076L90j296k072m08J234J842L26n47q91j619L17J848J481
$$ 258 -2292 -2358 -98 1978 2368 1072 -1000 -1408 -174 1668 1994 1447 556 -1063 -746 1102 2583
2392B583Q6j640k201l15K673K452p69k533j485K03K034K286n38k484j250J70J009
$$ 2583 2669 1029 -1172 -1487 1186 3638 2869 336 -1149 -946 1088 3374 2836 352 -898 -728 281
2409B81J519L23j348j576j75N03J264J207j04k486j824J046J757J800m76k508
$$ 281 1800 2123 775 -801 -976 -473 791 1998 1894 -592 -2416 -1370 387 2187 1711 -797
2425g97j946J167K635J172j173j775j491O42K280R62o87j249j038l32R94J904
$$ -797 -2743 -1576 1059 2231 1058 -717 -2208 -1566 714 1676 989 -260 -1298 -1630 -636 1268
2441A268L99j390j531j071O90J910J748j751k153j209J191K106J407j338k910
$$ 1268 1667 277 -1254 -2325 -1635 275 2023 272 -1881 -3090 -1899 207 1614 276 -2634
2456b634m96J671J115Q64p45j592p59Q91J353O28M85q73j549m36J432J785R71
$$ -2634 -3130 -1459 -344 520 -225 -1817 -2576 -1685 -332 296 781 -92 -1641 -2077 -645 1140 2111
2473B111j313j981j094J987K550K22j504j788p11J512K142M73j942j371j4R78
$$ 2111 798 -1183 -2277 -290 2260 2482 978 -810 -1521 -9 2133 2606 664 -707 -721 257
2489B57J108N64m03j640m46P7M20J693Q19j443j960l58J801J889P67k024k299
$$ 257 1365 1929 1526 -114 -560 -483 -63 1630 2449 1006 -954 -1312 489 2378 3145 1121 -1178
2506a178j35K316J501j03j744j858J34J683J063l00r53j076p13M36Q90Q90m44
$$ -1178 -1313 1003 2504 2401 657 -1201 -1067 616 1679 1379 426 -650 -1363 -927 -37 853 409
2523D09j052j153n28J645K196r64j946j670L45K258J744l87k308j157O01J781
$$ 409 -643 -1796 -2324 -679 1517 553 -1393 -3063 -2718 -460 1284 897 -1411 -2568 -1967 -186
2539a86J131J44j841n58N17N50P47Q47l33j312j378J018J719Q64k94j871j868
$$ -186 945 1089 -752 -1310 -793 -243 504 1351 1018 -294 -1672 -654 1065 1929 1635 -236 -2104
2556b104J123K141J001q57j878j278N88K511O95j077j654l35M12Q57R36j94j201
$$ -2104 -981 1160 2161 1304 -574 -1852 -1264 1247 1942 865 -789 -1124 -712 145 1081 887 -314
2573c14l02m91J96J847J107j363j721q07J396J540J103j047k261n43J305J454
$$ -314 -616 -1107 -911 936 2043 680 -1041 -1848 -452 1088 2191 1144 -1117 -1660 -355 1099
2589A099P04r30j947p85J355J704m01r2q00r20M1J061O52L90m90j931j016J725
$$ 1099 1803 873 -1074 -1859 -504 1200 799 707 -93 -1013 -972 89 741 1131 641 -1290 -2306 -581
2607e81K548J20j661j785j14J286K051J85j831j350L51O54J383N6l55j524j08
$$ -581 1967 2087 426 -1359 -1473 -187 1864 2049 218 -1132 -781 -127 1256 1312 957 -567 -675
2624f75L13Q97O31J48j363j518L65J248J108P02j494k623K62K498J130m31j522
$$ -675 -362 535 1166 1314 -49 -1567 -1202 46 1154 1856 362 -2261 -1999 499 1629 1198 -324
2641c24j719O11J645J255j093n38q33J27J27J478J49n85l37j313J78J217J472
$$ -324 -2043 -1432 213 1468 375 -163 -996 -869 -742 736 885 300 -37 -1350 -1172 45 1517
2658A517p99j157r50R5J475J567j29k349j004J028J323J167m18j693q37J100M53
$$ 1517 718 -439 -1389 -1294 181 1748 1619 -730 -1734 -706 617 1784 1366 -327 -1164 -64 389
2675C89L87l3k78q11o37O56J050N35n8j689j560J036J946P59j221j316p24M20
$$ 389 776 743 465 -346 -983 -327 723 1258 1200 -489 -2049 -1013 933 1692 471 -845 -1569 -1149
2693a149K058N74j283j220j62M04J150P19o17j013j46L4N87O32N87o56j229n65
$$ -1149 909 1483 200 -1020 -1182 -778 372 1091 474 -539 -685 -651 -64 568 1155 499 -730 -1295
2711a295Q04J606R18r58k365l96J553J476K92j493j373k03J352Q82j68m60n29
$$ -1295 -491 1115 2033 1075 -1290 -1686 -133 1343 1635 142 -1231 -1434 -82 800 632 172 -357
2728c57n21k1J393R7L3l23q79n53P08J617j6j032j264l72J202J960L95k232j410
$$ -357 -878 -899 494 591 624 301 -578 -1131 -423 1194 1178 146 -1118 -1490 -288 1672 2067 -165 -1575
2747a575O83J313R32j70j201j250O67Q04j16Q78m75r37n98J03P57R79O07j744
$$ -1575 -892 421 1353 1183 -18 -1268 -601 203 87 965 490 -447 -1045 -942 -185 794 1401 -343
2765c43j107j8J705J107m04j172j658N72J754J066p02j267o45N45J115K61j31
$$ -343 -1450 -1468 237 1344 940 -232 -1890 -1318 436 1502 800 -467 -1112 -567 548 809 678
2782F78p22J13l95l55P58J341p75p78r35K12R23J615m60k292o16R15J288R36p65
$$ 678 -44 69 -326 -681 77 1418 643 -135 -1070 -858 65 1680 1220 -1072 -1688 -773 515 1451 686
2801F86j618p36J268J062K5o62m08m46K86Q58J00J70K5r82j084P30J555O20o85
$$ 686 -932 -1668 -400 662 687 25 -383 -829 -543 315 415 585 610 -372 -1456 -726 829 1449 764
2820G64j547o47P44J848M54j110j647j07N04J377O01j172q97p7Q86j91N90M89
$$ 764 -783 -1430 -686 1162 1616 506 -1141 -1248 -744 633 1234 62 -835 -912 -26 -217 373 862
2838H62j215m53M3K23P88O14j84j608m21J067J365L45r70j549k17J527J251l82
$$ 862 -353 -806 -763 -540 248 862 678 -930 -1351 -284 1081 1426 456 -1093 -1310 217 1468 1086
2856A086r93o87n5M74J239j02p15j14m08j89P21P55K46p48j268l36R15J747K3
$$ 1086 93 -594 -649 -175 1064 962 247 133 -275 -464 257 1012 1258 510 -758 -1094 -179 1568 1591
2875A591j515j140J36J078J304k47j245j193P95J010K56l32l81m60j39M68J99
$$ 1591 76 -1064 -928 150 1454 1207 -38 -1231 -436 574 830 498 117 -343 -482 -14 185
2892A85L30K90p23j200L21Q40Q08j39o88j635M21J698O84q54j051o88N18P12J245
$$ 185 515 805 82 -1118 -797 43 851 712 24 -1611 -1190 508 1192 338 -713 -1401 -883 -171 1074
2911A074o54j090j50M62m8P26M7m61k03o57R5K18J671n14j340m63K84J193Q05
$$ 1074 420 -670 -820 -358 -406 320 367 -94 -297 -954 -859 -641 1030 516 -824 -1287 -1003 190 995
2930I95l60j466n89O57J543k81K23j149k47M12P10K62m37k33l94l79Q30N51L54
$$ 995 635 -831 -1420 -763 780 499 722 -427 -674 -262 448 710 273 40 -354 -733 97 648 1002
2949A002l82r31m69K26J524O95j071j305m45J335J021K90j151q59k60J069N91
$$ 1002 620 -311 -780 -554 970 1665 594 -711 -1156 179 1200 1490 339 -520 -780 289 880
2966H80K4m41n32j77Q4M74L40L92r59p89J01N61Q61K92p34j181j51J047J026l67
$$ 880 904 463 -69 -246 -162 312 652 1044 85 -704 -603 -42 819 1111 377 -804 -955 92 1118 751
2986G51p50r05j1P27R63j82r26l98M4kO70O67n27n94k1m71K39J169L12j039r59
$$ 751 1 -904 -915 -188 775 593 -333 -731 -687 -689 -19 648 121 -473 -494 -965 -726 443 755 -284 -1243
3007a243M11O91Q86l63q36r97K88J592k90K07r93l58Q3Q42J95J1n6m42o05L60
$$ -1243 -832 -141 745 382 -454 -1451 -1163 429 139 346 -647 -1005 -922 -80 115 126 70 -372 -977 -617
3027f17R61J52Qn59r54L01J124O79l54r73n30L86J142P04q35j052K98J11N38L74
$$ -617 344 496 504 -55 -1009 -708 416 1095 741 -232 -762 -376 766 1470 635 -417 -119 -8 530 904
3047I04n1n90l81J44L07q4P17m09j012l15P78M68N42k41r62q32R98R66k11k03
$$ 904 853 263 -118 26 333 249 966 557 -455 -770 8 476 1018 777 -185 -1017 -19 947 736 533
3067E33p76j99j00J503k51k03p04k64K87L99M45j25m24k54p09M06J097j38o95
$$ 533 -243 -442 -542 961 710 507 -197 -461 -174 225 670 545 121 -133 -842 -436 661 523 -172
3086a72n99l82M69R82M41j058q32J73R33K05K44l88n38p02P39P14k27K69p54j54
$$ -172 -771 -1153 -684 298 739 -319 -1151 -978 -45 160 404 16 -522 -1224 -485 229 2 271 -483 -637
3106f37L22N56R1n1j53o69m73R73P30j49o04q39M5P02P68K02j054l74j9J61Q92
$$ -637 -315 241 332 281 128 -541 -1014 -41 689 540 -64 -903 -858 -156 612 814 -240 -614 -633 -472 420
3127D20M09n44n56j72j25N19Q72J0j050l47K63K47R48K4j115q70O79Q05L55k67
$$ 420 829 285 -271 -443 -568 -49 823 833 -217 -564 -301 -54 894 918 -197 -1067 -388 417 772 505
3147E05l06n02j8P40J69n48J02j32o45N35N86P9j38o58j34k90J079M37m82o32
$$ 505 199 -303 -321 419 588 40 142 10 -635 -100 486 565 427 -231 -365 -655 424 861 379 -253
3167b53m65J21O43Q48p10n29l86L63N77J85R9j150p6O47k2M83m7k98n43J83J53
$$ -253 -718 -597 46 894 184 -345 -731 -368 209 394 493 -657 -733 -86 -108 375 328 30 -513 -330 -177
3188a77M66N70l46r38m71N98R17M6m80o37l00L77Q96j23k86l00q1J22L26L26o19
$$ -177 289 859 513 -425 -896 -298 619 665 185 -452 -752 -375 521 398 112 -188 -269 -147 179 505 -114
3209a14K1L7l68N65N68j57p33m49J42J58J018J89o42p97n3N61N65p8m22p02m0
$$ -114 -93 -56 -424 141 709 552 -181 -630 -488 -330 688 877 235 -562 -615 -54 511 433 11 -691 -731
3230g31R02K01J15m38k85j80J81O19k24J4m59k24j28O19L63j36k30n16l96P67
$$ -731 171 372 487 49 -236 -416 -235 384 160 174 -285 -509 -637 -18 345 209 -21 -537 -933 -166
3250a66Q20o0r05k37M46j86R02k06o11m30L85J32J31N44or93j49L79K48N65k75
$$ -166 654 594 -311 -548 -102 -288 614 408 -203 -633 -248 -116 15 559 553 -440 -589 -210 38 603 328
3271C28m34n77N26O84j11j19l32n43J42Q52J53k64Mo87k57Q68K15Q6q03L15o09
$$ 328 -106 -683 -157 527 416 297 -35 -578 -436 416 569 305 309 -378 -635 233 448 534 -269 46 -563
3292e63O10N83k19j94k66k71J39P22L71n30o47m5L39N13N4Q1j047J2M69K56R8
$$ -563 47 630 411 217 -49 -320 -181 541 912 382 -265 -310 29 542 596 677 -370 -358 111 367 465
3313D65o4j86o84R7P65m24K62M4r96O3M03O53m23j49k76l18L94P92q6m39k17n54
$$ 465 401 215 -469 -372 393 -31 231 275 -721 -658 -255 398 -25 -174 -450 -768 -374 418 332 -107 -324 -878
3335h78N01L58K40l23k26k92K71K47L82o1q68J73L29k18O32K49m90r49R04N5J66
$$ -878 -377 -19 221 -102 -328 -620 -349 -102 280 219 -649 -476 -147 -365 267 516 26 -923 -19 36 202
3356B02L43k63j058J52P28K09J3j91k21k69K91O55K6o54J04j25q5K78O23o07l7
$$ 202 545 282 -776 -624 104 313 326 135 -86 -355 -64 591 617 -37 67 -58 -143 135 758 151 114
3377A14K42m94K35R51o61l48j63L49j68M39J23l35k76J26J04M3N74o19o68J15
$$ 114 356 -138 97 1048 387 39 -124 225 57 496 619 284 8 134 238 281 855 236 -432 -317
3397c17M15M40K9p5p97k25N82J81J13l90k85r9m4O41j48J29j99n25J77L70M00
$$ -317 98 538 567 492 -305 -530 52 233 346 -44 -329 -428 -472 169 21 150 -49 -574 -397 -27 373
3418C73k48k70m33J34J01M19J76n49j99J2mO32L78m93q58K70M1K43L07J00r49
$$ 373 125 -145 -578 -444 -343 76 252 -297 -496 -484 -488 144 522 29 -829 -559 -518 -275 32 132 -817
3439h17K55K80J31O8L65n06l94M19L09n9J13k27l49l74R45L56n05L67m31m66M78
$$ -817 -562 -282 -151 -83 282 -224 -618 -199 110 51 164 -63 -412 -786 159 515 10 377 -54 -520 -42
3460d2O09k53k7l61k12L12J92O86p46k93L42M3N4M39k29n14M09J35k72P30l16
$$ -42 567 314 287 -74 -286 26 218 904 158 -135 207 250 304 743 514 0 409 544 272 1002 686
3481F86m68l15M82j80L31pl53m88O6L94j22O4j46k48k51L94M11k0L6o41j99L35
$$ 686 218 -97 385 205 536 529 176 -312 -246 148 26 90 -56 -304 -555 -161 250 230 266 -375 -574 -239
3503b39K20K66m50N5l68L40k08P06j17m50k16K52J59K44K47o62p3KR2M10j56p9
$$ -239 -19 247 -203 -148 -516 -176 -384 322 205 -245 -461 -209 -50 194 441 -221 -294 -292 -200 210 54 -25
3525b5o54O5K48n3L82j35k44k74M04J60M5j8o7n87O23K16L46n02P7M26n35L92
$$ -25 -679 -614 -366 -419 -37 -172 -416 -690 -286 -126 -81 -99 -166 -753 -130 86 432 -70 7 433 -102 290
3547B90K78k17j60p2P5J64L54l06j85l04j01N16j25N52q60k67J66K41L25m3l50
$$ 290 568 351 191 119 194 358 712 406 221 -83 -184 332 207 759 -101 -368 -202 39 364 321 -29
3568b9l55K76j0L15q8J1j45m75K86O02N8l36L8M3l53P13o9k14K81k88n02P53J54
$$ -29 -384 -108 -118 197 109 120 -25 -500 -214 388 446 110 148 191 -162 551 482 268 549 261 -241 512 666
3591F66l89j16m48K30j18M06m6n23N9j5l1Q7P06k33q49j21N42j90l8J75l32j19
$$ 666 277 161 -287 -57 -175 231 185 -338 -279 -294 -325 -238 468 235 -614 -735 -193 -383 -421 -246 -578 -697
3613f97O21K52j16j35o9k28K14M24q8J20j57j18j46J14J95J74k79l60k9K36N69
$$ -697 -76 176 60 -75 -144 -372 -158 266 178 298 141 23 -123 -9 186 360 81 -279 -308 -72 497
3634D97l47m09j52K21l8K37K90k36m6l80L47l22L67K29l87N9L98m5k2K26l69m07
$$ 497 150 -259 -411 -190 -228 9 299 63 17 -363 -16 -338 29 258 -129 -70 328 283 261 487 118 -289
3656b89L39P37l11KJ4n40M7J35K71K9l4k48n57L99L05q4j88q2k03m2M24J02j78
$$ -289 50 787 476 478 492 -48 -1 134 405 434 400 152 -405 -6 299 215 27 -55 -258 -300 124 226 48
3679D8l76rJ07j25O53q6m51j39P3L23L5P2j44k35K97k70K29K13J24o48J18J97
$$ 48 -328 -337 -230 -355 298 212 -239 -378 -305 18 53 125 -19 -254 43 -227 2 215 339 -309 -191 6
3701FK70J47l14j13n10P01J69m02O6j73l5k78O99k07j11n9k25o1K4O85k86J20
$$ 6 276 423 109 -4 -514 187 356 -46 20 -153 -188 -466 233 26 -85 -144 -369 -430 -406 279 -7 113
3723A13o23N69j37M05m5k97k37J36J36JL26l09k33j90P48J9k2r7o70J31K31Q4
$$ 113 -510 59 -78 327 282 -15 -252 -116 20 21 347 38 -195 -385 363 382 360 263 -407 -276 -45 39
3745C9K35j41n66J66J94M45j90k18J33n15J91M50L57n07j69Q0j3Q9J21L2l23j
$$ 39 274 133 -433 -267 -73 372 182 -36 97 -418 -227 223 580 73 -96 -16 -29 60 181 213 -110 -111
3767a11L45l72J81L55l59l31J90J54K00p5K16p03J27R6jK27K05m44r6L29k6K3
$$ -111 234 -138 43 398 39 -292 -102 52 252 177 393 -310 -183 -87 -88 139 344 -100 -196 133 107 130
3789A30K9k05k81n6M19J42k71K24k55l42M24M56r2m22l57K23N7J54K73m02O7J64
$$ 130 159 -46 -327 -383 36 178 -93 131 -124 -466 -42 414 322 -100 -457 -234 -177 -23 250 -152 -85 79
3811G9q6kN00l57l58J44q4L57J91m56j09k03L29K25l87N53m67j34J54L0M56O4
$$ 79 -7 -9 491 134 -224 -80 -164 193 384 -72 -181 -384 -55 170 -217 336 -131 -265 -111 -81 375 439
3833D39n84k39l13R34J94l14m22K54j87j32O40n5l1k57K00l86L50o9J75l02m10
$$ 439 -145 -384 -697 237 431 117 -305 -51 -238 -370 270 215 184 -73 127 -259 91 22 197 -105 -515
3854e15K09L41L96j17k84l04J94L31J02J77l46l30j69N10j16M5Rk18Q1J71J79
$$ -515 -306 35 431 314 30 -274 -80 251 353 530 184 -146 -315 195 79 124 133 -85 -4 167 346
3875C46l56J53R6p09K82L85l85K85k75R1j41J96K21j22l16J37j29K45K66j9n00
$$ 346 -10 143 239 -470 -188 197 -188 97 -178 -87 -228 -32 189 67 -249 -112 -241 4 270 251 -249
3896b49N1M7LN12q4p5l41L4J86k88N35o5p7m09K74L55m66N18m39k24J22L92m33
$$ -249 -198 -151 -148 364 280 205 -136 -102 84 -204 331 266 189 -220 54 409 -57 461 22 -202 -80 312 -121
3919a21J89J86m61P0J63K14k15j60K61l45n4L64l37L89l08p0J63P2J81j09l49
$$ -121 68 254 -207 -137 26 240 25 -135 126 -219 -273 91 -246 143 -165 -235 -72 0 181 72 -277
3940b77J01K52m9L19l11j69L94j99m8J24j9J15m51K66J54p6q9j56k89j8L74K01
$$ -277 -176 76 27 346 35 -134 260 61 13 137 118 233 -218 48 202 126 37 -119 -408 -426 -52 149
3962A49p5J25l16k21L27p6N00n91J67n03L12L16J4j37l32Q7L32O2j39M13m72P8
$$ 149 74 199 -117 -338 -11 -87 413 -178 -11 -514 -202 114 128 -9 -341 -254 78 140 1 414 -58 20
3984B0j92L94J03n1l15j37L56j61K0K85k20n48L20N1N6n6L07o11K3M85j06k07
$$ 20 -172 222 325 274 -41 -178 178 17 37 322 102 -446 -126 -75 -19 -75 232 -379 -356 129 23 -184
4006a84J43K5l62L00R8J27k02n9k25K05K10L75l67k83J12k60N65K32k29j05j39
$$ -184 -41 -16 -378 -78 20 147 -55 -114 -339 -134 76 451 84 -199 -87 -347 218 450 221 116 -23
4027b3r9K77l7M05n43l9L9k61K92l8n8Nk81M92K6J2k24J49n56N97K0j35k92J27
$$ -23 -122 155 118 523 -20 -59 -20 -281 11 -27 -85 -80 -361 131 157 169 -55 94 -462 135 155 20 -272 -145
4051a45k40rN95Nj47p7O5J2K43K28k81m09J74n5K11J37J69k14m31j39M28k20J05
$$ -145 -385 -394 201 206 59 -18 47 59 302 530 249 -160 14 -41 170 307 476 262 -169 -308 120 -100 5
4074ELj46j20K05j9o4j58N9j14K99L0l8J85j75k44k3M62j11J47k26P0K1Q2J5K3
$$ 5 8 -138 -258 -53 -72 -136 -294 -235 -349 -50 -20 -58 127 -48 -292 -315 147 36 183 -43 27 48 130 145 168
4099A68m15K37j51l9K74J75r5j48J72j92O1J95o3m24p9M00pj33L00j98n23N20
$$ 168 -247 -10 -161 -200 74 249 154 6 178 -14 47 242 179 -245 -324 76 69 -64 236 38 -485 35
4121C5n2P6j87K79l76J24J02J83Q5k43N0n70M35M09M7l48Q4m8L74j86l22J37k14
$$ 35 -17 59 -128 151 -225 -101 1 184 269 26 76 -494 -59 350 397 49 133 85 459 273 -49 88 -126
4144a26K18k8L4K91n60l95K93J87J02RJ30l96k7J46N9MK69k20j4J29k34K00M00
$$ -126 92 64 98 389 -171 -566 -273 -86 16 25 155 -241 -268 -122 -63 -59 210 -10 -24 105 -129 71 471
4167D71l18k93P5R6K00m7N36p68o7R8j83L64L4nl72j34L54r5J41j17l6m16K65
$$ 471 153 -140 -65 31 231 184 720 -48 -115 -17 -200 164 198 193 -179 -313 41 -54 87 -30 -66 -482 -217
4190b17N55l14j45j2L7L24k9n6l31NR8L63k47K91k44q4j05RL89k79K45j32m37
$$ -217 338 24 -121 -133 -96 228 199 143 -188 -183 -85 278 31 322 78 -6 -111 -102 287 8 253 121 -316
4213c16N60J94l76J80J5m93L13j1J08k75K04k22j32j73M76J60m58L5J99K6r0J88
$$ -316 244 438 62 242 257 -236 77 66 174 -101 103 -119 -251 -424 52 212 -246 -211 -12 14 -76 112
4235A12J27l63K52k70J04R5j09P4R0K86m66L52l67J94r2O9J41j48J9j80j01n8
$$ 112 239 -124 128 -142 -38 57 -52 22 112 398 -68 284 -83 111 19 88 229 81 100 -80 -181 -239
4257b39N31l80P7r5K17k93M26k61n1k59K11p0J68j28K71n3l32J69k98Q13k01l8
$$ -239 292 -88 -11 -106 111 -182 244 -17 -68 -327 -116 -186 -18 -146 125 72 -260 -91 -389 424 223 185
4279A85j05j85J20J05k21O3R6n4n7J64ml5l07k80N95J0l1PJ9j97k5K57j24K26
$$ 185 80 -105 15 120 -101 -38 58 4 -53 111 107 72 -235 -515 80 90 59 66 85 -112 -137 120 -4 222
4303B22k32k32L01k85L14k26k3J5J52j5K28J19j71o0k95J50j12L54j02k24o4K28
$$ 222 -10 -242 59 -226 88 -138 -161 -146 6 -9 219 338 167 107 -188 -38 -150 204 102 -122 -186 42
4325D2k5P6K50m44J99P2m0j92p9J37K5j39J38R5k27M02l97l7K31J04j35o6L2j12
$$ 42 17 93 343 -101 98 170 130 -62 -141 -4 21 -118 20 115 -112 290 -107 -144 87 191 56 -10 22 -90
4349i0J18J87R7k58m4k8j88K48JN4o9j71J34M9J08j25k95K81j70L76r5n6K12p36
$$ -90 28 215 312 54 10 -18 -206 42 43 97 28 -143 -9 40 148 23 -272 9 -161 215 120 64 276 -460
4373d60M42J67q2r0J44k21M2P8J56m41K43q2j59K41K30m90L62K1j36J28k3j92
$$ -460 -18 149 67 -23 121 -100 -58 20 176 -265 -22 -104 -263 -22 208 -282 80 101 -35 93 70 -122
4395a22j24K94O6k05j44L63r6k60K24k59j32L38j17L17n6k94K75m5L57k60k05
$$ -122 -246 48 114 -91 -235 128 32 -228 -4 -263 -395 -57 -174 143 87 -207 68 23 380 120 -85
4416h5R3J4J71k37J8j52J51J62k55K30m7j39j46M35j61r7r6J30N4k03N02k81j61
$$ -85 8 22 193 -44 -26 -178 -27 135 -120 110 63 -76 -222 213 52 -45 -141 -11 43 -160 342 61 -100
4439a00j4Ml4J26Q2l0k26J54K26k26OJ91k30j07l3L7J26l4K50k56q0J40j4J02
$$ -100 -114 -110 -144 -18 64 34 -192 -38 188 -38 -32 159 -71 -178 -211 -174 -48 -82 168 -88 -168 -28 -42 60
4463F0mN9j03L01j55J04m91K48j71q9J27J26j91L70j02k06K0K99j12j86J69m1
$$ 60 56 115 12 313 158 262 -229 19 -152 -241 -114 12 -179 191 89 -117 -97 202 90 -96 73 32
4485C2j66L45l7j98j33K95k46J33N2q9j55p6K62m7j62L28K9k32J04Q1k91K73L8
$$ 32 -134 211 174 -24 -157 138 -108 25 77 -12 -167 -243 19 -28 -190 138 167 -65 39 120 -171 102 140
4508A40j34j05J4m5K38k65o3q7N33k27K38q0l37J48J22k3J37j84J44j10l62N04
$$ 140 6 -99 -85 -130 108 -157 -220 -307 226 -1 237 157 -180 -32 90 67 204 20 164 54 -308 196
4530A96n6j34m6j22k7J83J69jk58N3J26j17J50j12j16j07L26r9j16L26k72p0P3
$$ 196 140 6 -40 -162 -189 -6 163 162 -96 -43 83 -34 116 4 -112 -219 107 8 -108 218 -54 -124 -51
4553e1J76L08j50L8m25j25P3K09K48l77K56j48K3P5M0k50j4M6o1k2K87n0l54J57
$$ -51 125 433 283 321 -104 -229 -156 53 301 -76 180 32 55 130 170 -80 -94 -48 -109 -131 156 106 -248 -91
4577i1J09j20n3L48j8n32K63K07j50J3r0j08L21p7p4K41k27k3l92J19P20l68k96
$$ -91 18 -102 -155 193 175 -357 -94 113 -37 -24 -114 -222 99 22 -52 189 -38 -61 -453 -334 386 18 -278
4600b78O19m87k4K39J40l5p8j94K45k8j94J49L81l05q3k12J18o1O4lk24M18k12
$$ -278 341 -146 -170 69 209 174 96 -98 147 119 -75 74 455 150 67 -145 -27 -88 -24 -27 -251 167 -45
4623d5K78j21m11K51Q3N5RL9r4o8J65j82j35J9M1L25l60K77j32J13k76N05k57
$$ -45 233 112 -299 -48 35 90 99 138 44 -24 141 -41 -176 -157 -116 209 -151 126 -6 107 -169 336 79
4646G9J50q1m33N09j37k56L42r6O6J11k20j16k21N30r1k87o4K83J99k26J1J44
$$ 79 229 148 -285 224 87 -169 173 77 143 254 34 -82 -303 227 136 -151 -215 68 267 41 52 196
4668A96j87K44j19j49Q1J03Q5l25k66J56N47j86m3l84K86K22r8k91N7j73K66o2
$$ 196 9 253 134 -15 66 169 254 -71 -337 -181 366 180 137 -247 39 261 163 -128 -71 -244 22 -40
4690d0j5L16k48k1p8J07m29O02k83r9j91N54j01O1J22l79K69l13K78K14l68K72
$$ -40 -55 261 13 -8 -86 21 -408 194 -89 -188 -379 175 74 135 257 -122 147 -166 112 326 -42 230
4712B30k43j44R8K73o3l90L18K06j89j71J93j54J36R2j79j90L68k06L9j31r5M71
$$ 230 -13 -157 -59 214 151 -239 79 285 96 -75 118 -36 100 192 13 -177 191 -15 24 -107 -202 269
4734B69k45R4j77J8j31pL10r7r9j4%Q9K99k51R2l38L03k73K49L41l33j83M38l19
$$ 269 24 118 -59 -41 -172 -179 131 34 -65 -79 -79 10 309 58 150 -188 115 -158 91 432 99 -84 354 35
4758C5k69K46J75n3k22K7L03j97J67rl72L61j76K55j99J7j06J46n9J00m05O0K74
$$ 35 -234 12 187 134 -88 -61 242 45 212 203 -169 192 16 271 72 89 -17 129 70 170 -235 -175 99
4781I9j80k06L50k87J57j75K24mL13j59k51o8O3J29K23q5J17l50J75m2N6L53j16
$$ 99 -81 -287 63 -224 -67 -242 -18 -22 291 132 -119 -187 -124 5 228 143 260 -90 85 43 99 452 336
4804C36j09o12K70m0J8k08K70o5M68l54k8J81q3k81J94K13k44Q8J7Kj22O2j52
$$ 336 227 -385 -115 -155 -137 -345 -75 -140 328 -26 -54 127 44 -237 -43 170 -74 14 31 33 -89 -27 -179
4827a79L86j12k3J68j12k04L19j02p9K15l11K1J56rj55k5p0L39l13J72J60l58
$$ -179 207 95 72 240 128 -76 243 141 62 277 -34 -13 143 134 -21 -46 -116 223 -90 82 242 -116
4849a16K40j09j46K63M5l09J55MM6m46M93j51M3L16l60J53k31J2J43Rk77K22o5
$$ -116 124 15 -131 132 177 -132 23 27 73 -373 120 -31 12 328 -32 121 -110 -98 45 54 -223 -1 -66
$$ [...]
8191A15
##END NTUPLES=NMR FID
##END=
