##TITLE=1H_CA-8707-1
 DMSO-d6, 8 sc, 
 27.3.2020
##JCAMPDX= 6.0         $$ Bruker NMR JCAMP-DX V2.0
##DATA TYPE= NMR FID
##DATA CLASS= NTUPLES
##ORIGIN= UXNMR, Bruker Analytische Messtechnik GmbH
##OWNER= root
$$ XWIN-NMR		Version 3.5
$$ Fri Mar 27 14:40:01 2020 Russian Standard Time (UT+4h)  she@DPX200
##.OBSERVE FREQUENCY= 200.1315
##.OBSERVE NUCLEUS= ^1H
##.DELAY= (6, 6)
##.ACQUISITION MODE= SIMULTANEOUS
##.ACQUISITION SCHEME= undefined
##.AVERAGES= 8
##.DIGITISER RES= 18
##SPECTROMETER/DATA SYSTEM= spect
##.PULSE SEQUENCE= zg30
##.SOLVENT NAME= DMSO
##.SHIFT REFERENCE= (INTERNAL, DMSO, 0, 15.7039)
##AUDIT TRAIL= $$ (NUMBER, WHEN, WHO, WHERE, WHAT)
$$ ##TITLE= Audit trail, XWIN-NMR		Version 3.5
$$ ##JCAMPDX= 5.01
$$ ##ORIGIN= Bruker BioSpin GmbH
$$ ##OWNER= she
$$ F:/spectra/data/she/nmr/H-F/1/audita.txt
$$ ##AUDIT TRAIL=  $$ (NUMBER, WHEN, WHO, WHERE, WHAT)
(   1,<2020-03-27 14:38:57.64 +0400>,<she>,<DPX200>,
      <created by zg, POWCHK disabled, PULCHK disabled
       configuration hash MD5:
       00 E9 B6 7A A2 85 ED C7 34 08 36 98 17 FE 4E 26
       data hash MD5: 16K
       04 3D 4B EC 09 C6 FA 6B 7C E2 C2 50 71 0F AE 9C>)
$$ ##END=
$$ 
$$ hash MD5
$$ 05 65 66 46 F7 86 7D D7 93 0F 72 2D E7 4B D7 16
##$RELAX= 
##$RELAX= 
##$RELAX= 
##$RELAX= 
##$RELAX= 
##$RELAX= 
$$ Bruker specific parameters
$$ --------------------------
##$DU= <F:/spectra>
##$EXPNO= 1
##$NAME= <H-F>
##$PROCNO= 1
##$TYPE= <nmr>
##$USER= <she>
##$AMP= (0..31)
100 100 100 100 100 100 100 100 100 100 100 100 100 100 100 100 100 100 
100 100 100 100 100 100 100 100 100 100 100 100 100 100 
##$AQSEQ= 0
##$AQ_mod= 1
##$AUNM= <au_zg>
##$AUTOPOS= <>
##$BF1= 200.13
##$BF2= 200.13
##$BF3= 200.13
##$BF4= 200.13
##$BF5= 200.13
##$BF6= 200.13
##$BF7= 200.13
##$BF8= 200.13
##$BYTORDA= 1
##$CFDGTYP= 0
##$CFRGTYP= 5
##$CHEMSTR= <none>
##$CNST= (0..31)
1 1 145 1 1 1 1 1 1 1 1 1 1 1 1 1 1 1 1 1 1 1 1 1 1 1 1 1 1 1 1 1 
##$CPDPRG= <>
##$CPDPRG1= <>
##$CPDPRG2= <>
##$CPDPRG3= <>
##$CPDPRG4= <mlev>
##$CPDPRG5= <mlev>
##$CPDPRG6= <mlev>
##$CPDPRG7= <mlev>
##$CPDPRG8= <mlev>
##$CPDPRGB= <>
##$CPDPRGT= <>
##$D= (0..31)
0 1.2 0 0 0 0 0 0 0 0.06 0 0.03 0 0 0 0 0.0002 0 0 0 0 0 0 0 0 0 0 0 0 
0 0 0 
##$DATE= 1585305537
##$DBL= (0..7)
120 120 120 120 120 120 120 120 
##$DBP= (0..7)
150 150 150 150 150 150 150 150 
##$DBP07= 0
##$DBPNAM0= <>
##$DBPNAM1= <>
##$DBPNAM2= <>
##$DBPNAM3= <>
##$DBPNAM4= <>
##$DBPNAM5= <>
##$DBPNAM6= <>
##$DBPNAM7= <>
##$DBPOAL= (0..7)
0.5 0.5 0.5 0.5 0.5 0.5 0.5 0.5 
##$DBPOFFS= (0..7)
0 0 0 0 0 0 0 0 
##$DE= 6
##$DECBNUC= <off>
##$DECIM= 24
##$DECNUC= <off>
##$DECSTAT= 4
##$DIGMOD= 1
##$DIGTYP= 9
##$DL= (0..7)
0 120 120 120 120 120 120 120 
##$DP= (0..7)
150 150 150 150 150 150 150 150 
##$DP07= 0
##$DPNAME0= <>
##$DPNAME1= <>
##$DPNAME2= <>
##$DPNAME3= <>
##$DPNAME4= <>
##$DPNAME5= <>
##$DPNAME6= <>
##$DPNAME7= <>
##$DPOAL= (0..7)
0.5 0.5 0.5 0.5 0.5 0.5 0.5 0.5 
##$DPOFFS= (0..7)
0 0 0 0 0 0 0 0 
##$DQDMODE= 0
##$DR= 18
##$DS= 0
##$DSLIST= <SSSSSSSSSSSSSSS>
$$ [...]
##$SUBNAM2= <"">
##$SUBNAM3= <"">
##$SUBNAM4= <"">
##$SUBNAM5= <"">
##$SUBNAM6= <"">
##$SUBNAM7= <"">
##$SUBNAM8= <"">
##$SUBNAM9= <"">
##$SW= 24.9337058887773
##$SWIBOX= (0..15)
0 0 2 0 0 0 0 0 0 0 0 0 0 0 0 0 
##$SW_h= 4990.01996007984
##$TD= 16384
##$TD0= 1
##$TE= 0
##$TE2= 300
##$TE3= 300
##$TEG= 300
##$TL= (0..7)
0 120 120 120 120 120 120 120 
##$TP= (0..7)
150 150 150 150 150 150 150 150 
##$TP07= 0
##$TPNAME0= <>
##$TPNAME1= <>
##$TPNAME2= <>
##$TPNAME3= <>
##$TPNAME4= <>
##$TPNAME5= <>
##$TPNAME6= <>
##$TPNAME7= <>
##$TPOAL= (0..7)
0.5 0.5 0.5 0.5 0.5 0.5 0.5 0.5 
##$TPOFFS= (0..7)
0 0 0 0 0 0 0 0 
##$TUNHIN= 0
##$TUNHOUT= 0
##$TUNXOUT= 0
##$USERA1= <user>
##$USERA2= <user>
##$USERA3= <user>
##$USERA4= <user>
##$USERA5= <user>
##$V9= 5
##$VALIST= <valist>
##$VCLIST= <CCCCCCCCCCCCCCC>
##$VD= 0
##$VDLIST= <DDDDDDDDDDDDDDD>
##$VPLIST= <PPPPPPPPPPPPPPP>
##$VTLIST= <TTTTTTTTTTTTTTT>
##$WBST= 1024
##$WBSW= 4
##$XGAIN= (0..3)
0 0 0 0 
##$XL= 0
##$YL= 0
##$YMAX_a= 253335
##$YMIN_a= -142514
##$ZGOPTNS= <>
##$ZL1= 120
##$ZL2= 120
##$ZL3= 120
##$ZL4= 120
##$ABSF1= 10
##$ABSF2= 0
##$ABSG= 5
##$ABSL= 3
##$ALPHA= 0
##$AQORDER= 0
##$ASSFAC= 0
##$ASSFACI= 0
##$ASSFACX= 0
##$ASSWID= 0
##$AUNMP= <proc_1d>
##$AZFE= 0.1
##$AZFW= 0.1
##$BCFW= 1
##$BC_mod= 2
##$BYTORDP= 1
##$COROFFS= 0
##$CY= 11.3945322036743
##$DATMOD= 1
##$DC= 2
##$DFILT= <>
##$DTYPP= 0
##$F1P= 16.9975609425685
##$F2P= -3.02152046262296
##$FCOR= 0.5
##$FTSIZE= 0
##$FT_mod= 4
##$GAMMA= 1
##$GB= 0.15
##$INTBC= 1
##$INTSCL= 1
##$ISEN= 128
##$LB= 0.24
##$LEV0= 0
##$LPBIN= 0
##$MAXI= 10000
##$MC2= 0
##$MEAN= 0
##$ME_mod= 0
##$MI= 1.114404
##$NCOEF= 0
##$NC_proc= 0
##$NLEV= 6
##$NOISF1= 3.799351
##$NOISF2= 2.8
##$NSP= 1
##$NTH_PI= 0
##$NZP= 0
##$OFFSET= 15.70392
##$PC= 1
##$PHC0= -9790.067
##$PHC1= 15.80082
##$PH_mod= 1
##$PKNL= yes
##$PPARMOD= 0
##$PSCAL= 0
##$PSIGN= 0
##$REVERSE= no
##$SF= 200.130013532006
##$SI= 16384
##$SIGF1= 3
##$SIGF2= 2
##$SINO= 400
##$SIOLD= 16384
##$SREGLST= <1H.CDCl3>
##$SSB= 0
##$STSI= 0
##$STSR= 0
##$SW_p= 3612.71676300578
##$SYMM= 0
##$S_DEV= 0
##$TDeff= 0
##$TDoff= 0
##$TI= <>
##$TILT= no
##$TM1= 0
##$TM2= 0
##$TOPLEV= 0
##$USERP1= <user>
##$USERP2= <user>
##$USERP3= <user>
##$USERP4= <user>
##$USERP5= <user>
##$WDW= 1
##$XDIM= 8192
##$YMAX_p= 0
##$YMIN_p= 0
$$ End of Bruker specific parameters
$$ ---------------------------------
##NTUPLES= NMR FID
##VAR_NAME=  TIME,          FID/REAL,        FID/IMAG
##SYMBOL=    X,             R,               I
##VAR_TYPE=  INDEPENDENT,   DEPENDENT,       DEPENDENT
##VAR_FORM=  AFFN,          ASDF,            ASDF
##VAR_DIM=   8192,          8192,            8192
##UNITS=     SECONDS,       ARBITRARY UNITS, ARBITRARY UNITS
##FACTOR=    0.0002004,     1,               1
##FIRST=     0,             0,               0
##LAST=      1.6414764,     0,               0
##MIN=       0,             -142514,         0
##MAX=       1.6414764,     253335,          0
$$ Real data points
##PAGE= N=1
##DATA TABLE= (X++(R..R)), XYDATA
0 0 0 0 0 0 0 0 0 0 -7 7 -8 8 -8 14 -16 16 -23 24 -31 37 -41 48 -56 64 -72 88 -96 111 -127 143 -160 181
32 181 -204 228 -254 284 -316 351 -388 430 -477 527 -585 648 -718 797 -885 984 -1101 1234
50 1234 -1391 1577 -1809 2097 -2473 2982 -3720 4891 -7050 12394 -56743 -48769 25005 -40472
64 -40472 -108671 -142514 -87405 -7942 28781 -19742 -68167 -75723 -47338 -9920 28922 24926 -9466
77 -9466 -42698 -47524 -20783 40611 71634 22033 -57804 -71206 -12025 61197 76747 8327 -79323
90 -79323 -81184 32 61405 44085 -20939 -75227 -70238 -11875 30778 13063 -25220 -51683 -63745
103 -63745 -47511 -3733 20560 1726 -40113 -75898 -69777 -6660 52328 29399 -47446 -88697
115 -88697 -55103 21450 70744 34111 -50058 -76528 -21234 42760 58315 25641 -24998 -44589
127 -44589 -10798 31642 41227 29603 7498 -24656 -34211 2 41893 48747 15289 -40124 -64930
140 -64930 -17687 52911 57029 -7650 -68608 -71095 -13784 47908 41356 -28889 -76436 -56524 -7834
153 -7834 21977 17255 -20163 -53438 -47012 -19939 2309 17997 11409 -25449 -54865 -35846 11938
166 11938 45947 36419 -16980 -61737 -35323 37514 71594 35316 -22761 -49364 -15610 47151
178 47151 69145 24977 -22115 -27689 -3199 26374 43071 25275 -8250 -25292 -22210 -5823
190 -5823 20770 33590 -1761 -49604 -59222 -25178 17797 28521 -17956 -79914 -84541 -28495 16931
203 16931 5250 -45478 -90292 -84273 -33901 116 -18041 -54522 -74027 -73225 -51666 -23417 -17390
216 -17390 -36552 -59054 -73408 -68297 -31198 4603 -9718 -57780 -84982 -65686 -14955 22447
228 22447 -265 -61809 -85447 -46152 4805 19909 -7178 -51858 -66668 -33579 4254 8190
240 8190 -8999 -29259 -45553 -40723 -13828 8156 6768 -12468 -41961 -55950 -24738 21835 27216
253 27216 -13060 -53435 -57357 -16841 32568 32132 -19499 -56905 -41941 -842 28088 22811 -12365
266 -12365 -39657 -27906 1100 17085 19877 9124 -15461 -28405 -12090 15925 33633 27644
278 27644 -6391 -37705 -22011 27728 52153 28334 -15145 -39133 -16008 34661 53198 18391
290 18391 -22402 -29049 -5915 24505 36666 14825 -14717 -20695 -10019 4814 21079 23751 428
303 428 -27552 -28854 -6314 21831 31325 2758 -40593 -44838 -4349 30967 27239 -8923 -44303
316 -44303 -43078 -469 29613 15803 -17171 -35138 -31469 -8264 14689 12480 -9811 -25271 -29336
329 -29336 -22189 998 19531 6302 -25716 -41417 -29285 3259 26821 11007 -31737 -50778
341 -50778 -25134 11211 25780 4978 -32104 -47330 -20281 12831 14591 -2812 -23006 -34684
353 -34684 -22993 -593 9730 3661 -11257 -28385 -34930 -13459 15253 17042 -8404 -34693 -40315
366 -40315 -12876 23391 24412 -12999 -43258 -34229 -3477 21798 18673 -13044 -36661 -26187 -103
379 -103 13028 10889 -2835 -21890 -26349 -10040 8212 15002 9176 -12988 -32494 -21565 11366
392 11366 28081 13005 -17112 -36528 -21750 16841 33946 8824 -23577 -31517 -13236 14870
404 14870 27350 7447 -19548 -23589 -8968 5793 15996 13043 -5789 -21959 -17958 -1510 15584
417 15584 20920 1538 -27426 -29920 -1517 23115 22485 -2481 -31584 -32560 -262 26274 16732
430 16732 -11418 -27745 -24764 -3660 16679 11612 -8959 -22010 -22069 -13090 4794 13579 668
443 668 -21157 -29160 -20653 45 18180 7086 -25553 -38939 -22887 3382 16479 2902 -28060
456 -28060 -41848 -22026 5338 10353 -5239 -24409 -33949 -23468 -1996 4987 -5186 -17526 -28672
469 -28672 -30462 -13743 6233 3681 -15087 -32065 -34620 -16161 10320 12728 -15023 -37968 -33600
482 -33600 -11610 11522 10422 -14027 -36954 -29387 -5936 6557 5187 -9349 -26894 -27433 -10640
495 -10640 3384 5118 -1576 -17739 -30179 -19329 4016 13775 2946 -17564 -32183 -22393 7010
508 7010 20992 3692 -21130 -29073 -15751 7960 20772 5465 -17818 -22075 -8232 6705 16622
521 16622 12102 -5501 -14892 -8131 7813 18316 22193 8116 -10761 -9780 10498 29304 30171 14267
535 14267 -7843 -8928 15925 38000 33035 13105 -2448 -2232 16899 36529 32860 13461 1218
548 1218 1965 11665 26324 31754 17165 288 -3926 2737 17416 28884 19251 -5504 -16315 -5154
562 -5154 13309 23220 13040 -11422 -25309 -10790 10340 15456 4186 -14495 -24907 -16170 4334
575 4334 10330 314 -12709 -21730 -20518 -4566 9520 5046 -10162 -21595 -22586 -8912 11083
588 11083 12142 -8390 -24977 -23098 -6796 11543 13610 -7933 -26369 -22402 -4510 8538 7689
601 7689 -6530 -23510 -24501 -9837 2143 2260 -6380 -20709 -29302 -19907 -2239 2244 -7123 -22295
615 -22295 -33639 -26823 -5270 5420 -7758 -26329 -33845 -25795 -6356 6063 -5417 -25489 -30658
628 -30658 -19750 -5474 4580 412 -16739 -25338 -16475 -2841 6519 7394 -4883 -19928 -16738
641 -16738 -125 12478 12543 588 -16413 -18272 758 17766 14674 -1116 -15289 -17220 -2225
654 -2225 14691 12634 -4604 -16784 -17637 -8433 5780 8849 -5427 -20037 -22193 -14852 -2760 5466
668 5466 -3399 -22219 -29030 -18383 -3889 4398 -1728 -19896 -30279 -18089 629 7396 601
681 601 -13528 -23216 -13412 6275 13549 6624 -3738 -10972 -7517 9738 22367 18107 5717 -2060
695 -2060 -496 12443 28356 29298 13136 1184 3246 15924 30688 32934 16910 445 2675
708 2675 17041 28109 29190 16988 183 -1670 12156 23204 22565 13400 -841 -7544 2501
721 2501 16893 19028 9664 -3173 -11552 -5826 10923 18167 7156 -6961 -13482 -7721 7245 16880
735 16880 7605 -9247 -14795 -7105 5133 14635 10085 -6111 -14961 -7783 4109 11823 10962 -2522
749 -2522 -15630 -12316 1918 10608 8686 -2792 -16931 -18885 -3958 8218 4957 -7976 -20423
762 -20423 -23605 -11464 3026 935 -13441 -24822 -26562 -18350 -4940 -1769 -14979 -28102 -29331
775 -29331 -20829 -9594 -3117 -11460 -26921 -30876 -20536 -7990 -960 -5895 -21013 -28443 -17832
788 -17832 -1836 4342 -346 -12701 -21290 -13319 3987 11741 5486 -4701 -12387 -8798 6783 17169
802 17169 12353 -456 -6301 -4122 5821 18916 17338 2646 -7032 -4587 5270 16679 17435 3456
816 3456 -9970 -8256 3440 12613 14127 3110 -12028 -13547 -817 9582 9232 1673 -10651 -15399
830 -15399 -5819 7486 9339 761 -10322 -15939 -8893 6345 11684 2054 -9633 -13963 -8620 5317
844 5317 14560 6227 -7831 -12426 -5634 6053 14938 10776 -4076 -11770 -4384 7091 14236 12029
858 12029 -849 -10592 -6480 6860 13998 11376 1784 -10261 -9928 3419 13418 10580 460 -10258
872 -10258 -12050 -945 11849 10325 -1723 -10960 -12176 -4199 8397 10956 -342 -12255 -12358 -4702
886 -4702 6493 11522 3067 -11154 -12721 -3526 7397 11950 5869 -7026 -12866 -3636 8864 12210
900 12210 6925 -4142 -11793 -5244 8618 13787 7365 -2229 -10239 -7322 6147 14846 7770 -3662
914 -3662 -9620 -8353 1839 12660 8823 -4102 -12155 -9947 -949 9015 8681 -3547 -14706 -11699
928 -11699 -2067 5266 7047 -2622 -14573 -15028 -3305 5336 5149 -1803 -12976 -17056 -6682 5304
942 5304 6260 -2139 -10917 -15283 -8448 5520 8936 -813 -10668 -13680 -7379 3225 10260 2234 -9969
957 -9969 -13543 -6981 3354 9565 5456 -7883 -13522 -7367 3305 9131 6944 -5203 -14503 -8423
971 -8423 3664 9423 6564 -2457 -12276 -11535 1917 9770 7090 -2373 -9571 -10348 -518 10731 8784
986 8784 -2130 -9361 -10165 -1545 9868 10409 -117 -9636 -9295 -1198 7611 11588 2930 -9215 -10186
1001 -10186 -1328 7051 11207 5228 -6472 -11024 -2024 8041 10966 5091 -3757 -10980 -4426 8441
1015 8441 11830 6140 -3365 -9056 -5768 6451 12912 6764 -3355 -8445 -6113 4437 13015 8344
1029 8344 -2856 -8975 -5430 3009 10727 10344 -894 -9839 -7029 2646 9410 9438 1080 -9818 -8747
1044 -8747 1490 9035 8595 1332 -8496 -10550 -786 9365 8620 803 -7709 -10503 -3918 7493 9586
1059 9586 599 -8184 -10241 -5122 5204 9570 2355 -8911 -11139 -5370 2673 8866 3723 -7962
1073 -7962 -12393 -6372 2695 7424 4334 -5709 -12637 -7620 3106 7383 4515 -4416 -11924 -9716
1087 -9716 1590 8070 4398 -3668 -10560 -10083 -296 8509 5790 -3746 -10007 -9452 -2179 7130 7611
1102 7611 -2626 -10481 -9036 -2920 5227 7939 -795 -10552 -10992 -2341 4424 6967 1317 -9025 -12110
1117 -12110 -3625 4553 6324 780 -7888 -12500 -5912 3621 6751 1375 -6351 -11551 -7751 2920
1131 2920 8436 2377 -6583 -9322 -7069 1753 8082 3459 -5317 -9052 -5792 914 7507 6274 -4176
1146 -4176 -10380 -6312 2437 7700 7459 73 -8608 -7121 2846 8319 7580 2452 -6107 -6977 2022 10011
1162 10011 8172 2243 -3780 -6089 567 10185 11028 2543 -3498 -5124 -612 9021 11708 5013 -4032
1177 -4032 -5426 170 7090 11440 6539 -4321 -6970 -370 6855 10622 6715 -2917 -8040 -1838 6054
1192 6054 9410 5842 -1273 -7614 -4759 4486 9565 6329 -939 -6500 -5819 2961 10015 7097 -1330
1207 -1330 -6273 -5977 1137 9317 8436 -888 -6879 -4484 935 7387 8540 811 -7786 -6598 220
1222 220 5774 6906 1440 -6923 -8687 -1778 5141 5672 1070 -6268 -10273 -4374 4515 5454 -328 -6661
1238 -6661 -10210 -6355 2342 6275 -134 -7257 -10200 -7487 277 5386 1805 -7423 -10206 -7185 -212
1253 -212 4890 3159 -4700 -9986 -6376 266 5156 4105 -2163 -9646 -7700 958 6006 4186 -56
1268 -56 -7823 -8273 810 6158 4399 -950 -6726 -8014 -2129 5182 5169 -1916 -7400 -8145 -3863 2802
1284 2802 5020 -1841 -8800 -9652 -5730 743 3575 -1257 -8968 -11886 -6411 -35 2793 -216 -8213
1299 -8213 -11239 -6393 261 4291 420 -5086 -10147 -5915 1228 5029 2415 -3029 -7588 -5739 2864
1314 2864 7281 5739 -868 -5756 -5350 2123 9960 8322 596 -3290 -2116 4343 9228 9492 3386
1329 3386 -3126 -1565 4394 9315 9050 5424 -1233 -2636 2801 8702 8648 5229 -254 -4791 381 8510
1345 8510 9314 3902 -1237 -2998 -420 6454 10102 4997 -1588 -2115 -1039 5875 9409 5537 -1412
1360 -1412 -3803 316 5000 8576 7125 78 -3532 277 4897 7584 6879 1746 -4656 -2801 4670
1375 4670 8688 6543 993 -4476 -4404 1949 6520 5173 -28 -5006 -7018 -1223 5001 4744 -2751 -6706
1391 -6706 -7566 -2680 1743 3810 -2565 -9088 -8664 -5689 -107 3138 -2056 -10337 -11206 -5761 -949 1008
1407 1008 -1198 -8143 -10925 -5257 889 1656 -162 -6068 -9337 -6398 2011 4621 793 -3657 -7424
1422 -7424 -6286 344 5718 2613 -2398 -5095 -4707 707 6872 4814 -1578 -5514 -3076 269 4202
1437 4202 5406 -1133 -5802 -4212 319 3438 3654 135 -5705 -6284 -1141 3036 2655 -482 -4898 -7467
1453 -7467 -3068 3297 4808 -135 -4203 -5777 -2995 3004 5568 1156 -4039 -6275 -2488 2142 5983
1468 5983 2069 -4121 -4196 -1792 2579 5846 4117 -1760 -5300 -1620 2877 6657 5167 55 -4964
1483 -4964 -2991 3399 6024 4743 707 -4206 -3686 2670 7179 4669 204 -4270 -4185 793 6181 4830
1499 4830 -391 -3850 -4207 -956 4648 5584 514 -4683 -3553 -592 3828 6407 2252 -4142 -4648 -505
1515 -505 3814 5667 3172 -2620 -5171 -371 5053 5967 3558 -931 -4197 -891 4919 6639 3279
1530 3279 -631 -3718 -2226 3175 6923 4656 -1148 -3753 -2868 1706 6361 4992 -1192 -4734 -3237
1545 -3237 666 4580 3686 -1665 -5079 -4005 314 3226 3639 -952 -5502 -5489 -508 3225 2908 -18
1561 -18 -4377 -5926 -2216 3019 2994 -70 -4064 -6125 -3247 3228 4142 -582 -4296 -5490 -3479 2267
1577 2267 5015 301 -4629 -4872 -2177 855 4412 2332 -3246 -5676 -2209 1465 3606 2676 -2068
1592 -2068 -6200 -3745 1583 3189 2932 -1079 -4697 -4826 660 4072 2009 -1441 -4118 -4643 -243 4542
1608 4542 3356 -1558 -4173 -3725 -1327 3748 4021 -1 -4610 -3876 -476 2789 5226 526 -3892 -4084
1624 -4084 -647 2961 4205 2144 -3404 -4801 -439 3903 4489 2313 -1673 -5051 -2087 3281 5026
1639 5026 2311 -1172 -3660 -2378 1951 5058 2264 -1530 -3285 -2319 1434 5527 3434 -1618 -4033
1654 -4033 -2814 659 4455 3986 -382 -4716 -2753 1006 3854 3857 36 -4313 -3820 724 3783 3197
1670 3197 635 -3503 -4790 -742 4200 3654 67 -2680 -4395 -1455 3424 4091 286 -3216 -4088 -2114
1686 -2114 2242 4758 1512 -3832 -4043 -2028 1564 4458 2256 -2823 -5229 -2186 1364 3501 2556
1701 2556 -1937 -5204 -3052 1154 3393 2194 -1116 -4700 -3566 1096 3901 2472 -874 -3712 -3858
1716 -3858 310 4522 2947 -827 -3003 -3324 -338 3682 4223 -267 -3623 -3073 -255 2737 4411 608
1732 608 -3797 -3300 -507 2659 3780 1915 -2740 -4515 -856 3006 3745 1918 -2029 -4480 -1472 3310
1748 3310 4054 1918 -1301 -3734 -1985 1780 4518 1984 -1677 -3435 -2480 953 4432 3008 -1191
1763 -1191 -3269 -2317 786 3679 3753 -1017 -4249 -2393 957 3472 3146 365 -3782 -2989 1338 3160
1779 3160 3463 495 -3030 -3484 283 4032 3313 408 -2508 -4018 -949 3648 4085 421 -2709 -3516
1795 -3516 -1637 2252 3989 992 -3028 -2525 -1643 2050 3526 2117 -2582 -3958 -1289 661 3255
1810 3255 2273 -1551 -4497 -2346 2085 3433 1971 -54 -4539 -3393 1599 3500 2382 -577 -3222
1825 -3222 -3527 747 3334 2144 -473 -3494 -3095 -642 4158 2844 -667 -3456 -2648 -601 2693 3992
1841 3992 858 -3448 -3060 63 1989 2824 887 -2859 -3762 -28 2381 2028 245 -1231 -3841 -1616
1857 -1616 2648 4316 702 -878 -2894 -1823 1860 4106 1224 -924 -3709 -1719 1161 4336 2814
1872 2814 -1152 -3806 -1286 877 3097 3113 -1751 -3765 -3346 2048 2268 2410 -479 -3046 -2529 1049
1888 1049 2805 2998 -368 -2966 -3485 259 2655 2795 165 -2368 -3659 -231 3037 3460 -379 -2280
1904 -2280 -2988 -1400 2916 3589 775 -2510 -2469 -683 2307 2863 2108 -2273 -3467 -662 1999 3451
1920 3451 2383 -1463 -3645 -1353 1723 3144 1844 -427 -3292 -2595 1303 3438 1934 -612 -2756
1935 -2756 -2346 790 4110 2238 -699 -2715 -2547 -117 3504 2855 -798 -2875 -2417 -114 2320 3305
1951 3305 156 -2965 -2715 -592 2000 2847 716 -2932 -3385 73 2666 2714 1292 -1656 -3563 -1650
1967 -1650 2714 3196 1032 -1169 -3252 -2145 2344 2805 812 -1838 -2482 -1301 910 2915 1136 -1932
1983 -1932 -3295 -1993 759 3211 2225 -1764 -3726 -2100 853 2260 2425 -131 -3240 -2412 1186 2687
1999 2687 2045 -50 -3035 -2806 570 2851 1758 -154 -2160 -2784 -288 2991 3206 -105 -2033 -2214
2015 -2214 -901 2302 3477 502 -2529 -2394 -513 1571 2935 1316 -2041 -2586 -465 2108 2853 1728
2031 1728 -1327 -2273 -948 2064 2551 1633 -746 -2878 -2775 872 2846 1532 -1276 -3400 -2272 79
2047 79 3286 1514 -1041 -2372 -3029 -336 3143 2505 -1254 -2374 -1886 -64 2416 2130 -350 -3042
2063 -3042 -2112 267 1555 1494 248 -2803 -2773 -370 1941 2650 915 -1550 -2871 -280 2716 2575 665
2080 665 -1725 -1673 -994 1639 3469 1191 -2255 -2720 -1090 793 2372 1581 -2203 -2351 -1397 85 2305
2097 2305 1656 -1050 -2016 -1780 1666 2669 2838 -588 -2681 -2319 1181 2699 1535 381 -1932 -1877 1158
2114 1158 2476 2156 -398 -678 -1573 324 2534 2445 247 -1354 -2071 -429 2051 3733 368 -1706
2130 -1706 -1989 -630 2311 2874 1593 -2411 -2494 -363 2150 2544 1394 -1453 -3118 -760 1758 1642
2146 1642 747 -1307 -2450 -1900 1140 2052 634 -1333 -2972 -2698 -62 2346 1117 -1511 -2596 -2438
2162 -2438 -50 2564 1149 -1026 -2641 -2056 -75 1676 1755 -242 -2378 -1522 940 1142 1632 483
2178 483 -1575 -2701 0 1162 2239 1572 -1725 -2325 -708 2395 2602 1142 -1564 -3041 -608 1850
2194 1850 2787 -4 -1087 -2050 -557 1313 2125 231 -1681 -1637 -1340 314 2983 878 -1477 -2864
2210 -2864 -1309 725 1514 1920 -1013 -2936 -1392 1850 1967 2275 -323 -2529 -1255 587 1990 1283
2226 1283 -156 -1732 -1471 -613 2193 2570 -286 -1875 -857 -648 2031 2912 715 -1425 -1086 309
2242 309 1682 2732 383 -1768 -2421 -1123 1738 1863 703 -1446 -2572 -93 1550 1640 540 -660
2258 -660 -2155 -1414 1170 2110 656 -1203 -2400 -1280 520 2633 1360 -574 -1471 -1490 376 2440
2274 2440 1539 -739 -2509 -1572 779 2541 1955 -419 -2339 -860 802 1363 1434 214 -1721 -1619 224
2291 224 1673 1835 701 -1113 -2316 -346 2069 2350 303 -1367 -2204 -685 2204 2635 221 -1658
2307 -1658 -1686 -413 1586 2388 636 -1291 -1730 -370 972 2172 1689 -594 -1842 -757 1034 2147
2323 2147 2265 -205 -2409 -1321 1402 2438 1754 -388 -2078 -1598 1100 2517 1515 -840 -1270 -1694
2339 -1694 682 2065 1580 -41 -997 -2133 739 1695 1748 150 -1601 -1457 -925 1243 1701 859 -1785
2356 -1785 -1796 384 1610 1728 367 -1651 -2671 -45 1550 1223 -349 -1060 -1871 -1244 986 1175 1039
2373 1039 -928 -1594 -1934 -167 1650 732 -1343 -2528 -2103 -373 1812 1236 -1429 -2896 -1578 88
2389 88 1762 1440 -1212 -2968 -1397 620 787 666 -598 -1808 -1790 -28 680 1046 410 -1465 -2686
2406 -2686 -695 1165 1582 403 -1056 -2044 -794 1742 2303 29 -1601 -1556 -578 1567 1976 395 -1748
2423 -1748 -1415 -431 1160 1601 727 -1168 -1440 -717 554 1483 1377 -428 -1999 -1294 1030 1775 1249 -444
2441 -444 -2180 -1721 1205 2204 881 -757 -2019 -1210 792 2254 846 -368 -1285 -921 178 1844
2457 1844 1531 33 -1050 -546 -727 1118 3042 984 -1027 -1509 678 2224 2783 645 -704 -1610
2473 -1610 1180 1877 1708 353 321 -1393 635 1969 1439 674 -57 217 117 1283 2653 1522 226
2490 226 -793 21 1181 2510 2736 357 -1406 -1075 583 2610 2058 -1151 -1569 -1375 1868 1708 590
2507 590 -1260 -1608 -158 373 1487 -294 333 -1090 -2217 -596 736 1226 358 -1482 -3040 -550
2523 -550 532 1936 -589 -2104 -1340 -564 825 1119 -286 -2019 -1637 -192 154 1320 -269 -1887
2539 -1887 -614 -260 -176 706 370 -423 -2633 -1159 100 797 737 44 -2188 -2245 -35 1601 871 -407
2557 -407 -1819 -1168 22 1645 981 -1696 -1359 -1450 41 23 -410 -1412 -1565 -665 -221 -729 467 -188
2575 -188 -1589 -1880 -1001 780 1252 206 -1673 -2417 194 1702 1568 431 -1488 -1499 330 1736 183
2592 183 -17 -657 -132 -509 886 1064 219 -646 -313 -1316 878 1452 1291 -764 -1748 -1272 -104 2841
2610 2841 1552 -1002 -2017 -1344 9 1475 1773 -71 -2084 -1660 1005 938 693 1152 -934 -1072 329
2627 329 928 1102 47 -855 -2050 581 2155 1739 57 -1262 -24 303 2873 3464 1466 -251 -999
2644 -999 134 1536 2973 1300 -955 776 575 1976 1962 1680 947 859 215 1361 1300 1552 99 -1368
2662 -1368 -801 2146 1262 1484 -1296 -1674 -1206 1411 1298 1332 -716 -1350 -633 -330 678 77 -857 -1413
2680 -1413 -932 -1632 -31 766 -235 -1441 -2525 -738 342 960 24 -2405 -2130 33 1318 1260 324
2697 324 -1588 -1766 -953 944 349 -378 -949 -2081 -656 568 580 -231 -946 -1412 -1081 -1160 703 844 -1310
2716 -1310 -2278 -1830 -472 584 140 -1347 -3299 -1935 369 152 787 -1416 -3082 -1639 -116 647
2732 647 -163 207 -849 -1309 -216 563 723 872 351 -1222 -310 1169 2355 1031 -381 -74 271 1716
2750 1716 2856 637 -1086 -356 807 1626 2425 539 -405 -1047 304 450 1142 585 -350 -569 -400 750
2768 750 747 503 -123 -1049 -1239 -427 1417 630 -929 -826 -2126 193 1414 346 -1730 -1191 -626 420
2786 420 965 -139 -362 -1014 -896 -142 781 911 -174 -418 -671 4 1035 1200 897 -645 -804 131 1676
2805 1676 1491 855 -878 -709 544 1781 1468 231 -817 -346 -399 531 1714 -148 -304 -307 -31 -202
2823 -202 1782 979 -445 -1813 -1006 -682 650 1473 -1553 -1005 -1329 377 405 311 -475 -1617 -758 1362
2841 1362 1044 360 77 -1356 -1515 823 1323 1107 39 -1134 -118 -149 1300 1569 149 -140 -1195
2858 -1195 -255 1479 1560 36 -1176 -793 123 681 1092 -120 -1263 -918 170 470 489 -306 -1062 -684
2876 -684 -842 -17 295 10 -580 -1375 -820 401 1218 174 -419 -1319 -1766 -368 871 240 -702 -1413 -491
2895 -491 539 810 835 -1318 -1031 -359 199 490 577 -415 -683 -520 329 510 634 142 -1076 -1446 -417
2914 -417 889 893 324 -773 -922 -247 97 1204 -126 -687 -236 -332 672 1161 516 -915 -509 -428 -95
2933 -95 264 738 -291 -989 -283 319 1647 -28 -257 -1298 -603 159 837 392 -118 -1982 -154 767
2951 767 966 703 -554 -1565 -254 673 1570 78 562 -545 -652 -144 630 -40 535 -1031 -643 -755
2969 -755 1384 1020 -946 -806 -837 -140 575 467 -615 -556 -944 330 -507 94 -356 -514 -1209 260 -4
2988 -4 214 754 -706 -1393 -1243 196 876 -282 -429 -1491 -1438 80 750 217 -695 -1272 -1093 103 623
3007 623 151 -1165 -1120 -756 -214 923 683 -193 -174 496 671 686 116 -143 -693 -819 180 829 1059 -7
3027 -7 -447 -998 -270 1162 1605 662 -568 -795 127 1678 1661 151 -208 82 278 927 1195 805 -69 -133
3047 -133 291 467 1625 1301 201 -207 -440 425 1249 893 -67 -1123 -260 585 761 497 -217 -1024 -715
3066 -715 538 809 -186 -178 -436 -495 242 1277 569 -6 -97 -1065 -819 466 1259 65 -366 -1169 43 1128
3086 1128 669 355 -1366 -940 -40 1419 1145 403 -514 -1056 442 598 510 519 -931 -538 -619 670 287
3105 287 231 168 -1110 -603 16 1187 72 -800 -1073 -655 351 1654 647 -372 -682 -54 -34 880 720
3124 720 -516 -170 186 433 264 455 119 -1590 -1208 498 231 616 388 -515 -708 428 277 -55 152
3143 152 -862 -1080 -397 996 497 -502 -1015 -806 -748 439 405 467 327 -474 107 24 662 785 147 -1671
3163 -1671 -208 181 549 678 -364 -1123 -20 1188 739 236 -349 -1868 -1397 -723 1518 25 443
3180 443 -1113 -1510 -69 -575 733 -330 -405 -157 -110 94 489 204 -974 -732 -308 1230 1346 390 -239
3199 -239 -622 176 792 687 355 -1304 -953 373 568 856 -115 -514 -879 -913 1584 844 -229 53 -1424
3218 -1424 -1448 -349 503 180 -2031 -592 -709 57 799 759 -1000 -1759 -358 -598 444 48 -1278 -1059
3236 -1059 -958 -1030 -426 -52 -285 -1295 -1045 -754 357 431 -421 -887 -670 -326 79 791 404 195 -748 137
3256 137 308 349 -328 -240 -50 219 896 1253 170 -749 -1199 404 131 915 489 775 -612 294 632 884
3276 884 136 -163 -328 -72 110 758 657 341 145 -497 771 303 736 -140 -212 -598 920 723 -356
3295 -356 -1215 -792 -688 -260 239 363 418 -437 196 365 94 153 -307 -1317 -493 403 203 -71 -189 -653
3315 -653 -425 -30 712 -46 340 -402 -130 295 712 407 140 -405 -882 -647 123 603 127 -563 -780 -586
3335 -586 -356 522 -36 -949 -1181 -465 69 125 25 -988 -1240 -360 -43 6 219 -581 -832 -868 -559 151 -40
3356 -40 -166 -521 -833 43 480 431 250 -404 -37 262 1017 1097 98 -208 -22 489 1003 1104 637 202 81
3377 81 388 613 1039 458 -49 -271 206 370 565 525 -299 -754 -227 361 377 96 -333 -784 -631 245 177
3398 177 140 -526 -880 -1093 -270 389 19 -927 -657 -418 -419 384 -45 -161 -834 -585 -216 314 358 -194 -457
3419 -457 -387 4 494 409 92 -444 -610 129 575 474 88 9 -795 -24 665 916 890 -404 -280 -247 888
3440 888 -147 -205 -1186 -879 -619 240 1383 69 147 -364 -583 -614 1401 721 -116 -850 -352 672 119
3459 119 616 -201 -346 -232 -10 -363 117 -634 -192 -272 -288 1877 315 405 425 143 449 1072 1483 107
3479 107 -154 55 489 785 448 453 -431 38 28 644 666 258 -220 -335 11 56 320 162 -386 -707 -328 596
3501 596 380 60 -329 -857 -297 131 322 -63 -249 -873 -585 69 780 -108 -692 -529 -570 -336 405 251
3521 251 -409 -571 -216 95 456 339 -321 -367 -426 368 597 397 -176 -774 -731 254 413 216 78 -342 -653
3542 -653 -57 309 212 -89 -340 -532 -304 104 333 -273 -248 -520 -486 90 774 120 -489 -586 -45 116 467
3563 467 304 -378 -419 -83 242 322 254 -45 -721 -380 234 760 315 -30 150 -57 272 621 248 -281 306
3584 306 -873 460 -93 -34 100 -225 -79 -79 440 618 59 -559 -30 -101 598 697 170 -433 -381 -54 313
3605 313 330 60 -478 -513 68 341 407 -8 -519 -677 -295 261 134 -261 -438 -629 -535 -29 361 -204 -432
3626 -432 -900 -550 -198 294 -148 -242 -894 -274 -444 17 58 -253 -992 -363 -725 -46 400 -303 -514 -703 22
3647 22 575 449 434 -334 -724 299 734 712 201 90 -10 130 708 757 235 167 217 269 579 824 398 16
3669 16 -40 234 475 597 537 -67 -327 235 543 768 134 185 -261 16 548 484 507 -38 -293 -266 189 404
3691 404 404 118 -562 -296 127 693 313 -111 -321 -329 -41 347 697 -108 -353 -75 -166 384 287 117 -401 -442
3713 -442 -78 -17 326 424 -415 -606 -298 139 116 25 -111 -690 -665 309 293 -55 -352 -619 -662 -193 374 82
3735 82 -371 -559 -572 -269 429 124 -548 -492 -337 -89 62 36 -321 -673 -62 280 494 229 173 -244 -116 366
3757 366 363 386 41 9 -293 427 560 541 301 174 -115 367 515 258 140 -237 -206 -223 369 411 54 -433 73
3780 73 -299 93 212 32 -390 -484 -205 245 -32 -131 -285 -711 -497 75 284 119 -159 -703 -540 140 114
3801 114 -2 -216 -317 -386 -125 534 -8 119 -306 -363 81 881 578 -88 -174 -134 -23 451 583 -70 -60 -274
3823 -274 98 773 688 211 -45 -345 117 183 418 209 -144 -404 57 413 220 335 -165 -289 16 -87 626
3844 626 603 -284 172 422 149 695 404 -327 513 245 -56 -171 -269 -398 178 35 1420 -619 -264 -252
3864 -252 -420 -1179 -376 141 386 87 -631 -643 -12 1422 -97 -113 -145 -985 -304 122 289 -502 -241 1
3884 1 -55 47 516 -79 -1070 -174 -143 -236 171 177 -690 -347 116 -357 463 -125 -103 -645 -915 70 300 44 237
3907 237 -745 -890 333 626 240 -118 -483 -987 -396 421 -761 -434 -269 -128 -370 513 0 -8 136 -274
3927 -274 564 364 148 -299 -179 296 528 351 194 622 -263 -70 528 676 -464 784 658 -700 -432
3946 -432 522 -127 132 458 -435 -366 133 540 -120 -368 -169 382 744 758 407 -843 92 -556 159 63 857
3967 857 459 -535 474 1379 614 435 -540 -1441 21 658 495 -441 -315 -111 -598 750 350 -202 -40
3986 -40 -370 -354 -236 420 -869 -206 842 -495 -28 187 200 374 76 -69 518 32 645 468 -381 62
4006 62 371 626 586 234 -112 454 -96 -510 -95 -365 366 -295 -223 395 289 41 69 0 485 326 -6 -580
4028 -580 97 -1309 -374 -106 407 -77 -1601 237 -977 -165 -86 9 -280 -499 -257 613 653 114 -174 -501
4048 -501 189 602 -305 555 422 -456 -129 -616 -270 362 -583 183 -651 -137 -123 -454 -176 -733 -68 166
4068 166 -114 430 -19 -609 -711 -708 -54 464 -292 -150 -813 29 368 45 19 -353 -673 -53 -188 361 277
4089 277 18 -196 -753 1113 201 162 -219 -274 -244 77 607 209 345 134 -13 463 836 69 32 -279 -571
4110 -571 83 562 561 193 -171 -523 -48 53 19 -129 -569 -516 560 158 -12 -150 -53 -10 -103 637 245 -104
4132 -104 -656 -322 -258 111 654 -63 -88 -415 -365 55 -246 -114 -613 -171 -37 338 162 320 -258 472 268
4153 268 96 550 -88 779 -884 -213 79 115 -411 123 -86 173 -138 257 380 -521 -206 -387 301 317
4173 317 -248 -76 -461 -31 -1247 127 -364 88 52 -351 21 -184 -629 1034 76 -1240 143 -800 1184
4192 1184 259 -272 157 211 883 391 -661 53 445 317 128 -105 -44 -953 125 114 -175 734 266 -192
4212 -192 1143 -151 -466 41 68 521 385 44 -481 845 326 356 -787 883 -649 314 105 -24 295
4231 295 -336 606 554 294 733 395 -591 378 673 297 206 -55 86 39 284 60 49 -69 -91 -980 -171 228
4253 228 72 -398 -558 -2 -57 158 -230 -348 -300 -501 -456 138 205 -1049 -288 81 325 269 74 -47 -274
4274 -274 554 -23 453 195 234 -577 -951 152 610 338 -197 562 -41 4 19 737 259 836 168 -423 410
4295 410 735 64 -113 359 417 288 -44 239 97 -110 -339 427 -213 -151 485 -301 -288 317 316 120 497 -75
4317 -75 -115 105 520 344 -285 6 -13 -89 74 145 316 -110 -165 285 201 -132 233 -81 -150 148 406 -1 177
4340 177 -44 -338 -285 -94 12 323 -63 -360 -231 71 -32 -439 -253 -353 -220 -92 -47 196 -845 -762 60
4361 60 -272 -246 125 -370 53 -418 -119 -27 269 -136 -351 -230 253 492 380 68 -380 218 508 543 -269
4382 -269 424 202 -132 90 225 270 -352 -212 -228 -310 393 945 147 364 -383 29 -293 294 78 5 -168
4403 -168 -231 478 168 -146 -320 180 125 -28 565 -259 -408 -753 -217 498 127 666 196 567 -441 214
4423 214 553 306 -224 -620 270 -334 299 106 -215 336 -175 97 -69 13 276 -584 -214 347 499 27
4443 27 -305 -872 -255 897 -44 -350 -311 -1049 178 197 109 312 -97 322 23 163 -353 -181 243 532 525
4464 525 -762 -542 -125 -326 295 -660 -71 -147 489 -4 -268 -161 -214 459 42 1358 715 -432 -334 369
4484 369 372 -436 576 122 -531 860 163 337 183 -645 238 276 175 -319 -511 -207 -198 -73 2 502 -107
4505 -107 -37 -822 -546 -277 344 -318 -693 -523 -311 -203 -36 -673 -357 -40 -353 -301 -30 348 -129 -769 -1128
4526 -1128 69 9 -491 -283 -383 -517 240 -138 -79 -1172 -252 -389 327 1132 554 -62 386 310 -937 150
4546 150 -597 -63 413 -825 563 92 -74 -107 -988 -456 -140 -150 477 401 159 182 440 210 -353 -536 -489
4567 -489 -632 195 255 636 -133 591 313 -23 -494 127 -289 544 16 -417 242 111 357 -343 -127 -218 328
4588 328 -21 77 -44 -682 -237 -182 -188 -357 -102 299 -625 262 411 -251 83 -515 239 199 245 532 -173 -184
4610 -184 463 -337 -843 436 177 -288 -641 -755 436 -275 51 -755 -611 -12 -197 217 15 156 -210
4629 -210 -84 1031 362 390 671 158 -580 -2 -69 36 -270 -764 -122 115 -18 -255 132 -359 -42 296
4649 296 -269 326 380 -411 -193 92 -64 -94 -43 -341 -204 -470 96 -476 -220 -632 89 93 -590 -390 -480 187
4671 187 -488 -648 585 132 546 -381 -4 -782 -303 95 -451 191 -1301 353 -256 1999 -1088 -47
4689 -47 -334 -912 -33 576 -460 -615 131 65 -302 104 346 -226 -331 -166 179 -149 350 38 -375 177
4709 177 383 -85 296 -180 286 -149 194 -372 165 -253 -193 -87 -356 -302 -322 -100 -243 235 -126 345 -158
4730 -158 155 -409 110 -329 -213 570 -312 -87 139 -390 -474 42 -15 -632 36 135 27 -394 -326 -302 624 -9
4752 -9 399 -45 -15 189 -36 -51 17 472 -392 -351 -169 159 -368 739 -88 143 -237 -257 356 -840 86 -424
4774 -424 -6 313 -57 -166 27 -136 -612 485 238 40 -467 201 -471 -26 -191 -365 919 -18 138
4793 138 -704 -491 739 -590 309 -328 -429 -529 194 -194 536 -19 645 775 -50 202 -668 704 -434
4812 -434 1000 -136 -591 -559 -149 93 -18 -673 494 -389 -640 308 822 471 -258 -251 -532 1034 -232
4831 -232 1036 587 226 -290 -238 266 -146 867 840 275 88 -236 -79 162 72 -744 137 -174 -170 174 -117
4852 -117 -244 -260 229 -135 356 112 -72 3 46 -115 -114 137 -284 45 -21 -438 -82 40 -160 -115 -132 130 102
4875 102 69 85 -612 -353 239 -55 235 50 -402 123 -43 -28 -204 747 -181 -749 84 360 219 193 219 -329
4897 -329 72 217 543 -209 321 47 -143 22 -63 133 -32 496 803 -123 95 238 815 -211 226 -404
4917 -404 -598 -172 -88 43 -39 355 -236 47 670 -510 -250 -463 511 856 -550 1068 -75 435 69
4936 69 127 -38 178 -174 333 336 -284 43 251 150 -136 213 186 -30 179 -220 155 14 110 48 -151 -581
4958 -581 -56 54 -41 42 -1 -51 -107 464 122 -13 177 -77 40 165 130 -276 -334 51 -316 -126 -223 29 3
4981 3 -206 -137 -281 -86 80 -123 -144 -310 -218 -68 329 245 -158 -260 126 28 92 243 316 -376 -189 94 64
5004 64 169 276 65 -196 -113 406 333 375 -70 -98 -80 378 417 591 -730 160 696 264 -324 293 -660 -156
5026 -156 -162 -750 38 23 -399 -271 -70 -137 -80 -223 16 211 490 241 315 -226 -296 -1031 -189 -156 225 0 -81
5049 -81 -136 -174 86 105 18 -94 -141 -251 81 -19 9 -512 -329 50 332 14 496 466 -141 -164 97 -25 -30 693
5073 693 -344 138 -331 1182 998 379 -41 -380 -879 -420 1292 -103 555 123 -296 2 347 355 60
5092 60 201 146 -159 308 199 22 54 -45 232 163 257 -192 -275 56 84 1 -46 144 179 60 377 -27 61 86
5116 86 74 1 132 135 149 113 48 -322 -164 -24 783 -134 200 376 328 195 949 0 -62 204 78 -432 -545
5139 -545 249 -1250 -408 -240 -197 53 44 282 -1003 66 418 436 164 215 352 486 -13 302 185 -314 1242
5160 1242 -546 325 -180 382 339 -271 -582 395 -415 -75 367 -262 444 602 -34 606 433 -632 221
5179 221 137 476 556 -188 -1230 -25 -284 1000 399 -506 574 -811 820 131 70 -674 88 241 285
5198 285 659 443 -22 224 -246 -827 498 -159 -35 -534 -660 -723 -25 463 -10 -516 -105 529 -3 -7 -568
5219 -568 192 -160 -503 -374 -16 -463 736 21 -348 706 386 981 888 450 324 -280 223 301 566 -135
5239 -135 1 -46 -451 77 -249 -371 41 -137 -30 263 -222 -49 -183 -56 434 392 28 46 -68 320 166
5260 166 -22 150 -93 248 -221 311 112 -49 98 -261 -238 3 213 326 -244 -147 186 192 85 298 167
5281 167 -305 -59 -160 53 9 86 178 -386 290 389 -170 -427 -152 -50 -282 -72 339 -104 -77 -557 295 178
5303 178 -419 -112 111 -117 27 244 7 189 -204 227 -3 249 269 167 16 -84 -200 21 -102 -10 29
5324 29 137 307 211 47 160 -91 -25 185 279 -69 35 13 34 -92 201 226 118 99 -81 183 -364 104 341
5347 341 -144 -176 127 184 153 3 -163 -81 39 -15 263 -105 -81 -299 -206 -41 -147 -566 -351 48 -211 -350
5369 -350 404 520 652 -113 209 90 221 -336 -339 270 -386 173 14 261 -471 -11 -41 -355 -356 176 -183 333
5391 333 -276 2 -41 220 4 -12 -160 18 -70 -64 170 -124 129 -4 136 -43 212 -203 -227 -139 387 -113
5413 -113 24 -166 50 635 80 347 798 -73 -204 -395 120 -140 -103 51 14 -476 256 72 180 132 68
5434 68 67 -152 -151 -135 286 57 -295 -101 73 -183 50 -51 -17 73 222 70 118 466 -52 -92 104 68 169 185
5458 185 -181 -115 -76 57 -74 -271 -300 -19 111 35 65 73 -83 -151 130 82 -26 38 -20 -105 261 -3 64 -68
5482 -68 60 24 115 -78 303 149 -164 -119 25 275 64 38 11 160 84 -12 90 -161 -421 -55 277 35 45
5505 45 26 -46 -61 89 -55 -199 -131 128 -180 -265 40 211 -104 74 96 -111 -153 250 306 173 -154 -150 16 -43
5529 -43 17 -104 -5 -95 -87 241 125 -196 -132 -82 -147 -58 210 -137 -99 -60 103 -249 -21 100 -193 -85 104 172
5553 172 -69 60 17 -59 118 318 -89 102 38 -82 -207 -245 -2 315 58 -235 230 -13 38 -6 172 47
5575 47 97 -131 76 91 -1 37 -179 200 -50 37 328 287 -252 -11 89 132 -303 -153 50 95 -15 -183 115
5598 115 169 -112 -171 78 -12 -187 78 149 -220 -141 274 -66 -437 -36 8 -91 144 -171 -21 -165 -2 239
5620 239 -12 149 51 -227 -144 2 66 -16 -33 -280 13 -180 249 260 -48 70 -5 121 50 377 -89 80 -23
5643 -23 -209 -341 470 147 16 42 -190 262 385 -229 -57 -295 -346 -268 -126 299 282 96 -182 14 104 65
5665 65 -80 89 -34 107 178 15 -336 302 153 -82 15 -254 -51 32 -198 265 268 -43 -119 41 144 9
5687 9 28 -4 -33 24 -60 35 288 -150 -259 -219 -157 133 -2 -15 -161 -15 220 -104 37 -284 -78 -69 -194 -106 201
5712 201 156 -41 69 -222 -124 305 -221 263 -6 141 -40 8 40 -91 163 -180 23 -70 51 144 96 -77
5734 -77 -313 132 20 15 -16 25 -31 185 -146 191 12 -206 -52 -15 326 40 32 98 -213 129 -40 109 90 -228
5758 -228 -71 26 75 -23 182 224 147 -134 -38 73 1 -109 -293 -105 -46 -3 -104 346 -94 -334 -83 -184 -131
5781 -131 -898 -958 37 -266 -515 -77 753 -419 -827 -372 309 188 -697 279 1068 -261 -386 718 -893
5800 -893 -578 102 -568 163 -673 271 -277 158 -211 -239 -312 -34 -481 501 114 313 108 -360 -296 432 144
5821 144 -347 -348 -407 6 -146 -261 608 -286 -594 514 -349 172 -240 492 -276 -307 -72 -262 34 124 212 63
5843 63 381 -717 -774 1299 -512 -192 -614 -638 -92 -63 511 150 -526 76 -578 -376 132 225 -1265 -632
5863 -632 298 -171 -243 626 -658 -1031 -377 -441 327 -327 -92 -206 120 326 829 232 -177 231 -355 188
5883 188 -25 -358 632 -568 9 297 24 -75 720 -461 -565 203 6 418 -963 369 806 -705 265
5902 265 240 -154 -651 -246 -980 -546 -23 -222 724 24 -699 323 -207 634 -399 913 457 233 -96
5921 -96 -1090 188 558 -111 241 -340 -53 -353 258 593 -56 -28 -285 -458 206 523 142 -98 -284 -101
5941 -101 -691 -23 109 669 -23 174 5 306 42 -28 188 -411 -57 -25 200 -149 -333 174 -520 37 477
5962 477 107 -448 185 94 -26 217 -269 -243 11 -114 87 -164 -521 -400 -115 -384 -114 263 274 272 257 -41
5984 -41 310 190 61 -27 292 155 -57 55 -217 -260 0 -428 127 -95 -119 -123 21 76 95 200 206 -17 78 191
6008 191 150 98 165 -2 147 124 -60 144 -140 104 -52 -55 -250 4 -139 -222 140 -16 -241 55 -226 -1
6030 -1 456 -127 301 -110 251 -244 107 198 161 -43 -142 -293 -418 -27 275 -112 231 95 46 22 4 -76 -218
6053 -218 124 72 375 -213 161 -99 -16 285 -80 -48 -78 88 -13 292 -157 -213 61 -136 81 -113 -22 100
6075 100 -25 -35 -114 119 76 -227 152 -90 0 88 181 -443 -51 230 -117 143 17 -94 -80 -237 -52 170
6097 170 355 -25 -17 110 121 426 -303 -150 260 -581 -22 137 78 140 31 -398 108 45 171 -88 201 -407
6119 -407 -2 -336 -536 458 69 -141 209 -621 -285 -452 -477 1017 184 215 -529 -898 -725 -988 509 519
6139 519 -445 -232 -351 -588 3 146 184 -29 -100 -299 -418 -71 -33 -231 -465 -343 -511 -466 244 -1006 241
6160 241 -497 517 -66 -469 510 531 184 -100 680 -445 -4 -158 -64 -113 -26 -93 20 -273 124 33 -91
6181 -91 -84 -219 173 -141 -402 165 2 -50 83 -5 234 146 -193 -71 -200 -128 70 24 10 135 16 456 138
6204 138 -41 52 32 -6 194 66 -129 32 4 -22 20 233 -80 102 162 89 192 321 -77 -38 76 223 -112
6227 -112 98 -21 -84 95 105 265 105 109 -196 102 205 -10 -236 138 -246 225 82 -202 -58 39 131 16
6249 16 88 -118 471 366 228 -376 130 -287 -378 19 -295 251 -81 0 -102 -43 -10 -221 30 108 -268 -175 379
6272 379 229 86 -11 -293 -260 165 -96 -308 -156 -133 161 -317 -187 149 -194 284 -74 -182 -39 380 -263
6293 -263 687 -918 -385 109 824 -882 -227 798 662 -616 502 616 -368 551 550 231 -19 229 26
6312 26 -384 -17 534 -707 248 -129 407 -537 4 -291 -451 -140 -15 -426 -609 640 -551 -587 597
6331 597 -242 287 239 -1073 -398 54 -593 564 14 550 691 739 459 310 671 591 -259 107 518 -77
6351 -77 -760 1013 -44 -344 -192 -106 78 -360 -45 -262 287 -182 223 -103 -26 -430 -45 -72 -138 302 217
6372 217 613 -357 287 -658 296 -508 -373 394 -419 -473 748 646 1466 -146 107 197 772 361 -277 463
6392 463 -265 110 225 -179 -115 347 352 -74 54 -32 -199 -17 -67 -583 44 -293 157 -376 -214 199 -52 511
6414 511 201 -104 8 -192 -288 -371 -105 -367 70 -365 97 11 -229 41 -410 36 124 615 360 -629 146
6435 146 161 -70 -220 879 -144 -126 -123 314 644 30 -133 531 -421 341 -373 50 -16 102 -119 -55 -191
6456 -191 -508 663 439 376 -95 -198 35 436 -49 -32 286 8 -342 -710 -145 -452 -131 45 456 112
6476 112 -275 -60 295 -206 255 -624 373 -212 122 -95 -825 -1483 -14 -746 17 -547 -359 126 -211 271
6496 271 46 235 -14 -421 -708 -630 -823 131 503 87 -495 -426 -396 -486 -407 -230 114 71 -287 -268 88 -23
6518 -23 -160 -177 -274 -137 6 -9 -61 -297 194 -231 14 -28 -262 -162 157 -243 79 53 -130 -56 -112 3 96
6541 96 132 82 130 -136 220 -53 1 155 201 121 232 -154 -18 -267 61 -20 -260 221 269 11 95 -890 92
6564 92 -490 630 -150 -564 -1171 -469 -303 -529 381 -27 1049 -15 279 -1171 445 263 -745 357
6582 357 -1144 -351 8 -67 -317 126 -388 43 493 324 150 125 409 1014 -54 -704 -77 -369 -96 673
6602 673 -170 80 -616 -32 384 -387 755 -274 -389 -28 -100 -446 31 -206 143 93 -623 -861 397 272
6622 272 101 -285 38 -49 -318 193 -890 -69 -494 -493 -223 647 -44 -136 75 -163 -44 -383 -79 46 831
6643 831 706 -353 -404 39 120 -368 325 -122 -324 13 12 -211 -132 -176 172 271 -28 -36 107 -418 234 -36 0
6666 0 461 17 464 215 424 -242 400 33 -154 68 -99 101 284 -109 153 277 136 16 15 -102 53
6687 53 112 275 167 8 332 -238 -74 -81 -20 232 -23 -34 97 191 150 -227 -393 72 -141 31 -456 144 -359
6710 -359 49 225 -84 -115 -103 156 456 -228 275 -104 -42 115 -397 -186 -208 296 70 69 400 -333 142 -333
6732 -333 -593 -322 -253 340 557 -116 -110 -493 -601 162 509 -805 131 -245 -56 -275 -320 604 357 282 -147
6753 -147 20 -266 -208 432 -74 44 271 -159 -49 237 223 -221 140 -83 237 215 44 -443 350 272 85
6774 85 -83 -23 -167 -132 -203 166 -206 150 12 69 31 132 -94 -56 223 75 -215 -25 -453 -97 99 -184
6796 -184 -244 -21 33 -159 269 -81 -150 -150 -188 139 -64 107 174 -41 49 263 -420 -153 -244 252 -286 38 45 -154
6820 -154 408 305 82 -68 82 629 -30 241 -281 -512 -161 72 21 -216 -59 42 5 296 -53 -810 -551
6841 -551 -872 352 366 187 274 -6 -249 -117 295 -180 218 184 -209 466 411 -366 49 67 324 19 62 156
6863 156 177 41 62 32 190 118 155 -114 -185 -4 205 -191 203 67 -179 51 -46 129 168 -158 -131 -70 117
6886 117 347 -79 -207 -134 29 -86 242 243 160 -52 -70 230 -173 -217 -190 -22 29 -31 -443 164 -31 -53 -61 22
6910 22 -24 188 -341 -36 20 -145 -50 -115 109 -134 37 -127 -72 208 -113 -28 -198 122 141 -61 -105 -205 -71
6933 -71 -33 -275 -51 19 -103 327 -78 271 199 122 -192 171 -7 215 50 130 -81 -117 172 113 77 -172 -11
6956 -11 -43 -19 13 195 -77 -222 45 -181 126 -24 241 -248 -119 95 -78 -133 4 30 -22 -57 -61 -150 -301 39
6980 39 25 129 -278 -246 113 313 40 103 -243 -131 138 -13 -81 13 -65 141 159 -123 -77 205 55 149 52 -59
7004 -59 35 73 -134 170 -151 -129 -2 -173 -2 54 88 -331 20 -50 -213 9 -55 -33 94 -83 82 -81 -8
7027 -8 -82 95 -262 194 -154 -96 -295 141 -47 131 -156 -95 134 131 -21 -152 255 -123 -374 -276 -63 128 13
7050 13 257 110 52 -36 183 -102 -225 98 -29 75 88 -94 154 -470 136 187 216 46 -157 126 -172 -244
7072 -244 13 69 -47 81 -39 214 258 190 444 166 -250 60 325 614 -723 -164 -548 304 50 -786 -219
7093 -219 68 53 463 566 567 281 257 -381 83 -13 -299 1238 -276 228 106 -219 111 453 600 -204 697
7114 697 -453 -321 -237 -5 971 -166 183 541 198 -36 -151 391 455 363 -636 645 38 268 234 -158
7134 -158 -110 -373 -95 -42 -486 -1091 42 774 429 -162 198 -456 224 391 392 657 -29 -1005 405 -379 -234
7155 -234 -888 -282 2 118 276 -238 103 -227 66 -79 -75 -396 -1 -102 -242 489 -497 516 -456 -286
7175 -286 91 186 75 581 -563 662 -257 -82 131 161 256 -455 -303 -49 -62 -32 563 -196 170 658 -586
7196 -586 300 280 -238 -858 257 377 507 85 -392 -532 -87 -410 7 -290 149 -34 -146 91 -124 279
7216 279 -138 -396 -215 328 19 -233 -146 -109 62 168 171 -163 35 -28 216 102 -433 229 119 91 -180 117
7238 117 -197 -64 -97 -61 -214 52 77 225 -25 -31 27 297 -13 251 -65 20 56 -374 98 19 0 154 -28
7261 -28 -207 -175 -58 -50 90 161 231 21 76 -22 -59 -72 -74 24 -181 238 -1 180 95 -226 238 -56 109 -89 381
7286 381 114 -104 2 -347 -375 -77 -136 -410 -400 172 35 -370 212 -150 -104 575 -360 -55 -243 -351 650
7307 650 144 140 318 -232 35 -292 -408 110 476 234 -391 -20 -237 83 191 -66 -198 -23 -256 248 37
7328 37 89 -19 -6 40 175 54 27 -158 -16 -144 -19 81 136 116 117 -34 40 81 94 176 264 -35 53 17 -18 66
7354 66 -10 91 -221 -226 -207 -32 56 202 13 27 -105 128 -142 260 -117 -98 -94 64 30 167 -29 -116 -50 -5 86
7379 86 81 27 72 203 6 58 -67 61 0 236 135 241 -118 -312 108 -37 12 118 -453 45 9 28 -223
7402 -223 89 -190 124 -86 69 -217 -27 -16 98 375 240 -176 3 -148 -9 -106 -148 456 159 -10 142
7423 142 -39 -81 -116 14 -118 -4 96 -132 117 -99 185 9 -168 51 -130 -41 -98 90 105 143 182 1
7445 1 181 94 -48 96 199 70 118 -118 -115 -304 45 -28 120 21 -58 84 47 236 -239 32 150 -92 12
7468 12 97 -59 -158 120 67 171 -559 -75 -253 240 405 11 -111 111 -6 269 206 58 -39 118 230 -173
7490 -173 2 121 -101 255 33 -53 30 -76 -97 -14 -32 -65 -52 375 220 400 311 -41 -487 25 -207 -307 48
7513 48 -158 -9 -115 -157 402 196 -150 -78 27 51 135 -123 -397 246 70 -21 -285 -389 -356 -80 -119 14 -113
7536 -113 -222 124 -278 208 -388 -108 -149 25 55 72 -31 -193 -300 -136 -120 -138 213 -72 205 104 -421 228
7558 228 626 -106 -397 -122 616 -262 -168 -189 -203 15 202 -137 -355 -76 420 378 527 114 -173 -258 327 -391
7580 -391 365 -218 62 -208 0 227 53 -129 -120 -348 -46 -18 191 -257 50 71 -41 -100 10 73 186 -160
7602 -160 -345 52 -662 77 308 -26 -62 -267 -115 -281 60 138 183 -87 336 -102 214 -14 299 14 -169
7623 -169 150 -215 175 154 319 -64 -54 -152 -245 -68 -226 129 -5 -165 18 98 147 -22 38 -124 -249 385
7645 385 550 -247 39 -85 170 -448 -604 273 136 -841 434 452 11 433 330 260 36 63 678 376 -720
7666 -720 -403 514 462 11 -538 -184 -169 964 -490 -35 186 -53 537 -401 -677 204 236 -79 509 204
7686 204 160 57 525 -7 49 66 145 92 67 -41 -56 71 219 5 28 -23 -85 129 12 -76 -127 -279 -145 -39
7710 -39 -159 -32 -142 -46 31 -49 -32 236 287 96 -180 -15 -169 105 134 -31 -49 121 -55 49 314 22 328
7733 328 24 23 -65 252 -85 -439 -63 185 345 -39 -1 34 -109 113 -98 119 24 -256 -170 185 51 217
7755 217 -246 189 -22 398 -99 152 176 85 34 -120 67 305 -132 276 -549 112 -380 -329 252 -259 -63
7776 -63 -727 -437 -515 -639 225 -72 145 15 -528 -586 721 -142 254 551 -397 460 26 254 18 -229 -528
7797 -528 179 -9 76 -130 110 23 6 -107 -580 71 254 -95 61 12 35 -184 -121 -12 154 -24 -472 106
7819 106 -61 -164 -20 222 -173 8 23 -143 115 -54 -40 -121 46 129 -101 132 139 88 150 39 -359 213 93
7842 93 -86 167 -128 82 -146 -198 -259 81 -229 -146 67 311 -71 6 269 57 -34 -106 44 -6 -331 -24 -40
7865 -40 111 -16 -120 -208 -201 -16 356 100 -213 -38 -101 115 -131 -410 231 -112 178 -278 -142 71 308 223
7887 223 -338 -369 115 138 312 83 -10 -390 -390 149 442 84 -850 249 -562 -95 542 20 386 -400 -106
7908 -106 186 327 305 -57 300 -524 269 -88 -148 -171 549 -160 371 6 -788 49 -102 -168 -6 157 95 -745
7930 -745 -166 146 588 193 -9 -626 -601 121 430 174 233 -351 -62 -259 -94 -133 -174 -250 -514 146 195 174
7952 174 304 -84 -368 121 -18 -320 98 272 -465 1038 -264 -242 131 -118 -327 515 206 -727 146 48
7972 48 -24 853 555 -621 101 -158 -33 -180 59 -306 489 -240 -569 -10 -265 -425 -194 -80 267 530
7992 530 -254 -535 280 -555 -147 -108 -62 89 708 -317 107 292 -122 231 -332 266 -164 -236 319 -53 193
8013 193 258 -361 10 428 299 650 -272 232 -8 -33 64 -174 -115 -739 -131 -64 -588 193 -117 105 5 -296
8035 -296 -32 123 -719 -614 78 -95 377 57 -495 172 531 107 -242 0 -260 -15 13 181 -340 148
8055 148 171 134 52 137 -437 -430 -132 -312 67 -96 -326 -263 -291 412 113 436 -152 -158 -115 268 7 -249 14 -151
8079 -151 75 -232 370 -169 -103 -207 -381 32 12 42 2 419 -175 528 -81 -36 -277 -13 -318 473 -99 -488
8101 -488 -142 -193 -237 354 105 9 411 -279 -11 336 85 -333 112 166 -127 -263 74 -197 103 -292 22
8122 22 -229 173 -75 -86 -278 184 -54 -88 38 -218 -80 -495 114 184 241 -63 74 10 -216 -101 143 -5
8144 -5 -39 -72 94 30 5 92 45 131 -255 -41 383 309 153 -94 335 -197 158 -115 -195 74 103 65 203 560
8168 560 -124 -24 -1 -151 -218 -390 -111 104 -216 -69 13 -140 153 -187 214 -47 -58 135 83 -88 -118 -32
8190 -32 -144
8191a44
$$ Imaginary data points
##PAGE= N=2
##DATA TABLE= (X++(I..I)), XYDATA
0 0 0 0 0 0 0 0 7 -8 8 -8 9 -14 16 -18 24 -31 34 -41 49 -57 68 -80 92 -104 122 -139 159 -181 205 -230
30 -230 260 -292 327 -366 408 -455 506 -562 624 -692 766 -846 939 -1039 1151 -1277 1419
47 1419 -1582 1768 -1985 2240 -2550 2930 -3408 4039 -4905 6182 -8258 12216 -22561 109605
61 109605 253335 126529 73414 70710 153426 209142 208029 126473 78495 89670 136171 156989
73 156989 165415 132361 84330 58199 75089 105648 139986 130667 62921 -5731 11987 84951
85 84951 130284 99101 13819 -49226 -15008 75983 110023 51923 -22547 -49108 -12008 51437
97 51437 73796 30610 -17722 -28217 -13077 14325 47829 51683 13102 -26115 -34277 -3421 53389
110 53389 81078 30792 -45792 -55829 7185 74200 81577 16893 -58564 -55417 21214 73408
122 73408 51558 -5469 -46760 -41589 5470 41060 28239 -4675 -28510 -41778 -32543 6604
134 6604 34479 16637 -28421 -63680 -55956 3049 56543 32108 -43689 -79799 -42350 27040
146 27040 65420 31504 -41233 -62683 -11046 46864 58146 30794 -6732 -22293 5146 44418
158 44418 58557 52929 35746 6597 -3186 32431 78651 87194 54282 5105 -13055 33174 99907
171 99907 103239 41783 -12153 -8298 43332 94601 86641 24486 -15425 323 40181 63288 57532
184 57532 26781 -5550 -7887 14200 35618 47792 41668 3340 -30469 -14194 32358 62529
196 62529 48585 -3265 -44263 -18761 49265 78144 40536 -12372 -30634 1842 57623 76245
208 76245 39639 99 -1892 20928 48274 66517 58169 29711 13051 17435 36574 68129 83509
221 83509 52973 6065 -323 39051 83020 92097 49584 -6150 -7279 48140 90082 76834 31587
234 31587 -4074 765 43677 73915 58551 25323 7833 6494 21435 47369 56190 37833 11565
247 11565 -5065 -233 34715 67163 50888 1467 -24322 -3908 41939 71596 48030 -8859
259 -8859 -30839 5587 50877 59909 33696 -3745 -18058 8308 41040 44704 29848 11638 -5783
272 -5783 -5980 18249 41990 40913 19299 -11186 -24588 4183 49222 52312 10373 -29032 -29809
285 -29809 7497 49314 46344 -2384 -36855 -22893 13586 35318 29369 -622 -26063 -18949 5372
298 5372 18815 22449 13538 -9927 -26704 -13045 16907 34123 25931 -6598 -36119 -20523 27923
311 27923 50096 25320 -14744 -33472 -10767 33798 50995 20852 -15650 -18953 2047 26905
323 26905 39763 25047 -1041 -7885 2792 16022 33128 38218 15903 -10642 -12909 13478 41290
336 41290 47706 20964 -18686 -20162 19518 51268 45129 12846 -15837 -12677 21695 49699 37243
349 37243 8710 -5468 -2088 15283 36301 36630 19832 3986 -3199 2907 26723 46195 33921
362 33921 3365 -13624 -527 29916 53100 37669 -3576 -21614 3973 39346 49770 30579
374 30579 -2575 -15377 8166 37591 39902 23875 7675 -3619 2248 23307 36888 30771 15043
387 15043 -1599 -8422 12096 41897 43764 15493 -10556 -13139 12802 45502 46019 9798 -18265
400 -18265 -9064 19282 40240 37426 10237 -12927 -5413 18144 30006 28855 17300 -1635 -8820
413 -8820 5365 24453 31580 24382 2809 -17662 -6954 26153 41293 24332 -4161 -19801 -6574
426 -6574 27440 42915 19165 -12042 -16877 -215 22496 32095 18049 -6747 -12212 -753 12638
439 12638 22875 22645 4704 -13507 -11623 6626 22920 28118 9226 -19185 -21436 7434 30629
452 30629 27569 4387 -20605 -20996 8617 31761 23509 -1215 -16441 -12581 4555 23518 22169
465 22169 2771 -9416 -10895 -2788 13922 25329 14388 -7843 -16538 -6451 12779 30654 21203
478 21203 -8819 -22747 -5147 20601 30575 17462 -10188 -21683 -3254 21606 24938 11751
490 11751 -4862 -14082 -5691 14087 23585 15431 2045 -8540 -10517 5543 26254 25806 5794
503 5794 -11367 -12499 5719 30912 33136 7057 -14407 -8847 13449 32312 32956 10975 -9076
516 -9076 -2788 18427 31547 30591 19039 3534 -174 14906 30003 32649 25896 10879 -1886
529 -1886 7615 30945 40167 28171 8221 -4674 3687 30612 43019 25392 1554 -6075 4948
542 4948 24902 35013 22110 -1282 -7436 3299 15804 23864 20048 2481 -10907 -5662 8055
555 8055 19043 20558 6303 -14656 -15010 5283 21922 21020 4835 -14749 -16585 5901 26032
568 26032 21731 2849 -10020 -10056 6873 25293 24698 7514 -3998 -3402 5744 20531 28084 16433
582 16433 -750 -5021 3341 18516 30246 22301 -923 -11853 904 19676 28060 18903 -3153
595 -3153 -15291 -2673 17252 22296 10761 -4053 -14913 -8384 9774 17492 7735 -5182 -13983
608 -13983 -14083 -140 14525 11430 -4243 -16626 -17326 -3857 14862 16658 -2570 -19501 -16306
621 -16306 -304 15663 17876 646 -17707 -14226 3114 15314 15153 3589 -11601 -14028 379
634 379 13073 14331 5739 -8013 -16737 -7971 9838 15241 4464 -10663 -21248 -15207 4545 14544
648 14544 1455 -17612 -24802 -17406 -616 9831 -166 -19949 -25757 -17094 -3896 5279 2091
661 2091 -13775 -23739 -16275 -2655 7393 8890 -2542 -16973 -14669 3847 17846 18241 7471
674 7471 -6278 -6953 11774 30203 28801 15106 4403 3985 19147 36579 36125 22737 12096 12285
688 12285 22405 36340 41836 29935 15048 12560 20611 32776 40766 32766 13397 5639 15116
701 15116 28941 35245 28173 9414 -1838 7613 24335 28980 20183 5912 -4867 330 17388
714 17388 24445 16156 2890 -5257 -3598 9872 22125 17464 3347 -5413 -5195 5675 20738 21119
728 21119 5035 -7481 -5309 6636 18337 22252 8591 -8323 -7097 6771 17856 18262 7818
741 7818 -7840 -10572 2185 13490 13946 5021 -8516 -15503 -6659 8346 10582 407 -12377 -20257
755 -20257 -14805 1354 8669 -2139 -17234 -23107 -17840 -3196 6274 -1444 -18394 -23988 -16305 -4451
769 -4451 4888 1985 -13234 -21738 -14455 -1376 6792 6600 -4555 -16198 -12681 2683 13011 11683
783 11683 2200 -9891 -10439 4548 18318 16453 4825 -5542 -7768 4051 18980 19095 5101
796 5101 -5818 -6659 1364 14009 17567 5860 -7899 -10087 -2409 7376 13805 4563 -10868 -16233
810 -16233 -6963 4588 9328 3593 -11317 -20280 -11212 3162 7949 2320 -9593 -18505 -12851 2998
824 2998 10603 4119 -6471 -13742 -9956 3551 14771 10777 -1144 -9250 -6231 5177 17938 17327
838 17327 3777 -5699 -2230 8480 19808 21531 9406 -3283 -1444 10945 20712 21792 12685
851 12685 -856 -2800 9875 20425 21063 12402 644 -3881 5579 19338 20660 11314 973 -4455
865 -4455 1428 15651 21382 12313 -727 -4704 510 12852 21517 13901 -191 -5054 920 11406
879 11406 19899 16064 2004 -5666 717 12463 18638 17114 5850 -4987 -1934 11047 18885 16004
893 16004 5912 -4409 -5242 7731 18334 14971 4432 -4718 -6970 3011 15914 14152 1800
906 1800 -8071 -9022 -1307 10081 12957 782 -10417 -11443 -4873 4992 9518 1026 -11835 -15408
920 -15408 -5876 3060 7571 1940 -10641 -17505 -8659 3271 6478 1273 -8942 -16461 -10421 2921
934 2921 9115 2994 -6814 -13074 -10601 1960 10879 6094 -5562 -11046 -8883 932 10932 10226 -2885
949 -2885 -11170 -7341 1484 9879 10850 550 -10960 -8314 2250 9593 10944 2268 -9298 -9844 1282
964 1282 10740 9995 4329 -6892 -10616 -679 11697 11816 4740 -4902 -9098 -1845 10562 13745 5819
979 5819 -4458 -7324 -2431 8235 15295 8230 -3856 -7521 -1468 7369 14538 10045 -2240 -8910
993 -8910 -1828 7647 13399 11066 286 -8477 -4414 6747 13367 10664 1561 -7926 -6277 5615
1007 5615 14191 10455 1648 -6866 -7045 2736 13857 11526 657 -6563 -6704 640 11106 12416 1480
1022 1480 -8134 -7709 -258 8420 11843 4094 -8208 -9704 -829 7388 10355 4899 -6752 -11551 -3173
1037 -3173 7523 9402 4150 -5151 -11416 -6121 6251 10552 3896 -4927 -9889 -7000 3907 10937
1051 10937 5468 -4746 -10091 -7259 1996 10831 7568 -4349 -10589 -6356 1755 9421 9337 -1262
1065 -1262 -10372 -6844 2763 9343 9838 1803 -8414 -7764 2780 10048 9501 2685 -5648 -8180 1019
1080 1019 11276 11030 3395 -4239 -7000 -493 10732 13155 4875 -4420 -5781 -630 8896 13660 6626
1095 6626 -3909 -6160 -338 7569 13624 8400 -2334 -7190 -794 7978 12150 9258 -250 -7299
1109 -7299 -2489 7923 12197 8748 1283 -5878 -4347 5992 13058 9551 906 -5984 -5186 4729 12465
1124 12465 10149 1637 -5527 -5735 2685 10710 11916 3363 -5934 -4356 2684 9889 11511 4234 -5822
1139 -5822 -6225 1250 8033 10566 5874 -4031 -8407 -225 9363 9464 4824 -3070 -8206 -2506 8050
1154 8050 10530 4510 -3041 -7311 -3671 5623 10393 3679 -4984 -7699 -5057 2546 8918 5395 -5053
1169 -5053 -10013 -6038 277 6133 5645 -4268 -11846 -8575 -508 4831 4008 -2632 -11324 -10659 -934 4706
1185 4706 3035 -2165 -9908 -10808 -2153 5322 4510 -2171 -8680 -10197 -4236 5100 7766 -1003 -7697
1200 -7697 -8123 -4326 4372 7613 1265 -7192 -8325 -3109 3300 7943 3637 -5952 -8868 -2680 4640
1215 4640 7529 4466 -3729 -9134 -4165 4700 7662 4331 -1502 -7563 -6127 3564 8713 5553 -1631
1230 -1631 -6673 -5398 2616 10029 7923 -512 -4947 -4201 1746 9672 10022 1375 -4649 -2777 2826
1245 2826 9222 11083 4480 -3866 -2785 4734 10502 11068 6647 -1150 -3432 3881 11078 11293 7251
1260 7251 46 -3805 1154 9999 10852 5559 -876 -4447 -1126 7325 10990 5294 -3224 -4819 -2704
1275 -2704 4015 7694 5352 -3692 -7415 -4276 1726 6136 4679 -3558 -8400 -5413 1057 6250 5053
1290 5053 -1721 -8500 -5761 1990 6856 4951 232 -5746 -5562 1833 8186 7190 1112 -3108 -5062
1305 -5062 1716 9386 8623 2444 -2887 -2910 893 7515 9551 3320 -3337 -5042 77 5647 7967 5122
1321 5122 -3631 -6604 -956 4010 6924 3675 -3851 -7981 -2960 3412 4389 2681 -2405 -7230 -5725
1336 -5725 1540 6140 1889 -3138 -6679 -6497 314 5249 3180 -4183 -7658 -6366 -1100 5496 4997
1351 4997 -1664 -7334 -4812 -445 4848 6490 -693 -6937 -5251 -380 4579 4557 2159 -6621 -6815 -710
1367 -710 4266 5054 877 -5052 -7393 -3574 2941 5269 418 -5345 -7820 -3640 3319 4984 -715
1382 -715 -6293 -8215 -5304 610 5045 1807 -5128 -8388 -4252 1402 5525 4211 -2522 -7587 -3540
1397 -3540 2656 5879 5056 921 -6397 -2869 4914 7080 6779 3195 -3046 -2517 4552 10683 7910 3950
1413 3950 -1248 -1586 4309 9736 10217 3860 -567 -1488 1700 8037 8901 4018 -1500 -2816 776 5683
1429 5683 8140 4390 -3342 -5638 -475 4414 6878 3963 -3100 -6834 -2664 3767 4238 2134 -2207
1444 -2207 -6698 -4076 1821 5587 2116 -1879 -5533 -4615 964 5539 2991 -3409 -5223 -3977 275
1459 275 6122 5452 -1900 -5020 -3691 1340 5745 5136 -289 -6004 -4294 586 4284 5122 1501 -4827
1475 -4827 -4646 -608 3567 4110 440 -3729 -6227 -2147 4049 5418 -34 -5187 -6910 -3686 2479
1490 2479 5696 776 -4166 -5718 -3259 1857 6032 2192 -3657 -5627 -2251 2109 5427 3968 -2261
1505 -2261 -5372 -2332 2907 5495 4467 -363 -4811 -3374 3461 6298 4977 596 -3841 -3691 2267
1520 2267 7194 5316 478 -3337 -3451 645 6309 5388 29 -3783 -3282 -271 4959 5803 893 -4424
1536 -4424 -4259 -551 3228 4877 1711 -3989 -5330 -864 2839 4117 2409 -3407 -6348 -1943 3514
1551 3514 4353 1995 -2528 -6024 -3166 3100 4985 2044 -1879 -3990 -3777 1485 5614 3172 -2140
1566 -2140 -4301 -3372 1278 5887 4681 -1163 -4407 -2947 1328 4874 5685 -281 -5281 -3311 1008
1581 1008 4530 4365 1224 -5066 -4691 560 5078 3927 1214 -3067 -4790 -715 4407 5197 800 -2728
1597 -2728 -4481 -1521 3881 5477 1645 -2970 -3604 -1534 3141 5219 2360 -2939 -4203 -1093 2421
1612 2421 5226 3738 -1187 -5030 -2022 2565 4513 3895 -845 -4409 -2509 2406 4776 3010 -310
1627 -310 -3818 -3572 1570 5272 3797 -490 -3153 -3394 72 5012 4615 -1072 -3397 -3573 -621 3790
1643 3790 4363 343 -4214 -3285 -467 2866 4510 1330 -4003 -4204 -595 2994 4022 1528 -3451 -5381
1659 -5381 -1292 2931 4139 1913 -1863 -5281 -3007 2589 4367 1228 -1701 -4324 -3006 2019 4670
1674 4670 2347 -2236 -3844 -2826 493 4584 3485 -1857 -4191 -2610 675 3748 3823 -940 -4715
1689 -4715 -3113 708 3336 3370 282 -3781 -3755 729 4461 3503 696 -2935 -4090 -418 4147 3803
1705 3803 851 -2344 -3819 -1065 3537 4882 1339 -2355 -2982 -1560 2620 5170 1929 -2784 -3406
1720 -3406 -1198 2311 4408 2822 -1871 -4080 -1246 2358 4120 3046 -690 -4409 -2275 2257 4170
1735 4170 2630 -423 -3743 -3235 1511 4851 2975 -314 -3103 -2602 427 4606 3860 -506 -2825 -2605
1751 -2605 -83 3870 4356 27 -3406 -2785 160 3120 4023 1059 -3389 -3278 -88 3036 3970 2264
1767 2264 -2824 -4377 -619 2782 3694 2016 -1605 -4062 -2033 2802 4001 978 -1577 -3240 -2428
1782 -2428 1946 4226 2366 -2135 -3213 -1918 1864 3934 2476 -1184 -3695 -2070 843 3464 3122
1797 3122 -1389 -4001 -3280 352 3416 3108 416 -3306 -3741 191 3394 2492 500 -2665 -4111 -346
1813 -346 3809 3080 214 -1880 -3314 -974 3085 3896 175 -2372 -3178 -1193 1981 4190 763 -2607
1829 -2607 -3125 -1594 2418 4084 2099 -2104 -4175 -926 1327 2873 2424 -881 -4150 -2313 1994
1844 1994 2605 2652 -391 -3716 -3232 1445 3765 2186 -1227 -3104 -2672 82 3544 3156 -486 -2464
1860 -2464 -2900 -380 3617 4106 -255 -2220 -2697 -494 1801 2535 1314 -2666 -3204 204 2317 3389
1876 3389 1568 -2535 -3358 731 2722 3056 1134 -1382 -3849 -1169 2790 3956 960 -1965 -2921 -1547
1892 -1547 2094 3962 1775 -2089 -3244 -1356 1382 4071 2786 -1344 -2581 -1642 1374 4068 3620
1907 3620 -776 -3053 -1807 721 2671 2723 230 -2843 -2646 1168 3429 2664 67 -2668 -3300 50
1923 50 3439 2712 -476 -1923 -3132 -973 2710 3700 680 -2337 -2984 -703 2363 3741 836 -2839
1939 -2839 -3111 -966 1585 2870 1777 -2219 -3816 -693 1329 2796 1763 -1041 -3534 -1917 1792
1954 1792 2688 1986 -1069 -3291 -2328 1149 3261 1858 -1093 -2799 -2265 616 3657 2275 -906 -2828
1970 -2828 -2042 537 3129 3472 -683 -3186 -2414 176 2551 2856 1007 -2775 -1937 -213 2249 3013
1986 3013 967 -2166 -2738 -394 2492 3069 1152 -1240 -2950 -1062 2397 3434 847 -908 -2537
2001 -2537 -1300 2108 3687 1403 -1469 -1859 -1130 1464 3943 2543 -1408 -2507 -892 1361 3009
2016 3009 2562 -629 -2758 -1416 1603 2505 2379 121 -2867 -2231 576 2623 1759 129 -2474 -2746
2032 -2746 127 2896 1669 -336 -2505 -2849 -932 2369 2621 -425 -2973 -2406 -1285 1383 2519 552
2048 552 -1943 -2448 -576 1422 2827 1417 -2420 -3052 -358 1259 2193 1419 -1241 -3256 -873 1781
2064 1781 2600 1198 -576 -3560 -2201 1827 2706 1466 47 -2726 -1933 937 3233 2764 -1962 -2392
2080 -2392 -2208 -298 2071 3041 -891 -3026 -1863 1042 1747 2794 -79 -3898 -1667 789 1166 1866
2096 1866 916 -2292 -2671 -608 2602 2465 303 -1878 -2074 -426 2564 2298 1070 -1166 -2155 -587
2112 -587 2028 3443 742 -1409 -1457 -732 1646 3665 2210 -1755 -2654 -406 342 2845 2423 -1789 -2321
2129 -2321 -1684 1249 2602 2093 -389 -3056 -1874 366 2218 1731 -80 -2339 -2448 668 2755 1114
2145 1114 -206 -1337 -2262 -354 1727 2090 -178 -2158 -2091 -664 1749 2884 311 -1698 -2226 -576
2161 -576 1717 2925 1256 -2200 -2622 518 1766 2671 1288 -47 -2335 -83 2366 2608 1827 416
2177 416 -1735 -1393 1843 2314 2051 -301 -1837 -1328 747 3377 2159 -398 -1692 -850 530 2668
2193 2668 2397 -626 -2760 -1430 806 1330 2212 -943 -2873 -2239 614 1556 1929 993 -2512 -2384 -1036
2210 -1036 2542 2247 1141 -1791 -2990 -526 2106 2826 -117 -1373 -1757 -610 1336 2559 -23 -1345
2226 -1345 -1744 -1024 755 2717 1094 -1571 -2095 300 268 1505 1339 -676 -2437 -806 203 1145 1546
2243 1546 -922 -2821 -1760 929 1983 1216 -660 -3041 -1088 849 1944 1684 -330 -2124 -1690 455
2259 455 1019 1648 -404 -1495 -1430 -1493 2063 2495 712 -1898 -2297 -219 1603 2902 817 -1924 -1972 -22
2277 -22 1428 2154 1864 -1350 -2179 -62 1764 1990 1041 -207 -1965 -1113 1382 2140 1192 -131 -1441
2294 -1441 -1713 733 2676 1838 -420 -1655 -1477 593 2638 1666 -1033 -2478 -1043 950 2040 1844
2310 1844 -485 -2440 -1395 542 1417 1776 385 -1493 -1852 105 1728 1747 630 -1708 -2600 -790
2326 -790 1852 1954 179 -1503 -2574 -812 1683 2299 -104 -1680 -1667 -852 1074 2109 161 -1478
2342 -1478 -1747 -458 104 2013 1343 -1325 -2275 -537 581 1233 1130 -589 -2591 -1181 735 1532 820
2359 820 -1053 -1017 -2171 946 3023 619 -779 -1393 -1013 -506 2984 1447 193 -950 -1828 -721 1266
2376 1266 2215 414 -1584 -1639 -867 1023 2392 838 -1255 -2188 160 2111 2397 1131 -1449 -2337 356
2393 356 2359 1680 708 -531 -1169 -964 1189 2284 1035 -173 -1029 -844 1079 2696 1610 -742 -1648
2410 -1648 -1333 428 2614 1719 -765 -2028 -1065 643 2174 1597 -733 -2114 -1094 878 1319 849
2426 849 -90 -1506 -1622 205 1187 1225 516 -1144 -1891 -607 1542 1692 455 -1350 -1707 -873 2082 1760
2444 1760 27 -1450 -1729 -484 1264 2055 292 -1574 -1244 -165 789 1375 852 -574 -1560 -26 239
2461 239 1605 1241 -684 -1771 -2081 346 1005 1078 -506 -2170 -1528 1066 1437 832 114 -2031 -930
2478 -930 -208 1075 710 -267 -1215 -761 251 1189 1507 87 -1992 -1170 -1193 1643 1685 876 -2017 -2907 -681
2497 -681 541 981 -95 -2009 -2745 -268 750 652 -144 -1488 -1434 -592 361 918 -503 -1323 -1376 -1449 343
2516 343 2545 998 -792 -374 -767 118 1550 2300 -1621 -2165 -585 618 2783 1891 -139 -778 -304
2533 -304 1403 1511 2367 -566 -1233 -88 1400 968 779 790 -995 -607 551 1635 1820 1177 -1438 -2484
2551 -2484 -669 1007 1488 273 -1110 -2066 -494 572 1712 386 -1430 -1595 680 943 1208 -742
2567 -742 361 -1630 -254 546 1095 574 640 -1697 -1576 599 1900 1255 -175 -1320 -1405 578 1688
2584 1688 413 -891 -869 222 -167 758 746 -663 -1361 -830 563 64 853 -442 -1070 -2341 737 -392
2602 -392 1439 -126 -1492 -2031 -574 1553 1227 -294 -2534 -1861 -104 2976 720 58 -247 -1745
2618 -1745 48 1766 764 -128 -358 -825 -314 1211 2492 2343 -324 154 -23 602 1557 2373 -327
2635 -327 -2140 841 1402 3779 2386 296 -1395 -404 1575 1046 279 149 -1957 800 827 1214 820
2652 820 796 -977 -1801 -118 1 569 -542 -806 -1487 -2037 1446 2254 -51 -1415 -1845 -994 602 1258
2670 1258 -664 -2492 -1446 -234 659 739 -638 -1120 -699 204 435 573 632 -357 -795 -1095 380 1317
2688 1317 1340 821 -648 -926 1141 2015 826 -189 -1515 -1376 513 1736 604 -1454 -848 -20 504
2705 504 690 672 -347 -1482 -1408 428 245 975 -530 -1850 -1528 -162 1365 1505 243 -1107 -1826 -258
2723 -258 1727 1495 425 -884 -1245 329 2234 740 565 -253 -544 534 1511 2433 859 141 -157
2740 -157 -135 430 1799 1166 -73 -1828 -1190 466 1986 1365 -1239 -1911 -736 451 660 658 -807 -1988
2758 -1988 -1290 -165 -236 180 -809 -1669 -2593 -1361 -128 -410 -558 -1022 -1437 -860 754 1233 -956 -1870
2776 -1870 -1376 -835 552 1564 109 -1639 -875 94 1575 1222 474 -1130 -107 437 990 1185 1160 18
2794 18 -775 569 610 1612 1235 25 -1331 -322 1320 1379 946 -281 -1349 -408 544 1567 1109 -666
2812 -666 -1504 16 287 929 270 -665 -753 -256 6 499 893 36 -1144 -1289 27 914 370 864 -6
2831 -6 -1779 -76 1338 1278 200 -491 -1228 666 1551 895 -375 -529 -855 -97 1235 817 479 -826
2849 -826 174 -367 225 571 661 -639 -1228 -674 212 894 1702 -330 -1690 -253 370 862 212 -1079
2867 -1079 -1191 -1064 585 633 -6 -787 -873 -928 -817 833 302 -84 -1117 -1199 -351 900 1041 -11 -305
2886 -305 -818 -155 1218 1220 -430 -1751 -995 647 1171 622 374 -1008 -656 406 1121 1188 -109 -781 -569
2905 -569 -244 1105 1517 133 567 -843 -1239 1024 921 1211 -529 -941 -145 -65 1523 524 -1138 -734
2923 -734 -62 763 933 760 -154 -790 277 -448 55 732 -517 -424 -320 275 238 681 422 -1138 -1237 108
2943 108 920 1196 -156 -1348 -1773 45 1430 929 -131 -1611 -1098 -719 -280 588 -537 -1514 -204
2960 -204 -1007 -850 -279 -1394 -1741 -1052 -871 -536 948 737 131 -1337 -1046 -117 922 -266 -635 -1692
2978 -1692 -56 -750 1191 -712 -862 -389 -404 1168 904 1184 -515 -794 -1023 364 1004 133 -546 -488
2996 -488 169 -516 254 1162 -199 -1086 -1657 -38 519 932 -261 -769 -485 699 447 608 1338 38
3014 38 768 1178 2315 1325 813 851 -28 916 1499 1716 780 841 46 -488 1385 1935 810 -199 -370 26
3034 26 1214 1830 1199 -292 -619 91 672 1121 1100 296 -843 -413 144 52 980 74 -801 -1067 -191 808
3054 808 655 42 -1088 -1345 -113 848 588 76 -843 -1369 -316 347 654 -109 -465 -823 -1161 194 746
3073 746 -149 -447 -496 -101 229 745 774 -964 -1419 -507 521 380 935 -743 -1819 -911 531 1036 172
3092 172 243 -1345 -413 214 1135 -926 -466 -866 -1345 -913 634 528 -732 -770 -1567 -985 633 901 -1074
3111 -1074 -874 -899 -442 791 1295 -399 -1299 -932 171 116 -346 372 -1111 -1096 -14 290 118 143 -356
3130 -356 -1257 -290 748 1047 -251 -290 -1097 -848 -590 878 -480 -471 -987 -786 -129 379 -559 -1145 -693 -646
3150 -646 180 517 561 -1490 -1709 -292 256 658 505 881 -586 -1542 5 902 113 -41 -528 -1207 -209
3169 -209 1365 1281 158 -367 -37 103 -14 1931 -454 -832 63 778 -95 1825 -275 -695 430 150
3187 150 680 1359 105 -369 -246 -5 258 1043 938 383 -46 -28 1318 1220 1033 -154 268 -2 722 350
3207 350 -46 -9 -547 -604 596 832 -178 -441 -999 718 -671 626 470 -402 -1349 -1152 -330 1073 1247
3226 1247 283 -657 -1510 -459 -149 715 40 -1397 -859 290 258 826 403 -408 -593 -330 -207 -439 -175
3245 -175 119 -878 -789 237 1853 710 -258 -342 -554 672 1460 1628 -679 84 -592 236 61 122 284
3264 284 -1161 -575 -2 227 1032 -121 -273 -766 -406 0 82 62 -605 -1154 -233 20 159 212 -1048 -328
3284 -328 -222 598 492 -539 -1478 -1272 -388 87 553 183 -1552 -986 659 -692 885 552 -569 -1410
3302 -1410 -90 132 927 651 -768 -1044 -747 991 632 167 -588 -725 -272 1294 745 -245 140 -400
3320 -400 -882 807 1006 269 -464 -599 -489 -429 343 421 -128 -640 -259 -219 256 978 -269 -903 -704 234
3340 234 662 741 732 -279 -513 461 1146 867 762 563 -36 477 1407 1054 756 788 127 454 980 1254 694
3361 694 612 247 505 814 1162 839 -164 79 333 882 1017 638 44 -586 -79 232 390 333 -114 -1059
3381 -1059 -712 -205 198 117 -477 -1065 -1236 -399 -3 -337 -716 -1020 -1220 -336 213 268 -507 -1193 -1124 -535 268
3402 268 287 -245 -913 -650 -62 263 641 168 -435 -520 132 417 499 514 -220 -598 -320 583 680 74 -144 -237
3424 -237 0 271 382 31 -83 -290 -572 -347 768 295 -371 -1412 -747 156 587 332 -349 -1323 -669
3443 -669 -24 -57 1052 41 -1118 177 -835 466 354 273 -602 -773 1082 -391 468 455 -198 -471
3461 -471 -72 245 1982 268 441 -1059 -128 983 1283 1110 879 225 -137 81 996 881 -879 -119
3479 -119 26 204 422 326 -335 -615 -319 -112 308 -39 -87 -940 -717 313 193 -150 -542 -573 -950 -68 397
3500 397 159 139 -611 -549 -193 549 425 -197 -396 -404 -9 307 779 480 14 -282 33 559 534 308 -660 -127
3522 -127 150 351 620 361 -293 -506 100 220 426 33 -93 -615 -637 630 476 202 -60 -622 -387 310
3542 310 615 9 -347 -481 -484 292 458 235 -278 -549 -226 119 631 339 -39 -533 -208 257 533 373 505
3563 505 -155 -7 412 840 297 40 -260 -444 170 566 263 282 -702 126 -174 712 511 -93 -650 -852
3583 -852 -449 35 372 -95 -1 -685 -638 157 151 339 -238 -1073 -413 274 -23 24 -370 -830 -457 -44 255 -136
3605 -136 -313 -660 -684 -94 406 -35 -504 -490 -655 -270 401 300 -456 -539 -414 -265 161 -28 -485 -681 -242
3626 -242 -17 205 348 236 -276 -166 286 275 770 529 237 -308 72 607 524 629 79 -38 54 455 786
3647 786 444 174 141 178 627 928 435 -7 -185 -182 310 802 395 67 -289 41 212 314 359 313 -796 5
3669 5 8 127 350 -68 -505 -336 -253 85 -164 -207 -533 -549 -253 378 303 -371 -436 -753 -477 329 244 3 -729
3692 -729 -520 -237 204 46 99 -757 -284 -280 1 453 407 -233 -751 -157 -135 348 369 -83 -452 -415 663 399
3714 399 254 -356 -674 -482 -227 330 310 -284 -435 -267 157 345 622 62 -391 -329 -3 805 480 -66 -270
3735 -270 -157 52 437 715 278 -218 -114 149 517 457 302 140 -232 379 691 557 367 406 -46 238 228
3756 228 455 122 -205 -269 -25 338 698 91 -83 -224 -176 44 168 55 -584 -523 -410 -366 140 197 -654 -677
3778 -677 -177 -67 -146 -290 -439 -683 -652 42 -89 39 -132 -389 -537 -334 122 -66 45 -207 -166 -4 329
3799 329 128 -12 22 -149 -73 272 468 224 -494 -320 132 410 472 355 -117 -22 53 396 348 508 45 -69
3821 -69 -3 634 493 198 -633 -216 -96 84 189 127 102 -500 -184 166 540 269 -553 173 -533 -426 304
3842 304 318 -35 -371 -611 132 -404 144 220 -355 -289 445 115 399 -181 -436 -419 681 325 -197 183 21
3863 21 -248 52 359 -161 -359 -397 -384 -887 445 943 887 -569 -414 210 -227 276 -536 67 500 340 326
3884 326 759 972 88 -767 -363 182 749 -227 -326 301 502 339 -31 -393 232 84 -823 329 250 661
3904 661 222 -126 -521 -73 420 579 -211 -28 3 245 -5 195 414 -198 39 -467 -707 66 -166 -175 -578
3925 -578 -115 242 -179 -8 501 -472 137 -237 -143 231 -100 -612 237 783 -239 -86 -699 -378 397 -433
3945 -433 -153 -353 -451 -366 -1146 356 -901 -138 -576 -696 -537 -491 279 -397 596 -989 -474 454 289 383
3965 383 1070 -108 182 217 1218 139 -344 265 -889 175 1311 534 253 562 221 -393 942 1004
3983 1004 -217 21 -109 119 858 -246 1054 -1141 -250 223 -497 451 -648 145 -756 -221 878 -294
4001 -294 -81 -1166 -272 28 613 5 -734 162 -1057 78 210 204 -131 -424 -233 -1574 -471 -201 72
4020 72 -254 278 417 -420 313 733 -260 -513 -1001 -550 387 342 679 3 363 787 544 822 -267 -41
4040 -41 -166 270 173 255 181 210 -165 -475 -442 549 949 -243 -932 128 193 167 508 -384 -76 157 399 30
4062 30 174 -5 460 -202 -210 58 409 -422 -527 -790 3 -649 -386 541 -855 -28 304 156 167 450 -3
4083 -3 -91 -195 302 140 333 411 -714 -128 440 -14 0 62 -219 43 -138 -391 -161 -265 -157 -455 -177 -174
4105 -174 348 -79 -482 -858 24 653 -129 -16 -383 -315 -243 225 89 -420 -84 -531 35 -258 586 -328 -617
4126 -617 -532 -70 477 416 -208 158 -579 -20 185 105 125 -431 -209 -241 -190 506 368 -73 -231 533 833 197
4148 197 647 -314 -364 -522 161 -233 -461 -66 -588 -278 -218 81 -176 141 296 -289 -17 364 -111 154 162
4169 162 118 -74 177 121 -109 -383 -234 -161 144 149 -258 -242 -108 426 -707 219 98 233 426 19 1523
4190 1523 201 -11 -891 -53 794 139 231 844 180 -1001 36 132 537 -437 -826 74 72 -986 -217 472
4210 472 -104 -415 -397 -453 -455 146 -484 -542 247 94 -50 -831 -585 -843 96 -274 -419 -277 -460 -172 10 557
4232 557 455 556 -233 -458 -675 -119 154 26 -1115 -245 121 -65 343 334 -109 -30 108 155 235 -184 -201 -435
4254 -435 -635 572 63 -101 -67 -159 -58 572 206 -340 397 -482 -730 183 -111 318 530 153 -392 -734
4274 -734 350 714 -247 -630 -84 -331 178 -106 521 300 -267 82 557 743 352 -81 -737 -604 197 -566
4294 -566 222 477 102 8 443 355 -75 -106 -326 -95 16 -13 142 -321 -266 -339 -303 174 432 -297 -315 -541 -241
4317 -241 -95 106 423 -454 -37 -312 -215 21 -202 -127 -278 127 107 454 -137 -127 -111 -314 322 84 8 64
4339 64 -476 -122 -257 273 128 -224 -213 -397 46 107 397 57 284 224 -255 58 217 231 -548 -306 82 35
4361 35 319 476 -163 -96 177 -637 420 249 -110 41 183 654 474 148 817 -150 -376 535 197 7
4381 7 -224 224 128 330 119 465 -436 -793 78 102 -24 172 -955 -234 -51 766 -4 -200 -212 -260 -19 -210
4403 -210 60 -418 -90 -311 -596 80 -85 -264 -744 -885 552 -255 211 -423 -679 -323 42 -274 498 452
4423 452 -1019 47 -202 -56 -28 659 555 565 -370 -223 100 -489 -206 -1042 -112 -589 616 -535 295
4442 295 142 -569 -504 -149 416 337 300 -388 1 377 819 251 -221 -176 394 -530 -117 460 -415 283 -552
4463 -552 13 236 1004 454 3 -252 377 -21 -31 912 2 -390 -153 -417 -491 696 127 -26 430 390 148
4484 148 -109 -240 -1146 -284 253 -113 46 -511 -404 -552 -148 486 486 849 -804 264 -84 91 -36 -264
4504 -264 -531 -365 398 -115 128 254 74 -71 -595 -923 -45 660 -267 -909 1 -135 151 -93 -54 22 515
4525 515 236 -555 -340 103 1049 1079 654 -23 53 17 128 -237 -467 841 -381 -423 -135 -422 -796 737
4545 737 67 -551 406 135 -217 -49 942 -353 -397 138 419 544 531 267 -604 -278 -110 266 666 -458
4565 -458 213 -839 257 226 -634 38 404 132 -80 230 842 -381 -845 -194 168 -202 -101 -332 -250 358
4585 358 345 -240 69 103 -277 -323 -185 461 -344 -66 451 656 22 432 423 179 280 -314 -188 -38 -108 719
4607 719 -264 -76 -79 -165 693 325 -250 296 169 104 379 579 14 -359 166 -89 -289 -52 -296 -891 -499
4628 -499 475 168 151 -189 118 -42 -273 637 -665 -473 -323 -142 -328 -111 394 -178 -147 -162 -296 192 91
4649 91 36 125 -361 -367 -354 384 -369 266 -105 -640 730 117 -50 58 378 -28 -749 -125 -524 52 -176 463
4671 463 -781 -162 501 -577 234 339 -404 217 -406 -363 -620 570 602 207 540 -49 -1304 -566 592
4690 592 116 311 -134 207 -432 -235 497 -536 -96 -19 -790 -276 72 238 -31 195 -357 -541 20 413
4710 413 -111 -687 -186 -559 385 302 -27 568 -533 -204 -18 -144 402 -521 191 -146 364 -121 260 -255
4730 -255 707 -180 -214 -1014 -327 -896 105 -16 12 77 -224 -437 659 126 -101 -103 -1391 -522 -81 -203 208
4751 208 -40 70 -337 -222 -51 -292 -50 -345 65 -125 -491 655 270 150 -710 315 952 -403 164
4770 164 371 474 -327 92 -320 672 198 -62 -606 -269 287 -261 400 -272 -588 326 -548 -415 -222 91
4790 91 -410 -164 -297 925 -166 452 -855 -310 459 -33 -464 -73 -519 378 198 819 586 188 -470
4809 -470 -396 -131 43 518 61 -240 -386 -175 164 364 -868 453 -655 -58 9 -420 -846 -476 20 -62
4829 -62 86 -634 39 1173 390 -767 -71 -41 -151 -246 -588 9 207 186 688 55 -178 -101 52 64 -57
4850 -57 -243 194 173 299 190 281 -158 -367 -357 88 232 4 55 -254 -3 -167 -511 236 -134 341 458 352
4872 352 -28 -149 283 96 -507 -276 -16 107 63 -54 300 -78 -166 65 16 -455 428 -149 -91 710 556
4893 556 -268 -563 60 508 -529 226 633 148 -52 -56 307 -371 -402 444 427 198 -965 -1056 -1134 158 387
4914 387 -281 -533 -215 -495 -467 -500 -1258 -317 911 514 207 -582 -204 548 64 -96 -531 159 -804 -280
4934 -280 -355 -34 343 386 -218 -286 264 -7 -166 -569 -121 601 4 115 104 -302 -43 229 -282 -118 26
4955 26 -281 -399 -44 -213 -6 -5 -124 -264 -97 -225 123 -44 40 110 -179 -24 -171 165 -173 -110 -124 -7
4977 -7 5 21 -310 -32 1 48 -57 233 184 -288 -275 212 179 225 69 67 201 262 282 140 183 186 -93 25 154 259
5003 259 -35 134 156 178 -54 217 156 73 157 -24 -78 253 22 47 1325 -55 -27 37 699 -142 308 -116
5025 -116 -527 -470 1242 206 120 -755 -542 132 -112 -448 -104 -223 -148 267 91 47 -299 -1070 -483 170 -31
5046 -31 382 86 -216 -158 -244 251 -32 -279 -166 200 -20 185 -88 274 158 -89 -8 91 -106 62 21 -697
5068 -697 170 305 -9 1048 -207 -231 95 877 218 -748 282 -22 296 -206 -69 301 -15 -184 196
5087 196 210 350 116 -47 -106 243 105 1 -19 -213 68 192 -13 176 235 -48 -91 -233 -27 35 -301 -3
5109 -3 -221 32 132 1 -19 -148 -120 151 129 424 -230 -215 130 -73 107 -168 -77 -428 -542 188 -120 -56 -873
5132 -873 477 -1 -354 69 19 505 450 -233 71 868 39 158 -240 404 559 -376 425 434 -165 664 653
5153 653 305 -85 -135 -439 101 309 -331 312 98 305 55 -52 -181 -165 -349 116 -1205 586 -145 -562
5173 -562 446 -228 -104 640 435 168 -108 -965 230 572 -410 723 139 586 370 622 404 591 143
5192 143 95 -704 58 478 205 -14 965 637 -292 -656 362 -344 -235 82 703 370 767 -567 -438 788
5212 788 -481 73 -68 -509 47 57 199 252 967 46 -104 450 -398 -260 -149 312 235 -319 -281 102 -571
5233 -571 630 -44 -159 -193 263 -128 249 227 478 528 -63 -243 125 -191 270 21 78 -87 132 107 -370
5254 -370 261 5 319 9 124 434 129 -181 -23 96 -483 -74 -29 -478 -285 -27 -129 75 25 -169 -150
5275 -150 20 -547 200 -48 382 -191 191 147 240 104 -40 -318 34 -234 -135 34 -78 162 -81 2 60 -98
5297 -98 -6 -284 -34 -289 281 251 -263 -26 216 220 -185 63 -181 -222 -108 107 119 239 -27 14 -115 57 -267
5320 -267 247 3 -170 -30 11 -144 19 288 -149 -198 -23 -81 437 90 55 53 154 13 142 -1 -159 -260
5342 -260 -28 85 -26 235 -83 -159 97 -18 231 143 356 -251 -233 -302 425 212 4 -211 -508 -407 486
5363 486 -224 -498 -515 -35 51 609 -787 -491 201 185 1245 14 404 -247 212 -403 190 -190 164 -510
5383 -510 15 -106 53 272 72 -156 -303 -172 133 -313 100 -64 86 -14 -9 512 91 136 60 -350 91
5404 91 513 129 688 -201 -1017 -299 188 74 -390 -511 -184 305 -26 -300 -509 311 -75 1117 48 -73
5424 -73 -67 -31 -739 416 87 311 320 396 217 -96 61 141 66 24 48 95 433 94 69 153 33 -130 -93 -42 54
5449 54 -32 75 -109 177 -83 -64 -159 -354 -83 220 364 15 107 -228 -80 190 115 66 -102 -217 -518 51
5471 51 291 -56 -319 257 90 -168 369 91 72 -72 -18 57 346 224 104 -100 -127 -120 -10 -48 152 -29 -111
5494 -111 -66 81 -286 54 -21 -80 -36 204 -235 318 -179 -220 -300 -94 54 -5 -13 64 121 82 36 -178 235 65
5518 65 -207 -142 39 -112 50 -64 -95 -65 81 25 207 -95 -93 -16 213 -20 51 -221 -267 267 -276 -99 181
5541 181 273 94 68 72 97 123 145 -123 13 -63 -319 -5 -165 -41 -437 -56 -224 261 -153 -173 434 -183 170
5564 170 30 -138 -161 -45 162 -129 -121 45 186 -133 154 49 112 -160 40 71 -181 59 226 -20 105 -160
5586 -160 -42 316 -67 -53 -159 -57 14 -25 152 -280 474 -195 70 -195 58 133 105 6 -138 -5 165 338
5608 338 -64 272 -27 39 -378 -33 150 11 -67 86 373 -273 79 -39 -189 46 -8 -101 -146 265 16 -62
5630 -62 65 551 -20 -332 -135 124 -117 58 348 32 -152 53 91 62 65 64 172 -231 86 85 -33 -151 -14
5653 -14 179 129 -15 71 63 -397 -98 -210 346 160 -46 -123 -42 126 66 63 88 63 111 148 75 122 59 -231 -95 -313
5679 -313 141 161 -163 -176 25 116 44 189 24 -46 -121 -103 -126 -83 -2 13 3 147 -80 339 -112 49 -135 -230
5703 -230 15 -161 -222 164 -77 251 -107 139 119 33 133 260 -289 -176 -48 -94 33 205 15 27 196 -231
5725 -231 214 -187 -124 399 42 165 -130 -107 395 -142 -90 319 -50 214 -67 142 168 -203 -410 41 231
5746 231 240 -144 -131 -71 -81 -48 24 -238 -187 29 -131 185 113 -114 -340 101 -35 111 76 83 114 -58 34 145 -376
5771 -376 -216 -138 139 6 156 36 -401 269 -616 280 -225 -237 -163 -748 113 -188 -27 275 -708 899 947
5792 947 -363 -59 -499 91 -263 -815 -451 -253 -550 -23 -138 98 -72 -298 143 296 -20 263 32 -354
5812 -354 8 699 -202 -399 -527 299 99 195 -554 -161 -398 -178 102 240 -536 -374 -137 67 -418 35
5832 35 57 -713 -198 -768 -344 -58 -224 -395 489 598 61 -550 975 579 204 -225 113 -450 507 -402
5852 -402 94 -852 -239 -110 -448 -230 431 -142 -24 695 -317 -698 -652 744 -43 -838 -44 145 116 480
5872 480 601 -668 -64 262 -616 648 329 -481 -777 239 -654 725 -538 -367 706 498 -147 -273
5890 -273 -238 270 310 49 152 -856 679 493 330 251 -1223 115 -738 -993 102 -428 -338 -508 -360 132
5910 132 -416 372 340 -98 -503 -1105 241 -46 53 -309 -292 41 -110 955 276 504 65 497 208 -409
5930 -409 -459 550 388 189 -223 -292 -14 -159 -250 571 339 -311 -436 -327 -15 -187 -15 144 -62 345 14
5951 14 -199 -256 912 -131 -120 -52 223 47 -414 120 236 -105 -469 213 124 -113 257 -320 53 -348 242
5972 242 346 -72 -382 -542 -274 -396 -510 -146 561 -88 352 435 143 -47 132 -291 -129 -78 -204 70 -142
5993 -142 6 -318 -234 -241 -76 -124 232 20 -138 149 -46 -146 185 -95 -17 -116 46 -170 -70 124 242 -47
6015 -47 -50 73 -32 162 -1 -205 55 -31 136 98 -230 -105 49 111 -11 -67 214 84 -147 -161 70 78 -180
6038 -180 87 -340 37 78 275 65 69 -109 189 31 45 -23 -166 -112 -8 -3 -80 154 -63 100 95 -11 -195 60
6062 60 126 -312 -161 -107 73 182 29 108 20 36 -126 -70 -6 -31 26 242 -17 -216 17 261 152 116 192 110
6086 110 -93 114 -66 33 103 147 -196 -59 228 -2 -156 256 -81 36 -45 -40 57 13 -46 -508 142 155 156 -15
6110 -15 -257 -160 243 103 -73 -634 99 357 -395 334 130 -220 185 -86 -67 967 -133 -23 298 -129
6130 -129 -531 268 -637 747 56 -107 -257 -275 778 173 48 186 -706 269 244 525 4 -410 -631 -729
6150 -729 543 378 -222 -58 -609 476 174 -466 504 -66 -272 -1411 -755 -248 -573 80 -526 -508 -77
6169 -77 -83 21 359 96 124 -103 -31 -55 -186 342 328 101 -448 -156 30 281 81 275 182 52 -215 24 -28
6192 -28 -110 159 2 168 155 23 216 293 142 129 -69 209 -25 165 -43 -1 -101 -80 229 -88 55 66 33
6215 33 319 17 260 126 -16 -11 -112 9 102 160 -14 -105 34 15 34 -148 132 -187 53 263 -370 15 68
6238 68 209 -240 85 179 56 -118 -41 52 18 -13 502 -303 -14 162 -554 -385 -569 -139 519 60 141 35
6260 35 -895 -317 505 -116 15 -43 157 84 -62 144 -80 351 -412 127 -5 207 -115 -360 -112 16 -186
6281 -186 6 515 19 -8 -58 79 -156 155 -287 161 65 -386 56 -79 -234 -395 386 232 817 928 -244
6302 -244 -368 146 475 -42 -503 44 -317 -102 -104 -80 -109 67 -29 693 234 720 -576 -82 826 -255 335
6323 335 37 202 100 -698 -584 -932 620 285 648 749 -1100 181 806 604 -1396 -421 816 -1083
6341 -1083 823 -424 18 -491 -92 -62 -67 49 -117 -62 484 753 -334 263 -34 218 -69 -133 -209 152 99
6362 99 -32 427 -100 142 -125 568 -26 -119 -195 141 657 495 53 49 416 279 -374 -289 1122 -822 773
6383 773 -510 -414 73 665 -581 171 165 909 215 43 -327 -87 14 -395 -708 574 -59 -249 -257 -434 -12
6404 -12 56 68 -487 15 72 6 36 29 -241 -235 132 126 -473 267 64 -310 -71 42 207 297 498 -10 446 -197
6428 -197 427 357 195 193 416 -120 227 75 -98 268 -339 341 279 -534 -227 -338 -159 -149 -639 -207 293 31
6450 31 -645 -171 94 -565 232 -62 593 -94 204 -120 -82 -1 505 150 173 -585 319 373 60 -529 -193 321
6472 321 353 -60 -616 -108 -13 280 -503 -256 -195 525 -170 -493 -1126 126 -765 667 -654 341 435 -610
6492 -610 199 -440 78 -435 966 132 -13 -451 -173 -497 287 881 -82 581 -285 -318 271 -35 103 -191
6512 -191 -74 66 -238 -4 -78 -114 -200 67 -213 0 -53 10 96 69 -70 -59 -434 -246 203 -33 22 -320 34
6535 34 -118 -252 61 -309 299 84 -88 -110 -125 -29 -38 157 193 175 -332 -214 -190 -202 228 103 384 -219 -288 92
6559 92 -413 22 -121 -801 -66 -124 -241 155 -295 380 454 -210 -831 146 281 -378 -286 -137 -80 1 173 -115
6581 -115 -820 580 -167 158 -516 -305 -221 153 -115 454 308 909 179 -427 -73 800 -148 542 499 78
6601 78 250 278 70 21 -409 -776 366 -10 164 -41 -565 -593 -241 -903 -77 232 31 -192 -959 -106 88
6622 88 208 47 409 337 62 416 -582 -323 -111 -459 15 46 -15 92 -110 514 -20 -278 -54 -146 -267 -106
6644 -106 613 -101 86 -416 -18 -320 -122 -218 -174 -14 211 289 -23 613 -161 -351 -77 -450 147 431 108
6665 108 -213 -306 -465 -27 269 178 -19 -300 18 -219 263 -417 209 -91 -85 -44 -211 108 197 195 -128 43 -116
6688 -116 13 9 -77 -211 26 143 -85 -216 141 249 -12 192 -202 167 -150 77 -70 64 152 -283 90
6709 90 77 -155 187 -59 103 357 -122 48 375 54 558 -195 -446 137 -219 868 402 -651 -133 437
6729 437 -119 436 206 -63 -975 -437 -8 756 302 225 -561 185 -826 -372 -245 241 -391 -192 -141 -182 84
6750 84 188 362 -332 -228 59 -167 -98 -383 -87 578 -348 588 -620 -451 -122 23 24 -191 77 -291 220
6771 220 -242 20 -239 196 -115 62 -120 420 -92 -201 -55 122 -98 -4 118 -84 -122 -147 -334 74 185
6792 185 246 4 -115 -55 -57 66 32 -26 -56 246 -69 -48 -293 100 -3 -38 327 323 -108 23 4 -158 -163 -222 -158
6817 -158 177 119 -228 -140 17 94 175 216 -442 128 463 139 -171 -146 -262 63 -394 473 194 101 -37 -145
6839 -145 -466 -304 -435 205 -640 -394 209 436 -126 -310 250 -105 263 103 640 203 -147 -124 104 -146
6859 -146 108 58 37 -312 227 171 117 395 125 -74 173 -69 1 134 -4 242 73 6 -195 29 -54 -61 -28
6882 -28 -1 -110 -12 -45 34 -133 -319 -10 -82 -87 117 -89 -49 212 116 37 85 19 -28 -80 291 39 108 140 -10 -93
6908 -93 110 -121 -88 -272 -53 13 -33 57 15 -21 -20 41 131 -53 -60 -39 196 186 -55 -108 -110 252 -116 -183 85 211
6934 211 -128 -21 -78 87 101 7 74 121 158 -50 -123 -248 63 166 -42 107 1 230 255 -87 -104 -4 104
6957 104 -59 128 -65 4 -17 -29 258 -191 -160 10 156 -174 -66 13 37 140 87 34 107 -55 -53 -16 -150 -43
6981 -43 134 -127 117 125 90 121 -262 -224 -97 23 -234 -24 152 -100 -44 291 137 -111 -82 -112 294 123 -291
7004 -291 149 -139 119 84 36 -58 -4 -18 70 73 -86 40 24 -176 -33 191 86 268 -98 -23 94 58 -161 35
7028 35 -67 289 102 -222 -105 153 -51 -147 53 -75 -154 138 129 -32 -31 -52 -117 -147 -13 -444 224 -194 -200 133
7052 133 179 -59 -15 -211 -152 -36 -135 -3 -281 175 42 140 375 -352 22 129 124 -3 85 118 13 -50 -58 -78
7076 -78 -272 224 250 -219 84 -21 16 -293 -429 -321 212 -465 -547 627 -180 -169 -920 655 50 399 -213
7097 -213 -251 -156 -353 965 151 -171 96 168 -305 -272 -18 -23 -84 -44 -210 135 72 -163 197 -170 -75 789 169
7120 169 -640 496 537 -17 62 -131 -65 -281 -568 -329 -475 -870 -388 -387 342 308 -282 -254 621 -564 -269 -864
7142 -864 -95 504 -548 424 604 660 -148 -475 283 428 -263 -468 -21 691 -1056 330 -62 481 -90
7161 -90 -313 91 -151 -705 101 44 233 -65 -102 112 -48 -72 -212 165 69 -213 -23 27 162 -62 -129 197
7183 197 705 -54 -211 -264 -83 468 -211 -51 -510 199 -547 93 368 -86 -419 -530 -289 -152 97 -208
7203 -208 360 115 -25 412 64 98 293 -236 44 -79 546 -20 87 -99 186 -11 -157 -194 17 24 96 119
7225 119 -19 -39 -93 -2 -60 -81 39 -144 82 91 88 -113 177 -77 68 48 177 69 -163 -123 393 23 272 119
7249 119 37 -70 -170 -4 -104 3 -96 -111 89 103 4 88 95 -180 157 -343 107 93 -2 84 -199 18 -19 -9
7273 -9 -169 -120 -158 142 -114 -268 -61 122 -201 -24 27 -63 -1 157 18 -111 -143 -308 -37 5 -466 417 -71
7296 -71 -226 -166 87 -528 426 -114 33 -42 4 378 -103 -91 422 69 -93 120 361 83 99 -31 -58 -116 210
7319 210 -262 -137 27 226 145 -114 -79 -42 249 -83 165 109 121 -104 46 142 177 -139 0 194 -55 -118 16
7342 16 -8 19 -137 68 -20 22 -187 104 92 -19 37 -252 -293 -276 -86 -283 -30 209 -146 206 43 107 33 72
7366 72 190 -202 -214 87 117 14 224 -84 102 1 40 -124 27 289 413 -367 -69 -101 28 87 2 39 -26
7389 -26 -25 -43 -71 35 166 -168 135 15 104 -102 80 -140 -176 -28 102 26 -39 -5 216 288 111 -114 366 140
7413 140 124 126 -30 -33 -119 -27 -83 -145 -7 35 -314 -230 -142 -50 105 -147 62 -97 22 -128 -13 209 229 -5 133
7438 133 -137 72 51 291 -174 233 -13 -157 78 0 142 -86 -105 18 -54 -5 165 -78 207 -179 46 -54
7460 -54 -140 -14 -2 65 41 -160 121 -199 -200 -233 -25 302 195 -196 -290 -104 -246 -593 -176 -194 -140 -224 -157 -103 -32
7485 -32 221 96 42 -10 -240 -72 17 -104 166 -160 -52 -287 12 206 -26 -144 146 49 560 17 30 -220
7507 -220 17 222 28 -305 419 -81 -412 -154 -295 136 -221 166 217 -43 232 -106 -168 -11 -275 305 -54
7528 -54 179 510 -26 -38 170 107 80 116 52 67 53 -211 1 25 33 4 85 173 6 205 -134 239 -115 -113 208
7553 208 282 117 236 803 -420 521 -312 -1374 183 -62 301 49 -153 36 -333 84 -149 308 245 -14
7573 -14 -201 36 52 104 -353 503 -104 67 18 63 39 404 38 245 -69 -220 -322 -97 21 78 -114 -11
7595 -11 -13 59 -310 18 -151 11 116 -294 -100 -38 -240 -565 69 -124 -36 11 126 131 -45 68 22 -226 97
7618 97 -31 131 -57 182 -111 -160 -68 93 25 90 -337 244 -214 -45 -283 -155 -41 33 26 90 46 -14 274 -151
7642 -151 98 -333 133 -914 515 984 -930 31 158 49 -258 -627 -277 336 88 294 -501 -120 -445
7661 -445 -414 -127 -652 4 640 69 -400 -230 -101 -94 507 526 1436 358 -220 -650 -324 -745 -1022 -336 38
7682 38 221 176 419 -211 -103 47 93 137 29 -43 48 -156 184 43 -70 169 60 -14 -161 -65 152 -102 -56
7705 -56 -93 128 183 -233 49 43 155 416 117 2 -100 252 59 -77 204 219 96 280 -102 318 -206 -25
7727 -25 99 -99 20 -56 -30 -4 -48 -14 35 -352 198 -36 129 22 113 60 -237 -120 -43 -240 -81 -206 -100
7750 -100 -6 132 -77 54 -19 -270 459 -218 136 -41 21 94 371 123 -176 -139 19 -263 -5 21 -1182 250
7772 250 -92 -543 134 9 415 1078 134 288 -770 -579 -247 -128 268 -293 248 -405 -277 208 -570 98
7792 98 -50 42 -36 14 -76 389 -247 121 37 23 -171 -107 28 -99 -45 -182 -91 -6 -81 0 162 128 50 -249 96
7817 96 -64 -132 -113 -159 -36 70 43 -109 168 -92 -95 -16 187 -16 -21 -259 -153 21 56 -146 -192 -141 29 -78
7841 -78 17 12 31 -88 82 -60 69 0 -67 -235 -244 139 123 -300 -95 22 -47 37 -126 -244 295 86 -152 20
7865 20 94 243 87 -151 143 -79 40 99 -276 -221 -388 14 -193 91 -22 -67 72 -112 155 -106 -227 -538
7887 -538 138 -13 -74 -354 -823 141 230 -256 166 73 -418 -170 -175 -196 233 -229 396 -175 -641 -220 -145 473
7909 473 79 -164 -89 154 318 741 -483 -142 133 -120 394 -85 -484 292 844 279 252 -532 -274 74
7929 74 382 -84 358 142 279 -329 -361 465 -71 -185 193 -4 -214 14 123 411 152 -306 11 -563 -708
7950 -708 -107 -518 -425 -192 317 428 426 224 161 -155 23 -1 -26 -195 -547 94 104 -17 54 457 29 10 389
7973 389 -207 2 64 -784 12 511 -444 169 175 2 -74 -874 -228 143 -296 450 207 -390 64 76 -350 -375
7995 -375 534 -97 313 409 -202 -314 -69 264 -263 16 -367 26 -171 -256 -34 482 536 179 476 568 -348
8016 -348 174 -173 382 315 -110 -105 306 354 -286 712 -248 116 434 30 -73 -38 -167 278 127 294 231 -625
8038 -625 15 44 81 208 246 -108 -195 19 51 -132 -116 117 -323 -67 199 -103 -685 157 65 -258 -66 68
8060 68 50 86 155 -123 527 400 -399 586 473 98 129 175 -204 -313 -222 156 177 88 97 45 -84 -132 9 171
8084 171 219 -115 -133 -102 -106 -343 -73 -227 -13 -149 659 63 375 32 -46 65 100 128 -6 226 -208 42 -20
8107 -20 -33 109 -71 293 -37 -91 135 -239 -123 -95 113 -1 2 375 -161 113 -381 -97 34 -238 -108 -1
8129 -1 -42 243 68 -79 -109 -22 -195 -179 -313 0 -98 152 -21 87 -62 94 -288 -65 4 -211 -122 -53 -171
8152 -171 166 207 107 -368 -401 -161 19 -147 46 -328 124 96 -13 94 -199 -115 119 211 59 59 -41 342
8174 342 -100 -117 -41 -54 30 -18 319 -17 -249 -100 -75 -84 -57 15 -294 62 -207
8191b07
##END NTUPLES=NMR FID
##END=
