##TITLE=1H_CA-8706-2
 CDCl3, 8 sc, 
 26.3.2020
##JCAMPDX= 6.0         $$ Bruker NMR JCAMP-DX V2.0
##DATA TYPE= NMR FID
##DATA CLASS= NTUPLES
##ORIGIN= UXNMR, Bruker Analytische Messtechnik GmbH
##OWNER= root
$$ XWIN-NMR		Version 3.5
$$ Thu Mar 26 14:16:56 2020 Russian Standard Time (UT+4h)  she@DPX200
##.OBSERVE FREQUENCY= 200.1315
##.OBSERVE NUCLEUS= ^1H
##.DELAY= (6, 6)
##.ACQUISITION MODE= SIMULTANEOUS
##.ACQUISITION SCHEME= undefined
##.AVERAGES= 8
##.DIGITISER RES= 18
##SPECTROMETER/DATA SYSTEM= spect
##.PULSE SEQUENCE= zg30
##.SOLVENT NAME= CDCl3
##.SHIFT REFERENCE= (INTERNAL, CDCl3, 0, 15.7039)
##AUDIT TRAIL= $$ (NUMBER, WHEN, WHO, WHERE, WHAT)
$$ ##TITLE= Audit trail, XWIN-NMR		Version 3.5
$$ ##JCAMPDX= 5.01
$$ ##ORIGIN= Bruker BioSpin GmbH
$$ ##OWNER= she
$$ F:/spectra/data/she/nmr/H-F/1/audita.txt
$$ ##AUDIT TRAIL=  $$ (NUMBER, WHEN, WHO, WHERE, WHAT)
(   1,<2020-03-26 14:15:43.78 +0400>,<she>,<DPX200>,
      <created by zg, POWCHK disabled, PULCHK disabled
       configuration hash MD5:
       00 E9 B6 7A A2 85 ED C7 34 08 36 98 17 FE 4E 26
       data hash MD5: 16K
       7F 62 DA 84 1A 12 34 FD 3E 79 9B 2F 10 A7 BC B5>)
$$ ##END=
$$ 
$$ hash MD5
$$ 95 AB DE C5 13 57 70 3E E8 55 AA 8D 71 E1 B6 FF
##$RELAX= 
##$RELAX= 
##$RELAX= 
##$RELAX= 
##$RELAX= 
##$RELAX= 
$$ Bruker specific parameters
$$ --------------------------
##$DU= <F:/spectra>
##$EXPNO= 1
##$NAME= <H-F>
##$PROCNO= 1
##$TYPE= <nmr>
##$USER= <she>
##$AMP= (0..31)
100 100 100 100 100 100 100 100 100 100 100 100 100 100 100 100 100 100 
100 100 100 100 100 100 100 100 100 100 100 100 100 100 
##$AQSEQ= 0
##$AQ_mod= 1
##$AUNM= <au_zg>
##$AUTOPOS= <>
##$BF1= 200.13
##$BF2= 200.13
##$BF3= 200.13
##$BF4= 200.13
##$BF5= 200.13
##$BF6= 200.13
##$BF7= 200.13
##$BF8= 200.13
##$BYTORDA= 1
##$CFDGTYP= 0
##$CFRGTYP= 5
##$CHEMSTR= <none>
##$CNST= (0..31)
1 1 145 1 1 1 1 1 1 1 1 1 1 1 1 1 1 1 1 1 1 1 1 1 1 1 1 1 1 1 1 1 
##$CPDPRG= <>
##$CPDPRG1= <>
##$CPDPRG2= <>
##$CPDPRG3= <>
##$CPDPRG4= <mlev>
##$CPDPRG5= <mlev>
##$CPDPRG6= <mlev>
##$CPDPRG7= <mlev>
##$CPDPRG8= <mlev>
##$CPDPRGB= <>
##$CPDPRGT= <>
##$D= (0..31)
0 1.2 0 0 0 0 0 0 0 0.06 0 0.03 0 0 0 0 0.0002 0 0 0 0 0 0 0 0 0 0 0 0 
0 0 0 
##$DATE= 1585217743
##$DBL= (0..7)
120 120 120 120 120 120 120 120 
##$DBP= (0..7)
150 150 150 150 150 150 150 150 
##$DBP07= 0
##$DBPNAM0= <>
##$DBPNAM1= <>
##$DBPNAM2= <>
##$DBPNAM3= <>
##$DBPNAM4= <>
##$DBPNAM5= <>
##$DBPNAM6= <>
##$DBPNAM7= <>
##$DBPOAL= (0..7)
0.5 0.5 0.5 0.5 0.5 0.5 0.5 0.5 
##$DBPOFFS= (0..7)
0 0 0 0 0 0 0 0 
##$DE= 6
##$DECBNUC= <off>
##$DECIM= 24
##$DECNUC= <off>
##$DECSTAT= 4
##$DIGMOD= 1
##$DIGTYP= 9
##$DL= (0..7)
0 120 120 120 120 120 120 120 
##$DP= (0..7)
150 150 150 150 150 150 150 150 
##$DP07= 0
##$DPNAME0= <>
##$DPNAME1= <>
##$DPNAME2= <>
##$DPNAME3= <>
##$DPNAME4= <>
##$DPNAME5= <>
##$DPNAME6= <>
##$DPNAME7= <>
##$DPOAL= (0..7)
0.5 0.5 0.5 0.5 0.5 0.5 0.5 0.5 
##$DPOFFS= (0..7)
0 0 0 0 0 0 0 0 
##$DQDMODE= 0
##$DR= 18
##$DS= 0
##$DSLIST= <SSSSSSSSSSSSSSS>
$$ [...]
##$SUBNAM2= <"">
##$SUBNAM3= <"">
##$SUBNAM4= <"">
##$SUBNAM5= <"">
##$SUBNAM6= <"">
##$SUBNAM7= <"">
##$SUBNAM8= <"">
##$SUBNAM9= <"">
##$SW= 24.9337058887773
##$SWIBOX= (0..15)
0 0 2 0 0 0 0 0 0 0 0 0 0 0 0 0 
##$SW_h= 4990.01996007984
##$TD= 16384
##$TD0= 1
##$TE= 0
##$TE2= 300
##$TE3= 300
##$TEG= 300
##$TL= (0..7)
0 120 120 120 120 120 120 120 
##$TP= (0..7)
150 150 150 150 150 150 150 150 
##$TP07= 0
##$TPNAME0= <>
##$TPNAME1= <>
##$TPNAME2= <>
##$TPNAME3= <>
##$TPNAME4= <>
##$TPNAME5= <>
##$TPNAME6= <>
##$TPNAME7= <>
##$TPOAL= (0..7)
0.5 0.5 0.5 0.5 0.5 0.5 0.5 0.5 
##$TPOFFS= (0..7)
0 0 0 0 0 0 0 0 
##$TUNHIN= 0
##$TUNHOUT= 0
##$TUNXOUT= 0
##$USERA1= <user>
##$USERA2= <user>
##$USERA3= <user>
##$USERA4= <user>
##$USERA5= <user>
##$V9= 5
##$VALIST= <valist>
##$VCLIST= <CCCCCCCCCCCCCCC>
##$VD= 0
##$VDLIST= <DDDDDDDDDDDDDDD>
##$VPLIST= <PPPPPPPPPPPPPPP>
##$VTLIST= <TTTTTTTTTTTTTTT>
##$WBST= 1024
##$WBSW= 4
##$XGAIN= (0..3)
0 0 0 0 
##$XL= 0
##$YL= 0
##$YMAX_a= 679037
##$YMIN_a= -497950
##$ZGOPTNS= <>
##$ZL1= 120
##$ZL2= 120
##$ZL3= 120
##$ZL4= 120
##$ABSF1= 10
##$ABSF2= 0
##$ABSG= 5
##$ABSL= 3
##$ALPHA= 0
##$AQORDER= 0
##$ASSFAC= 0
##$ASSFACI= 0
##$ASSFACX= 0
##$ASSWID= 0
##$AUNMP= <proc_1d>
##$AZFE= 0.1
##$AZFW= 0.1
##$BCFW= 1
##$BC_mod= 2
##$BYTORDP= 1
##$COROFFS= 0
##$CY= 11.3945322036743
##$DATMOD= 1
##$DC= 2
##$DFILT= <>
##$DTYPP= 0
##$F1P= 16.9975609425685
##$F2P= -3.02152046262296
##$FCOR= 0.5
##$FTSIZE= 0
##$FT_mod= 4
##$GAMMA= 1
##$GB= 0.15
##$INTBC= 1
##$INTSCL= 1
##$ISEN= 128
##$LB= 0.24
##$LEV0= 0
##$LPBIN= 0
##$MAXI= 10000
##$MC2= 0
##$MEAN= 0
##$ME_mod= 0
##$MI= 1.114404
##$NCOEF= 0
##$NC_proc= 0
##$NLEV= 6
##$NOISF1= 3.799351
##$NOISF2= 2.8
##$NSP= 1
##$NTH_PI= 0
##$NZP= 0
##$OFFSET= 15.70392
##$PC= 1
##$PHC0= -9777.807
##$PHC1= 2.000824
##$PH_mod= 1
##$PKNL= yes
##$PPARMOD= 0
##$PSCAL= 0
##$PSIGN= 0
##$REVERSE= no
##$SF= 200.130013532006
##$SI= 16384
##$SIGF1= 3
##$SIGF2= 2
##$SINO= 400
##$SIOLD= 16384
##$SREGLST= <1H.CDCl3>
##$SSB= 0
##$STSI= 0
##$STSR= 0
##$SW_p= 3612.71676300578
##$SYMM= 0
##$S_DEV= 0
##$TDeff= 0
##$TDoff= 0
##$TI= <>
##$TILT= no
##$TM1= 0
##$TM2= 0
##$TOPLEV= 0
##$USERP1= <user>
##$USERP2= <user>
##$USERP3= <user>
##$USERP4= <user>
##$USERP5= <user>
##$WDW= 1
##$XDIM= 8192
##$YMAX_p= 0
##$YMIN_p= 0
$$ End of Bruker specific parameters
$$ ---------------------------------
##NTUPLES= NMR FID
##VAR_NAME=  TIME,          FID/REAL,        FID/IMAG
##SYMBOL=    X,             R,               I
##VAR_TYPE=  INDEPENDENT,   DEPENDENT,       DEPENDENT
##VAR_FORM=  AFFN,          ASDF,            ASDF
##VAR_DIM=   8192,          8192,            8192
##UNITS=     SECONDS,       ARBITRARY UNITS, ARBITRARY UNITS
##FACTOR=    0.0002004,     1,               1
##FIRST=     0,             0,               0
##LAST=      1.6414764,     0,               0
##MIN=       0,             -497950,         0
##MAX=       1.6414764,     679037,          0
$$ Real data points
##PAGE= N=1
##DATA TABLE= (X++(R..R)), XYDATA
0@%%%%qJ6qQj6K2l1M1m9O0p6R0j11J36j61J90k27K64l04L55m06M66n37O08o91
29c69P86q83R94j120J253j400J561j739J932k146K383k637K921l237L583l969
45b087M400m880N427o052O768p602Q593r787J1260j3141J5630j9093K4294l3078
59a9348N1628j56779L16285M47292k76355m76154l16084J26824L37698K43199
69B78206j21954k72723j04411K24516K76208k1204l82008l02337J25946M21914
79A22153K82036o0405l32761l24665l4924K80258K66800M685j70609j01898N2762
90a6568R5545m1671j65971p5389J40389K17368J04731q8191k34071j92936M5378
101b11386K20272J43542l0734q5272l0113J9891j5046j03067r3164P5302K16086
$$ y = [0, 0, 0, 0, 0, -8, 8, 0, 8, -8, 14, -17, 24, -25, 35, -41, 49, -62, 74, -87, 103, -124, 140, -164, 191, -215, 251, -286, 322, -369, 417, -466, 528, -592, 661, -739, 822, -917, 1015, -1131, 1252, -1385, 1536, -1701, 1882, -2087, 2313, -2567, 2860, -3192, 3576, -4026, 4567, -5220, 6040, -7101, 8529, -10564, 13730, -19348, 32280, -124499, 191786, 639078, 362723, -113431, -429515, -302691, 35007, 278206, 156252, -116471, -220882, 3634, 279842, 258638, -123370, -425707, -299761, 122153, 404189, 343784, 11023, -313642, -348566, -68308, 198492, 203177, 32568, -69330, -16568, 78977, 37306, -128665, -204054, -63665, 153703, 258434, 170243, -63828, -256764, -211386, 8886, 152428, 121694, 36422, 6309, 26200, 11154, -91913, -185077, -109775, 106311]
112A06311J55776m8439k28465k39847j7711K44162K40946j1332j95351j38074
122a32024N0009J65610O5878j64047k22053J5482K81681K75655q902l27439l69335
133c69485l8913L47482L83105N8241k81887l32451o2095K46759K45613l8110k29667
144g1408j23272J16131K41644J13583j88976l40578j14796K55663L60594J15449
154C64034k17917l29321j23646J73302K45801P2347j20541j56251k0746J49824
164C6886J27388r9592k28478o8527J73871K31513P6246j40375k34889j10856J02519
175a34294J85496R5511m6803j15410m3859O3260L6185q3840q1920N5381J40236
186F9943Q9578l5619j49155j40382J3325J51492J24134j8799j14884p3070O1889
$$ y = [106311, 262087, 213648, -14817, -254664, -272375, -28213, 212733, 201401, 6050, -132024, -82015, 83595, 149473, -14574, -236627, -221145, 60536, 336191, 327289, -150, -369485, -408398, -60916, 322189, 380430, 98543, -233908, -296003, -49244, 196369, 158259, -71408, -194680, -78549, 163095, 276678, 87702, -252876, -367672, -112009, 248585, 364034, 146117, -183204, -306850, -133548, 112253, 184600, 64059, -92192, -112938, 36886, 164274, 64682, -163796, -232323, -58452, 173061, 249307, 108932, -125957, -236813, -134294, 51202, 146713, 99910, -15500, -59359, 3901, 40086, -43754, -125674, -70293, 69943, 159521, 123902, -25253, -165635, -152310, -818, 123316, 104517, -10367, -83437, -21548]
197b1548J10659j9427j52059q9349R0201J84793J23875o5174k39724j92856O8143
208b02466K59838J82704n6875k17645j49983O9516J84365O7038j10751j40833
218a15092j3240J46068J76343p050k30022k10613M5423K47846K03385k4271k26383
229g606k00527L0159K00747J37795m9573j59394r2534Q9303J78845L8669j66563
240f79j79944L661J79334J90659J4775j88678j97432l789J63123J46478N090j22429
252A0169j08197L1539J20048L5117r3448r7445J1746J17302J13420k3131j53608
263c6488j12715M5640J34910Q5099l5148j16261o4246P0967J06751n254j09392
274c6137p7581M0217J34804R5623o7028j73180q9426Q3507J59609Q5247p2075
$$ y = [-21548, 89111, 69684, -82375, -171724, -81523, 103270, 227145, 161971, -77753, -270609, -202466, 57372, 240076, 183201, -34444, -184427, -114911, 69454, 136492, 25741, -115092, -128332, 17736, 194079, 187029, -42993, -253606, -208183, 39663, 243048, 218777, -7606, -208133, -177974, 22773, 160568, 110995, -48399, -140933, -51630, 127215, 165884, -679, -180623, -176962, 2372, 193031, 207806, 19128, -178304, -182093, -18970, 127508, 132598, 10169, -98028, -66489, 53559, 88676, -4772, -102217, -90471, 26831, 140251, 117120, -36488, -149203, -103563, 31347, 116446, 81298, -34963, -99209, -28242, 78509, 73255, -36137, -113718, -73501, 61303, 156926, 89898, -83282, -172708, -89201, 70408, 155655, 83580]
285H3580j59855o4776J02904J33536L366j13274j00091K1956J38786J07389o3820
296H9701j72313q9670Q0803J69404R6205q4181j83064p2434J10882J50634L1332
307A27299j04889j32270j3670J36117J30468l5401j58222j07865M9926J65887
317E7380J14610p0206j79415q2929Q7473J45687O0744q0919j40109l6329J16198
328g815J22101j7432j25925r7569L6323J43607R4674p2475j54305o0140Q6017
339e2939J34307N0358r3724j40158j6240J26165J11240k6522j25459r3663M3912
350h2723J46921Q2069q3308j47076n1263Q9188J39145M4941j09211j41444l213
361a15974J28207J04540k3621j22126r3932M3975J43009P1423q2338j33822m5002
$$ y = [83580, -76275, -141051, -38147, 95389, 98755, -14519, -114610, -92654, 46132, 153521, 89701, -82612, -172282, -91479, 77925, 174130, 89949, -93115, -165549, -54667, 95967, 127299, 22410, -109860, -123530, 12587, 143055, 107654, -50568, -158433, -108507, 57380, 171990, 101784, -77631, -160560, -73087, 72600, 133344, 52425, -87684, -124013, -7815, 114286, 96854, -29071, -126640, -90317, 53290, 147964, 75489, -78816, -138956, -52939, 81368, 131726, 38002, -102156, -118396, 7769, 119009, 92487, -32972, -126635, -82723, 64198, 146267, 62959, -84117, -135380, -46192, 92953, 137894, 28683, -112761, -115974, 12233, 116773, 93152, -28974, -122906, -78931, 64078, 135501, 53163, -80659, -125661]
372a25661Q7323J34106L5397j15983j28917O071J21581J01594j7916j24202j00985
383a27592M5603J43206O9279p5061j28171n0563Q1588J33653L1833j10395j19329
394a05949M068J08688J01062j2655j21533r6194M7094J31523O2251o6976j19370
405f7991n1449P9812J30394K4263j07955j11234K275J08628J05977j5944j32511
416c5735r3560N5291J31148O2442o2407j26644n8633Q5554J35372K3963j06642
427A0149j12421l652J08826J10302j7708j30892q7999N1229J22859O5964n7693
438E8964j28523n6542Q9641J28073J7625r9985j06001n851J07567J06436k2802
449H8602j24993p7884M8353J15073O4174n9512j26797m4604R3245J15237J0503
$$ y = [-125661, -38338, 95768, 131165, 15182, -113735, -107664, 13917, 115511, 97595, -26607, -127592, -81989, 61217, 130496, 55435, -72736, -123299, -41711, 91942, 123775, 13380, -105949, -101881, 6807, 107869, 95214, -26319, -122513, -75419, 56104, 118355, 51379, -67991, -119440, -39628, 90766, 115029, 7074, -104160, -101885, 6743, 112720, 96776, -35735, -129295, -74004, 57144, 119586, 57179, -69465, -128098, -42544, 92828, 116791, 10149, -102272, -105924, 2902, 113204, 95496, -35396, -123395, -72166, 50693, 116657, 58964, -69559, -126101, -36460, 91613, 109238, 9253, -96748, -102599, 4968, 111404, 88602, -36391, -114275, -65922, 49151, 113325, 53813, -72984, -117588, -24343, 90894, 101397]
460A01397r4594j02974k912J11100J01673l0253j21400p1778M6706J13278O3035
471A13278o4356j23259l4740R1235J06217J1188r2475j06572m43J17848R9570
482A17491l4167j18014p3516L9475J14224O7979o0279j18210l5548P7568R9177
493G6180K0037q4798j04829O35J11143Q8630k8348j03548p5046K7470J07386O9767
505A04679m9903j03303l8090N8270Q7344K2871p4242q8854R662R5851O5318k8591
517F1012q8941o5657K9759J03666N8380n3305r3785k9266N5257P8927J2276p5220
529f897p1698K5481Q9549N1455l8072r6988o1632N4037J19937M6754p5129j04820
541f8023k7808P0434R5625J2003q9157q0074K5006R6796O4093m0203j16948p0540
$$ y = [101397, 6803, -96171, -99083, 12017, 113690, 83437, -37963, -109741, -63035, 50243, 113278, 48922, -74337, -109077, -17842, 88375, 99563, 7088, -99484, -99927, 17921, 117491, 83324, -34690, -108206, -68731, 45493, 113472, 53193, -65017, -100565, -22997, 76180, 96217, 11419, -93410, -92775, 18368, 106998, 78650, -24898, -99944, -72474, 34912, 104679, 54776, -48527, -86617, -28347, 58997, 81868, 7626, -81228, -71566, 24285, 89603, 61012, -27929, -93586, -63827, 39839, 98219, 44914, -48871, -78137, -22880, 56047, 68323, -6897, -78595, -53114, 36435, 87890, 49818, -47170, -108802, -54765, 65172, 111926, 36797, -68023, -95831, -25397, 70228, 82231, -6926, -87000, -61994, 34802, 98895, 58692, -58256, -128796]
553a28796O9405J37087N1801p9292j22518m9526P1213J20335L4735q4350r5632
564g5538l039Q3971P9370j6275j07310p4432N2284J18790N8982n3291j15070o9383
576a20941N0947J17061N4292n3786q5603l1443M4362O7784P464o4925m9278L0959
588c3107P2254L7411l5496q3976m7674M5150Q6370L2398l7008n6109k5188K5822
600a9153M2814l814m4893j2279M6372M9942j970o0270p1600l907P7667P7078p36
613G5251o5966o4539k526O3806N0477l3687o9947n991O8241O6526o133q9608r7473
626a11569N353J17577J12290m454j13564j14521j060J11335R2982k4584r3746
637b3961n0418M0399Q8524M1506p3741j23083k5994J11102J35848K5883j11216
$$ y = [-128796, -59391, 77696, 129497, 50205, -72313, -121839, -50626, 69709, 104444, 20094, -75538, -78577, 5394, 84764, 68489, -38821, -113253, -60969, 57821, 116803, 63512, -51558, -120941, -69994, 47067, 101359, 47573, -38030, -69473, -25111, 42673, 50137, -14788, -64066, -33107, 39147, 76558, 41062, -42914, -90588, -45438, 40932, 73330, 36322, -19787, -44975, -19153, 23661, 19847, -25046, -37325, 9047, 58989, 57019, -3251, -74851, -78758, -1091, 75987, 75251, 9285, -55254, -57780, 6026, 56503, 22816, -47131, -53122, 15119, 81645, 75512, -14096, -111569, -106216, 11361, 123651, 119197, 5633, -108888, -109948, 1387, 94369, 69785, -23961, -74379, -33980, 54544, 96050, 22309, -100774, -126768, -15666, 120182, 146065, 34849]
648C4849j45172l4765J01574J24450L0476p0045r3554k5607O7029P2360k2538
659C9057q4033l2119N9326Q7650K8836o5739j06272m1430O2718R9145M9264l5820
671F0583q1019m3720L0066M1922k270j9164O796K7907K2618q685n2723n4296P815
684f4170O5572N7393K350m6404m7443k079L0045N550k4364l657L6952M7402J3271
697G0418n3386r5256m0347P1855J16705N0004n5961j07873n9912M6490R3501L1085
709F7323n4230o3333M591P3878O3414l6868j19829p2424O0119J39563R2289m2558
721A11935j49028j14490L6321J36324R1165k7755r6636o2778L3447Q2865K3088
732F4458o9038p6880O322R5219R8196q542j23650j12803J0972J08756R9425J4792
$$ y = [34849, -110323, -145088, -43514, 80936, 111412, 41367, -52187, -77794, -10765, 61595, 39057, -44976, -77095, -17769, 69881, 98717, 32978, -73294, -114724, -52006, 47139, 96403, 60583, -20436, -64156, -34090, 7832, 5562, -13602, -6806, 21101, 43719, 35034, -17689, -71985, -64170, 1402, 58795, 61145, 14741, -32702, -34781, -4736, 814, -23550, -27207, 9745, 57147, 70418, 17032, -78224, -118571, -46716, 69989, 119993, 64032, -43841, -103753, -57263, 36238, 67323, 13093, -50240, -45649, 28229, 91643, 54775, -65054, -137478, -77359, 62204, 154493, 111935, -37093, -151583, -115262, 21062, 112227, 84472, -12164, -74942, -41495, 41370, 64458, -4580, -81460, -75138, 20081, 118277, 109735, -13915, -126718, -115746, -6990, 92435, 107227]
744A07227p3541r0323j6088N6982M7993j0522l8539r691L9569M6622j2881o9256
756b2448n0744J4208N7773N7637J5226m4055n6810j2023K2393Q796l648J2929
768g66L3897K6454j7680o6246n7529J2408P0368O7566J1951n6764p5648j2214
780f4203O0765M4110k4339m8900q889N0999O1475L220q3378r2999n467R5505J13464
793A01363K7132r4178j24600k6835Q4764R2106J4915n9615o6096L004P3491M8948
805G4399m7746r5312l6667O8459J17415N1754p6443j30706n7371O1934J12515
816D2231O3204l8586r5850m6384M3886O3226P504m7363m4195J3829P0772N1626
828H3900l6378q8352n1667K7563Q0103O2997j0150o4245m7303K434K4463J7220
$$ y = [107227, 33686, -56637, -72725, -15743, 32250, 21728, -16811, -26502, 13067, 59689, 46808, -22448, -73192, -58984, -1211, 56426, 71652, 27597, -29213, -41236, -18843, -10047, -13695, -766, 33131, 59585, 41905, -24341, -81870, -69462, 906, 68472, 80423, 23659, -51989, -64203, -3438, 40672, 16333, -32567, -41456, 9543, 71018, 74238, -9140, -102139, -107606, -12101, 101363, 128495, 34317, -90283, -117118, -32354, 59752, 74667, 15052, -51044, -48040, 25451, 74399, 26653, -68659, -105326, -36867, 80548, 132302, 55859, -74847, -132218, -70284, 42231, 105435, 66849, -29001, -75385, -31499, 31727, 39231, -8132, -52327, -38498, 32274, 83900, 47522, -40830, -92497, -64934, 15169, 78166, 68016, 3771, -43532, -41098, -16635, 585]
840E85L778k718J4017K3412q706n1521l9020J2969N0390M6001M615m2406m3303
853c1907J114K9193J3717j4849k0367P753M5991L5307l3009p8062m0270L5892
865d9497P8772N8215j8149q3065o0297K1677O6675L7106k5261n4467j2941N1332
877A0100N3236j7820p4091n6246J9575Q7582Q1830j4659j04177q3914J5070Q7965
889D451P0982n665p1940n6911J9812O1254K9283l2907o1617j9844N4385P7268
901F8551P829o9465p0400j1772N4439O9667K0756m7679n5711o572L2588K6425
913A8656m469k8997j0348L1440L5700r133m5915l6653P156M4830M5472l829m6429
926b519l3783R327L1779J5477j3922k6604l32L6140K3932k1150m4709k2572J8291
$$ y = [585, 4363, 1645, 15662, 39074, 30368, -21153, -60173, -47204, 3186, 49187, 53802, 11396, -31907, -30793, -1600, 12117, -2732, -23099, -15346, 30645, 65952, 32943, -45119, -85389, -49497, 29275, 87490, 69341, -13724, -74021, -52344, 14331, 51437, 26176, -28291, -41232, 10100, 63336, 45516, -28575, -84821, -65246, 22336, 104166, 89507, -14670, -98584, -83514, 4451, 75433, 69768, -2172, -59083, -39271, 21983, 51266, 18359, -43258, -63102, -8717, 68551, 76380, 6915, -63485, -75257, -20818, 48849, 69605, 21926, -33785, -40357, -7769, 18656, 14187, -14810, -25158, 6282, 41982, 32849, -13066, -49719, -42563, 2267, 47739, 43910, -2519, -36302, -26975, 4804, 20281, 6359, -20245, -20577, 15563, 39495, 18345, -26364, -48936, -30645]
939c0645N2839L1385k5371n2272j8915K6167L6266R311k7737l5145R699M7670
951B3252K5891k8857n5389k8584L1452P0414L5046m0993p0830k8549L5827O1919
963C0599K7591l7473o0303q323M7614M4399n385m8350m3779R266O2529M2736k1529
976C9592n9501l6228J8705N5062L4130k7822m7521j2231K9722L2674M027l4592
988c983l6879J0220N1363K9123k2621n0122k6080K1493N2168K4647k9938m5675
1000b6284j0887K8704L5678P416l4078l8982J0027M5032K5810j7486m0993k6779
1012d2822J9796M6766K0083k9659l8761p226K6911L4689L77l8451l1937J8408
1024b1826M3884K1298k1915m6198k4582K9288N4393J5864l8126m5540r540L6454
$$ y = [-30645, 22194, 53579, 28208, -24064, -42979, -16812, 19454, 28765, 1028, -34117, -24418, 23252, 49143, 20286, -35103, -63687, -32235, 38179, 73225, 32232, -38598, -67147, -31320, 30599, 58190, 20717, -39586, -47909, -295, 44104, 38719, -9631, -53410, -44144, 18385, 61121, 39592, -19909, -56137, -37432, 17630, 51760, 23938, -23583, -35814, -6092, 26582, 30609, -3983, -40862, -30642, 20721, 49844, 27223, -22899, -48979, -27486, 24682, 49329, 19391, -26284, -37171, -8467, 27211, 34627, 549, -38433, -28406, 16626, 42436, 24950, -16043, -42822, -23026, 23740, 43823, 14164, -24597, -31823, -4912, 29777, 30154, -8297, -40234, -21826, 22058, 43356, 21441, -24757, -49339, -20051, 34342, 50206, 12080, -33460, -43000, -6546]
1036f546M5461K719m7688l9109J3179M6011L0960j4950m9255l0333K5392N0445
1048B6286J6792k9034m0453j2139L1774M1066k623m2761k8595J6704M0885K4537
1060D2439k0892m9540k1536L4546M8439R006l5221m2387o785M0054M3182q191
1072C3114m6501l0391J5844M5881K9969k2182n4880k2939L3311M8845J4236k9795
1084A4512m5907j1915L8862M0982n669m0556k8819J2380M3258K9375k4321n3052
1096c0870j9250L3941M8117J6461l2624n1680j1589M1905M3944k274l9424l4746
1108c8089N965M5384L3285k0912n0190k1424K5550M5975K2215k8135m9591j2752
1120d2719L5118L7961J773l1205l0978M918L9113K3383k2572l9966j1650K7046
$$ y = [-6546, 38915, 41634, -6054, -45163, -31984, 14027, 44987, 30037, -19218, -49551, -24159, 26286, 43078, 14044, -26409, -38548, -6774, 34292, 31669, -11092, -39687, -22983, 17902, 42439, 21547, -27993, -49529, -14983, 33456, 42462, 7241, -35146, -41931, -1877, 41305, 33114, -13387, -43778, -27934, 17947, 47916, 25734, -29146, -52085, -18774, 30071, 44307, 14512, -31395, -43310, -4448, 36534, 30865, -9691, -38510, -26130, 17128, 46503, 22182, -30870, -50120, -16179, 31938, 48399, 15775, -35905, -47494, -5589, 38355, 36081, -3343, -38089, -32124, 13260, 46545, 25633, -24557, -45981, -20431, 25544, 47759, 19624, -29967, -42719, -7601, 30360, 32133, 928, -30050, -25132, 13981, 37364, 14792, -25174, -36824, -9778]
1132i778M1266J1642l5957m5436K72M0703L4086m827l7609l2134J3073M5466K0730
1145D1497k7940m2023j1513L1034M5502R054m2492m5238K744M2698L6515m291
1157C5547m1761l5200J5189M6132J9875k5922m0032j3178L1038M5391N904m3986
1169a003m1921M479M2011L8812l902m6743l7443J6139M6937K3134k1020m0829
1181b1349j9184K6552M5060Q572l7580l8095m47L6637L7829k937m3678l2928J5353
1194b6195M0178K0909j6182l7593j8500K6234L9822M015l4101l1993K381L6123
1206E098L3825j0367m4505k6379K0282M0457K0670k0068m3085j7816L0845M1854
1218C0811M095l3887l4125K00L7134L4613j0545m3665k5235J7489M1085K4029
$$ y = [-9778, 31488, 43130, 7173, -38263, -37991, 2712, 36798, 31971, -5638, -37772, -24699, 20767, 41497, 13557, -28466, -39979, -8945, 36557, 45611, 3119, -42119, -39375, 3323, 39838, 35547, -6214, -41414, -26225, 19907, 39782, 13860, -26172, -39350, -8312, 37079, 42983, -1003, -42924, -38445, 3566, 42378, 38476, -8267, -45710, -29571, 17366, 40500, 19480, -21349, -40533, -13981, 31079, 39651, 2071, -36024, -36471, 166, 37995, 35058, -8620, -41548, -26195, 13983, 34892, 18710, -18883, -37383, -11149, 28673, 32688, -1413, -33406, -31025, 5098, 38923, 28556, -15949, -42328, -22046, 18411, 39081, 19013, -24072, -41888, -11043, 30811, 34906, 1019, -33106, -32906, 4228, 38841, 28296, -15369, -40604, -23115, 17970, 41999]
1230D1999k0489m7504j7495L1520M0991O799k9436l5333m646L4729L3820q449
1242B6506l7936k3405J3908L7961K3307k1625m4616j3526K9487L6454Q445k5695
1254I265l5444n449L1765K9854q477l0931j8175J3639L2852J4761k5248l6542
1266b8130m090L0338L1945L219l0478l4491J957L6423K4659j2600l0694j5646
1278b7588J6587L4137R247l0956l5321J640L5974L3997K65m0301l9263O494M2486
1291G398L0215r295l6484k5920J3306M0782J6020k9836l6430m778L2407M0089
1303C7474O135m1196m6809n53M2937M1066K166l8055l8975L417L7497K3827j2520
1316A6411k8968j5343J6291L5595J1765l1281l9430l394L3111L6620O077l0833
$$ y = [41999, 21510, -25994, -43489, -11969, 29022, 35821, 6385, -28948, -33594, 1135, 34955, 26506, -11430, -34835, -20927, 17034, 40341, 18716, -25900, -39426, -9939, 26515, 34960, 9265, -26179, -31628, 137, 29991, 21514, -9417, -27592, -13953, 18899, 33660, 8412, -28130, -32220, -1882, 30063, 33282, 2804, -31687, -29730, 6693, 31352, 18752, -11942, -27588, -11001, 23136, 32383, 1427, -33894, -32254, 3720, 37717, 37982, -2319, -41582, -35088, 7398, 37613, 28318, -8166, -34086, -20780, 20002, 36022, 6186, -30244, -35022, -2615, 37474, 43609, 2413, -44396, -44949, -2012, 39054, 41220, 3165, -35810, -32393, 5104, 28931, 16411, -12557, -27900, -11609, 23986, 35751, 4470, -34960, -38354, -5243, 31377, 37454, 6621]
1328F621l4108j717K5246J9934j685j6231j3469R924K3083J056k7869k1265J0223
1341b0257K9578K1522o377l0876k2920Q841K5211J3653q392j9067n726K0304J9248
1354B4742j4477l4353j0846K3441L6794J7730k1835m5921k1434K5391M1918J6832
1366C7982k3086l6940q155L2274K9618j1260l7690k2424J6732M5705L2620k2016
1378C3360n9442l3668K4654N5948L3763j9281n1333k7458K3131L9294J2407k3342
1390H033l2724n495L4557L7582p158m6519l6357J0188M5002M0496n008m4788l4767
1403c6958N834L1044K4561m393k4603j3855J6208K2575m132k5346j9739P211K9957
1416H364K6795p582l2276k1906M731J9064J6108o5j3650l599J2279M269j6767
$$ y = [6621, -27487, -29204, -3958, 15976, 14291, -1940, -15409, -5485, 17598, 18654, -9215, -30480, -20257, 9321, 30843, 24466, -6410, -29330, -20489, 4722, 18375, 9983, -9084, -14810, 5494, 24742, 10265, -24088, -34934, -11493, 25301, 43031, 21196, -24725, -46159, -20768, 21150, 37982, 14896, -22044, -30199, 2075, 31693, 20433, -17257, -39681, -22949, 22756, 55376, 33360, -26082, -59750, -35096, 20852, 54615, 35334, -15999, -43457, -20326, 18968, 31375, 8033, -24691, -30186, 4371, 41953, 34795, -11724, -48081, -37893, 7109, 47605, 42597, -2191, -36958, -31124, -80, 24481, 20088, -4515, -18370, -2162, 20413, 16281, -9065, -28804, -21593, 8364, 35159, 27577, -4699, -26605, -21874, -2810, 13298, 13233, -417, -4016, 8263, 12532, -4235]
1429d235j9534k29K4066K9918M172k9610l2912k207K3936K5586M022k0826k2481
1442b0334R235K9101P910k8230l2006k386L6182M4514N017m2556n0894q203L8696
1455a3954N0450J2799l8184m5832J515L6822K6473j3187l3579k1028K2271M7415
1467C1981J9553l4001n6168k1129L4674N9073K4948l4310n1957j6727K4855L6107
1479A6899J2851k2381k9862K237L2307K1794j9085l7922j9950K3260M3550K1513
1491D5211k2913l7956j8649J0748K8161J8693q919k0205j662J3586M519j2348
1503a734j7169j202K2274K6153J71k6927k3713k117J8542K2452J939j9511j2604
1516a3446J4245J5894m467k4420j7040R073L5419K7749j3991m2296k9508J1049
$$ y = [-4235, -23769, -23998, 68, 29986, 34158, 4548, -28364, -30571, -6635, 18951, 22973, 2147, -20334, -11099, 18002, 25912, -2318, -34324, -36710, -528, 43986, 49003, 6447, -44447, -52650, -13954, 36496, 49295, 11111, -34721, -33206, 3616, 30089, 16902, -16677, -37705, -15434, 31981, 51534, 17533, -38635, -59764, -25090, 33983, 58931, 24621, -27336, -44063, -19208, 16899, 29750, 7369, -22493, -20256, 12051, 33845, 14760, -23162, -43112, -19852, 23698, 45211, 22298, -15658, -34307, -23559, 4602, 23295, 14376, -5829, -7491, 6095, 10614, -1734, -18903, -20105, 2169, 28322, 28493, 1566, -22147, -24264, -5722, 16730, 18669, -842, -13446, 799, 16693, 12226, -12194, -29234, -20161, 15258, 43007, 29016, -13280, -42788, -31739]
1528c1739L8965L2284j0182m0230k0221J8540L2589P109k5813l2746L05L9939
1540H800L6826q243m6590l9631M649M8803M5173o396m8701l5626J0616L8095K5189
1553C2964j3991l6835j4364K6090L6013M933l1700m0149n025L9520M2979p28l8148
1566A559l3229m80K8037K7567j526k6541j5683J2051K2266O229j9581k5991n21
1579b5843K9600K5664o087k6634k0502J570K1990J9668n664k1090p117J3403J4759
1592A3717k293j9969j6986J1271K9682J4199j6401k7704j4704J2431K9845J4638
1604B7726j8723k7720k596K2462K0958m542k7816k1692J4038L5928J8275j7530
1616A8768l6682k1827J7670M2023J9200k4218l5837r707K2172L0750N500k8253
$$ y = [-31739, 7226, 39510, 29328, -10902, -31123, -12583, 20006, 27115, 1302, -31444, -31139, 8800, 45626, 37383, -9207, -48838, -44189, 4614, 49787, 43391, -5310, -40936, -30320, 7775, 32964, 18973, -17862, -32226, -6136, 29877, 34810, 3110, -37039, -42064, -2544, 40435, 39707, 1559, -31670, -32150, -4113, 23454, 21928, -4613, -20296, -8245, 14021, 20250, 669, -25322, -25843, 3757, 29421, 23334, -3300, -23802, -22232, -242, 19426, 13762, -7328, -14445, -1042, 13717, 11424, -8545, -25531, -14260, 15422, 29621, 13220, -14484, -29188, -16757, 13088, 27726, 9003, -18717, -21313, 1149, 22107, 17565, -10251, -31943, -17905, 18023, 36298, 18768, -17914, -39741, -22071, 19952, 39152, 14934, -20903, -30610, -8438, 22312, 27812, -441]
1628d41k8716N693L2983K4052r942l5601k6086J4302M0784K0527j9334l4447j3874
1641c0100J6930L1701J0897k3856k8146J47K5748K3486m236l0079k3493J1763
1653a9238L3256J6446j4419k7929j4478J4265K8276R286k1205k1808r78J9707
1665A181J9875m185k4149j8713J3761K5428J0632j3600k4308j0303J7812K5590
1677A9021L639k2619k0308K030K2139K0923o992k8299j7054J4189K7108J2350
1689B6127j4066k7202j2190J9245K8165M176k2713k2235j068K3176K3369n247
1701A9537k8495j6877J0789K5527J3697j1214k7135j1827J9448K5346J966k0856
1713i4k2003J151K5395K2534q422k9441j7334J1565K7824J6674j2843l0256j2510
$$ y = [-441, -29157, -23464, 9519, 33571, 23629, -11972, -38058, -23756, 17028, 37555, 18221, -16226, -30100, -13170, 18531, 29428, 5572, -22574, -22427, 3321, 26807, 22571, -7508, -31001, -19238, 14018, 30464, 16045, -11884, -26362, -12097, 16179, 25465, 4260, -17548, -18526, 1181, 21056, 16871, -7278, -25991, -12230, 13198, 23830, 10230, -14078, -24381, -6569, 19021, 22660, 41, -20267, -18237, 3902, 24825, 17833, -10466, -27520, -13331, 13777, 26127, 12061, -15141, -27331, -8086, 20079, 24255, 1542, -20693, -21761, 1415, 24784, 19537, -8958, -25835, -15046, 10481, 24178, 12964, -14171, -25998, -6550, 18796, 20762, -94, -22097, -20946, 4449, 26983, 18561, -10880, -28214, -16649, 11175, 27849, 15006, -15250, -27760]
1726b7760J9704K5411M461j8555k3736j000K5540K1602p937k7676j7201R361K8817
1739A1031J8148j3791l0943j1636J8473K5457N794j8949k4703n04K6814K1996
1751B7187r111k8506j9683J0658L3026K0738j5885l4417j4855J6365K9076J3078
1763B7671j7096k8325n728K3083K1827k754k3299j9945N447K8950J9597j2601
1775A6827k8342j4696J1957K5202J2907j3782k3427m332J7879J5610k522j8717
1787e436j5761Q536K6667J2779j5402k6628j0640J4185K6505J1121j7060k4331
1799a5465l032J7401J6270j533j8875j5076J0267K5486R337j7389k5331q901J8223
1812h618K8385P589k2305k5112p66K0715J9448l340k4160j6676J3875K8816J0261
$$ y = [-27760, -8056, 17355, 21816, 3261, -20475, -21475, 4065, 25667, 17730, -9946, -27147, -17786, 11031, 29179, 15388, -15555, -27191, -8718, 16739, 22533, 3584, -21119, -21623, 5191, 27187, 18076, -10430, -30113, -19455, 13571, 34309, 18424, -15993, -30848, -14483, 14593, 27671, 10575, -17750, -23478, -395, 21432, 18678, -4621, -24566, -19119, 9831, 29428, 16827, -11515, -26211, -14254, 10948, 23855, 10073, -13354, -17686, 193, 15803, 13281, -5436, -21197, -12661, 14006, 26785, 11383, -15245, -25885, -11700, 14805, 25926, 8866, -15465, -18497, -1096, 15174, 13641, -5234, -20310, -10043, 15443, 24780, 7391, -17940, -26841, -8618, 19767, 27356, 5051, -20061, -20827, -112, 19336, 15996, -8164, -24840, -10965, 17851, 28112]
1825B8112k0134l0557j0692K3435L5763Q584k6995l2524n551K3954K9004L020
1837B5419k6513k3348O371K6797J5982j1382k8360j5375J8540L2695R735k1856
1849H705k8963q499J9894K7664N084k2784k0270M052K0356J3519q521k3702j0867
1862b4332J7820K6889M809k0542k4698o475K0660K6052K311k1500j8765K782J8124
1875C135J2842o724k0175q000J6895J9802J351j8881k0695j122K2480K2157l805
1888A9260k3437j6105O545K0890J3216j1435k4193n423J9849K2212M53k2513k4734
1901b5415j46K9334K5728n354k8485k2066N231K7366K0417j0853k7234j1513J5380
1914g610K3347P174j8769k5371k337K5085K3847l505k4834k1598M659K5321J9619
$$ y = [28112, 7978, -22579, -33271, -9836, 25927, 34511, 7516, -25008, -30559, -6605, 22399, 25419, -1094, -24442, -18071, 8726, 24708, 13326, -15034, -30409, -11869, 20826, 30561, 8705, -20258, -28757, -8863, 18801, 23885, 1101, -19169, -15117, 5239, 18758, 10237, -13465, -24332, -6512, 20377, 25186, 4644, -20054, -26529, -5869, 20183, 22494, 994, -17771, -14989, 3135, 15977, 9253, -10922, -18922, -2027, 17775, 19126, 245, -20450, -21572, 908, 23065, 19260, -4177, -20282, -13737, 7153, 20369, 8934, -15259, -20682, -833, 21379, 21832, -681, -25415, -25561, 3773, 29501, 24147, -4338, -26404, -21173, 6193, 26610, 15757, -11477, -22990, -7610, 15737, 22911, 4142, -21229, -23566, 1519, 25366, 21861, -2973, -24571, -19912, 5409, 25028]
1927B5028r772k5547j0279J1942K1379P837j6776k2985j123K2874J9969m807k2918
1940e178j8459N579K5855J5655r463k3111j1524J0621K0835R387j6814k0322M61
1953a6478J9148J5337m271j9499j6934Q780K4323J1786j2446k2395r773J3999
1965h423K4585N958j9806k2669J718K1379J6910l043k2300j8009P373K6186J4636
1978B4495j1698k4555j4146J3985K6880R488j8272k2304m121J6068J9688L060
1990A8568j8805j8814M121K1165J2546q167k0106j1226J1947K2688O655j6097
2002D475j8880l805J4439J8834J933j7831j6004N230J7773R888p438j8802q234
2015a8422J3887K0680K340j6665j8093j985J7123J9122m81k0608j4971O901J8715
$$ y = [25028, 15256, -10291, -20570, -8628, 12751, 20588, 3812, -19173, -20296, 2578, 22547, 17740, -5178, -23637, -18058, 7797, 23452, 13989, -9122, -20646, -10025, 10810, 20197, 3383, -16939, -16478, 2670, 18007, 13736, -5763, -22697, -13917, 10406, 22192, 9746, -12649, -22422, -8423, 16162, 22120, 2314, -20355, -18637, 2742, 19652, 16609, -5691, -23700, -16327, 9859, 24495, 12797, -11758, -25904, -11919, 14961, 24449, 6177, -16127, -20248, -4180, 15508, 18568, -237, -19051, -14930, 6235, 18781, 10614, -9492, -20718, -8771, 13917, 20572, 4475, -14405, -18210, -3771, 15063, 16996, -835, -16839, -11609, 6164, 16052, 8614, -10188, -18422, -4535, 16145, 18485, 1820, -16273, -18258, -1135, 17987, 17506, -3102, -18073, -11172, 7543]
2028G543R760j0174k0132o091J7809K0540K93j9901k0760n29K3231K3349l027
2041B1911k5818j9325O700K2955J5022q559k4071r607J4791K2416N167j7062k5077
2054b0557m747K3347K7118r5k4182k2003l85K0296J9399j72k0978j2295N537J6417
2068F700Q968q724k1081m560J7770J8722J122j7604j6563k234J4136J7487J248
2081A5387j4084j1418J458J1614O237q471j0981Q51J3868J0871m276j6137j2305
2094a7386K375J8595J3538n771j6276p632O569J2640K226j1366j1889O812J7754
2107A0189Q786r354k1610j3724J0775K7583J5358j3255k5841j1870J1307K2847
2119A1191P726j5830j8457P90J9511J5647n881k3739j9978R139L2484J8890j0928
$$ y = [7543, 17303, 7129, -13003, -19094, -1285, 19255, 19548, -353, -21113, -21642, 1589, 24938, 21911, -3907, -23232, -16532, 6423, 21445, 12886, -11185, -20792, -6001, 16415, 21582, 4520, -20557, -25304, -1957, 25161, 25066, 884, -21119, -21504, -1208, 18191, 18019, -2959, -15254, -9717, 6700, 15668, 6944, -14137, -18697, -927, 17795, 18917, 1313, -15250, -17484, -3348, 14139, 15387, 1303, -10115, -8657, 2957, 9194, 723, -10258, -9407, 4461, 15332, 11056, -5081, -17386, -15011, 3584, 17122, 11351, -4925, -12557, -5988, 6652, 8878, -2488, -14377, -7565, 10189, 18975, 9621, -11989, -25713, -14938, 12645, 28003, 14748, -11093, -22963, -11656, 11191, 18917, 3087, -15370, -14580, 4931, 20578, 14697, -9042, -29020, -19881, 12603, 31493, 20565]
2132B0565l0974j8375Q236K9350J6536j1041k2628r738J1845J7908N662j8020
2144f74k0288L110K4452J8470n294k4851k0196L869K4210J8403m010j7338j3006
2157a3143K459J3495P401q737j1798L361J4243Q276o846j6469j0213O519J7784
2170F332J0016n558j2928q560M793J0693J156j0319n031J0043J2449L83j2422
2183A047j6771l749J5647K0522M282j5820j8737l986J5570J6345l808j7897p415
2196a4770J1281J6868N939j4849k4495o638K0937K8937O291k1749k8810o972K1454
2209f576K5518J909j9585j7724K111J8675J5673p535k5621j3507J5894K7667J1807
2222B8706j6254k8839j2813J6397K6116R141j2798j9575o840J2240J6832j345
$$ y = [20565, -10409, -28784, -20548, 8802, 25338, 14297, -8331, -18069, -6224, 11684, 17346, -674, -20962, -17852, 6600, 25070, 19776, -5075, -25271, -21402, 2808, 21211, 17201, -137, -13143, -10684, 2811, 10212, 1475, -10323, -6962, 7281, 15557, 8711, -7758, -17971, -11452, 6332, 16348, 10790, -2138, -10698, -5905, 4788, 5944, -4375, -9406, 637, 13086, 13469, 1047, -15724, -19473, -3826, 16696, 20978, 5158, -13579, -17565, -1995, 14350, 10542, -7355, -14770, -3489, 13379, 19318, 4469, -20026, -26664, -5727, 23210, 29501, 7752, -21058, -28030, -6576, 18942, 20851, 1266, -16458, -14347, 4328, 20001, 12466, -13155, -26662, -10768, 16899, 28706, 12452, -16387, -29200, -12803, 13313, 22454, 9656, -9919, -16759, -4519, 12313, 10968]
2234A0968j6987j0747R482J8177Q383j0685k1241r524J2529J9578P885q906j5505
2247f593o495Q984J1348j925j0361l611Q023J1338J573j2064j5601k47J5424J4358
2261A4151n07j1802j3034K29J2943Q511p705j1588n16J2142J2293j951j7841j6303
2275b0978M736K0582J7000l250k0100j8421L870K1474J3032q598j7446o047J0548
2288c598J6830L548j6690j9246L11J9941K0408K33k1992k1434K033K1931J5531
2301A7806l750j6218j2140M884J6998Q410j2055j7074k609J4818J8167J571j8450
2314C58j9397J751J8037J4933q11j4542j4055K699J5338Q542q458j2959k815J0559
2328h20J3747J49j4997j3124L097J4419J0981k316j3995j0567N874J4162L908
$$ y = [10968, -6019, -16766, -7284, 10893, 19276, 8591, -12650, -22174, -9645, 9933, 17818, 8912, -6593, -13088, -4104, 7244, 5319, -5042, -8653, -630, 10708, 12281, 217, -15384, -15631, -207, 14151, 13644, 1842, -11192, -10963, 1980, 10491, 2786, -8802, -9318, 2824, 15117, 13166, -4675, -20978, -16242, 4340, 21340, 18090, -2010, -20431, -16561, 4913, 17945, 9347, -8099, -14146, -3598, 13232, 16780, 90, -19156, -18845, 1096, 21504, 21737, -255, -21689, -19656, 2275, 17806, 14056, -2162, -14302, -9418, 7580, 15990, 3935, -13139, -15748, -930, 17237, 18808, 358, -19039, -17288, 749, 15682, 14871, 329, -13726, -11027, 4311, 12853, 4395, -8564, -11379, -820, 12927, 13076, -1921, -15045, -11948, 2471, 13452, 11136, -2859, -13426, -7552, 6610, 10518]
2341A0518r162j0497p88J1498J1515l023j5746j0176O047J5492R444n365j6456
2354f699r247R433J5127L706j0168j2455j566J2000J3164k464j5631j0030M889
2367i941J4522J0239n195j6692q715R514J4692M029r036j3467k979J2451J3469
2380A2891j748j4246j0851K812J4761J1863n214j7082q297Q403J4350N700q398
2393D944j4506m327J2484J4138m54j3027j2513J420J4663J2288m713j5870q358
2406a3831P045J3723O454q184j5222l583J2944J3519n34j2524j3689P94J5928
2419B840J2986m984j5402r030N173J3847Q496p520j5267l950J1097J2604J498
2432A2388j1604j3230j63J4368J2141l187j3143r024K641J2260Q103o339j1975
$$ y = [10518, 1356, -9141, -9929, 1569, 13084, 10061, -5685, -15861, -9814, 5678, 15122, 9757, -6699, -15946, -6513, 8614, 12320, 2152, -10303, -11869, 131, 13295, 10831, -4800, -14830, -9941, 4581, 14820, 9625, -7067, -15782, -6268, 8424, 12453, 3417, -10050, -13029, -578, 12891, 11143, -3103, -13954, -11142, 3619, 15482, 10268, -6814, -15111, -6708, 7642, 13342, 4944, -9562, -13889, -1405, 12733, 12279, -748, -13261, -11841, 2822, 15110, 10397, -5473, -13831, -6786, 6937, 13391, 5207, -10015, -13598, -654, 12865, 12331, -193, -13882, -13088, 2840, 15826, 10842, -4560, -13590, -8417, 5430, 13926, 6406, -8861, -12811, -1714, 10890, 12388, 784, -12446, -12609, 1759, 13900, 10713, -2430, -11454, -8813, 3447, 11550, 5211, -6764]
2445f764k458Q730R064O00r937j0931J903J3619Q622m215j0867p864K938J1647
2459D087N952o117j0622q04Q225P471q10j0917q985M917J3999P904p502j2764
2473e966p469O516J4303M976r123j1664j209R963J0300j636j3490j0563O536J5351
2487F825R278o676j7020j0070P217J8679Q516r683j4968n793Q774J4736K589j3423
2501a019j1801K915J3690J1005l528j6160j3083O185J8027J0189o422j5106q172
2514a3280N656J4224N175r642j1297PJ0390R646k133j3550r675N161J4618Q393
2528A3693m560j2783p543M409J0281N646q159o286J271P015N017l663j0911n009
2542a1582Q838J1031L456q131j0608m824R106J1828j634p931p385L134J0014N174
$$ y = [-6764, -9222, -492, 8572, 9172, -765, -11696, -9793, 3826, 12448, 8233, -2634, -10498, -7560, 4087, 10039, 3922, -6700, -7504, 721, 8192, 7382, -3535, -12520, -7603, 6396, 14300, 6798, -5966, -13435, -6919, 7384, 12360, 3237, -8427, -9636, 327, 10627, 8991, -4499, -15062, -8526, 6825, 16103, 9427, -7593, -17663, -10446, 8233, 16749, 7066, -7902, -13695, -4921, 9815, 12404, -1019, -12820, -9905, 3785, 14790, 11262, -4898, -17981, -11796, 6231, 16420, 9998, -5108, -13280, -7624, 6600, 11775, 2133, -9164, -9157, 1233, 10879, 8746, -4804, -14479, -9318, 5300, 13693, 9133, -3650, -11193, -6784, 3497, 9143, 984, -5302, -4031, 2984, 8001, 4338, -6573, -11582, -2744, 8287, 11743, 3612, -6996, -11820, -2714, 9114, 7480, -451, -7836, -4702, 5312, 10486]
2556A0486p745j2074l583J1846J2610L830j1386j6823k311J3144J3201J254j1748
2569G01j1126J748J1864Q841n960j4127n672J0519J3802M903j0785j8374k845
2582a6511J3540J4054L335j1372j3568j694J1955J1075k887j2531o247N519J2065
2595F733O217p073j5358n164J0967J3333L384q710j2533k997R650P842R23q254
2609a040m770K521Q228M502q210j0562k77J0060J0085l36j1045j0042J575J1401
2623B090Q224m743j0111m559N472J1472J892j0582j0572J681J1021J0139o94j2873
2637b143j1309L686J3782P688n178j1202o433O694J1242L240r511j0296K74J0425
2651I59J0731m84j3660j1185M247J3344Q343m281j1987q373N521J3651M564p856
$$ y = [10486, 2741, -9333, -12916, -1070, 11540, 15370, 3984, -12839, -15150, -2006, 11195, 12449, 701, -10425, -8677, 3187, 12028, 6068, -8059, -13731, -3212, 10590, 15493, 4708, -13666, -16511, -2971, 11083, 14418, 3046, -10522, -12216, -261, 10814, 7927, -4604, -10851, -5332, 6733, 12950, 5877, -9481, -14645, -3678, 9655, 13039, 4329, -8204, -11201, -1551, 6291, 7214, -1040, -5810, -3289, 4939, 9441, 1231, -9331, -9608, 452, 10537, 10201, -844, -10886, -9311, 2090, 10314, 5571, -4540, -9099, -3627, 7845, 9737, -845, -11417, -9736, 1285, 11424, 10730, -2143, -13452, -9766, 4016, 11704, 6526, -4676, -11109, -4415, 6827, 10067, 556, -9740, -9466, 959, 11690, 11206, -2454, -13639, -9392, 3952, 12295, 8014, -3973, -12346, -6825, 6826, 11390, 3534]
2665C534j0366l188P815J1804J000j1120j0172K193J0963P746k288j0824p474
2678a0377N090J0024L689m828q969k185O838R165j526j0300n823M571R705N059
2692A0133n010j1834m592Q210J1575K412q540j0864k016J0058J1271k301j0830
2705b328p539L492J0152P648n740j2364m801Q062J1702K884p690j3062k598J0384
2719a798J2143r11r780q452N98J0384P713l955j1820m628O731J0442M603p137
2733D133j3439l566J0580J1319R18p800r231k131P835Q324j503p794l889L805
2747b439O599K688n958q872J97Q212O635q85o389o267L00P481M732l966o540l60
2763d832N956O239j510r762p375M981J1228O495l509j1084r132L555J2760P146
$$ y = [3534, -6832, -10020, -2205, 9599, 10599, -521, -10693, -8500, 2463, 10209, 7921, -2903, -10377, -5287, 4737, 8426, 3598, -5371, -7556, -718, 8447, 6921, -3379, -9202, -4631, 5074, 10133, 5123, -6711, -11303, -3093, 8482, 10894, 2354, -8510, -10526, -468, 10803, 8502, -2328, -9867, -6375, 3777, 11425, 5685, -6679, -11480, -3418, 8284, 11168, 3478, -9584, -12182, -1798, 10345, 9434, -346, -8798, -8200, 2184, 9897, 5942, -5878, -10506, -3775, 6667, 11270, 4133, -9306, -12872, -2292, 9027, 9945, 2145, -7086, -9217, -1382, 6942, 5439, -2355, -6244, -2439, 4160, 6848, 890, -7982, -7785, 427, 7062, 6177, -212, -6479, -6179, 1302, 6034, 2068, -4472, -4832, 1124, 7363, 5853, -3909, -11284, -6303, 4925, 11420, 7911, -3173, -12305, -8750, 4010, 11156]
2777A1156n959j0108l627O565R173P42j0143q467L016J1313R208k359j3442j2287
2791a5219L770J5742R300m606j1976p593L897J1096N401p307r829j831Q942J1050
2805A0837J354j3015j3100K121J2575J1289j38r958j1599n99R298Q193j455o524
2819g21m075K689P304Q38p398o482K214P162O023l91o573p333J047O469L052k109
2835A716l049k93M067L409m360q964j636P840Q539K945o214j0292m207O775R311
2850E587J425o029o163P49P815N338o643j1148k012Q970J1614M327q550j5467
2864a0187n458R932J4450M158q455j1923k952J0029R471l008j0658o000M373J2325
2878F097R402o629j7228r295P830J6163R192n521j4315q068N364J0146L763m025
$$ y = [11156, 5197, -4911, -8538, -1973, 7200, 7942, -2201, -10668, -7652, 3661, 12869, 10510, -2932, -15219, -11449, 4293, 13593, 8987, -2989, -10582, -6685, 4411, 9812, 2505, -7324, -9155, -213, 10837, 12191, -824, -13924, -11803, 772, 12061, 11923, 1965, -9634, -10233, -935, 7258, 5803, -721, -4796, -2107, 5197, 6035, -1363, -7845, -5631, 1531, 7554, 7163, 590, -6743, -5696, 773, 3825, 1716, -1333, -1626, 2441, 5850, 1490, -7474, -9110, -1270, 7269, 10214, 4000, -6292, -10499, -3724, 5587, 7012, 983, -5180, -4431, 3384, 8722, 2079, -9069, -11081, -2111, 9503, 13830, 5280, -10187, -15645, -5713, 8737, 12895, 4440, -7483, -10435, -406, 9065, 6057, -4601, -10601, -6228, 6097, 15499, 8870, -8358, -17653, -9823, 6340, 15532, 10011, -4304, -12372, -7008, 3138, 6901, 2876]
2892B876p336k141P661Q432l254j1763n933M861J0707P282l167j0611o724K562
2906f548O794M307j243m727q38M912K658n960p128J024O618P540K213o976r245
2921f599j833O118O483P11m670l997K824O667j70r034o443K766R889R456n29j2940
2937a301j1758K168J1926R528j219j0543q014M036J1179K756q019r879j003J0209
2951F6J2774J362j3925j4631j19J2974J3972J782j2509j2591Q60J0921P479k773
2965E642q849n595N279J1568L420r736j1752k229R340J2788L000j0145j1294l71
2979h934P203P217N34o074n586K642Q053J835o944p591j56P453Q745J11q757p212
2995g461J417N584N194m59o177l545N103O162j391p782m956K690Q973O602l642
$$ y = [2876, -4460, -6601, 1060, 9492, 6238, -5525, -11458, -6597, 4110, 11392, 8225, -2386, -9110, -6548, 246, 4553, 3310, -1417, -2255, 2657, 5315, -645, -7773, -6749, -131, 7409, 9622, 2646, -6599, -8432, -2314, 4169, 4880, 210, -3787, -963, 5704, 5534, -3500, -9943, -7177, 2712, 12168, 11639, -1301, -13059, -10891, 1035, 10563, 9344, -1199, -9213, -5177, 6002, 8758, 739, -9140, -10143, 66, 12840, 14202, 277, -14354, -14473, -1499, 12473, 14255, 1746, -10845, -9985, 936, 8415, 5642, -3207, -8802, -3523, 8045, 11465, 1729, -10023, -12252, -2912, 9876, 12876, 2731, -8563, -8934, -1731, 5486, 6020, -54, -5640, -2998, 5055, 6890, -54, -7645, -7801, -348, 8397, 8508, -249, -7461, -6044, -460, 4734, 4275, -1902, -5447, -344, 5818, 4427, -3355, -8311, -5621, 3352, 9954, 6312]
3010F312j0263n856M346Q325N279l996r515k701Q214P819k090q960o595K621J1115
3025D055Q134m719j2566o989M980J1571P026n695j1928l539Q084Q636O95q066
3039c21q844L65J1325R509l704j1914p704L238J1550Q162n146j1412m332O222
3053c006Q387K539o321r544j01R877P926k791r461p195K669J0328O738m527j0090
3068d572l292M835P963K755o299q549J82R271N833k124q372o563K426J0206N744
3083I444m959q752l103M348P512K874o426p902J235P994N418k301p810o430L488
3098e370R924M260n192p817l189M470Q024K137p239p279J745P732N515k351r165
3113c795n834M196R998M389n124q062l771N013Q648J351p925o436K006Q015N476
$$ y = [6312, -3951, -9807, -5461, 2864, 8143, 4147, -5368, -8069, 145, 7964, 5874, -3086, -9681, -7060, 4055, 12189, 7470, -5096, -12085, -7105, 4466, 11492, 5797, -6131, -9670, -1586, 7050, 7745, -321, -9165, -8800, 2525, 12034, 8330, -3584, -11288, -8050, 3500, 11662, 6516, -4896, -9228, -3006, 5381, 7920, 1599, -7945, -8046, 1831, 9757, 6966, -2495, -9690, -7021, 3307, 10045, 5518, -4572, -7864, -3029, 4934, 7689, 1390, -7159, -6977, 2294, 8127, 6003, -2369, -8932, -6506, 3700, 9444, 4485, -4267, -7370, -3022, 4490, 7364, 938, -6964, -5729, 2265, 7683, 5382, -2428, -8858, -5370, 4554, 8814, 3622, -4195, -7384, -2914, 5110, 7247, 8, -7271, -5526, 2206, 7721, 5370, -3795, -9629, -5433, 4565, 8954, 3830, -4232, -8003, -2990, 5658, 7009, -916, -7352, -5346, 2669, 8145]
3128H145l101r765n777N874J0552L607o304q778l887P067R419N52q849o786K110
3143e921Q728O790l222j1853o089O101J1118N383n408j0809n882O722J0491K519
3157H668p085p694p76P082P882j325j0227o349M107J0073O031m124j0755o408
3171a0900N859R764L275m684p306k433N479P184j132p497n007L170P664N643l671
3186E408r649n070M987Q421K940l527o412k370M864N354k132n925k356L509O980
3201E022L223n601r207k193P889P620K96n372p475j67P455N450l733q020k397
3216g210N156R356L084q492j1489j280R305J0362K189q474j0991j145R698Q294
3230H363k126q353n976L318J0469M731p779j1162k907Q234J1135M213q588j2281
$$ y = [8145, 5044, -4721, -10498, -4624, 5928, 9535, 3231, -5547, -9434, -2367, 7052, 7604, -1245, -8031, -5921, 2807, 9597, 6375, -5478, -11567, -5466, 5652, 11035, 5627, -5182, -11064, -4342, 6149, 8668, 1583, -6111, -6887, 195, 8077, 6752, -3475, -9824, -5717, 4356, 10387, 6263, -4492, -10900, -5041, 4723, 7998, 3314, -3992, -6425, -946, 6238, 5106, -2391, -7398, -4228, 3436, 9079, 5408, -4241, -9311, -4324, 4097, 7037, 3510, -2902, -5272, -408, 4946, 2814, -3111, -5467, -1958, 5022, 8245, 2644, -6563, -8756, -867, 6753, 7049, 1677, -5798, -5965, 1490, 6940, 3207, -4813, -7210, -2054, 7302, 10386, 1894, -9595, -10875, -1570, 8792, 10981, 2507, -8484, -9629, 69, 8363, 6237, -2116, -8092, -4774, 5695, 10426, 2647, -8515, -11422, -3188, 7947, 12160, 3572, -8709]
3244h709k432Q908R213J367p929p913Q55R085O100n018r025l946N525J0378M621
3259A1080p461j1229k455O986Q637K212n602p540k25O966L686l228n809k062M589
3274a455P896J289p898p807N98P057P049k5p143o310K404P312K236m197o155j609
3290f758P172Q122o62r847q182K367R609Q509k060j0390p879M260R166M233m358
3305C302q430l024P175R754m26r211r092R33J0243J0018j543j2154q812L646J0543
3320B922O518k617j0613n460O157R710J206p203q308q88Q921J0966k339j0597
3334a625p946J859R463P603k343r573n014M537Q002J782m860p688O24O753P462
3349I036l728q851n341L907Q780N319m882r223l231O750P069P51n982o757M17
$$ y = [-8709, -11141, -2233, 6980, 8347, 418, -7495, -6640, 2445, 8545, 3527, -5498, -9444, -3919, 6459, 11080, 3619, -7610, -10065, -3079, 5558, 7770, 2168, -5372, -5597, 1369, 5055, 1827, -3982, -6044, -1455, 6441, 7730, -168, -7975, -7377, -320, 6729, 6704, -439, -6749, -4345, 2967, 5203, 1006, -5149, -6758, 414, 8536, 7874, -1973, -10155, -7788, 1821, 10330, 8270, -2120, -9999, -5739, 3427, 7660, 3302, -5128, -8152, -977, 8777, 8351, -860, -9952, -9019, 1224, 11242, 9699, -2455, -11267, -7621, 2922, 9440, 6823, -3790, -9250, -3093, 6617, 7823, 620, -7688, -8576, 345, 11311, 8972, -1625, -9571, -7712, 1751, 9354, 7011, -2562, -7576, -3039, 4963, 6745, 1885, -5803, -5179, 1574, 9036, 5308, -3543, -8884, -4977, 3803, 9122, 4240, -4983, -8214, -1464, 5605, 6356, 374, -6383, -5966]
3364e966Q341O394m349r319m160M797Q823N729o388j0728l340P407R367K154p584
3379A178r591M67R445P169k987q752n802L102J0114O587o001j1828l817O752J0707
3394F743L309p254j0073j379Q091P148l07p106o801J561R340N444n098r487k557
3409h426N754Q622K809o716r309m91P340O521l90o527n930K320Q431L099n817
3424A290p471j332O817Q217R93q910q145J072Q601O704r83q521o635L411R283
3439D391K844o561p305o86P320Q819o97r645q374J572R722P978n10j0244q592
3454i968L550J0161M455l853r384k429M696J0105J648q730q519j266R047J0354
3468I867J142j0717r828J747Q069O342o33o467n440L016P341J648n473o743r76
$$ y = [-5966, 2375, 8769, 4420, -4899, -9059, -4262, 4561, 10290, 3902, -6826, -10166, -2759, 6608, 8762, 1178, -8413, -7946, 1499, 8668, 5681, -3071, -8873, -5771, 4343, 10930, 4929, -6899, -10716, -3964, 6743, 10052, 2798, -7275, -8654, -563, 6585, 6278, -828, -7629, -6068, 3272, 8716, 3618, -5869, -8426, -2672, 5950, 8759, 2043, -7266, -7757, -417, 6104, 5714, -813, -6743, -4423, 4008, 7107, 1290, -6181, -7513, -696, 7521, 8514, -396, -8541, -7469, 1132, 7836, 6853, -1668, -8303, -4892, 4391, 7235, 674, -6631, -7317, 3, 8822, 8125, -1520, -9894, -8322, 1400, 9378, 8868, -1376, -9968, -6418, 3743, 8198, 4345, -5039, -7468, -2772, 7333, 8981, 251, -8268, -9534, -487, 9867, 11009, 292, -9536, -7789, 280, 6622, 5989, -478, -5918, -2902, 4439, 6087, 614, -6129, -7105]
3483g105P220Q583j161q992o214J634O418N061j63n767m632L289N579n7n390m458
3499f155J999P400N659l996r489l895L524P539N190k899q220l271N387N962q50
3514C885o613m641L497R322N360o681j0949n529N882J2026P310o122j2491n088
3528a0832O920R352J986o116q325K89R220P720l692j1358p672L797J3173R257
3542A3719m403j3675p346L397J0483O474k849q764l396N324O413o94o764o250
3556h331J544J0370P700m152j0546o555K650Q790O394j683o607m215K494L668
3570A521J060l523l468J942P209L267n873p112k703L887P117L979l780o010j401
3585c888L127L460j473m438k121N511Q152m33q527q148n55P286J0549K560q468
$$ y = [-7105, 115, 8698, 7537, -1455, -7669, -6035, 383, 5444, 5281, -486, -5118, -1829, 3750, 3693, -1697, -6155, -4156, 3244, 8903, 4907, -4582, -8477, -4953, 2586, 7776, 4877, -3343, -6614, -1227, 4735, 3885, -2728, -7369, -3872, 5450, 10810, 4129, -6820, -12349, -6467, 5559, 12869, 6747, -5744, -10832, -3912, 5440, 7426, 1310, -7015, -6726, 2494, 10214, 6522, -4836, -12508, -8711, 4462, 13719, 9316, -4359, -11705, -8308, 2175, 8649, 5800, -2964, -6360, -1036, 5377, 4683, -2081, -8331, -6787, 3583, 11283, 7131, -3415, -9970, -7320, 1470, 7864, 6181, -426, -4641, -2147, 1521, 2581, -942, -4410, -2468, 4741, 8008, 2135, -4977, -7680, -3793, 3324, 7303, 3523, -2487, -3888, -761, 2699, 1226, -3212, -5333, 178, 8330, 7897, -630, -8778, -9333, -2047, 8502, 11062, 2594]
3600B594j0102p90P837P331j462p842n109M891R056K954p085j0820l539Q067J3842
3615I823L834r886j2500k564P450J0790J915p458q114J073P787N319l927q780
3629e238n650O468J2869L778q170j2326l109O768J0080L856n400q803j652N676
3643h53N342j66p685l664M924P950K243n775p930k881M809Q695K370m916n593
3658c130j963N266L613k598n110q98N871O619j292q864o106J129O971P996j264
3673F240p168n434J835O489M306l942p992m72O553P849q45q646p953P90R604Q314
3689I528j574r046p798J020R314P042m567p565l133N666P332J702p815r702K86
3704i310J0002J0444q16j0694r224M16J0327P728j830r244m817L399P108L806
$$ y = [2594, -7508, -8298, -461, 6870, 5408, -2434, -7543, -2652, 6404, 9358, 2273, -8547, -12086, -4019, 9823, 13657, 3771, -8729, -11293, -3843, 6947, 8862, 1404, -6710, -5637, 2150, 7469, 3542, -5238, -10888, -4420, 8449, 12227, 4057, -8269, -11378, -4610, 5470, 9326, 3926, -4877, -6529, -853, 4489, 4323, -3362, -7026, -2102, 5848, 8091, 2316, -5614, -8495, -3686, 5009, 7379, 2463, -3130, -5093, 173, 3786, 1188, -3922, -4820, 1051, 7670, 6378, -2486, -8592, -7463, -492, 7504, 6240, -928, -6362, -4527, 1962, 6268, 2326, -5666, -6138, 415, 8264, 7419, -1227, -9180, -8390, 1214, 9528, 7954, -1092, -8890, -7870, 1444, 8486, 3919, -3646, -6779, -1113, 6219, 7921, 106, -9596, -9310, 692, 11136, 10320, -374, -9598, -9182, 1145, 8873, 7043, -2201, -7018, -3619, 3489, 7295]
3718G295n174q518k033R149P608L49q204q754J74R023P012k350p053l670m4Q209
3734C019L410m938p418N04P062N973k348p392n935K199P971N945l368o779m570
3749f665L305P476K039n754o384J252N895N618j802o596o380K362R061M231l362
3764D296p656l151L124P450J806n817o513J389O444N392j308q799n681M024Q656
3779C656M891m411q326m549N199Q940K089o698o834k52O229P081p42q065o684
3794h476K835Q348N210k843q557m596M458Q523K321n910o949p57O139P297m71
3809F572q346o397K397Q290N550k357q975m829M213Q337K375m825p121j718O182
3824f52P609j61q122n922J499P560N829j858q339m892L713O912K652l387o167
$$ y = [7295, 2121, -6397, -8430, 719, 8327, 8676, 472, -8282, -8108, 915, 7927, 5577, -1476, -5146, -5190, 3019, 6429, 1491, -5927, -5423, 1639, 7612, 5264, -2128, -8063, -5864, 2107, 8052, 4684, -2095, -6665, -3360, 4116, 6155, 401, -5983, -4731, 1164, 6782, 4980, -1616, -7996, -5634, 3427, 7658, 4296, -3360, -6511, -3387, 4063, 5869, 52, -6461, -5072, 1372, 6764, 5456, -3343, -9024, -5000, 3656, 8547, 4136, -4190, -8739, -3540, 5400, 7489, 791, -6043, -6295, -66, 7015, 6273, -1792, -8476, -5641, 2707, 7917, 5074, -3483, -8079, -3621, 4902, 7223, 1313, -5636, -6393, -254, 7043, 6572, -1774, -8171, -5774, 2516, 8066, 5709, -3266, -8095, -3882, 4455, 6830, 2005, -5116, -6834, -652, 6957, 6796, -1326, -7248, -5749, 1811, 7640, 5782, -2557, -7449, -3736, 3176, 5828, 2441, -3726]
3839c726j991N459O391r79o772m546J730O630N043k664p291l797L569N899K242
3854E197l233n828q65N086N070j838n716l946K197O681M740l369p905k669L614
3869b784O226K098l394o734k43N580N125k282o856l428K881P727M962n262q018
3884d402l487M263Q414L417n268p825j343O329N877k299m732n683J992Q895N166
3899I314m447r855m831M172R341N571m599q872k819M989O290J331n239o187L72
3914e469P720N107k940p469m864K431Q889M820l868p525l195L230N541K455l530
3929A333n588R82N057K914k124n872l253L119P536K936m393o425j726L300N450
3944C246J582m717m126J793M593J947l044n474k115M989P123J566o318o784r26
$$ y = [-3726, -5717, -258, 6133, 5154, -1618, -6164, -4434, 2196, 7239, 4575, -2716, -6513, -2944, 2955, 5197, 1964, -3864, -4729, 357, 5427, 3589, -2127, -6073, -3876, 2805, 7545, 4176, -3729, -6398, -2784, 3442, 5540, 2146, -4588, -4831, 749, 5874, 3592, -3264, -6692, -3811, 3916, 8878, 3616, -4402, -7889, -3626, 4788, 8205, 2937, -4888, -6231, 98, 5975, 3676, -1056, -6739, -4747, 4148, 9314, 4867, -4988, -9819, -5647, 3694, 9265, 4666, -4206, -7025, -2036, 4254, 5585, 346, -5841, -5469, 2251, 7358, 4418, -3051, -7915, -5484, 3405, 8225, 4357, -3168, -6363, -3133, 2408, 4863, 1333, -4255, -3273, 1784, 4698, 2574, -3298, -6551, -3432, 4104, 7040, 2647, -3778, -5504, -2204, 3246, 4828, 111, -4015, -2222, 2371, 4318, 1274, -4200, -6315, -1326, 5797, 7363, 1045, -5739, -6665]
3959f665N172O860L47n769m966J724N605L020k787o886k999N825Q417J343o973
3974A268p815k365P113Q930J229p607o647K79N896N465r58p140m752M208P673
3989D777L009n192q146l405O249R002J873o078p048j526N165O134L55o252l977
4004e060K830N405K393l929o597j928O136O875N86n361o468o88M961N747l71o091
4020a560k840L090L500J875l454n410o33O099N989j975n657n083P1O971M716j825
4036C874o404k833L736M696J882m883n881M07O933N722j787p263n949J171Q520
4051A941N794k518p675m137K561O971L141m126o647j257N823N595J38n730p153
4066g279R02P816N969k238o931m361J298O581M110l003o141j298L616N290M60
$$ y = [-6665, -1493, 5367, 5714, -55, -5021, -3297, 2308, 5328, 2541, -4345, -7344, -1519, 6898, 8241, 1268, -6547, -8912, -1799, 7131, 8360, 753, -5894, -5615, 281, 5746, 4788, -2352, -7104, -2896, 4777, 7786, 2594, -5552, -8957, -2708, 6294, 8167, 2089, -4959, -6485, -1320, 4814, 5169, -1083, -5060, -2230, 3175, 5568, 1639, -4958, -6886, -750, 6125, 6711, 1350, -5118, -5806, -845, 4902, 4531, -1560, -4400, -1310, 2190, 4065, 611, -4799, -5432, 667, 6656, 4681, -976, -6059, -5988, 983, 5699, 3874, -2530, -5363, -1627, 3069, 4951, 68, -5813, -5406, 1527, 7249, 5462, -1801, -7750, -6579, 1941, 7735, 5217, -2458, -6595, -4034, 2937, 6078, 1952, -4695, -5952, -129, 5466, 5604, -126, -7279, -6377, 1439, 7408, 5170, -1761, -6122, -4824, 1757, 5867, 2864, -3277, -4575, -959, 4331, 4791]
4081D791m883n885R91P453L955k104o364m225J865O794L443k979n825j332L292
4096a013N005L82n274m783K635O151K808k891o173l336L181P780J976m555o570
4111d677q22M733N628m4o382m170K488O351L209l003p507l891M565Q713K687n036
4127B842p388k679M833P213J309n689n514O63N290M015j381o222l775L556P257
4142D330K195m235o408k390M251O315J357m067m656m45L583L352l88m836k593
4157d635L262N024J098l779n131j661N048N393J14m325l726m44L286L764j014
4172B274m744r72L684L725q1m859m513M82O281N115j332n884n223R65O232M454
4188E604k391o194j747L721M556J074m743n718NO647O577p87o866p076K64P449
$$ y = [4791, -92, -5977, -4986, 2467, 6422, 4318, -2046, -6271, -4406, 2388, 5831, 2852, -2973, -4305, -1013, 3992, 4374, -900, -5683, -3048, 3103, 5911, 3020, -3153, -6489, -3308, 4472, 6448, 1893, -4677, -5499, -766, 4862, 4818, -1564, -5734, -3246, 3105, 6314, 3311, -4196, -8087, -3522, 5191, 7878, 2842, -4546, -7225, -2392, 4821, 6130, 441, -5073, -4410, 880, 4895, 3514, -2708, -6483, -2927, 4330, 6525, 2290, -4118, -6508, -2257, 4058, 5415, 1348, -3308, -3753, -170, 3182, 2794, -2042, -4635, -1373, 3651, 4749, 970, -4161, -5822, -774, 4619, 4733, 408, -3318, -3762, -476, 3288, 2274, -2470, -3442, 242, 3967, 3886, -973, -5486, -5004, 1277, 6392, 5060, -824, -6047, -5082, 1150, 5604, 3213, -2981, -4728, -1007, 3549, 4623, -120, -5838, -5833, 814, 7391, 6604, -262, -7338, -7074, 375]
4204C75O469j543o353l958J622M673L383k601o019j408N272N756k7n632o425j19
4220f535O771N371J92n428m383j31L767L912r06m200j386L215K955l0l872m037
4236d725O58M979L460p16l752l361j32L615K856k081k082M18K513J172j402m194
4252b774k755K869O048K285k815n277k983K331N568K074l909l695O73L301K688
4267C629r88n555l442L799O942L293m020p363m222L754Q290K054l288n007k347
4282d471L767M417N0n746l175K623N081M605j946p574o769L292Q201M533k058
4297D830n656m224J453M228K889k248l742n68M126L410j002n100l525J592N327
4312A790L430j559l464m416L94M029J996l18k034j168L596K05q48n484q48L971
$$ y = [375, 6844, 5301, -1052, -5010, -3388, 1285, 4668, 2067, -3952, -5360, -88, 5668, 5641, 9, -6416, -6535, 236, 5607, 5799, 371, -4012, -4143, -376, 3536, 2630, -1570, -2956, 259, 3214, 3184, -688, -4725, -4067, 912, 4372, 3656, -96, -3457, -3589, 26, 2882, 801, -1281, -863, 1650, 2822, 1420, -2774, -5529, -2660, 3388, 5673, 2858, -2419, -5402, -3071, 2497, 4571, 662, -3033, -2360, 941, 3629, 2641, -2914, -6356, -2557, 4385, 7678, 3658, -3705, -7927, -4173, 4117, 6171, 2883, -2124, -4471, -704, 3713, 3763, -1983, -5158, -2535, 2546, 7151, 5205, -2369, -9138, -5846, 2355, 6888, 4830, -826, -5050, -3597, 631, 3520, 1272, -2470, -3038, 1088, 4498, 3496, -1604, -5129, -3537, 1790, 5220, 3661, 197, -4219, -3825, 204, 2200, 1882, -152, -1320, 2276, 2481, 1633, -3851, -4699, -728]
4328g28M037K399l211m747k626K240M539J482l138j559J087K716j018j600m241
4343d368m30M537M273K971n421o896j979O147O157r52l868k907L7L670L736k725
4359A982o132q00M044N882J032m668p230k167P989M960J477l149o849j930M466
4374a093N067j261l033l751J332N573K464l347n654k860M805O528J390l890n117
4389b847k007L246M133J16k750k302N55L890K298l528m875m67L967L863J593l605
4405A280m784r35L777L366l85k589j718Q06L612M25l645l407Q21M231L338k0m642
4422d69m493J334M621K447j167m128j785K950M305j76m777l437R21M734M338p95
4438D423n327n122J291N823L442q29m869l044K296M588P90l278l790k31M036M653
$$ y = [-728, 3309, 5708, 2497, -2250, -4876, -2636, 1903, 3385, 247, -1312, -225, 2491, 1473, -127, -4368, -4798, -261, 4012, 6983, 1562, -5334, -7313, -1166, 4991, 4039, 171, -2736, -2699, 971, 4707, 1982, -4150, -4950, -906, 4976, 6008, 1340, -5890, -8057, -68, 4892, 6369, 3220, -3629, -5559, -1093, 3974, 2713, -320, -4071, -2739, 2834, 5298, 1951, -3703, -6563, -1758, 4770, 6160, 2270, -2847, -4854, -1608, 2525, 2641, -109, -2411, -1856, 2034, 4332, 804, -4071, -4538, -571, 3292, 4885, 1280, -3504, -4439, -662, 2704, 2319, -270, -1988, -1182, 2430, 2855, -790, -4197, -3376, 855, 4193, 4173, -469, -4962, -3628, 993, 3440, 2273, -1855, -3640, -690, 3615, 3439, -1338, -4775, -3854, 880, 5218, 4423, -904, -6026, -4735, 1088, 4530, 3701, -1168, -4212, -1916, 2672, 3462, 184, -3606, -3837, 199, 4852]
4454D852on911m740J720M994L367q22m525l440K063M532J644k901m083j248M318
4470a86M471L41n171m463O11M628M080l2m698l649J639L554K055k066l528j065
4486c479L481M022o29m297k865P01L657L796j101m185k923K070L525J080k213
4501F40l267p4L442L578j823l782k711P49M548L324j731m323k086K032L246J196
4517B958k004l370m45L961K803k132l605k352J579M618K626k745m114j356K251
4532a327L398J191k776l747N31M347K331j562m461k895J764N814K890l142n042
4547b686k181K427M534J948k830m184Q4L261L012q92l483l735J342N608L238k745
4563B718m450l198J719M941K372k253m176p72K475K895M61l312l714J443M619
$$ y = [4852, 4846, -1065, -5805, -4085, 909, 4276, 3454, -1071, -4511, -2448, 2084, 3728, 827, -3256, -4504, -186, 4285, 4626, -545, -5008, -4397, 231, 4311, 4279, -419, -4068, -2429, 1125, 3180, 1114, -2414, -3479, 2, 4024, 3395, -902, -3767, -3066, 591, 4387, 3286, -899, -3822, -1752, 1773, 2853, 640, -2627, -2701, 741, 4319, 2496, -1286, -3997, -3248, 1300, 4624, 2893, -1430, -3516, -1484, 1762, 2958, 954, -2416, -2861, 1100, 3903, 1771, -1834, -4186, -2607, 2011, 4637, 1892, -2222, -3578, -1327, 2071, 3262, 486, -3261, -2730, 1617, 3948, 2386, -2075, -4970, -3206, 2608, 5498, 2356, -2686, -4867, -2440, 2094, 4042, 1212, -2972, -2888, 373, 3385, 2493, -990, -4725, -3383, 2225, 5463, 2718, -1732, -4930, -3211, 1730, 4102, 1849, -2327, -3099, -624, 2271, 2732, -580, -4294, -2851, 1768]
4578A768K692j585l876l552J103M465L179k089k974j715J188K569O85k259k166
4593b567J035L592J203k033k938k192J800L924J565k178k483m42J308J807P3l179
4609a705q28K437L208K26k679l790j750L967M722L06l302l584n80L065K965k45
4625B433l828j635K294L771P79k765m986j506M206N497R13l669m966j298L715
4640a045M472L3l880k593J120L331K294j865n000j631L227N448J485k811n315
4655b730k717K772N304J364k234k840j441K052K492m47k958j462K100K942J236
4670C433j671m131k091K698L801J027j891k383p45J569J786r75k161N4K340K094
4686B754K11l495l356M05L817L201j48l099k956K71K927K044k215k479J14K650
$$ y = [1768, 4460, 2875, -1001, -4553, -3450, 1015, 4194, 2105, -869, -2584, -1396, 1173, 1858, -401, -2567, -1532, 2060, 3263, 1230, -1708, -3900, -2100, 1824, 3389, 1211, -1272, -1714, -406, 1401, 1474, -1705, -2533, -96, 3112, 3338, 659, -3131, -4881, -914, 3808, 4114, 812, -2772, -3352, -287, 2678, 2433, -1395, -3030, -736, 3035, 3814, 1049, -3937, -5443, -1237, 4260, 5173, 1504, -3462, -4760, -1045, 3427, 3460, -420, -3013, -1893, 1438, 3732, 1867, -3133, -4764, -1537, 3911, 5396, 2585, -2730, -5447, -2675, 2629, 3993, 1759, -1081, -2522, -470, 2022, 1575, -1383, -2845, -745, 2197, 3433, 1762, -2369, -4460, -1762, 2039, 3066, 1175, -1208, -1953, -384, 1402, 427, -1734, -1680, 660, 2754, 2965, -530, -3886, -3481, 336, 3537, 3389, 290, -2666, -2395, 532, 2576, 361, -2118, -2004, 646]
4702F46K708j17l898m449J104N019L837j098m043m236P80M686K684j490m054r37
4718b858K225L705P79m172m512N15N022M382k42n011m870j56N292L958q34l399
4734a76k653N50L761J588k682l272j01L265L160Q47m107m328M27M091K975k80
4750C065k404l117M40K755J370k200j712M11K501K250j145l874k417J677M014
4765A614K051j495k880k661K002L300K96k200k211O87K398K656j398m585k203
4780d629L122L958J946j652n196k544L099M782R06l120l244l06L320L333j216
4795B559m550k202J724M908K579j969n645l060L477M933J601k617l729j710K836
4810h65L573j18l187k489P81L560K498j515m737j944K798L967J119j953l316j385
$$ y = [646, 3354, 3237, -661, -5110, -4006, 1013, 4850, 3752, -291, -4527, -3747, 939, 3623, 2133, -1921, -2858, -633, 3072, 3851, -321, -4833, -4318, 704, 5086, 4844, -167, -5037, -5193, 99, 4057, 3223, -176, -2829, -2279, 1482, 3070, 388, -2884, -2985, 280, 3440, 4287, 180, -4148, -3721, 370, 3345, 3065, 661, -2456, -2016, 739, 2109, -91, -1803, -1392, 1109, 3359, 2214, -1660, -4077, -2400, 1614, 3665, 2170, -710, -3371, -1369, 1931, 2227, 27, -2184, -1497, 901, 3557, 2159, -2426, -4629, -1507, 2451, 4397, 2745, -2451, -4995, -1896, 2886, 3792, 672, -2572, -2878, 442, 3775, 2559, -1991, -4193, -2469, 2439, 5018, 3049, -2596, -5656, -2179, 2754, 4355, 1738, -1991, -3701, -865, 2708, 2590, -597, -3086, -2305, 1255, 3753, 2238, -2499, -4443, -1645, 2322, 3441, 1488, -1828, -3213]
4826c213K599K776l08k391j635J449K459J302k589l799k23L640L062J16k774l487
4842c016k64L561L057j366l075j247Q65L739J265k842m171M56K685M090M23m021
4858A39l956m24M202L934m37m249k369M90M537J672k248l509j255L002M137J443
4874E109l600o467L12M303L968jl126l174o71L697K256l92l140j541J141K724
4890A398J576k416k910q86L350L147K54m353k709P25L392J168p79j693j087K585
4906G62J584j51l398j553J397M176O8j708k182l128K023M103P90n98l391j027
4922b233K583K198m31m287r06J889L036K291j919n180j554J715N937J557k078
4937B618m298k661L297L825M76l973k642J139L017L703j610n473l195K667M923
$$ y = [-3213, -614, 2162, 1854, -537, -2172, -723, 1736, 3038, 449, -3350, -3573, 67, 3129, 3245, 471, -3016, -3280, 281, 3338, 1972, -1103, -2350, -1485, 2254, 3519, 677, -3494, -3038, -353, 3737, 4160, 139, -3817, -4241, -39, 3895, 3458, -791, -3160, -2670, 1867, 3539, 1291, -2218, -3473, -471, 3666, 5109, 1509, -4958, -4646, -343, 3625, 3624, 498, -2676, -3347, 350, 2606, 2214, -926, -2467, -1326, 1398, 2974, 558, -2352, -3238, 112, 3259, 3513, -840, -3549, -2824, 568, 1736, 957, -736, -1823, 762, 2346, 2195, -1203, -2756, -1359, 2817, 2885, 1177, -1005, -4133, -2110, 1993, 2783, 2185, -1206, -2233, 350, 2548, 2117, -2170, -3076, -1187, 1849, 4140, 2221, -2959, -4513, -2798, 3139, 4696, 2618, -1680, -4341, -1044, 2781, 3257, -716, -3358, -2219, 798, 4501, 2891, -2582, -5777, -3110, 1813]
4952A813L097j371n166k605J954L792J951j714l342q72K316L085n00l945k185
4967c692J076L408L070o36m288k614J268K772J565k32k183j208J561J778p37k690
4983a782p54J710K963J274j869l908j070K143K914Q51j032k642o57K360J563j432
4999F32k922l35K722L203L99l506l756k98L365L551J129k949m221m42M012K982
5015C566k087l081j754K194M299J726l688n328q79L291N243K186l604n779q22
5030d517L763L790l46k230l018K19L870K226j693m679j731K433N011J868l196
5045A770m509j273K486K895J587j752l236l19K794K189j711k763j413K203L577
5060B525J135k802l719l13K162K704O88j843k253K06K108J199j395k350p85K740
$$ y = [1813, 4910, 3539, -1627, -4232, -2278, 1514, 3465, 1751, -1591, -2463, -147, 2938, 2438, -1507, -3692, -2616, 792, 3862, 3226, -1062, -3676, -2408, 364, 1929, 1697, -486, -1694, -133, 1645, 908, -1782, -2536, -826, 2137, 3411, 1542, -2366, -3436, -1293, 1621, 2472, 1440, -1202, -1859, 501, 2064, 632, -2290, -2625, 97, 3300, 3699, 193, -3563, -3861, -496, 3055, 4184, 1235, -2986, -3428, 584, 3566, 1479, -1602, -3356, -1162, 3137, 4863, 1175, -4153, -5032, -1741, 3502, 5688, 2084, -3695, -4517, -754, 3036, 2690, 460, -2558, -2339, 1531, 3757, 2064, -2615, -4346, -1913, 3098, 4966, 1770, -2739, -4012, -1526, 1369, 2956, 1204, -2032, -2351, 443, 2632, 921, -1842, -3255, -1052, 2525, 3660, 858, -2861, -3174, -1012, 1692, 2380, 537, -1716, -1510, 598, 1797, 402, -1948, -2733, 7]
5076GL264l42l399k956P92K699L124j64l523k578J786L109J026k306l308n52L289
5093c2M152l43m284m062N23L973M286Jm747l672J437L829K401j708m202j340L466
5110c22L935L52l519m371n53L959M890M41m805l943P53L628L135j352l604k134
5126c510K486L883Q91k843l915q99L209N098n26l477m139P57K697K803o07k651
5142g43k147J513K450J080j783k553m55K779L528j562k330l424P62L353K139m31
5158B176l646k093K710L192j38k156l499J245K715K445m08l636j844L88K588L942
5174C981k154m010q24K384K804L91l043l707M48M708K805j650l055l458K106L005
5190G31L069k478l533p24J828L162J104l923l753O73N215L053j135m639l919J661
$$ y = [7, 3271, 2929, -470, -3426, -2634, 65, 3189, 3025, -498, -3076, -1290, 1819, 2845, 539, -2769, -3321, -32, 4120, 3777, -507, -4569, -4046, -73, 4213, 4214, -533, -4205, -2768, 1061, 3462, 1754, -2448, -3788, -322, 3613, 3965, 446, -3925, -4478, -519, 4371, 4812, 7, -3936, -3183, 445, 3580, 2228, -1376, -3510, -1024, 2859, 3750, 907, -3008, -3907, -698, 4400, 3874, 397, -3742, -2985, -288, 2515, 1908, -743, -2890, -1377, 1073, 2153, 370, -2183, -2638, 141, 3669, 2107, -223, -3647, -2885, 468, 2607, 2176, -1470, -3563, -853, 2339, 2201, 45, -3454, -2209, 506, 2951, 2543, -1093, -2937, -2549, 39, 3981, 1827, -2183, -3007, -623, 2181, 2572, -471, -4178, -3730, 978, 3783, 2133, -922, -4380, -2274, 731, 3800, 1322, -2211, -2935, -1107, 2055, 3159, -764, -4517, -3844, 1371, 4424, 3289, -1350, -5269, -3608]
5206c608N612K548k228m092k052K340L561P38k787l261M78L921K703n38m150l658
5222d473R21N105L238j745m831j704J861L275N03j544k858M81P97M217p91k986
5238e34l769J495L487L630j202l750k462J296L010Q20k043j593K98J556K304p49
5254A794l323k440K002M069K108l003k995j823J774K937J300j741k595P59J801
5269F24L000k253l158k336K883L958K026k606m797j606K794M006Q73k842l080
5284b514J72K968K813j558m246j824K098N250J190k337n038k582L504N121J079
5299D096j906m261j901L368K928n56k676k532J323M104K405k012m285k999K410
5314b494L689L075j638n107j078J682K491J175k273j292N92K733J794k053l184
$$ y = [-3608, 2004, 4552, 2324, -1768, -3820, -1480, 2081, 2819, 32, -3229, -2751, 1170, 3873, 3335, -815, -4473, -3552, 1553, 4791, 3046, -1785, -3489, -1628, 1647, 2150, 606, -2252, -1771, -974, 3243, 2452, -534, -4303, -2808, 679, 4309, 3107, -643, -3105, -1809, 1201, 2021, -22, -1615, -1317, 239, 2543, 1794, -1529, -3969, -1967, 2102, 4210, 1207, -1788, -3611, -1837, 1100, 2400, 659, -1936, -1177, 624, 3624, 1371, -1787, -4123, -1240, 2718, 4744, 2138, -2659, -4265, -1471, 2535, 3408, 566, -2514, -2342, 626, 3439, 1881, -2365, -4189, -2091, 3159, 4349, 2012, -3026, -5608, -2104, 3017, 4096, 2190, -2071, -3972, -604, 2324, 1768, -908, -3440, -2117, 1987, 4392, 2380, -1905, -4904, -2494, 1195, 4270, 2632, -2475, -3553, -1871, 620, 1795, -478, -1770, -1178, 1555, 3349, 1296, -1888]
5329a888j055R31L762K324k071l886p35J445K223J58q74j373M37K024Q07k160
5345F9k761m81K650L413Q61k507l900n93K902J786k84j563k773K584K624J989
5361D016m583k632R29J828N292j473k648n670J186M093M072r69l464l132J411
5376a744K486K453k255l794j359L250N071N05l866m650r81L922M614R05l468m444
5392c355J50K849K706j084k266j635R00M515Q62k678m374k45K374L959K149l526
5408A301l574k052K837L679n78k587K91m5K372J96j454k951q30L810K622L29k369
5425I97m549M06L251K612j326j845j924K905J231l97j810l453J366K484M369j330
5441B987l511l784J753L052L766k622k985j660J891L320o6k675l460J413K957
$$ y = [-1888, -2943, -2012, 1750, 4074, 2003, -1883, -2618, -1173, 1050, 1208, 334, -1039, -602, 1422, 2229, 69, -2692, -3173, -523, 2890, 3751, 1244, -2656, -3249, -347, 1439, 1155, -408, -3181, -597, 2027, 4016, -567, -3199, -2270, -442, 4850, 3377, 729, -4941, -3755, 338, 4410, 3441, -23, -3155, -1744, 742, 3195, 940, -2854, -4213, -963, 4108, 4613, 747, -3903, -4884, -962, 3652, 4557, 1089, -3355, -3205, -356, 2350, 1266, -1000, -2635, -1735, 2780, 3642, 964, -3410, -3655, -1281, 2678, 4827, 1301, -2273, -4325, -1488, 2191, 1613, -974, -683, -728, 1644, 1840, 386, -2565, -3395, 415, 3037, 3366, 997, -3552, -3146, 105, 2717, 1391, -454, -2378, 527, 1758, 1361, -449, -3902, -2536, -52, 4317, 2987, -524, -4308, -2555, 497, 4263, 1641, -1344, -3004, -1113, 2207, 2141, -534, -3994, -2581, 376]
5456C76L686m67l971m299J837L025M567p06m815l630J787L565J856j903k935r96
5472c023L117L091N98m309l222O61L605L941m26m475l340J048L210K567l63l634
5488i54j458P63L289M90k102l061N80L978K411j164m907j073J557K080K521j139
5504A811l006j221K029L290m98m413m48J81L993K760k690m650j027K186L678K195
5520D170l899l036m6L153K202m60k860k396K027K615K336j937m169j416Q02N717
5536B803J867k173n777j490M321K368O25l238o91j029K619L095j136l956j642
5551c434J524L420L768l327m507o15J075M192J125k933k660J80K008K450l64k941
5567a039j699J123M089N44k442l620k2J660L163O17j545l405O63J639K757r45
$$ y = [376, 4062, 3595, -376, -4675, -2838, 187, 4754, 4048, -767, -4397, -2610, 955, 2811, 908, -2027, -3023, 94, 3185, 3783, -526, -3748, -3087, 518, 4459, 4033, -442, -3782, -2734, 476, 3043, 2680, -954, -2412, -1649, 1640, 2130, 28, -3033, -2453, 1525, 3936, 2772, -2135, -3208, -1651, 429, 2950, 1811, -1195, -2416, -387, 2903, 2405, -2008, -2456, -2275, 1718, 4478, 1788, -2862, -3889, -1703, 1975, 4170, 271, -2765, -2811, 342, 2544, 2084, -776, -3172, -1145, 1470, 3806, 1869, -2300, -3716, -2914, 2803, 4670, 2497, -3280, -4770, -449, 1919, 2544, -694, -1385, -2414, 205, 3300, 2164, -1792, -3434, -1910, 1510, 5278, 1951, -2556, -3171, -2096, 2096, 3221, 288, -2372, -2192, -184, 2266, 1902, -1039, -2738, -1615, 2474, 3018, 576, -3044, -3066, -1406, 1757, 2374, 829, -2576, -1913, -274, 2483, 1538]
5583A538k773j682K014M398o86l087k951L16K302N267o70m150l281P63L643J917
5599B878m82m130j414K300L535N25l329l205l28L089M527L81m969l158J61L689
5615G0L635p17l873j980J390L223Q53j609l304j137L101L840J57l682l443J55
5631c321L010L412P3k978k830O64K368J529n39k665r02K323K505m13k889j947
5647b600L41K744K173n98k361j925J155J580J232j210k315M53K103J748j234k962
5663a676j227J268L419J832j707l525j648J357L663J076k230k896P0K831K186
5678B793p18l415k353Q82M519K854j635m631k524J540M225K466k142l658j270
5693c067K471K760L11k597l288Q19L744K766j246l875l425J589M141K638j290
$$ y = [1538, -1235, -2917, -903, 3495, 2809, -278, -3229, -2913, -611, 4656, 3986, -164, -3445, -2682, 961, 2878, 2396, -1734, -3148, -848, 2687, 3212, -117, -3322, -3650, -561, 3966, 4347, -622, -3780, -3619, 70, 3705, 2988, -885, -2865, -1475, 1748, 2601, 992, -2312, -3449, -348, 3492, 3649, -33, -3476, -3321, -311, 3101, 3174, 196, -2634, -1970, 398, 1927, 1388, -1277, -2179, 144, 2649, 2236, -653, -2600, -2259, 485, 2658, 2060, -301, -2226, -1071, 509, 1741, 531, -1784, -1331, 772, 2520, 1286, -1676, -2903, -1635, 1784, 3616, 1909, -1616, -3264, -1907, 1756, 2832, 602, -2294, -2224, 607, 2793, 2075, -1340, -3693, -2811, 1708, 4562, 2927, -1704, -4228, -2688, 1537, 4003, 1861, -1797, -3067, -596, 2164, 2475, -122, -3410, -2591, 1153, 3919, 2673, -1202, -4627, -3038, 1103, 3741, 2451]
5708B451l579j622Q62L023J241j693k613k66K742K152p22k743k486R08L360J616
5724B631q77k629q70J84J946J520j856j681Q76J903O41j245k222j450K336K529
5740A736J377k442j991j530J401K959P46j802k576J395J703J189j693k512j418
5755c458K484L741R25k808l226j503K574L480J352l356k478O59K395J999j115
5770A665l072k450K587M196J285k383m482k011L229L936J459k907l276o16K185
5785f55L317k26k843k650J726K884J802j628l549k025K557L564J217k348k680
5800a537j187J439K928L31k008j937R37J986J462j387l012r24K041L149L39j739
5816H81k695p26J936K480k82k443r45P11K178J146k049k429n10K911K214j54j800
$$ y = [2451, -1128, -2750, -1888, 1135, 2376, 683, -1930, -2196, 546, 2698, 1976, -767, -3253, -2345, 1015, 2631, 1754, -875, -1745, -1561, 385, 1905, 49, -1632, -756, 1147, 1788, 543, -1679, -3129, -793, 1736, 3113, 671, -1320, -2850, -1449, 1510, 2256, 454, -2122, -727, 976, 2165, 472, -2040, -3458, -974, 2767, 3692, 884, -2342, -3845, -1271, 2209, 3561, 205, -2273, -1614, 781, 2780, 1665, -1407, -3857, -1270, 2926, 4211, 1828, -2654, -4665, -1436, 2500, 3959, 1052, -2224, -2840, -655, 2662, 2436, -407, -3057, -1331, 1553, 3355, 1727, -1822, -3847, -1290, 2274, 3491, 1143, -1537, -2724, -1285, 1643, 1974, -34, -1971, -1034, 952, 2414, 1027, -1985, -2909, -868, 2281, 2620, 881, -1814, -2540, -604, 1876, 1594, -849, -1794, -1083, 1095, 2241, 192, -2237, -2747, 164, 2378, 2224, 424]
5833D24k990l33L288J897m23k813r53Q58K617M97j945l189J66K641L098O23l856
5850c93k174p58M855J624p89l653j672J314K952N61k81m336m19K093L568N47k243
5867G96l331j049M028K122k16k654k277J33L515J605j386k990j173K393K880O10
5883C006k648l068m26L076L063o51k745k065K56L012J818j868k133o69J128K512
5899A598J197k532k838Q7K454K416j91k318k008O72K508Q54q88k390p35K332J408
5916A626P41k711k152P09K080J912k75k514k236J418K583M37r15k013l78J766
5932G8K335J85l167j793R58K037K546q74l710j690J725K640J252k277j693m54
5948a902J750K630l66k481j795o8L239J843j82l815k560J750L112J254p51l023
$$ y = [424, -2566, -2899, 389, 2286, 1863, -950, -1903, -1045, 1572, 2069, 124, -3065, -2899, -258, 2840, 3463, -393, -2567, -3325, 1530, 3154, 2365, -1288, -2960, -1646, 1306, 1867, 1586, -2750, -3169, -1076, 2492, 3039, 796, -2535, -3584, 444, 2566, 2350, -304, -2581, -2448, 1067, 2672, 1286, -1704, -2877, -484, 2396, 3006, 358, -2710, -3136, -60, 3003, 2352, -393, -2458, -2202, 810, 2628, 760, -1373, -2042, -914, 1598, 2795, 263, -2575, -2488, -34, 2382, 2191, -127, -2135, -1463, 1045, 1899, 1011, -1379, -2114, 218, 1626, 2367, -344, -2496, -1787, 293, 2205, 1930, -584, -2820, -1402, 1181, 1618, 703, -1310, -1688, 78, 2413, 2598, -569, -2362, -1404, 633, 3179, 2305, -1405, -3095, -1370, 1270, 2522, 245, -1448, -1902, -152, 2478, 2112, -369, -2164, -2232, 1007, 2850, 2668, -1147, -3707, -1957, 1155, 2409, 1658, -1365]
5964a365j164J570L185M14k400k791N6K736K481m10l407j892L44K939K390r43
5980A743k535j938K017J847J97j454j546QK637K256q54k510j639j88J908K424
5996B373r19k080j850K010J532O11k306p92m23L147J186j110k432j010N30K391
6012H58J269j019k272l02J308J264k0j572j406J112K367J090k022k570p63J330
6028a348K978J425j862l109n79J670K207R61k426j933M83K828J265j365k470j672
6044b947J110L783J546j758l168j774J516L022J395j915k590j09J988J494l01
6059A292j941j844N73L266J766j544k712j837J349K657J608j427k088o49J051
6074d80J211K48j253j479R47J737J245j439k092o93R84K335M63j094j733r5J124
$$ y = [-1365, -2529, -959, 2226, 2640, 240, -2551, -2495, 241, 2722, 2312, -1095, -2987, -2643, 296, 2686, 1743, -792, -2730, -713, 1134, 1331, -123, -1669, -1661, 976, 3232, 2378, -132, -1771, -1959, -51, 2373, 1454, -626, -2476, -466, 1066, 1677, -629, -1421, -1844, 1303, 2489, 1379, -1053, -2063, -1533, 858, 2127, 1108, -1164, -1466, -158, 1106, 1086, -486, -1892, -780, 1587, 2677, 655, -1915, -2678, -1348, 1630, 3055, 1193, -1916, -2495, -825, 1382, 2343, -83, -2016, -1533, 1295, 2560, 1195, -1275, -2947, -1837, 1946, 3492, 1734, -1434, -3208, -1692, 1330, 2725, 810, -1780, -1889, 99, 1593, 1292, -649, -2493, -1920, 1346, 3112, 1568, -1144, -2981, -1632, 1025, 2633, 1206, -882, -1531, -480, 731, 979, -274, -1753, -806, 931, 2176, 737, -1355, -2048, -1064, 1271, 1734, 640, -1093, -1188, -64]
6091f4Q36k60r02j275J875J510J34j750k154m25K491K438l97j761k084j30J769
6108a49J945o16k032q98J241K309J53j454l096k68K639L253o6k473k670j93J910
6125d65K793m84k207j813Q95J773K083j332l024k11J833K733p59j308k544o63
6141b700J550L679j91j069j944j059Q14K099L28k020p53J023J401J279k105j761
6157a429j63J586K706p88j361j225j018J451K930k075j805m58K731k68J108j223
6173F99l091J805R82J967m1k751j657R66J583J089j324j785m02J609K758j65k969
6190g27j301M84K692J400r14k285j251j57L148J009l64l442J65Q27K253N30k511
6207d44k019M18K851J683O6l265j473P6K946J292j260p12j859Q99K516o2j066
$$ y = [-64, 772, 512, -390, -1665, 210, 1720, 1854, 104, -2050, -2475, 16, 2454, 2057, 296, -1788, -1918, -149, 1796, 1180, -852, -1750, -509, 1800, 1953, 499, -2597, -2865, -226, 3027, 2961, 488, -2182, -2375, -465, 2328, 1844, -363, -2176, -1281, 492, 2575, 1243, -1781, -1992, -159, 2574, 1815, 507, -2037, -2700, -1150, 2529, 2338, 1269, -675, -1734, -920, 1179, 1507, -513, -1266, -243, 1158, 2437, 332, -1429, -1592, -6, 2700, 1912, 551, -674, -1692, -241, 2689, 614, -1191, -1649, 1082, 814, 1922, 699, -2392, -587, 395, 2362, 2321, -430, -2087, -1121, 462, 1551, 227, -1558, -1960, -351, 2407, 2242, -727, -2028, -1544, 1148, 2548, 1634, -651, -1902, -2059, 1089, 2098, 1734, -1708, -1543, -716, 1537, 2067, -444, -2463, -2045, 806, 2489, 2555, -710, -2183, -2107, 839, 2131, 871, 159, -1700, -801, 1715, 1653, 587]
6224E87j827K82J866Q67j121j585j042J174K195Q46j396j127j412J229J641J200
6240B377k789l4M30M56N71r20j296m01O11K461J046q35k773j034J431K055L04
6257A660j747j921J057J401K029j695k300l76P93L372P79k592k501p18L036K008
6273B285J089k489k714N17J611J507m13k193j451J413J666J586j031k896j253
6288b766K162K424P17k103j710o20J320J768L03j549j226O25J139R39q04k063
6304a444k36J758J483J9j235j731k79J646J234p8j343q94M21J227R82j517j386
6321a373K05J726J192m98j455j512o7K077J680o65k117q45J089J610M24j439k107
6338b075R66K143R72k45k367k150N60K975J675q85k393j320P13K217J213j644
$$ y = [587, -1240, -958, 908, 1775, 654, -931, -1973, -799, 1396, 2242, 846, -281, -1693, -464, 1177, 2377, -412, -446, -16, 440, 1011, 91, -1205, -1606, -995, 1466, 2512, 1677, -1096, -2130, -699, 1356, 1660, -87, -2008, -951, 450, 2479, 784, -1516, -1892, -1099, 2273, 3052, 460, -2041, -2759, 277, 2285, 3374, 885, -1829, -1312, 299, 1806, 1393, -800, -2251, -838, 828, 2414, 1383, -1513, -2766, -604, 1820, 2537, 434, -1276, -1896, -576, 1192, 1495, -54, -1280, -655, 484, 1423, 619, -1444, -1680, 78, 1561, 1580, 345, -1386, -1665, -19, 1215, 1137, -206, -1100, -679, 548, 1530, 13, -1373, -1168, 558, 1750, 1252, -203, -1715, -1782, 295, 1975, 1310, -807, -1652, -563, 1047, 1471, 32, -2075, -1109, 1034, 2006, 1761, -606, -2756, -2196, 779, 2454, 1569, -824, -2144, -1431, 786, 1999, 355]
6354C55j788OJ436J568L56j946k260K06K198K363m60k087j778j50K006J582n12
6371A095j450p12N38J412M22j334j775K64K163J359k47j802j460P9J755Q00k68
6388H39j015o08N07R27l0j184r34J220J452K43o69j741q06J003K061N59j430j220
6406h26m6Q71J206n45j900k48J609J494J33j369k284p27J917K372O54j180k170
6423a039r27J388J987J08k108n59M05J541J281q13k785j118J554K437J245j321
6439A276k451j072J250J920O13j203j316k01J114J596n58k032p21M63K371R23
6455A972j049k067r29J071J779O89p3j577j148Q31J438l71j243j31J107N81O17
6472A497r52j999k2R39J400L49p07j347j74J365R02j207j169J99J142J192j95
$$ y = [355, -1433, -1427, 9, 1577, 1933, -13, -2273, -2067, 131, 2494, 2034, -53, -1831, -1981, 25, 1607, 1095, -355, -1067, -529, 883, 1305, -29, -1804, -1540, 623, 1982, 1735, -67, -1527, -1448, 307, 1107, 839, -176, -784, -277, 650, 620, -564, -1498, -278, 1174, 1417, 748, -993, -1799, -796, 1265, 1824, 394, -826, -872, -1, 1205, 660, -1240, -1488, 121, 1615, 1748, 379, -1905, -2632, -715, 1657, 2311, 1131, -1039, -1966, -578, 1409, 1517, -591, -1150, -745, 796, 2077, 1264, -1521, -2639, -1085, 1352, 2597, 1276, -1175, -2247, -997, 923, 1536, 333, -983, -1184, -70, 1526, 968, -1064, -1785, -1322, 1049, 1972, 923, -1144, -2073, -1002, 777, 1466, 1393, -184, -1332, -501, 937, 566, -677, -808, 299, 880, 1497, 545, -1454, -1476, -537, 863, 1212, 505, -842, -1016, 349, 1251, 44, -1125, -926, 216, 1408, 1213]
6489A213j196k065L23J871J208M7j053j613l4J804J144j032j853n8J257J448L36
6506A747j858j934j04K008K284K6k159j987J98K211R91n72j258p58L28J929Q30
6523A922j631k427L82J588Q99J515k438j320o29J886J475o08r42j579J838J204
6539A135J222j151k863O11J610J209N06j265j894P1R48J039P19j680j455M04J924
6556A090K43j272j200k41J379J273K02j988j032L72J462R90k17r27j577R76J276
6573H09J79j143j150N72P80K056p05k047j015M71K096P84n81j810j123J203K098
6590A474J68j707j558J22J194K350r61k098j034O79J666J462j20k262j036P36
6606i25J656P07o68j626r75K215J580l51j300j253j225K967J250j253p83k178
$$ y = [1213, 17, -2048, -1725, 146, 1354, 1401, 348, -1265, -1299, 505, 1649, 617, -1236, -1294, -37, 1411, 1747, -111, -2045, -2149, -141, 2143, 2169, 10, -1977, -1779, 432, 1423, 851, -407, -1165, -837, 1092, 1922, 291, -2136, -1754, -166, 733, 2248, -190, -1510, -2139, -253, 1222, 614, -328, -1907, -69, 1135, 2357, 1206, -1657, -1046, 564, 1773, 2279, 1014, -880, -809, 139, 1178, 1897, 217, -1238, -834, 1090, 1333, 61, -1139, -1380, -1, 1272, 1474, -514, -1546, -1174, 288, 1278, 1061, 134, -1443, -467, 809, 988, -155, -1305, -733, 47, 2103, 1398, -649, -1664, -1193, 903, 1687, 1106, -704, -1827, -624, 1474, 1642, -65, -1623, -1501, -307, 2043, 1082, -1016, -2050, -1371, 295, 1757, 1637, -625, -1661, -925, 731, 1438, 770, -856, -1831, 384, 1964, 1613, 313, -940, -2165, 802, 2052, 799, 16, -2162]
6622b162J089K026O49j596p25j132J924J841m42j917r67M59J645J585j422j890
6638a035o87R53J116J071j202j310m27J483J492l15j642j182R77J115J544j139
6654H12j689p38R47J276R62j495j046k37J635O66l05j331j462J087J788J040j157
6671G53j763o02R87J580P49j422j606j37J485J331l01j935q93Q07K234P12j319
6688F60k033p13J277K252N70j750j804R4J348J627j81j852j411J080J612J090
6704A866r43k265r10J401K121Q07j618j909Q4J243J327K83j733j301O71J683R50
6721A757q22j731j281J183K071L45j009j527m52R47J802j38j464n73M59J055Q12
6738A434n91j937l46J338J546O8j176j538j07J004J341J17j667n56O26J081N71
$$ y = [-2162, -1073, 953, 1602, 6, -719, -1851, 73, 1914, 1472, -445, -1412, -953, 692, 2277, 855, -1035, -1722, -769, 347, 1418, 216, -1094, -1521, -38, 1454, 1139, -503, -1685, -708, 407, 1951, 812, -877, -1615, -668, 608, 1570, 75, -971, -1208, 427, 1093, 788, -543, -2005, -918, 870, 1910, 753, -1010, -1612, -625, 955, 1704, 282, -1324, -1461, 24, 1355, 1054, -881, -1774, -967, 1267, 1979, 660, -1373, -2086, -809, 1443, 2013, 263, -1541, -1447, -99, 1528, 1347, -505, -1916, -836, 776, 1866, 923, -1342, -2252, -851, 1270, 2077, 459, -1450, -1366, -123, 1204, 1487, -246, -1547, -876, 807, 1757, 935, -796, -2077, -894, 1177, 1522, 513, -1014, -1466, -519, 1283, 1145, -319, -892, -433, 622, 1434, 843, -1094, -1440, -102, 1444, 1512, 336, -1202, -1309, -305, 1036, 1153, -514, -1070, -444, 637, 1208]
6755A208p42k001rJ601J522%j529j445k61J723J419l27j724n54L63J610Q59j218
6773D95j797j84J395J706O5j750j527j41K058J485P5k075j374O55J386J208j071
6790F09j707m70J156J484O40j386k079l93K141J761q2j471j521J65Q52J961q83
6807G77j279r01J009J096P01j043j623m69K054J276K7j715j450K61J379R80m22
6824F58j325k81P06J084K62j275j524M72J544P78K52j607j428M85J838Q06p84
6841F61j294n71Q14J536L69j694j217K89J743Q29j67j758j731P69K267Q59n78
6858A126j970j552J660J882J46j040j334q45J784J579l6j723j560O77K036J027
6874A857r95j374j539J137J721R26j244j323n64J075J775N2j603j599Q82J439
$$ y = [1208, 466, -1535, -1544, 57, 1579, 1579, 50, -1395, -1656, 67, 1486, 1159, -565, -1119, -756, 854, 1713, 495, -1302, -1486, -91, 1615, 1680, -70, -1597, -1738, 320, 1805, 1880, -195, -1569, -914, 472, 1680, 609, -1098, -1568, -412, 1072, 1712, 326, -1753, -2146, -5, 1756, 1674, 203, -1318, -1153, -301, 1660, 777, -502, -1403, -394, 702, 1403, 360, -1263, -1732, 322, 1598, 1625, -90, -1540, -1279, 100, 1080, 658, -667, -948, -242, 842, 1104, -171, -1695, -1223, 321, 1099, 1351, -256, -1684, -1199, 639, 1445, 661, -633, -1204, -390, 1146, 1515, -179, -1396, -1107, 636, 1465, 1298, -460, -2191, -1422, 845, 1704, 1126, -844, -2396, -736, 1146, 1292, 252, -1082, -1927, -143, 1436, 1400, -323, -1883, -1206, 830, 1857, 862, -512, -2051, -914, 807, 1733, 489, -834, -1398, -323, 1452, 1504, -99, -1698, -816, 623]
6890F23P57j99j620j390Q15K068N13j190j346n82J256J555j08j743n66O63J383
6907H89P29j118j474q08J215J815J13q91k044r5J878J375n11j636j219J080J900
6924A198N51r67k194n15J556J848P38j641k190l09J767J863j14j606j266n3J760
6941D26J333o08k093r42J476J583Q36p36k640m26J598J647p0j308j372O7J449
6958B20J120n16j957l78J292J558K08j083k012L2J594J490p9j762j090J92J858
6975F87Q26q27j764j36J011J383M02k112j336M11K022J196m84j588j526K09K445
6992H19J336j759j906L50M10K098n1j585j791M23K162K009o60k377j779O09K496
7009H04J379r63j830j120Q77J982P02j703j652p8J605J898o0k213k087Q85K380
$$ y = [623, 1380, 1181, -439, -1829, -1014, 1054, 1567, 377, -969, -1551, -295, 1260, 1152, -591, -1157, -494, 889, 1618, 500, -974, -1782, -567, 1248, 1361, 470, -1574, -1669, 209, 1584, 1073, -563, -1782, -702, 1198, 1749, 782, -1412, -1927, -371, 1477, 2215, 574, -1616, -1925, -158, 1705, 1591, -15, -1281, -1334, 426, 1759, 1151, -942, -1884, -408, 1175, 2011, 1275, -1365, -1791, -193, 1454, 1384, 76, -1296, -1229, 220, 1340, 824, -1133, -1511, -219, 1339, 1547, 464, -1548, -1516, 78, 1568, 1489, -273, -1363, -1171, 687, 1513, 686, -1078, -1214, -203, 1180, 1582, -530, -1866, -1455, 567, 1763, 1279, -309, -1835, -1626, 819, 2155, 396, -1510, -1160, -750, 1348, 1297, -288, -2079, -1656, 506, 2515, 1855, -522, -2301, -1692, 804, 2183, 1220, -610, -1730, -853, 1129, 1831, 128, -1524, -1602, 3, 1901, 1841, -372, -2459, -1574, 806]
7026H06J122m98j752j183L63J843O96r81j491j91J562J173r6k322j069Q66K025
7043H73Q35l91j599j507J131J237N69j118p53j02J413R44p35k185n12J399J875
7060A374N15r67k065j405K149J733j4j117j361J47J454J590j347k060o90J547
7076e17J819R79j247k603j099J652K683L58j460j807m35J531J387K2j925j039
7092a701P39J822J564j378k652j234J727K491R50j296k767l09J435J693J43j301
7108g4r21l0J591J034o90k162m59J159J835M20j095j398p77R51J371J80o63j121
7126h49J94J268P01j147j659m3J906J110K89j511j654J3J639Q75p4j105j087N54
7144e80J351M88j247j453j4J594J569M73k188k080K42J700J669K64j786j683P83
$$ y = [806, 1928, 1430, -322, -1505, -1142, 701, 1397, 416, -1075, -1266, 296, 1469, 1373, -949, -2018, -1152, 873, 1708, 1317, -282, -1789, -658, 579, 1148, 30, -723, -825, 588, 1532, 797, -1388, -1900, -501, 1374, 1889, 922, -1143, -2548, -399, 1334, 1320, 203, -1158, -1011, 443, 2033, 686, -1374, -2064, -517, 1302, 2281, 1034, -1569, -2668, -1016, 1667, 2025, 565, -1242, -1677, -146, 1241, 1263, -662, -1701, -962, 860, 2424, 1046, -1606, -2840, -1113, 1378, 2328, 1032, -1735, -2044, -609, 1084, 1227, -74, -995, -1025, 566, 1600, 910, -1252, -1711, -552, 1283, 1703, 608, -790, -1567, -616, 755, 935, 272, -849, -655, 613, 1314, 167, -1492, -1535, 371, 1481, 1770, 259, -1395, -1382, 257, 1132, 1058, -47, -1134, -580, 771, 1259, 12, -1441, -1455, 139, 1708, 2181, -7, -2087, -1845, -145, 1524, 1788, 2, -1681, -898]
7161h98J744O49j032j699q28K024J750L56j934k669K10K059K330J20j889k330
7177b037K59K108J322o21j321j159P14K022N91j538k227L0J637J496P01j697k099
7194a819N37J005J251L33j180j261P76J268J99j262j245J66J239J523j15j721
7210c06j135L04J282J214l42j577p25R37J255J2j189r98L05J674J110l14k363
7227h56j005O31J528J464n62j864p99J137J530J17j400j482k09K525J307n25k332
7244g95j497P74K015J595n94k250j595J462J975O82j445j597m83J661J987l94
7260A501j776j791K41K659J342o91k233j077O03J820R21p00j902l71J343J636
7276A525k82j742j023J62J894J216p34k018q66R17K000O00q91j962k61J275J463
$$ y = [-898, 846, 1495, 463, -1236, -2064, -40, 1710, 2066, 132, -2537, -2327, -268, 2062, 2182, 293, -2037, -1778, 330, 1652, 1031, -290, -1449, -735, 1287, 1878, 340, -1887, -1857, -220, 1276, 1977, 280, -1819, -1282, -277, 974, 1307, 127, -1134, -358, 910, 1109, -153, -1398, -1232, 7, 1530, 1415, -306, -1441, -1137, 145, 1359, 1017, -560, -1285, -348, 907, 919, -270, -1268, -963, 711, 1821, 1507, -856, -1861, -1230, 298, 1762, 1200, -664, -1463, -326, 1204, 1321, -79, -1561, -1770, 755, 2062, 1537, -795, -2292, -1518, 497, 2092, 1498, -752, -2347, -885, 1090, 1772, 327, -1270, -1753, -92, 1895, 1501, -275, -2066, -1825, 834, 2176, 1485, -748, -1825, -1222, 598, 1519, 819, -1083, -1454, -111, 1525, 1243, -499, -1522, -1360, 534, 1750, 1016, -1002, -1868, -951, 1049, 1649, 758, -1204, -1465, -190, 1273]
7293A273J17j499j387M35J804J291j123k281j85M95K044P98j461j511j71J661
7309C00J071m03j552q75P25J767R86j624j336r29J157K091Q49j523k255K02J140
7326b09J779j29j944j290N64K074J056r04j732j185J022K265N57j643j642J5J133
7343b13K061R0j914j814M83K101Q94r95j755q88J339J870P69j502k098l78J683
7360b67J669J67j759j755R78J506J067k54j903r96J052J840J27j202j658o1J496
7377D7J745l85j993j093M12J957J034p15k077j174J448J905L84j182j599k33J643
7394A24J541k36j962j445Q08J774J408r96k010m68R48J608N73j064j932j91J351
7411a69J930n34j845j219P12J600J401q00k413m34J451J462j3m70j981J64J140
$$ y = [1273, 1390, -109, -1496, -1061, 743, 2034, 911, -1370, -1555, -1060, 984, 1782, 321, -1190, -1361, 300, 1371, 968, -584, -1459, -734, 1033, 2019, 395, -941, -1870, -713, 1378, 2227, 704, -1551, -1349, -209, 1570, 1441, -503, -1793, -1229, 845, 1901, 997, -735, -1920, -898, 1367, 1924, 281, -1361, -1346, -213, 1848, 1938, 24, -1790, -1307, 794, 1688, 693, -1062, -1950, -611, 1259, 2028, 526, -1572, -1950, -267, 1402, 1569, -190, -1945, -967, 539, 1606, 1352, -551, -1547, -495, 1345, 1472, 270, -1388, -1449, 47, 1792, 1407, -586, -1679, -1267, 690, 1724, 1009, -1068, -2242, -794, 1111, 1495, 313, -1286, -1519, 124, 1665, 1429, -533, -1978, -1170, 604, 2012, 1016, -994, -1462, -514, 1094, 1667, 603, -1329, -1520, -169, 1761, 1227, -618, -1837, -1125, 475, 1876, 1076, -1337, -1771, -320, 1142, 1129, 659, -1322, -1158, -18]
7428a8J388m60j033j996M01K568Q33q18k364J5J810m8J370j499k750J354J624
7445C77M01O58j483j739l66K758J750j283j689j104O68J880O32j055j958n03J571
7462d85J932L46k059j440J59K175J011n64j914r13J074K030K06r58k014L0J443
7479E9J298K32j789j492L95J549J531r35j858n10R35J987J89j460j161n59J613
7496B4J105M30j868j327P90J596P00p64j460o94P99K124p1j148j408m19J558J416
7514A383k35j379j067K06J496R93o13j466j150J021K076K43j503j356Q2R79J702
7531A412K65k117j073M26J529J373p32j701j026J157J780M95j553j369j86J160
7547a60J582M6k041n97J92J683J230j011j377q76O29K148l5q42j001j352J686
$$ y = [-18, 1370, 910, -123, -2119, -1718, 850, 1683, 865, -1499, -1484, 326, 278, 1648, 149, -2601, -1247, 377, 778, 1436, -47, -1786, -2152, 606, 2356, 1073, -616, -1720, -1052, 828, 1460, 405, -1553, -2056, -485, 1447, 1793, -266, -1706, -1547, 628, 1639, 1075, -839, -1752, -678, 1352, 1558, 600, -1414, -1384, 59, 1357, 1589, -200, -1692, -1297, 252, 1783, 848, -1010, -1520, -585, 1402, 1591, 131, -1030, -1589, 24, 1129, 1559, -309, -1636, -846, 750, 1450, 686, -774, -1468, -669, 1455, 1384, 236, -1172, -1591, -33, 1383, 1148, -231, -1298, -1092, 404, 1397, 784, -682, -1832, -811, 1265, 1508, 5, -1351, -1269, -290, 1412, 1677, -440, -1513, -1087, 442, 1815, 1083, -618, -1644, -487, 1293, 1788, 235, -1134, -1320, -160, 1422, 1468, -573, -1170, -978, 705, 1935, 924, -453, -1329, -700, 1448, 1413, 571, -430, -1782, -96]
7564i6J402l45j577p21P09O61J464m33j831p89R58J500P57j231j401p06J649J210
7582A180j62j224j006j1J591J201k41k267p00Q82J750O79j293j489o71J545J352
7599A116J28j175j365R2J591J105m41j892p68O22J761P52r60j795k70J219J553
7616A273l16q05j338j11J709J213q08j705o61J126J482L72j012j576l93J363J144
7633I57N96j344k220P89P65J071l92j114n36J002O01J791k150j061q33K222J505
7650A649l85j224j833J44J981J250q53n79j195P02J730K38j744p14r54K285R39
7667A437P07k209j976R78R50J721p98j510q00J011J106J622j893j859k75J567
7683b21J699L73j760j656m8J474R71J27j019j501M87K077J65q95j240r0J161J792
$$ y = [-96, 1306, 961, -616, -1337, -628, 33, 1497, 1064, -767, -1556, -598, 902, 1659, 428, -973, -1679, -30, 1180, 1018, -206, -1212, -1223, 368, 1569, 1328, -939, -1639, -757, 993, 1672, 379, -1110, -1781, -236, 1116, 1244, 69, -1296, -1204, 387, 1492, 1051, -841, -1609, -987, 774, 1526, 566, -1229, -1499, -280, 1273, 957, 152, -1186, -1297, 412, 1625, 817, -888, -1549, -423, 1059, 1431, 419, -1157, -1550, -187, 957, 1553, 209, -2011, -1222, -457, 614, 222, -892, -1428, -426, 175, 1966, -184, -1245, -2078, 144, 1649, 1264, 40, -1793, -1649, 332, 1582, 729, 150, -1045, -343, 1387, 1625, -119, -833, -1787, 498, 1437, 2144, -65, -2041, -1063, -113, 1608, 810, -700, -1500, -489, 617, 2239, 346, -1513, -1788, -221, 1478, 1851, 91, -1565, -1613, -139, 832, 959, -60, -1561, -1074, 1003, 1168, 273, -967, -1057, 104, 1896]
7701A896j061j082j258L69J230J080L60j962o58J06K231l49r30j073O51R28J104
7718A582j012j688o03Q65J706J009q30j969q40J429J789l4j547r56J83J396J268
7735A748n41j445j739J301J517J274q10k430r73J459J367P79l65k311k01J507
7751A37J277k34j786j017O49J903J663j267k017j156O20J729J542r54k274k25
7767a410Q17J828p35j021n81O05K211Pq47k408J95J19J102R60J2j605l81Q03N16
7786A87K3j277J60m04K388O14j949r24o31J540R5J158o63j663M8R27J103M07j325
7805a86m3o42K490r9k89j534j156J353J056J673k882m50j485K816Q27j45j944
7822f40kk99J485J284j687j195o11M98K528P67j445k558j77J388J898J17j404
$$ y = [1896, 835, -247, -1505, -1136, 94, 1174, 1534, -428, -1086, -980, 1251, 902, -28, -1101, -450, 478, 1582, 570, -1118, -1721, -856, 850, 1859, 1029, -940, -1780, -351, 1438, 1404, -143, -1099, -916, 480, 1748, 1207, -238, -1977, -676, 841, 2115, 1305, -1125, -2098, -639, 728, 1507, 1142, -1169, -1370, 137, 1414, 1180, -606, -1623, -974, 929, 2592, 1325, -692, -1848, -1228, 501, 2043, 1089, -1185, -1410, -593, 1235, 500, -521, -1102, -497, 1714, 1721, 874, -1534, -1339, -1220, -118, 842, 854, -751, -1132, -329, 187, 210, -1067, -907, -1311, 1077, 1691, -258, -1182, -1813, -273, -178, 980, 317, -1346, -1298, -371, 732, 1139, -186, -229, -871, 1619, 1520, 1231, -303, -1459, -106, 950, 2623, -259, -709, -2194, 622, 1449, 1304, -640, -642, -941, 544, 1828, 141, -1054, -1665, -1167, 1361, 2128, 683, -1875, -2052, -664, 1234, 1351, -53]
7839e3j283j37J271J261n53j609o06P07J370J022m28j273q77j33J661J235n81
7856I94j202l63l91K183p65o48q14O64J824q0j501l02l30K49J410K21p16q19l86
7875g72R00N27o17k82p33J434N90m2j329j034j28K182P94q25o15j651j68J186
7893e83J997l69j432m44J249L20J72j535m23m64J960J526o28k166m82J77J156
7910C1K9O55q36j192P24J297N32q77j078o14J282J496k51j471q70m14R36K221
7928A600p56q59j419P57J207L94q18m07o23J596k86R59j694j192P01J152J057
7945A369j052r02j058L92J479j24o98k63J81Q16P49K68j326j529R53J426M53j154
7963b0l17l39L83J320p14Qj326L8N11J170k9j423j557J335K395p57m06j376o20
$$ y = [-53, -1336, -1473, -202, 1059, 506, -1103, -1709, -1002, 368, 1390, 962, -311, -1188, -1321, 340, 1575, 994, -208, -571, -962, 1221, 456, -192, -1006, -342, 1482, 1402, -99, -401, -731, -482, 928, 1149, 433, -386, -772, 128, 655, 38, -244, -977, 457, 1047, 1005, -324, -1358, -1486, 696, 1490, 665, 50, -1601, -1769, -583, 1414, 1045, -387, -831, 418, 738, 910, -625, -1048, -1512, 448, 1974, 1346, -820, -1302, -1125, 31, 60, 715, -121, -1313, -589, 708, 1240, 363, -715, -1329, -47, 1449, 1198, -273, -1143, -1557, -621, 1600, 844, -15, -1434, -677, 530, 924, 106, -301, -924, 672, 386, 1345, -349, -1541, -840, 312, 1369, 317, -585, -1643, -1251, 228, 104, -594, -857, -676, 140, 889, 1157, -169, -1698, -745, 681, 1134, -20, -337, -676, -293, 1027, 313, 321, -1005, -967, -456, 714, 685, -738, -2295, -960, 1435, 678, 272, -1104, -1724]
7982a724R40J671l52q46r10m16J644M20K60j163l56o5J786K4K26j729j269J869
8000A0Q52N72k04j394j100J440P09R24j722m62K73J068K35j733m65j77N14Q19
8018A59L77N19j515l90J164R67j099M42k140J54J461om21P7M7j029K404q92n66
8037b87j252j44J304J361k35j258o22K4J401J43n25o15n19J911MO38p70j620j04
8056a165J019J796l51k194m42O34N46J511j197m55j773K026J124N55j870q49p4
8073a159J288J479M56j702k328K167K57K11L70k229q63R29J741j16o52r94K68
8090h77J547J59l9j325q45M96J600M14j041p63j88N60P12N23r21j027oJ340O96
8109A015l15j037j096Q84J152N99o31j373k58P27R53N36r84j152J20J224N35J45
$$ y = [-1724, -784, 887, 535, -311, -1221, -1637, 7, 427, 687, -476, -832, -897, 889, 913, 1139, -590, -1859, 10, 862, 1434, 1230, -164, -1264, 176, 885, 1809, 87, -375, -102, 966, 1201, -532, -997, -1174, -660, 159, 536, 1055, -460, -850, 314, 1281, 182, 624, -1516, -1362, 99, 93, -328, -251, -204, -1233, 1171, 279, -287, -1539, -1683, -379, 982, 747, -511, -1133, -1109, 292, 435, -90, -705, -1224, 687, 691, 1329, 559, -1061, -1165, -146, 1650, 1299, -895, -1337, -703, -157, 1354, 157, -298, -2071, -45, 1079, 1634, -236, -1085, -1159, 129, 1608, 2064, 362, -1966, 201, 458, 669, 1039, -1190, -2053, -1124, 617, 501, -151, -1145, -877, 670, 829, 790, -535, -1380, -884, 716, 1130, 89, -674, -862, -302, 410, 933, 12, -1015, -1021, 319, 1015, 700, -337, -1433, -549, 603, 1202, 571, -802, -1060, -333, 620, 1156, 172, -980, -860, 364, 899, 1044]
8127A044j677p39P51J015O31p58p49n39O58J136K33r40j150K80J203O28m01r81
8145c55r69L99J621O52p64p83o27L41J083O66j254j029L53Q61P22m00q28o67M95
8164d83J143L38n26j005m95R49O22M18j029n23R5M45Q30l81o76n72K86J149L26
8183I11m53r52m19Q87R97k10p64o94
$$ y = [1044, -633, -1372, -621, 394, 1025, 267, -482, -1021, -363, 773, 1006, 66, -1084, -804, 399, 1027, 626, -355, -1324, -925, 696, 1348, 584, -199, -826, -485, 598, 1264, 10, -1019, -666, 195, 917, 517, -311, -978, -483, 660, 998, 472, -533, -1028, -79, 543, 961, -68, -591, -496, -51, 779, 398, -278, -850, -564, 585, 911, 458, -494, -913, -26, 971, 761, -3, -697]
8191f97
$$ Imaginary data points
##PAGE= N=2
##DATA TABLE= (X++(I..I)), XYDATA
0@%%%qJ6qQk4L2m0M9n7P2q9J08j32J62j94K28k70L17l68M30m97N70o57P48q47
28d51R65j092J229j383J551j735J939k165K407k673K970l292L647m040M469m947
44b601N484o080O752p518Q392r405J0598j2024J3761j5937J8760k2576K8065l6691
58b1020N2319q9639L36270M01107n91633m82710j02644L64720L66243J15808k56046
69I2775k69993j3728K67350J79096j38134l65395j30360K95398M25094Q6212k82414
80A45901l80255j66083J67163L64562J93628j31902k47978q2730R2019R5213m7796
91A742j22652J898J84368J63994l1226j94580k08490o2755J69309K51194P5129
102B27931j29259j37995k6989L2174N91n3688j7012J21636J78037L2079j73206
$$ y = [0, 0, 0, 0, -8, 8, 0, 8, -16, 16, -24, 25, -32, 40, -49, 59, -73, 89, -105, 123, -147, 170, -198, 232, -265, 305, -352, 396, -451, 514, -578, 651, -732, 819, -916, 1023, -1142, 1265, -1408, 1562, -1730, 1917, -2123, 2346, -2601, 2883, -3197, 3555, -3963, 4429, -4976, 5622, -6402, 7359, -8578, 10182, -12394, 15671, -21020, 31299, -58340, 277930, 679037, 87404, -395306, -497950, -133230, 233013, 348821, 92775, -177218, -190946, 76404, 255500, 117366, -248029, -378389, -82991, 342103, 428315, 145901, -234354, -400437, -233274, 131288, 324916, 193014, -54964, -137694, -45675, 49538, 1742, -120910, -119012, 65356, 229350, 198124, 3544, -204946, -267701, -98392, 152802, 227931, 98672, -39323, -66312, -34138, -33547, -87235, -104247, 17389, 195426, 227505, 54299]
113E4299k35199j10630J30795K88261J59295j36113k47581q4880J19621J57238
123I5106Q074j71596j39032J17237K83984J30513j87479l57141k02154J80216
133b42272M25649K52259j62758l90422k40144J09720L24953J86166j40179k53632
143a30660m8303J85006J91499j6300k48532k48145N8468L49551K74311q2043l39270
154e4418k69457M2319K87800K25933l8212j98328j34902M2472J56022P4011j35787
165b547j84607L0405K31490J69185o0403k22620j89552J3176J98405J83730J1913
176A78575j27402j28681j6040Q2646M3294o7823m5952Q5728J23402J1537j11335
187B7949j44676o0459R7738J74329P0974r0098j35330l8443Q5942R1428m4225
$$ y = [54299, -180900, -291530, -160735, 127526, 286821, 150708, -96873, -181753, -62132, 95106, 103180, -68416, -207448, -90211, 193773, 324286, 136807, -220334, -422488, -242272, 183377, 435636, 272878, -117544, -357688, -247968, 76985, 263151, 122972, -130660, -178963, 6043, 197542, 181242, -67290, -315435, -256967, 92584, 366895, 284852, -54418, -323875, -281556, 6244, 232177, 193965, -4363, -139265, -96793, 59229, 133240, -2547, -187154, -156749, 74741, 243926, 183523, -39097, -228649, -215473, -17068, 166662, 178575, 51173, -77508, -93548, -10902, 32392, -35431, -81383, 4345, 127747, 139284, 27949, -116727, -177186, -79448, 94881, 165855, 75757, -59573, -98016, -12074, 79354, 35129]
198C5129j33632k4986J43561J52410Q413j56995k13588o6734J85109K66457P0687
209B65831j79573k33610o3864J52934J87819P432j54669j10097N5522J56673R5621
220A80019r7087k30138j06790J64901K65323R1992j57837k52446j08300J41066
230a09297K30299P0815j32070j64656k8400J31862J43811l2313j90917j15292
240a96158J01850K06344J05656r9043k21324j24899J02314K08501R4602q1376
250I6467j51167p2075P5936J22252K701j09094o7128O1578J18355N1973q4518
261D5280j51842n1041J13683J42616K8343r2954j15055k0518R8322R2445m1073
272D8206j14267l4137Q7155J16263K4327j17649j53277j0739J48877J45722L247
$$ y = [35129, -98503, -123489, 20072, 172482, 180895, 23900, -189688, -256422, -71313, 195144, 265831, 86258, -147352, -211216, -58282, 129537, 136969, -17700, -127797, -72275, 84398, 180019, 82932, -147206, -253996, -89095, 176228, 268220, 110383, -142063, -250363, -109297, 121002, 191817, 59747, -104909, -133309, -1447, 142364, 110051, -80866, -196158, -94308, 112036, 217692, 118649, -102675, -227574, -125260, 83241, 177843, 96467, -54700, -126775, -50839, 71413, 74114, -34980, -102108, -40530, 77825, 129798, 45280, -106562, -157603, -43920, 98696, 127039, 34085, -80970, -101488, -3166, 89279, 48206, -66061, -100198, -13043, 103220, 127547, 9898, -143379, -154118, -5241, 140481, 143728]
283A43728j32976j40113l59J43282J11906n1093j32396n5967P5598J30514M3090
$$ y = [143728, 10752, -129361, -129720, 13562, 125468, 74375, -58021, -113988, -38390, 92124, 135214]
$$ [...]
8191f42
##END NTUPLES=NMR FID
##END=
