##TITLE=1H_CA-8706-1
 DMSO-d6, 8 sc, 
 26.3.2020
##JCAMPDX= 6.0         $$ Bruker NMR JCAMP-DX V2.0
##DATA TYPE= NMR FID
##DATA CLASS= NTUPLES
##ORIGIN= UXNMR, Bruker Analytische Messtechnik GmbH
##OWNER= root
$$ XWIN-NMR		Version 3.5
$$ Thu Mar 26 14:10:25 2020 Russian Standard Time (UT+4h)  she@DPX200
##.OBSERVE FREQUENCY= 200.1315
##.OBSERVE NUCLEUS= ^1H
##.DELAY= (6, 6)
##.ACQUISITION MODE= SIMULTANEOUS
##.ACQUISITION SCHEME= undefined
##.AVERAGES= 8
##.DIGITISER RES= 18
##SPECTROMETER/DATA SYSTEM= spect
##.PULSE SEQUENCE= zg30
##.SOLVENT NAME= CDCl3
##.SHIFT REFERENCE= (INTERNAL, CDCl3, 0, 15.7039)
##AUDIT TRAIL= $$ (NUMBER, WHEN, WHO, WHERE, WHAT)
$$ ##TITLE= Audit trail, XWIN-NMR		Version 3.5
$$ ##JCAMPDX= 5.01
$$ ##ORIGIN= Bruker BioSpin GmbH
$$ ##OWNER= she
$$ F:/spectra/data/she/nmr/H-F/1/audita.txt
$$ ##AUDIT TRAIL=  $$ (NUMBER, WHEN, WHO, WHERE, WHAT)
(   1,<2020-03-26 14:09:10.01 +0400>,<she>,<DPX200>,
      <created by zg, POWCHK disabled, PULCHK disabled
       configuration hash MD5:
       00 E9 B6 7A A2 85 ED C7 34 08 36 98 17 FE 4E 26
       data hash MD5: 16K
       EF DD 93 53 50 88 3F 39 FD 53 F0 40 8B 36 7C D8>)
$$ ##END=
$$ 
$$ hash MD5
$$ DE 77 4D 43 D4 48 83 2A 41 D3 A8 B4 A4 BC 53 33
##$RELAX= 
##$RELAX= 
##$RELAX= 
##$RELAX= 
##$RELAX= 
##$RELAX= 
$$ Bruker specific parameters
$$ --------------------------
##$DU= <F:/spectra>
##$EXPNO= 1
##$NAME= <H-F>
##$PROCNO= 1
##$TYPE= <nmr>
##$USER= <she>
##$AMP= (0..31)
100 100 100 100 100 100 100 100 100 100 100 100 100 100 100 100 100 100 
100 100 100 100 100 100 100 100 100 100 100 100 100 100 
##$AQSEQ= 0
##$AQ_mod= 1
##$AUNM= <au_zg>
##$AUTOPOS= <>
##$BF1= 200.13
##$BF2= 200.13
##$BF3= 200.13
##$BF4= 200.13
##$BF5= 200.13
##$BF6= 200.13
##$BF7= 200.13
##$BF8= 200.13
##$BYTORDA= 1
##$CFDGTYP= 0
##$CFRGTYP= 5
##$CHEMSTR= <none>
##$CNST= (0..31)
1 1 145 1 1 1 1 1 1 1 1 1 1 1 1 1 1 1 1 1 1 1 1 1 1 1 1 1 1 1 1 1 
##$CPDPRG= <>
##$CPDPRG1= <>
##$CPDPRG2= <>
##$CPDPRG3= <>
##$CPDPRG4= <mlev>
##$CPDPRG5= <mlev>
##$CPDPRG6= <mlev>
##$CPDPRG7= <mlev>
##$CPDPRG8= <mlev>
##$CPDPRGB= <>
##$CPDPRGT= <>
##$D= (0..31)
0 1.2 0 0 0 0 0 0 0 0.06 0 0.03 0 0 0 0 0.0002 0 0 0 0 0 0 0 0 0 0 0 0 
0 0 0 
##$DATE= 1585217349
##$DBL= (0..7)
120 120 120 120 120 120 120 120 
##$DBP= (0..7)
150 150 150 150 150 150 150 150 
##$DBP07= 0
##$DBPNAM0= <>
##$DBPNAM1= <>
##$DBPNAM2= <>
##$DBPNAM3= <>
##$DBPNAM4= <>
##$DBPNAM5= <>
##$DBPNAM6= <>
##$DBPNAM7= <>
##$DBPOAL= (0..7)
0.5 0.5 0.5 0.5 0.5 0.5 0.5 0.5 
##$DBPOFFS= (0..7)
0 0 0 0 0 0 0 0 
##$DE= 6
##$DECBNUC= <off>
##$DECIM= 24
##$DECNUC= <off>
##$DECSTAT= 4
##$DIGMOD= 1
##$DIGTYP= 9
##$DL= (0..7)
0 120 120 120 120 120 120 120 
##$DP= (0..7)
150 150 150 150 150 150 150 150 
##$DP07= 0
##$DPNAME0= <>
##$DPNAME1= <>
##$DPNAME2= <>
##$DPNAME3= <>
##$DPNAME4= <>
##$DPNAME5= <>
##$DPNAME6= <>
##$DPNAME7= <>
##$DPOAL= (0..7)
0.5 0.5 0.5 0.5 0.5 0.5 0.5 0.5 
##$DPOFFS= (0..7)
0 0 0 0 0 0 0 0 
##$DQDMODE= 0
##$DR= 18
##$DS= 0
##$DSLIST= <SSSSSSSSSSSSSSS>
$$ [...]
##$SUBNAM2= <"">
##$SUBNAM3= <"">
##$SUBNAM4= <"">
##$SUBNAM5= <"">
##$SUBNAM6= <"">
##$SUBNAM7= <"">
##$SUBNAM8= <"">
##$SUBNAM9= <"">
##$SW= 24.9337058887773
##$SWIBOX= (0..15)
0 0 2 0 0 0 0 0 0 0 0 0 0 0 0 0 
##$SW_h= 4990.01996007984
##$TD= 16384
##$TD0= 1
##$TE= 0
##$TE2= 300
##$TE3= 300
##$TEG= 300
##$TL= (0..7)
0 120 120 120 120 120 120 120 
##$TP= (0..7)
150 150 150 150 150 150 150 150 
##$TP07= 0
##$TPNAME0= <>
##$TPNAME1= <>
##$TPNAME2= <>
##$TPNAME3= <>
##$TPNAME4= <>
##$TPNAME5= <>
##$TPNAME6= <>
##$TPNAME7= <>
##$TPOAL= (0..7)
0.5 0.5 0.5 0.5 0.5 0.5 0.5 0.5 
##$TPOFFS= (0..7)
0 0 0 0 0 0 0 0 
##$TUNHIN= 0
##$TUNHOUT= 0
##$TUNXOUT= 0
##$USERA1= <user>
##$USERA2= <user>
##$USERA3= <user>
##$USERA4= <user>
##$USERA5= <user>
##$V9= 5
##$VALIST= <valist>
##$VCLIST= <CCCCCCCCCCCCCCC>
##$VD= 0
##$VDLIST= <DDDDDDDDDDDDDDD>
##$VPLIST= <PPPPPPPPPPPPPPP>
##$VTLIST= <TTTTTTTTTTTTTTT>
##$WBST= 1024
##$WBSW= 4
##$XGAIN= (0..3)
0 0 0 0 
##$XL= 0
##$YL= 0
##$YMAX_a= 200915
##$YMIN_a= -159114
##$ZGOPTNS= <>
##$ZL1= 120
##$ZL2= 120
##$ZL3= 120
##$ZL4= 120
##$ABSF1= 10
##$ABSF2= 0
##$ABSG= 5
##$ABSL= 3
##$ALPHA= 0
##$AQORDER= 0
##$ASSFAC= 0
##$ASSFACI= 0
##$ASSFACX= 0
##$ASSWID= 0
##$AUNMP= <proc_1d>
##$AZFE= 0.1
##$AZFW= 0.1
##$BCFW= 1
##$BC_mod= 2
##$BYTORDP= 1
##$COROFFS= 0
##$CY= 11.3945322036743
##$DATMOD= 1
##$DC= 2
##$DFILT= <>
##$DTYPP= 0
##$F1P= 16.9975609425685
##$F2P= -3.02152046262296
##$FCOR= 0.5
##$FTSIZE= 0
##$FT_mod= 4
##$GAMMA= 1
##$GB= 0.15
##$INTBC= 1
##$INTSCL= 1
##$ISEN= 128
##$LB= 0.24
##$LEV0= 0
##$LPBIN= 0
##$MAXI= 10000
##$MC2= 0
##$MEAN= 0
##$ME_mod= 0
##$MI= 1.114404
##$NCOEF= 0
##$NC_proc= 0
##$NLEV= 6
##$NOISF1= 3.799351
##$NOISF2= 2.8
##$NSP= 1
##$NTH_PI= 0
##$NZP= 0
##$OFFSET= 15.70392
##$PC= 1
##$PHC0= -9792.383
##$PHC1= 19.60082
##$PH_mod= 1
##$PKNL= yes
##$PPARMOD= 0
##$PSCAL= 0
##$PSIGN= 0
##$REVERSE= no
##$SF= 200.130013532006
##$SI= 16384
##$SIGF1= 3
##$SIGF2= 2
##$SINO= 400
##$SIOLD= 16384
##$SREGLST= <1H.CDCl3>
##$SSB= 0
##$STSI= 0
##$STSR= 0
##$SW_p= 3612.71676300578
##$SYMM= 0
##$S_DEV= 0
##$TDeff= 0
##$TDoff= 0
##$TI= <>
##$TILT= no
##$TM1= 0
##$TM2= 0
##$TOPLEV= 0
##$USERP1= <user>
##$USERP2= <user>
##$USERP3= <user>
##$USERP4= <user>
##$USERP5= <user>
##$WDW= 1
##$XDIM= 8192
##$YMAX_p= 0
##$YMIN_p= 0
$$ End of Bruker specific parameters
$$ ---------------------------------
##NTUPLES= NMR FID
##VAR_NAME=  TIME,          FID/REAL,        FID/IMAG
##SYMBOL=    X,             R,               I
##VAR_TYPE=  INDEPENDENT,   DEPENDENT,       DEPENDENT
##VAR_FORM=  AFFN,          ASDF,            ASDF
##VAR_DIM=   8192,          8192,            8192
##UNITS=     SECONDS,       ARBITRARY UNITS, ARBITRARY UNITS
##FACTOR=    0.0002004,     1,               1
##FIRST=     0,             0,               0
##LAST=      1.6414764,     0,               0
##MIN=       0,             -159114,         0
##MAX=       1.6414764,     200915,          0
$$ Real data points
##PAGE= N=1
##DATA TABLE= (X++(R..R)), XYDATA
$$ [...]
2197b61K120p57k127l9M0J763L42p88k473P34K005Q54n39r93j291N84J446J37
$$ -261 1859 1102 -1025 -1064 -1024 739 1081 293 -2180 -1446 559 1413 874 -119 -1410 -826 620 757
2215G57n89j117p2J162M40N51j107j360O33J542k42l1o92p92J62J827r5j182l31
$$ 757 168 -949 -1021 141 581 1132 25 -1335 -702 840 598 567 -125 -917 -755 1072 977 -205 -536
2234e36j72N53J501k40j642r42J078K053p76m16j056j261J537J355K37j434j205
$$ -536 -708 -155 1346 1106 -536 -1478 -400 1653 877 461 -595 -1856 -319 1036 1273 -161 -1366
2251a366P78J063J708j287k488p9J200R92P42j014j077q81K197J050j250j705
$$ -1366 -588 475 2183 896 -1592 -1671 -471 521 1263 249 -828 -1709 488 1538 288 -1417
2267a417L28J95J301L62r41m84j31O98M41l90j1p85K49J133Q50q78o01n43j097
$$ -1417 -1089 -894 407 769 -172 -656 -787 -89 352 -38 -49 -834 -585 548 1398 520 -81 -624 -1721
2286a721J305M03l77k00K42J9J233N24j044j435K59K271J43q33k385J448R5J245
$$ -1721 -416 -13 -390 -590 -348 -329 904 1428 384 -1051 -792 1479 1622 789 -1596 -148 -53 1192
2304A192m46k297J44Q52J357k3p99o96l66J401R86j046q31qL57N11J224j845q84
$$ 1192 746 -1551 -1407 -555 802 779 -20 -716 -1082 319 1305 259 -572 -580 -223 288 1512 -333 -1217
2323a217J017J48K52P0M59j255p31J145O91l60n96P14j394J736K21j130j577N74
$$ -1217 -200 -52 200 270 729 -526 -1257 -112 579 219 -377 337 -1057 679 900 -230 -1807 -1233
2341a233J662J258l17j454j277N63J053O96p77K96r69K35R61J44j078p99J25Q97
$$ -1233 429 1687 1370 -84 -1361 -798 255 951 174 470 -499 -264 697 841 -237 -1036 -911 -14
2359a4J345j364p66q21J901J415j387j110m70J75J235Q15n82j768J170J14N48
$$ -14 1331 -33 -799 -1620 281 1696 309 -801 -1271 -1096 139 954 372 -1396 -226 -112 436
2376D36K39p38j004L52J190R00r24n23l34n01J276P05q09p34n1K4O33O70n98j083
$$ 436 675 -63 -1067 -715 475 1375 451 -72 -406 -907 369 1074 265 -469 -520 -496 137 807 209 -874
2396h74R4J476K29M6q97p90L73P93j00j004k49L18J395J96n05j535OJ184J019
$$ -874 -780 696 925 971 74 -716 -343 450 350 -654 -903 -585 810 1006 501 -1034 -1028 156 1175
2415A175n11q39o66M59J130k1r57o89j59J257K35j33J36m91n94Q31O52o15m5j075
$$ 1175 664 -175 -841 -382 748 727 -230 -919 -1078 179 414 281 417 -74 -668 163 815 200 155 -920
2435i20P2P31J163o36q08k50J09M93J149r51j265L8J255P70j82j275j019P93J612
$$ -920 -848 -117 1046 410 -398 -648 -539 -46 1103 152 -1113 -1075 180 950 768 -507 -1526 -733 879
2454H79J47j507l06N07K8P77q7j111p78J513O68j832R02j157m4K137k13j409M20
$$ 879 1026 -481 -787 -280 -252 525 438 -673 -1451 62 730 -1102 -200 -1357 -1401 736 523 -886 -466
2473d66J63l6J86R17j309R97j407Q13P07n63J3J85j508Q86K651k799J52o45M76
$$ -466 -303 -339 -153 764 -545 452 -955 -142 565 2 15 200 -1308 -422 2229 -570 -418 -1063 -587
2492e87k64J995N01j734q66K106K98m1k187N8L14J541J92o80o08o67J73J559M6
$$ -587 -851 1144 1645 -89 -955 1151 1449 1408 -779 -721 -407 1134 1326 646 38 -629 -456 1103 1149
2511A149j307q04L64J561m79o73l01k95J394P84n31r64m05J26O58J002p47N59
$$ 1149 -158 -962 -598 963 484 -189 -490 -785 609 1393 862 -102 -507 -381 277 1279 532 1091
2529A091j522P56K61k07o48l2k77J030P34o82q93r3J91R43K03J27j331o15R55
$$ 1091 -431 325 586 379 -269 -301 -578 452 1186 504 -389 -482 -291 652 855 982 -349 -964 -9
2548iP18O4l46j576K83J393J88q45P4j727J401R85J12q96j126Q78P95M17m26r80
$$ -9 709 773 427 -1149 -866 527 715 -130 -56 -1783 -382 603 715 -181 -1307 -429 366 783 357 -623
2568f23j123J843J6N6Lq49L62R75j50l77m06p06R98j8q2O57p45n79r4J296J19
$$ -623 -1746 97 113 169 172 -677 -315 660 510 133 -273 -979 19 1 -81 576 -169 -748 -842 454 573
2589E73l72m74j149R16K169q16j052p27M13N40K484j762p12J17q4Q02m12j14k051
$$ 573 201 -273 -1422 -506 1663 847 -205 -932 -519 21 2505 743 31 148 64 866 454 340 -1711
2608a711J301J403l52j460o60Q23J225l96p52L81l1J961j59j733N23K32j052L48
$$ -1711 -410 993 641 -819 -1479 -656 569 173 -579 -198 -229 1732 1573 -160 363 595 -457 -109
2626a09R61k17p90l01P17j52l5L56n23o22L24R12l54j10m26l14N92J242l70j894
$$ -109 852 635 -155 -456 261 109 74 430 -93 -715 -391 521 167 57 -369 -683 -91 1151 781 -1113
2646a113Q59M24R0l2j18m08O0N36N35k61o67n11j0J445P48r79j106J43Q04N35
$$ -1113 -254 170 260 228 110 -298 -238 298 833 572 -95 -606 -616 829 1577 598 -508 -365 439 974
2666I74l80n48p53N46Q98l20l47j58j99M05Q41j64p44j2j89j20N97J80n31p09
$$ 974 594 46 -707 -161 737 417 70 -88 -287 118 959 795 51 39 -150 -270 327 507 -24 -733
2686g33k11J795p46J051j106n08N54l0M90r93j58O53J4N66R5j080n35J036P46
$$ -733 -944 851 105 1156 50 -458 96 66 556 -437 -595 58 72 638 733 -347 -882 154 900
2705I00p11l05k50l42J254K08j032n87n90J147N38J71q90p84R78J277j298m9k15
$$ 900 189 -116 -366 -708 546 754 -278 -865 -1455 -308 230 401 -489 -1273 -295 982 -316 -365 -580
2724e80M71m49J316o50j237J474M10j649P35O36n24n93j99M09M05M71r81k95k65
$$ -580 -109 -558 758 108 -1129 345 755 -894 -159 477 -47 -640 -839 -430 -25 446 -535 -830 -1095
2743a095J712j03o85p91O45M94J000q10r50k54Q10N44J92p08p55n5J183M18l08
$$ -1095 617 514 -171 -962 -317 177 1177 367 -583 -837 -27 517 709 1 -754 -809 374 792 484
2762D84j281j19J250m4O62q58n97m6R22p7k1m58M1k06N70M02n44j61M2j52J10
$$ 484 -797 -916 334 290 952 94 -503 -549 373 296 275 -183 -142 -348 222 624 80 -81 -39 -191 -81
2783h1P75n71j340J658J0j38j23j18m50m8R79M17j183j21J97j25J416l49o67m66
$$ -81 694 123 -1217 441 451 313 190 72 -378 -426 553 970 -213 -334 -137 -262 1154 805 138 -328
2803c28l8Q02L75l42j029o06J041J164m97r92m72N62M74Q23p13n42R7N20J058
$$ -328 -366 436 811 469 -560 -1166 -125 1039 542 -450 -922 -360 114 937 224 -318 -221 299 1357
2822A357j078j99n23Ln2O90m07j94J36J129p57k36J449k066J07M83O11r65M97
$$ 1357 279 80 -443 -440 -492 198 -209 -403 -267 862 105 -131 1318 -748 -641 -158 453 -512 -15
2841a5r92O30J050r77N45r09j01K23O16J537r70j473R62J61J142j208m77k33N82
$$ -15 -1007 -377 673 -304 241 -668 -769 -546 70 1607 637 -836 126 287 1429 221 -256 -489 93
2860I3Q94n01q36k47N19L74N57n49p79J45P76J59k87j37k79l43R50Pj30m43J40
$$ 93 987 486 -350 -597 -78 296 853 304 -475 -330 446 605 318 181 -98 -441 509 516 386 -57 83
2881H3k83J05M91Pn68j56L51K62L04j27j338k7J293K62l06o19l93J29J126K9m93
$$ 83 -200 -95 396 403 -165 -321 30 292 596 469 -869 -896 397 659 353 -266 -659 -530 596 625 132
2902A32r02K50N75L25L52p58q08Q31P23r1n65m57J29K16N58N3r02k81N13j5L21
$$ 132 -770 -520 55 380 732 -26 -834 -3 720 629 64 -393 -264 -48 510 563 -339 -620 -107 -122 199
2923A99m4k65k88M03l1K10L8k2o86J92Q08k51q93K47L52RL10N3q23n30R28M39
$$ 199 155 -110 -398 5 -26 184 222 200 -486 -294 514 263 -630 -383 -31 -22 288 341 -482 -1012 -84 355
2945C55j79p7o66j83O40O99m44n70p2M30L91J57m70n67k63J306l12L6k79m14K66
$$ 355 176 99 -567 -750 -110 589 145 -425 -497 -67 324 481 11 -556 -819 487 175 211 -68 -482 -216
2966b16R16n55o02o9K61J00N7J76q41J85O46J89n34J2K55m73L62N36p2p18j17
$$ -216 700 145 -457 -526 -265 -165 -108 68 -773 -588 58 247 -287 -275 -20 -493 -131 405 333 -385 -502
2987e02j69L32M58p4l86k88L97O57O9o70l77j50J004L65l46p61l70N06N88M60
$$ -502 -671 -339 119 45 -341 -629 -232 425 494 -176 -553 -703 301 666 320 -441 -811 -305 283 743
3007G43q59n54N3J011m7k12n91q6N03P07l35o31j75O57P7LJ90m79R7l0K55J17
$$ 743 -116 -670 -617 394 347 135 -456 -542 -39 668 333 -298 -473 184 261 264 454 -25 72 42 297 414
3029D14j66J0n63k9R76j19k88m10P0K27M67J24o49n18M81N27J38k30o50k19M13
$$ 414 248 258 -305 -334 642 523 235 -175 -105 122 589 713 64 -454 27 554 692 462 -188 -407 6
3050FQ32k37o16k14Q3O33L63k39j102N18L55K25r1l78l41J08N15L61p50K22m29
$$ 6 838 601 -15 -229 -146 487 850 611 -491 27 382 607 516 138 -203 -95 420 781 31 253 -176
3071a76K02L34j60l04k43L02J26J66J11k83m21J83N46J17p07O0P2M0N23q8q60
$$ -176 26 360 200 -104 -347 -45 81 247 358 75 -346 -163 383 500 -207 -147 -75 -35 488 400 -460
3092d60m8M52K76k16P9m23n45O36J047p84k35m05J27M74N40j00j187O4Q56K84
$$ -460 -508 -56 220 4 83 -340 -885 -249 798 14 -221 -626 -499 -25 515 415 -772 -708 148 432
3112D32n6j76p21j48Q62N57o93o08K12J59L08R8j92m96K93J93j89L30j59m24J55
$$ 432 376 200 -521 -669 193 750 57 -551 -339 -180 128 226 34 -462 -169 24 -165 165 6 -418 -263
3133b63N71k20M3m4o09J80R19n8m02m08J00K40N49l5p56k90L37M06L52p71k25
$$ -263 308 88 131 87 -522 -342 577 519 117 -291 -191 49 598 563 -193 -483 -146 260 612 -159 -384
3154c84QL75O64k43o84J0K03L9P8O3m45P4L66J24j71j30k33L8J56L69J7l40k92
$$ -384 -376 -1 663 420 -264 -254 -51 -12 66 129 -316 -242 124 248 77 -53 -286 -248 -92 277 294 -46 -338
3177c38oK14J55L49p45K06L70Nj71l78q4J11N92J00l42l63j43L54L84j7o71k1
$$ -338 -344 -130 25 374 -371 -165 205 210 39 -339 -423 -312 280 380 38 -325 -468 -114 270 253 -418 -439
3199d39K71O36j56l55k90k46N24O19r8q07k97M30P9M98j94m87lN16J59J29r91
$$ -439 -168 468 312 -43 -333 -579 -55 564 466 -341 -638 -208 -129 369 175 -312 -315 201 360 489 -502
3220e02K5K64N79J29k87o98J10M29nK20j76n95o9Q53L9n16O0j17J87K19K26k11
$$ -502 -477 -213 366 495 208 -490 -380 49 44 264 88 -507 -576 277 316 -200 -140 -257 -70 149 375 164
3242A64m56K7J36J64N7k59l80M43J83R7O6m37k50K82N72n5l42k03O7K07J46L83
$$ 164 -292 -265 -129 35 92 -167 -547 -104 79 176 242 -195 -445 -163 409 354 12 -191 -124 83 229 612
3264F12q41j22M23L26k68k04P9jj96O64j74m06O8j47L31J24k56J5k98N49l77K06
$$ 612 -229 -351 72 398 130 -74 5 4 -192 472 298 -108 -40 -187 144 268 12 27 -271 278 -99 107
3286A07M97p86K30L86j06P8p13J35M24j94N81q21j80L1P90M92j058k22l36J070
$$ 107 604 -182 48 434 328 406 -307 -172 252 58 639 -182 -362 -331 459 951 -107 -329 -665 405
3306D05o3J97j160N85k05K50P8j27j38J49O24l7o26m66R3N93J31l46m78L81m39
$$ 405 342 539 -621 -36 -241 9 87 -40 -178 -29 595 558 -68 -534 -441 152 283 -63 -541 -160 -599
3327e99K37R0Q22l90m99k25L78M12n84O45p12K27L27L79j94o46J25j16K55N24
$$ -599 -362 -272 550 160 -339 -564 -186 226 -358 287 -425 -198 129 508 314 -332 -207 -323 -68 456
3347D56k89p90K82L23K6K8K96n51k79P21M02p62j60k1p3M32L92l89n09L79J91
$$ 456 167 -623 -341 -18 8 36 332 -219 -498 223 625 -137 -297 -318 -391 41 433 44 -465 -86 105
3368A05J73l11p2m94N20K00K7n06l6J32M86J41j48l73J5O24k86k74L28n80p5O64
$$ 105 278 -33 -105 -599 -79 121 148 -358 -394 -262 224 365 217 -156 -141 483 197 -77 251 -329 -404 260
3390B60J36n18j41J82J45j33O73l23p54J51O32j38j05J23m49J88N05n2j80m18
$$ 260 396 -122 -263 -81 64 -69 604 281 -473 -322 310 172 67 190 -259 -71 434 382 202 -216
3410b16J9L05L02k67N3o66L50K70j05L42m84RM8L81k16k31K62l58N2N94k61m10
$$ -216 -197 108 410 143 196 -470 -120 150 45 387 -97 -88 -40 341 125 -106 156 -202 -150 444 183 -227
3432b27J05K00m6Q6K21q43J51M92K31k29m01O9k6L43M28m67n13R04n58L35j32
$$ -227 -122 78 32 118 339 -504 -353 139 370 141 -260 -191 -217 126 554 87 -426 478 -80 255 123
3453A23J04r38R39k35O95o43M31p72K72k32P53o90n46j66Q13r9R4O46j137Q01
$$ 123 227 -711 228 -7 688 45 476 -296 -24 -256 497 -193 -739 -905 -92 -191 -97 549 -588 213
3473B13k92j23R93j234L35P28n65M46m78j05o69O43K19j50N47l53m22Q13j060
$$ 213 -79 -202 791 -443 -108 620 55 501 23 -82 -751 -108 111 -39 508 155 -267 546 -514
3492e14N03P34j147J009l7o47L85K12rq24J555j570K14Q61J10j08n66r10P17M09
$$ -514 -11 723 -424 585 548 -99 286 498 489 -335 1220 -350 -136 725 835 727 161 -749 -32 377
3512C77K93K68j229R55j305J00J057P24j240J125k116J285j6l7j052q7P79P97
$$ 377 670 938 -291 664 -641 -541 516 1240 0 1125 -991 294 278 241 -811 -898 -119 678
3530F78l65o99k8L38K74o6j372J96L88J143j733J002P80n50j20M0j09j6M11r71
$$ 678 313 -386 -414 -76 198 132 -1240 -1044 -656 487 -1246 -244 536 -14 -134 -94 -203 -219 192 -779
3550g79J34Q42Q41J55k159P00J367j520J048q67q85J170J12N21L36r40L73m48
$$ -779 -645 197 1038 1193 -966 -266 1101 -419 629 -238 -1123 47 159 680 1016 76 449 1
3568An76Q55k47J39l36J308q29r17O50n68L63Q90j201N67p29K36K67O85r52m05
$$ 1 -575 280 33 172 -164 1144 315 -602 48 -520 -157 733 -468 99 -630 -394 -127 558 -394 -799
3588g99J74R0L38m5K25j01j146Q63O68n83M00K7l8mj34k20Q4r68K140p53k43j99
$$ -799 -625 -535 -197 -242 -17 -118 -1264 -401 267 -316 84 111 73 69 -65 -285 -201 -1169 971 218 -25 -224
3610b24l38J13K49M68j87j13L27l71n34O83K30l06k61K84m37P14q11j94J27L01
$$ -224 -562 -449 -200 268 81 -32 295 -76 -610 73 303 -3 -264 20 -417 297 -514 -708 -581 -280
3630b80Q09j41k89M79l30o6r6k66R0L75l74Q8J40m82K79m11L66K91j85j90O62
$$ -280 529 388 99 578 248 182 86 -180 -90 285 -89 -1 139 -343 -64 -475 -109 182 -3 -193 469
3651D69K53k17o26k88K19P16j070J305k00q97k02L97RK32K00p08K58OL49o82N00
$$ 469 722 505 -121 -409 -190 526 -544 761 561 -336 -538 -141 -132 100 300 -408 -150 -144 205 -477 23
3672B3k14O0N16K61m33m8k98pK09J23o07M53j67N14p3j67j88K23l4p5M52m64o1
$$ 23 -191 -131 385 646 213 165 -133 -140 69 192 -415 38 -129 385 312 145 -43 180 146 71 523 59 -2
3695bj10K39P10o51k60l37J81O36k62j02RM57n53p92R72Ol86P56j09k11j25J65
$$ -2 -112 127 837 186 -74 -411 -230 406 144 42 51 508 -45 -837 135 141 -245 511 402 191 66 231
3717B31jl52L04k06n0L90p04O36k05K67l32k14k12P79j03q70M37J84O06k00p3
$$ 231 230 -122 182 -24 -74 316 -388 248 43 310 -22 -236 -448 331 228 -642 -205 -21 585 385 312
3738C12r4K00n31M65m2k9N33j431L14l23Q81k79J44m09L26kn01Q4J44k27M63P3
$$ 312 218 418 -113 352 310 281 814 -617 -303 -626 255 -24 120 -289 37 35 -466 -382 -238 -465 -2 71
3760G1L9k86K5M69j72J26m65N6K33L99m05l03J04J0K78k72K23j08k8j61M38N5
$$ 71 110 -176 -151 318 146 272 -193 -137 96 495 90 -213 -109 -99 179 -93 130 22 -6 -167 271 326
3782C26j60L7l25J87p0N25p38q4P9K37K95k53j10p6N06o8k14J04l38j54K79J33
$$ 326 166 203 -122 65 -5 520 -218 -302 -223 14 309 56 -54 -130 376 308 94 198 -140 -294 -15 118
3804A18m1k82K22j61K96j73J15m67K59J70l29K25p0j27M35k14J58m19K55M3l49
$$ 118 77 -205 17 -144 152 -21 94 -373 -114 56 -273 -48 -118 -245 190 -24 134 -285 -30 13 -336
3825c36K52J07j96k79K40M01k20r2m5P6Q2J29J21n96J80R4P1R7Q0m34k4J83K75
$$ -336 -84 23 -173 -452 -212 189 -31 -123 -168 -92 -10 119 240 -356 -176 -82 -11 86 166 -268 -292 -109 166
3848A66l7k22r1K38P6L47m46k89M87k22K53j82k80J31JJ78j03j9k67K76n4J50
$$ 166 129 -93 -184 54 130 477 31 -258 229 7 260 78 -202 -71 -70 108 5 -14 -281 -5 -59 91
3870I1J24k93r7n8L53j5N2l03k73J18L59l3J04l31j2L42L27m50j56k51L08k8M10
$$ 91 215 -78 -175 -233 120 105 157 -146 -419 -301 58 25 129 -202 -214 128 455 5 -151 -402 -94 -122 288
3893B88k33k48J33L44l59L81l6l11ok21K67n0J47k08m8J59L4K04l44K21k83K02
$$ 288 55 -193 -60 284 -75 306 270 -41 -47 -268 -1 -51 96 -112 -160 -1 33 237 -107 114 -169 33
3915C3j25R3l03j31N60J6l4l09J75o4O5L22j56m48L28j94J08K74j6l26rL02r4
$$ 33 -92 1 -302 -433 127 143 109 -200 -25 -89 -24 298 142 -306 22 -172 -64 210 194 -132 -141 161 67
3938F7p1k11m8M19l3J56l33mM6K98l59R7j99k98O26r4K95m58j26J85K58k11J22
$$ 67 -4 -215 -263 156 123 279 -54 -58 -12 286 -73 24 -175 -473 153 59 354 -104 -230 -45 213 2 124
3961A24l18k32N64R3k40K66k22K20k09k0j32J52l24J27M06r0m01J9N11l77J19
$$ 124 -194 -426 138 231 -9 257 35 255 46 26 -106 46 -278 -151 255 165 -236 -217 294 -83 36
3982C6j14J23k37o9K26J62J10j06l87J39K52J20j85m33L25J64J73l43k19q5J37
$$ 36 -78 45 -192 -261 -35 127 237 131 -256 -117 135 255 70 -363 -38 126 299 -44 -263 -348 -211
4003b11M35n4k74J68m9j91K71J69m28qJ28L00l40K94k02QQ7j22N0o8L1j18M32
$$ -211 224 170 -104 64 15 -176 95 264 -164 -172 -44 256 -84 210 8 16 103 -19 31 -37 -6 -124 308
4026C08k53j11QO1k34J82K72j79j67K24l03L64M2j27J16k45K46K01n95O0J06J47
$$ 308 55 -56 -48 13 -221 -39 233 54 -113 111 -192 172 214 87 203 -42 204 405 -190 -130 -24 123
4048A23j00n2R1j09j85J11K45p1J3K32l25L45L6o00J62K8K62l16K16k13j7K68
$$ 123 23 -29 62 -47 -232 -121 124 53 66 298 -27 318 354 -246 -84 -56 206 -110 106 -107 -124 144
4070A44r1l09K48l0k94K29L66m11p3K08r6K49J71k95m76L43K97j34J07j5j94l4
$$ 144 53 -256 -8 -38 -332 -103 263 -148 -221 -13 -109 140 311 16 -460 -117 180 46 153 138 -56 -90
4092i0M0M33L8l97k00K09j10M6j61m2l4L1M4K48P0n05L36J29k87k5J18M9q9O6
$$ -90 -50 383 421 24 -176 33 -77 -31 -192 -234 -268 -237 -193 55 125 -380 -44 85 -202 -227 -109 -60 -149 -83
4116h3M65l90J39k0r4j84L46k07k01O4K86j94K0J68j50L47j54p6J8k5K9k97L77
$$ -83 382 -8 131 111 17 -167 179 -28 -229 -165 121 -73 -53 115 -35 312 158 82 100 75 104 -193 184
4139A84n9k36l00L14J97j51J49J4o7K65k70L2j49K85k72Q6l0j16J17R6j00K0J90
$$ 184 125 -111 -411 -97 100 -51 98 112 45 310 40 72 -77 208 -64 22 -8 -124 -7 89 -11 9 199
4162A99l70M24j08J49l17j50K39L15J58m16J02j89k89J91Q5jk96nm4o1L91j27
$$ 199 -171 253 145 294 -23 -173 66 381 539 123 225 36 -253 -62 23 22 -274 -279 -323 -384 7 -120
4184a20O0k54L50m7P0L8m0k70K55J22j7l15J26L8l7J00J12m13L08J86k18j33L5
$$ -120 -60 -314 36 -11 59 97 57 -213 42 164 147 -168 -42 -4 -41 59 171 -242 66 252 34 -99 -64
4207f4m11M33M10l14j06Q8m4P0j05J58r9m65J98K91J40L7k63p2J78L66k85k83
$$ -64 -475 -42 368 54 -52 36 -8 62 -43 115 16 -449 -251 40 180 217 -46 -118 60 426 141 -142
4229a42L9J1M30p9j16k72M6M2K26j14k39j0O3P9J17kj29n86N59k8O3Ok67L1L40
$$ -142 -103 -92 338 259 143 -129 -83 -41 185 71 -168 -178 -115 -36 81 79 -50 -636 -77 -105 -42 -36 -303 -272 68
4254F8k32M30l46k9q9K49K18n64J00r7M30R8j92J27j58o8j34L23j63p5j5j10M69
$$ 68 -164 266 -80 -109 -198 51 269 -295 -195 -292 138 236 44 171 13 -55 -189 134 -29 -104 -119 -229 240
4277B40l87N3k18k32N50J18J11k40O1k01K6J83q0K6j38L4L16l80l3J63k63J33
$$ 240 -147 -94 -312 -544 6 124 235 -5 56 -145 -119 64 -16 10 -128 -94 222 -158 -191 -28 -291 -158
4299a58M52k78k24L35p9j26K63mk74M4K63j08J7j43k9J24p2J70k78O6j69K39P6
$$ -158 294 16 -208 127 48 -78 185 181 -93 -49 214 106 123 -20 -49 75 3 173 -105 -39 -208 31 107
4322A07J32Nl51OJ84J78l89N2R0M0J68k40J57k23l31N78o6J42k30k59M10L1l44
$$ 107 239 244 -107 -101 83 261 -128 -76 14 54 222 -18 139 -84 -415 163 97 239 9 -250 160 191 -153
4345a53N18k58k2m4N0J38k28N1r2L6O0K92m60M2J92J38n92K84O6o4K25Pq6L2j78
$$ -153 365 107 85 41 91 229 1 52 -40 -4 56 348 -112 -70 122 260 -332 -48 18 -46 179 186 100 132 -46
4370d6L41l23J90N6k11J31j47j0k3L23k70j05K69l74K0K80M5l63J84J49j44L3
$$ -46 295 -28 162 218 7 138 -9 -19 -42 281 11 -94 175 -199 -179 101 146 -217 -33 116 -28 5
4392EQ1m3M5o5j77J24J70J88n94K47J6q6L29k94q1M06m31J88P6l2q7Q4j27K64
$$ 5 86 43 88 23 -154 -30 140 328 -266 -19 -3 -89 240 -54 -135 271 -160 28 104 72 -15 69 -58 206
4416B06j52l1K1o2M5j19L51m48n7K19q3K24l76L27K7n56N21R7K58j035P03n13
$$ 206 54 23 44 -18 27 -92 259 -189 -246 -27 -110 114 -262 65 92 -464 57 154 412 -623 80 -433
4438d33R91J87q47Q77q33J7J51k2j05K19Q4J75o96Q83k73k99o56nM85K62O1r4
$$ -433 558 745 -102 775 -58 -41 110 88 -17 202 286 461 -235 648 375 76 -580 -585 -100 162 223 129
4460A29n24L03o59O73n97J261l19k94j34m35O97J94J66q30P19O2o32J61M00K08
$$ 129 -395 -92 -751 -78 -675 586 267 -27 -161 -596 101 295 461 -369 350 412 -220 -59 341 549
4480E49j038j4P82P56j130O55r77M33l38K26J52k3k7O9R4l85L07l19J19K58K74
$$ 549 -489 -503 279 1035 -95 560 -417 16 -322 -96 56 33 6 75 169 -216 91 -228 -109 149 423
4501D23l75k26J04M63m71j71o7M63K47k45l13J98l95K46J01m15O57k66M2L17m05
$$ 423 48 -178 -74 389 -82 -253 -320 143 390 145 -168 30 -365 -119 -18 -433 224 -42 0 317 -88
4522h8l36K49J67k87K13n0L34K02o16l35R49n89M70k21J5l34j8P33n36k71n0N28
$$ -88 -424 -175 -8 -295 -82 -132 202 404 -212 -547 402 -187 283 62 77 -257 -275 458 -78 -349 -399 129
4544A29j33P5R2l30L32j06m2k4j57o8O43k70j23l85M55k88J72KJ93j12J9l43n12
$$ 129 -4 71 163 -167 165 59 17 -7 -164 -232 411 141 18 -367 88 -200 -28 -26 167 55 74 -269 -781
4567g81R03l35M46k80L5J31M3n81O65jk06p0j87O4m4O55k21j95J16j09k31M55
$$ -781 122 -213 233 -47 -12 119 162 -419 246 245 39 -31 -218 -154 -198 457 236 41 157 48 -183 272
4589B72p3r3l40L38j45L35k46k77K38J80j51J14R8k46J79k58Q6Q6k84J42n5J15
$$ 272 199 106 -234 104 -41 294 48 -229 9 189 38 152 250 4 183 -75 11 97 -187 -45 -100 15
4611A5J20o6l53J24K40m4j53K76n8j62O7o3r5K99j54P9J31l56j71J53Q5K11J80
$$ 15 135 69 -284 -160 80 36 -117 159 101 -61 6 -57 -152 147 -7 72 203 -153 -324 -171 -86 125 305
4634C05k50k68J98R5j4j21k0J77k4k63K35L09k48k1r8l76N22m7j25j58K20J82
$$ 305 55 -213 -15 80 66 -55 -75 102 78 -185 50 359 111 90 -8 -384 138 91 -34 -192 28 210
4656B10o5k22j11K32m4K10j29k62J0K52k7q7k08K67j66J95l13K93p8K7q2P7J29
$$ 210 145 -77 -188 44 0 210 81 -181 -171 81 54 -33 -241 26 -140 55 -258 35 -43 -16 -98 -21 108
4679A08l0k39o4K00R4r3J49j68j27J11q5L7j99J06K91j55J43j48J00o3N2r1P4
$$ 108 78 -161 -225 -25 69 -24 125 -43 -170 -59 -144 -107 -306 -200 91 -64 79 -69 31 -32 20 -71 3
4702CK38m44N5K25j92J18q6L5l0K77j47j34j15M05p8k48r0L1l4K59M1p8K9k87
$$ 3 241 -203 -148 77 -115 3 -83 -48 -78 199 52 -82 -197 208 130 -118 -208 -177 -211 48 89 11 40 -247
4726b47J86P4K48l12l6p4J8N01k74p7l35M12k64J15n8j34M09k2j82J82p3k29J23
$$ -247 -61 13 261 -51 -87 -161 -143 358 84 7 -328 84 -180 -65 -123 -257 152 130 -52 130 57 -172 -49
4749d9K74k82J65j23Q8r0mNn7K24k52k26K60K94k17O4l07L21jj0L9N3o2k20q9
$$ -49 225 -57 108 -15 73 -17 -21 -16 -73 151 -101 -327 -67 227 10 74 -233 88 87 77 116 169 107 -113 -202
4774b02K16O7k97K49R4j03j50L98l80j89L01L2o8k89K71K13m15K24j32OQ3J93
$$ -202 14 81 -216 33 127 24 -126 272 -108 -297 4 36 -32 -321 -50 163 -252 -28 -160 -154 -71 122
4796A22K44n38n1J89J2K04l43L57m03J46j64L13m1k98J89K92N6k21j26l8J57j39
$$ 122 366 -172 -223 -34 -22 182 -161 196 -207 -61 -225 88 47 -251 -62 230 286 65 -61 -99 58 -81
4818h1j05K88n2k4k49K88j2o1k44J19K69l56O0j40J92Q2q4j02L87k33J80K45l53
$$ -81 -186 102 50 26 -223 65 53 -8 -252 -133 136 -220 -160 -300 -108 -26 -110 -212 175 -58 122 367 14
4841A4r8K29Q0p8K2j51j45P5j03K78k55K14j91J63rN2k2K6k27J51r7J85j14l1
$$ 14 -84 145 225 147 169 18 -127 -52 -155 123 -132 82 -109 54 45 97 75 101 -126 25 -72 113 -1 -32
4865c2nJ17k56l3N78o06L77J05m7j88l06M03J64k51L2j09R4l5l14J73j09L11j36
$$ -32 -37 80 -176 -209 369 -237 140 245 198 10 -296 107 271 20 52 -57 37 2 -312 -139 -248 63 -73
4888g3K52j41O5l2j5l40J90J90o4l9k25K63KJ19l05J84J28l36J58J28j64l8J07
$$ -73 179 38 103 71 56 -284 -94 96 32 -7 -232 31 33 152 -153 31 159 -177 -19 109 -55 -93 14
4911A4k25J91k4J9j8nK20j96k82K28J46J85l10R6Pn1r5M1L64m30k2K35j71p3J66
$$ 14 -211 -20 -44 -25 -43 -48 172 -24 -306 -78 68 253 -57 39 46 -5 -100 -59 305 -125 -147 88 -83 -156 10
4936A0K25j74K2pj55K37k57j15J6K67Q4j05k69K23k3Q8J2k13J43L51k25j01k65
$$ 10 235 61 83 76 -79 158 -99 -214 -198 69 153 48 -221 2 -21 67 79 -134 9 360 135 34 -231
4959b31L05j09K6L43k76MK0Nm2K54M6n55J42nK10r1J3n8q2K66k3L1k91JQ7j91
$$ -231 74 -35 -9 334 58 62 82 87 45 299 345 -210 -68 -73 137 46 59 1 -81 185 162 193 -98 -97 -10 -201
4985b01J61J13j51J13k7OL25n79M5L04J81k89J88j15o7J03j29l37L92J89l13K17
$$ -201 -40 73 -78 35 8 14 339 -240 -195 109 290 1 189 74 7 110 -19 -356 36 225 -88 129
5007A29j78J16O2j39J17q9J54j42j86J06p4K29j52K26k63P2R5j62Q0j11q3J04
$$ 129 -49 67 129 -10 107 18 172 30 -156 -50 -124 105 -47 179 -84 -12 83 -79 1 -110 -193 -89
5029h9l0J16j28K66j98k91K34P4L04k54L03m03K54j35k86K27n9J50j57p1O2K14
$$ -89 -119 -3 -131 135 -63 -354 -120 -46 258 4 307 -96 158 23 -263 -36 -95 55 -102 -173 -111 103
5051A03j78J32j69j61K70l19L16o3P8p7K47K12j57m84K18M1j43J90k91J49k59
$$ 103 -75 57 -112 -273 -3 -322 -6 -69 9 -68 179 391 234 -250 -32 9 -134 56 -235 -86 -345
5072c45O85k70M4J06k96l9J83k90j4M00j13N0k27Q9j83J78j00J29K90j35ol51
$$ -345 340 70 114 220 -76 -115 68 -222 -236 164 51 101 -126 -37 -220 -42 -142 -13 277 142 136 -215
5094b15K26O2j60M52k77J21k34J19k47p5K09J16j50J64M9p1j36L6J46m23K78o4
$$ -215 11 73 -87 365 88 209 -25 94 -153 -228 -19 97 -53 111 160 89 -47 -11 135 -288 -10 -74
5116g4j11M9j8J25NJ3nP7j35J09j05jJ92k35QL49m17O4N4K49l94N6M06j09k18
$$ -74 -185 -136 -154 -29 -24 -11 -16 61 -74 35 -70 -71 121 -114 -106 243 -174 -110 -56 193 -201 -145 261 152 -66
5141f6m4j11K58J02J2p9J34j49q2J67j82R2k78L11K4j20m4L16l53j0J33r6J44
$$ -66 -110 -221 37 139 151 72 206 57 -25 142 -40 52 -226 85 109 -11 -55 261 -92 -102 31 -65 79
5164G9k25q7Q4j30J40J96j72K44k90J90J18k24j77K15K36j99Q4J49k04J68l00
$$ 79 -146 -233 -149 -279 -139 57 -115 129 -161 29 147 -77 -254 -39 197 -2 82 231 27 195 -105
5185a05K41l12J10J31N6j2L4l99L25R0p55L32J53l27O84J83k62m86J77k3k86N46
$$ -105 136 -176 -66 65 121 109 143 -256 69 159 -596 -264 -111 -438 246 429 167 -319 -142 -165 -451 95
5207I5m14N02l33M92m11L64m85k36k8O1N46m19K87M13j068N24l1j65M10k94l51
$$ 95 -319 183 -150 342 -69 295 -190 -426 -454 -393 153 -266 21 434 -634 -110 -141 -306 104 -190 -541
5228e41P25M96k79k90j25k51m58N29j68L75j43p4K62L0J14l04q4K04K52k96N9
$$ -541 184 680 401 111 -14 -265 -723 -194 -362 13 -130 -204 58 88 202 -102 -186 18 270 -26 33
5249C3k14K42k10K19r1q2L49k19K67j95j01k49L02K81m26L52Q8m15j41K39K3m0
$$ 33 -181 61 -149 70 -21 -103 246 27 294 99 -2 -251 51 332 -94 258 346 -69 -210 29 52 12
5271A2k29j45K95j6J35l5L3K2K83l96p3L43k42N5K42l73L44k69L8k41L76k08k22
$$ 12 -217 -362 -67 -83 52 17 50 72 355 -41 -114 229 -13 42 284 -89 255 -14 24 -217 159 -49 -271
5294b71M05n6o0l42M19K18k75J52r7Q0j21QJ29j23j19r0J7J59J18J0j80J81j33
$$ -271 134 78 18 -324 95 313 38 190 93 173 52 60 189 66 -53 -143 -126 33 151 161 -19 162 29
5317B9j59J08L32m26Q0j06op8J98M10n07J39j16K95m04K17n5n3J81l42K92K72
$$ 29 -130 -22 310 -116 -36 -142 -148 -226 -28 382 -125 14 -102 193 -211 6 -49 -102 79 -263 29 301
5339C01q3l01L60k33o1O8m25L13Q6L18n3j28j23j62K02j03J74j87L29j94k04J83
$$ 301 218 -83 277 44 -17 51 -374 -61 25 343 290 162 39 -123 79 -24 150 -37 292 98 -106 77
5361G7q0J29N7j73R0j94KK27Q0j84j31j12K25P1O5j5k61J36j8j57J82K76m56K73
$$ 77 -3 126 183 10 100 -94 -92 135 215 31 -100 -212 13 84 149 134 -127 9 -9 -166 16 292 -164 109
5385A09Q1k64oj27J38K3k18K62O7j94P3K64j74j45K52l41M89k29l3P7j00j7L4
$$ 109 190 -74 -80 -207 -69 -46 -264 -2 65 -129 -56 208 34 -111 141 -200 289 60 27 104 4 -13 21
5408B1m4k4O2R4n9L6k4j32P6J05r3p2J90m1L0l50K08m5P1k89J42M60m41m2L56
$$ 21 -23 -47 15 109 50 86 62 -70 6 111 18 -54 136 95 125 -225 -17 -62 9 -280 -138 322 -119 -161 195
5433A95l77L79l82J66J94j94k57M81j17R2l56K78k7J34l11M01l03k09K22L0J4
$$ 195 -182 197 -185 -19 175 -19 -276 205 88 180 -176 102 75 209 -102 299 -4 -213 9 39 53
5454E3k04L96K10q23N83Q6m01K18j91K55k76r3L58j02l3k70N36k76m18L81L36
$$ 53 -151 245 455 -368 215 301 -100 118 -73 182 -94 -187 171 69 36 -234 302 26 -392 -11 325
5475C25J35q21J12J89k03L3l9J76m8J09j37L98j87j39o0K11J79k87N12o01J44
$$ 325 460 -361 -249 -60 -263 -230 -269 -93 -141 -32 -169 229 42 -97 -157 54 233 -54 458 -143 1
5496Ak20p4N57J48o33L47jk27J09j82K99k12K63l7J82p09L86N0J67k42J26O7k45
$$ 1 -219 -293 264 412 -221 126 125 -102 7 -175 124 -88 175 138 320 -389 -3 47 214 -28 98 165 -80
5519h0J16k25K54K4n3k93J32K89j22j58P8J33j7j62J55j1J7R0N8m5j10l24M35
$$ -80 36 -189 65 89 36 -257 -125 164 42 -116 -38 95 78 -84 71 60 77 167 225 180 70 -254 181
5542A81m9k60j02J71K90j73NP9m1m28L19N1l08m0N4Q7L80m1j38L9p4j04m4R7J79
$$ 181 132 -128 -230 -59 231 58 63 142 101 -327 -8 43 -265 -305 -251 -164 216 175 37 76 2 -102 -146 -49 130
5567A30l41J85O3r4K81m19K31R8M1n6m32K47J78L0r4NJ87k00P8K1j00N6Pj05j86
$$ 130 -211 -26 37 -57 224 -195 36 134 175 119 -313 -66 112 142 48 53 240 40 118 139 39 95 102 -3 -189
5592a89L2N9R0j03j75L36J95l29L21k39K7j05m3J07m02L41R0L76n73J47j16J83
$$ -189 -157 -98 -8 -111 -286 50 245 -84 237 -2 25 -80 -123 -16 -418 -77 13 389 -184 -37 -153 30
5614C0J06j92L28m09J95Q8m35L47j30J47M7k84J64R3j06L17n78M58k00j7l08K22
$$ 30 136 -56 272 -137 58 146 -289 58 -72 75 122 -162 2 95 -11 306 -272 186 -14 -31 -339 -117
5636a17M81k86R7j0j17K3k12LK34j57J68m1o3J35k08j6k4M92k98j51Q1r7J90l37
$$ -117 364 78 175 165 48 71 -141 -138 96 -61 107 66 3 138 -70 -86 -110 382 84 -67 14 -83 107 -230
5660b30K08j9K38l41m3L72m33J48N00o76L53k6j00k22R9O62p00J19j56M97l00
$$ -230 -22 -41 197 -144 -187 185 -248 -100 400 -276 77 51 -49 -271 -172 490 -210 -91 -247 250 -50
5681e0J8J74n21l30N8Q61L6j151O81J044j030j89P16n56K79J15n53L40L52K6o52
$$ -50 -32 142 -379 -709 -651 210 246 -905 -224 820 -210 -399 317 -239 40 155 -398 -58 294 320 -332
5702c32O9O54j85k28n74M28K09p7l1l50J70L65N8j4q89J274m03l65J05P8Q3j92
$$ -332 -263 391 206 -22 -596 -168 41 -36 -67 -417 -247 118 176 162 -727 547 144 -221 -116 -38 45 -147
5724a47k4l01K98K9M60n8m45J09k8j2k45K0J081l21L67q30N74J1o98J58PK67r5
$$ -147 -171 -472 -174 -145 315 257 -188 -79 -107 -119 -364 -344 737 416 783 -47 527 538 -160 -2 5 272 177
5747A77J4n51L81k67O60p48N24pn84N74o33M06o16N34P27j22p40J28J1K21k95
$$ 177 191 -360 21 -246 414 -334 190 183 -401 173 -460 -54 -670 -136 591 469 -271 -143 -132 89 -206
5768b06L71k71k22O89l55j73K46j31J4p3P5j13RP7J3J79k29K99k60j95J94J17
$$ -206 165 -106 -328 361 6 -167 79 -52 -38 -111 -36 -149 -140 -63 -50 129 -100 199 -61 -256 -62 55
5790E5J54j40K60j58j11J36rM4k87Q6n07M33J66J2k96M34o45K05K94q8m98P62
$$ 55 209 69 329 171 60 196 187 231 -56 30 -477 -44 122 134 -162 272 -373 -168 126 38 -460 302
5812C02l02l5J55l34M03K4j18l78L53k40J20j45J91k60J68J16l30K05K84k67K70
$$ 302 0 -35 120 -214 189 213 95 -283 70 -170 -50 -195 -4 -264 -96 20 -310 -105 179 -88 182
5833A82k25K93R3m08j82K44K37l18l8K93Q4k61j21K9j33L39k41k90L97N25m92
$$ 182 -43 250 343 -65 -247 -3 234 -84 -122 171 255 -6 -127 -98 -231 108 -133 -423 -26 499 7
5854Gj02M65k20j67q1j71L06j44O1J78l11K97k39L73k25J52j68J35j60o1J2k7
$$ 7 -95 370 150 -17 -98 -269 37 -107 -46 132 -179 118 -121 252 27 179 11 146 -14 -75 -63 -90
5876i0P9J31j84Q0n8J19k4K0J02j98k3l51O21m05K05j62J32l10J04K27k8J4j64
$$ -90 -11 120 -64 16 -42 77 53 73 175 -23 -46 -397 224 -181 24 -138 -6 -316 -212 15 -13 1 -163
5899a63J14J43m6l9J3j37J10l57L61J90r6l46K37N0J23j95R1l44J3M77l76L77
$$ -163 -49 94 48 9 22 -115 -5 -362 -1 189 93 -253 -16 34 157 -38 53 -291 -278 199 -177 200
5921B00j07l08lK54j46N09o17J87J32L08n70M7L24l30P4O96n54k64k03K64K58
$$ 200 93 -215 -218 36 -110 399 -218 -31 101 409 -161 -114 210 -120 -46 650 96 -168 -371 -107 151
5942A51o38P87o23J33Q88J1q17K59J015p23j058L4k49J445j47p06M17J86k40J53
$$ 151 -487 300 -323 -190 698 709 -108 151 1166 443 -615 -581 -830 615 468 -238 179 365 125 278
5962B78n32L5J85P1l0K43j01L9l56Q4K5rJ80j82L60m40p6L32j28l26L86O9k99
$$ 278 -254 -219 -34 37 7 250 149 188 -168 -84 -59 -68 112 -70 290 -150 -226 106 -22 -348 38 107 -192
5985a92M91j57J8L1K50m08J44j03J01k70kJ78l44N26k35k6l4k4R6k07L54l03K46
$$ -192 299 142 160 191 441 33 177 74 175 -95 -97 81 -263 263 28 2 -32 -56 40 -167 187 -116 130
6008A30j10j46mK54m8Q7k87Q9j2J69j24m7k4p1m0L01o5m24L64K98o04L13m1J70
$$ 130 20 -126 -130 124 76 163 -124 -35 -47 122 -2 -49 -73 -144 -184 117 52 -372 -8 290 -314 -1 -42 128
6032A28r5r5N29m21k81M37j19j61J28j9J44j22j4j04j64K82k74M27l7k44J15k54
$$ 128 33 -62 467 46 -235 202 83 -78 50 31 175 53 39 -65 -229 53 -221 206 169 -75 40 -214
6054b14J23KJ36k36K15k22K57j02J9J23l1K89m98K52k12K05j09J59%p5n2J28k5
$$ -214 -91 -89 47 -189 26 -196 61 -41 -22 101 70 359 -139 113 -99 106 -3 156 156 81 29 157 132
6077A32k18m7J91k2k50N25n76K09oq4J77oK32k56M9j69J02l08J87K38j35j7q2
$$ 132 -86 -133 58 36 -214 311 -265 -56 -62 -146 31 25 257 1 50 -119 -17 -325 -138 100 -35 -52 -134
6100a34PJ03k7J66q8o6O1p8n9J5M3K13r7o5K4m2J42r1J75l63K47j54OM04n23M80
$$ -134 -127 -24 -51 115 27 -39 22 -56 -115 -100 -57 156 59 -6 18 -24 118 27 202 -161 86 -68 -62 342 -181 299
6126B99K57p84K36j31m1k1J63J96m18J78k9J37k4r6k06n1L52N1j68n5L15J4m01
$$ 299 556 -228 8 -123 -164 -185 -22 174 -244 -66 -95 42 18 -78 -284 -335 17 68 -100 -155 160 174 -227
6149b27J37k23O45k39K3j55L55l04j36j66Q1p8P52j37n06L0J28j46k71M49L26
$$ -227 -90 -313 332 93 116 -39 316 12 -124 -290 -209 -287 465 328 -178 -148 -20 -166 -437 12 338
6170C38L24j082j73l48P86M5j76K34J07M85o97L4P23q31k37L27o27N46P75L4o68
$$ 338 662 -420 -593 -941 -155 -110 -286 -52 55 540 -157 -123 600 -231 -468 -141 -768 -222 553 587 -81
6191h1m00L73J88N00p83l9R54q42k70R35l90K95n17n20J014l07k83k41j96O77
$$ -81 -481 -108 80 580 -203 -242 712 -130 -400 535 145 440 -77 -597 417 110 -173 -414 -610 67
6211F7n7m42n5P63p27K60N7O8K7J25j96p3M74o3m77N45k18J70k48J9L92k22O9
$$ 67 10 -432 -487 276 -451 -191 -134 -66 -39 86 -110 -183 291 228 -249 296 78 248 0 19 411 189 258
6234B58l89J96l33K50l00L07k1l0J92K7j64p9M4J4j01P2J53q2J70j49K17q3J0
$$ 258 -131 65 -268 -18 -318 -11 -32 -62 130 157 -7 -86 -42 -28 -129 -57 96 14 184 35 252 169 179
6257A79o8j16O0mj71K10k42J71Q4l4n5mj53R3J41j56k3J23j0L13l24k4P6l79K56
$$ 179 111 -5 55 51 -120 90 -152 19 103 69 14 10 -143 -50 91 -65 -88 35 25 338 14 -10 66 -313 -57
6282e7k64M46j09L0k61J59Q3J15o9o5j50M05j62o2k07KP8n2K29Mj22k7M7l94P64
$$ -57 -321 125 16 46 -215 -56 27 142 73 8 -142 263 101 39 -168 -166 -88 -140 89 93 -29 -56 -9 -403 361
6307C61l18K12j07l81O23r83J009K6r8J92j256P96K17P21m07o01k18m20R98K13
$$ 361 43 255 148 -233 390 -593 416 442 344 536 -720 76 293 1014 607 6 -212 -632 366 579
6327E79o63l9J273j335j071O58R60j82J49l87o87J255j079M76l55J416k47o38
$$ 579 -84 -123 1150 -185 -1256 -598 362 180 329 -58 -745 510 -569 -93 -448 968 721 83
6345H3n3j3J68k21R18j047n64J040m42K46j23K08k28l11P01j46K82O5m21L69q71
$$ 83 30 17 185 -36 882 -165 -729 311 -131 115 -8 200 -28 -339 362 216 498 563 142 511 -360
6366c60O82o15K14k49J61j0P02j299P09j43N41l57j67O14l48j56n62Q53p04R26
$$ -360 322 -293 -79 -328 -167 -177 525 -774 -65 -208 333 -24 -191 423 75 -81 -643 210 -494 432
6386D32j69K21k32k16r87J658r77N37J42j422O20J142m68p3J25p19M93n60J64
$$ 432 263 484 252 36 -951 707 -270 267 409 -1013 -393 749 281 208 333 -386 107 -453 -289
6405b89Q07n83K76n12N07o0j080L30Q03l98O37J09l86l3O7j08K10n17K16O77p74
$$ -289 518 -65 211 -301 206 146 -934 -604 199 -199 438 547 161 128 195 87 297 -220 -4 673 -101
6426a01L06K36r38L14M84O4o8k04K7j73N75k3K98n41l53N03M52j202p2K27L95
$$ -101 205 441 -497 -183 301 365 297 93 120 -53 522 499 797 256 -97 406 858 -344 -416 -189 206
6447B06l29n75J123l94Q1p3Q0j07N7m2j17J55p3k4mr7K86n9rn5Q6j10L0J32k60
$$ 206 -123 -698 425 31 112 39 119 12 69 27 -90 65 -8 -32 -36 -133 153 94 85 30 116 6 36 168 -92
6472i2J6qM14o12L08k33M02J89j1o34K54nj1L40n15K52n4j50J34l7MP9j67K97
$$ -92 -76 -84 330 -282 26 -207 195 384 373 -261 -7 -12 -23 317 -198 54 0 -150 -16 -53 -49 30 -137 160
6496A60j65J38nK03k24n3JlJ6k46L6K30j94K69n5KK39l19m2K16k47L66k91r8K29
$$ 160 -5 133 128 331 107 54 55 52 68 -178 -142 88 -106 163 108 110 349 30 -12 204 -43 323 32 -66 163
6521A63n2j31j21l08M59J18k81L49O6l52K47lj8j33j71P1L39m15k26L23n34K90
$$ 163 111 -20 -141 -449 10 128 -153 196 262 -90 157 154 136 3 -168 -97 242 -173 -399 -76 -610 -320
6543c20M12m97k70R92n64M85l50k51L93N47l15j73q25J381j129M73L08q58R48
$$ -320 92 -405 -675 317 -247 238 -112 -363 30 577 262 89 -736 645 -484 -11 297 -561 387
6562C87j077K2O19q6q18J444l61Q64j66j207N37M36l73j66L96k92Q76l09q80j14
$$ 387 -690 -668 -49 -135 -953 491 130 994 828 -379 158 594 221 55 451 159 1035 726 -154 -268
6582b68L2k89P21j23l81p7l54Q79P1q14J226m40%o92L59O71n92j17l87R69M7k20
$$ -268 -236 -525 196 73 -308 -385 -739 140 211 -603 623 183 183 -509 -150 521 -71 -188 -575 394 441 221
6604B21k48p0l9J83L9o9M39k11n26K55O07O7j615J150k40L20l70j53R6N60M9k61
$$ 221 -27 -97 -136 47 86 17 456 245 -281 -26 581 648 -967 183 -57 263 -107 -260 -164 396 445 184
6626A84j21O07j028L67L04p26L64rL06m50j53L80k28L87p0k94M64n92R2M90n26
$$ 184 63 670 -358 9 313 -413 -49 -58 248 -202 -355 25 -203 184 114 -180 284 -308 -216 274 -252
6647b52L5J601n89j702R67j51M23K78o54J03M21M68j512L15j22J55K19K4m02L64
$$ -252 -217 1384 795 -907 60 -91 332 610 -44 59 480 948 -564 -249 -371 -216 3 27 -375 -11
6667a1k9k96O02ok20K3Q4N57j017M38K05n15K68NK96m03n04R19r33O35j53k23
$$ -11 -40 -336 266 260 40 63 147 704 -313 125 330 -185 83 88 384 -19 -523 396 -537 98 -55 -278
6689b78K46r3L26q3q9J57k42R3k39K82r8J19OR0l28j6N46n20K44m98L38j12J87
$$ -278 -32 -125 201 118 29 186 -56 37 -202 80 -18 101 107 197 -131 -147 399 -121 123 -375 -37 -149 38
6712C8J79k72j49L77k91KK29k48J11K53l53J8K57l61M07j66K70l63J26l51K42
$$ 38 217 -55 -204 173 -118 -116 113 -135 -24 229 -124 -106 151 -210 197 31 301 -62 64 -287 -45
6733d5L04j27k75J46n7K2N8K18j99J81k11J45j17L39k46J38l05K76j17P4j26j2
$$ -45 259 132 -143 3 -54 -32 26 244 45 226 15 160 43 382 136 274 -31 245 128 202 76 64
6755F4l67N13l3l07J09j56K70r6p1J42RM3J17j64l10O7J20n1J02j9J87j99j00
$$ 64 -303 210 177 -130 -21 -177 93 -3 -74 68 77 120 237 73 -237 -170 -50 -101 1 -18 169 -30 -130
6778a30J46J50o0N0j06j34L46k37J70J9j22m5j60J30j7L68j84k32Q0j85L38k83
$$ -130 16 166 106 156 50 -84 262 25 195 214 92 47 -113 17 0 368 184 -48 32 -153 185 -98
6800i8J28jk00Q2K08o6j94k05L27K27j47jJ6Q0M14k24P6o06l1K23l51N22n85M91
$$ -98 30 29 -171 -89 119 53 -141 -346 -19 208 61 60 76 156 570 346 422 -184 -215 8 -343 179 -406 85
6824H5j80O95n33m42M47j3J15j24K06j80j7r0K41l36L1J23k30P5jn1J11N6R6m1
$$ 85 -95 600 67 -375 72 59 174 50 256 76 59 -31 210 -126 -95 28 -202 -127 -128 -179 -68 -12 84 43
6848D3j9K05k63l23L85k00J6M26l4j76LL40m72k5N19p76O40l12K78m15n91j75
$$ 43 24 229 -34 -357 28 -172 -156 270 236 60 63 403 -69 -94 425 -351 289 -23 255 -160 -751 -926
6870i26R25r56R59N18k42O15j171P18o97K91l25O17n27L18k69J05K94J13j21l35
$$ -926 -1 -957 2 520 278 893 -278 440 -257 34 -291 326 -201 117 -152 -47 247 360 239 -96
6890i6J63J7j60K37m12L90O6K68m6l39M48q99Q56n30k15L49N8J65k84n08M17O31
$$ -96 67 84 -76 161 -251 139 205 473 427 88 536 -363 493 -37 -252 97 155 320 36 -472 -55 576
6912E76o96N5Q5m98M63J71J66m21J56j08L06k25m04M70Q3K1k03P7l06J51K23O9
$$ 576 -120 -65 20 -478 -15 156 322 -99 57 -51 255 30 -374 96 179 200 -3 74 -232 -81 142 211
6934B11K71n89K17j70j36N44l4l04Lr1n69O92J62Q8J04J9p7q04J222O0j043N10
$$ 211 482 -107 110 -60 -196 348 314 10 13 -78 -647 45 207 295 399 418 341 -463 759 819 -224 286
6956B86Ok81N10l12j78k1m76J35P45o03q41P64k54Q74p28J47Q92m6j088M08K0
$$ 286 292 11 521 209 31 10 -466 -331 414 -189 -1030 -266 -520 354 -374 -227 665 619 -469 -61 -41
6977d1N74m66J085j078m58n13J34J209j030J039j032J383j030P27R1n7l99j36
$$ -41 533 67 1152 74 -384 -897 -763 446 -584 455 -577 806 -224 503 594 537 138 2
6995BP62j361L19N0N31l80M6n94Q23K46R15r17p29j76N05l82N65K10p94R08r35
$$ 2 764 -597 -278 -228 303 -77 -31 -625 198 444 1359 442 -287 -463 42 -340 225 435 -359 549 -386
7016c86L39j310J152J28P92r21L8J076j280Q29k99J62l37K13l58J076j314R2m12
$$ -386 -47 -1357 -205 -77 715 -206 -168 908 -372 457 158 320 -17 196 -162 914 -400 -308 -720
7035g20O99K36N59r44J79L76j562P97L42K11l0j91K63o67K31K10j74J68Ln8J27
$$ -720 -21 215 774 -170 9 385 -1177 -380 -38 173 143 -48 215 -452 -221 -11 -185 -17 -14 -72 55
7056E5l27K90K7K8k15J64j16J53j68l9L32o5l11K03j49R8K07m9k2k67L93j31J4
$$ 55 -272 18 45 73 -142 22 -94 59 -109 -148 184 119 -192 11 -138 -40 167 118 96 -171 222 91 105
7079A05L5j07j24k5J93j9l56L80o8k36J8K5J36l7K83k15N9j01K3N5O2j31O6L3
$$ 105 140 33 -91 -116 77 58 -298 82 14 -222 -204 -179 -43 -80 203 -12 47 -54 -31 24 86 -45 21 54
7103E4j22l67N84j97J12p8J58K55n98r9K60L44J81p15N19j82n8L21p68J164j124
$$ 54 -68 -435 149 -48 64 -14 144 399 -199 -298 -38 306 487 -228 291 109 51 372 -396 768 -356
7124c56j27P22q92K55J209j366O77n10J65m7q15K150j328k94M03l88J126j398
$$ -356 -483 239 -653 -398 811 -555 122 -388 -223 -270 -1085 1065 -263 -557 -154 -542 584 -814
7142h14J362j76o79K78l76N6j136J163M89L84o9j15m10J53m05P93n37Q8L34p63
$$ -814 548 372 -307 -29 -405 -349 -1485 -322 167 551 482 367 -43 110 -295 498 -39 49 383 -380
7162c80R15j105J201j312O94q03R85q60K70L36q84J355j64K65P5o12n25k22R99
$$ -380 535 -570 631 -681 13 -790 195 -665 -395 -59 -943 412 248 513 588 -24 -549 -771 228
7181B28M17r22K87k72N41M50p57r9r4k64N58Qp2K8P5l57K46j14M7O2J76Kl31L17
$$ 228 645 -277 10 -262 279 729 -28 -127 -221 -485 73 81 9 37 112 -245 1 -113 -66 -4 172 174 -157 160
7205A60m59K30l7k09p2O25j82j78K04j01P3r8J66m08L98j51N5m2k15L29p9n5n2
$$ 160 -299 -69 -106 -315 -387 238 56 -122 82 -19 54 -44 122 -286 112 -39 16 -26 -241 88 9 -46 -98
7228i8J35l34M58j66k71K76lJ44k15J64Q6k09K20J19j10k57j90R0M31m87N9l9
$$ -98 37 -297 161 -5 -276 0 -3 141 -74 90 176 -33 187 306 196 -61 -251 -161 270 -217 -158 -197
7250a97J70k70K59N5j65L17r9o3j25R4k72j44K70J29l3L22l64J11j20j54j27L22
$$ -197 -27 -297 -38 17 -148 169 70 7 -118 -24 -296 -440 -170 -41 -74 248 -116 -5 -125 -279 -406 -84
7272h4M38m58lk20K90k99j6K88J81l23J37j38J25J60j08R4pk73K19K1k7J35J9
$$ -84 354 -104 -107 -327 -37 -336 -352 -64 117 -206 -69 -207 -82 78 -30 64 57 -216 3 24 -3 132 151
7295A51j70K36l9k68O2O8K73o66k10L5o3J432o83j72K47l03m27J523r07M5J24
$$ 151 -19 217 178 -90 -28 40 313 -353 -563 -528 -591 841 158 -14 233 -70 -497 1026 119 164 288
7316B88k99J85k00j026Q67N37J17p03m98R65q99M6K07J63J190K97j641O53n27
$$ 288 -11 174 -26 -1052 -185 352 469 -234 -732 233 -666 -620 -413 -250 940 1237 -404 249 -278
7335b78J87J74M02o63K54j64j60J44K86n42L71m6k40O36l14m9j40K83K41m94K79
$$ -278 -91 83 485 -178 76 -88 -248 -104 182 -360 11 -35 -275 361 47 -2 -142 141 382 -112 167
7356A67l55O4k6K01m88M60p8o95O94n02K18N80L6o63l78L96P84j046P57k52J42
$$ 167 -188 -124 -150 51 -437 23 -55 -750 -56 -558 -340 240 276 -387 -765 -369 415 -631 126 -126 16
7377A6k08K4K28k04k54M40K94j00J65l63r7K76n34O44l08Q1m86J77J28j41M51
$$ 16 -192 -168 60 -144 -398 42 336 236 401 38 -59 217 -317 327 19 100 -386 -209 -81 -222 229
7398B29j70k9K66m16Np0M8N06j32P3p54L54l56Q78o58K60K33J37J04j5n87k48
$$ 229 59 30 296 -120 -115 -185 -137 369 237 310 -444 -90 -446 432 -226 34 267 404 508 493 -94 -342
7420c42l13N77m34L5O16m28k21P67J81p03J046j169K6j5k7J34P0J07J35o4L96
$$ -342 -655 -78 -512 -477 139 -289 -510 257 438 -265 781 -388 -362 -377 -404 -270 -200 -93 42 -22 374
7441C74q74J037q29J56k62K28L62o57M68M0K5o14R81j29l31L65l41k62L18j72
$$ 374 -500 537 -292 -136 -398 -170 192 -465 3 43 68 -546 435 306 -25 340 -1 -263 55 -117
7461a17j90M23l76L16k59M70l67o53O01j78O61n43k14R43o90K03l80k12N38K88
$$ -117 -307 116 -260 56 -203 267 -100 -753 -152 -330 331 -212 -426 517 -173 30 -350 -562 -24 264
7481B64m97P25n70j24j4J53K33k20l41L52p47N21O0L18L42p3m4M28j55K19r21
$$ 264 -233 492 -78 -202 -216 -63 170 -50 -391 -39 -786 -265 -205 113 455 382 338 766 611 830 -91
7502i1J19Q33q12L03M57l44m96K33J49o84R56n67l31M68L12n75M1p8j20K50j28
$$ -91 28 861 49 352 809 465 -31 202 351 -333 623 56 -275 193 505 -70 -29 -107 -227 23 -105
7523a05L90j43J92k44J19L3O1l26kl4J2K53m47K20p5j3k55M16P5m44N12k16M04
$$ -105 285 142 334 90 209 242 303 -23 -25 -59 -47 206 -241 -21 -96 -109 -364 52 127 -317 195 -21 383
7546C83n45J90p4R1J13j55l8m3j45J16J03P6k04P7J21M7n2j90J6J81n3P0J80k79
$$ 383 -162 28 -46 45 158 3 -35 -78 -223 -107 -4 72 -132 -55 66 113 61 -129 -113 68 15 85 265 -14
7570a4kj55J89l27N91l68O3r8J8J37k69L37k09K08l30p5K92J98k1l14J60P7Rl9
$$ -14 -16 -171 18 -309 282 -86 -23 -121 -103 34 -235 102 -107 101 -229 -304 -12 186 165 -149 11 88 97 58
7594E8P74p53j82L53j20j52J10k35Q25j213m16J233j53n00L00J75m24K48o34J226
$$ 58 832 79 -103 250 130 -22 88 -147 678 -535 -951 282 129 -371 -71 104 -320 -72 -706 520
7614E20j067K44k90O46M7k54Q52p27m82R49r80M18N77m62P5k66p64J030L06n73
$$ 520 -547 -303 -593 53 100 -154 698 -29 -511 438 -542 -124 453 -9 66 -200 -964 66 372 -201
7634b01L05k49J49J80j55m35Q91l19q5K41p65QR9K72J20m01k14M14J74M58j93
$$ -201 104 -145 4 184 29 -406 485 166 81 322 -443 -435 -336 -64 56 -345 -559 -145 29 487 294
7655B94o31P03m16O8q7k32K49m58N15l88Q54m93k49Q5l60R38MN23j207m33L57
$$ 294 -337 366 -50 18 -69 -301 -52 -510 5 -383 471 -22 -271 -186 -546 392 396 919 -288 -721 -364
7676c64p04Q18J581j052m4K95l12r79Q95k29J38J18O59m62K29j54m79p69N13L40
$$ -364 -1068 -250 1331 279 235 530 218 -761 134 -95 43 161 820 358 587 433 -46 -815 -302 38
7696C8n00K97K9R8P6q03O87k07L74J3N5o11J55L44J12l05L21j41l2p1K00n1l52
$$ 38 -462 -165 -136 -38 38 -765 -78 -285 89 102 157 -454 -299 45 157 -148 173 32 0 -71 129 78 -274
7719b74K07n3K27J54l28J85p8l38Q16m5l81k79j59K66K90j13M6pl13k1k06Q7J81
$$ -274 -67 -120 107 261 -67 118 40 -298 518 473 92 -187 -346 -80 210 97 143 136 -177 -198 -404 -317 -136
7742a36J17p34J253l34j7M6K01l38K48n95P7N97m86K71L04n15K13n20L64k90L99
$$ -136 -19 -753 500 166 149 195 396 58 306 -289 -212 385 -101 170 474 -41 172 -348 16 -274 125
7763A25o0J8J33n03L24k16K63o1k21j44M67j85M3j77J64J48l52K21M36l89K7j61
$$ 125 65 83 216 -287 37 -179 84 23 -198 -342 125 -60 -17 -194 -30 118 -234 -13 423 34 61 -100
7785a00J83l47J40J45R2n9j68K21r5J92l4M1j38j89JJ88j40J88j27O9m5J43N6
$$ -100 83 -264 -124 21 113 54 -114 107 12 204 170 211 73 -116 -115 73 -67 121 -6 63 18 161 217
7808B17k04P6m0J09m26K47L5k40L63k7j90M0J01k5j54J76q8k3J34J71P0n26J31
$$ 217 13 89 49 158 -268 -21 14 -226 137 110 -80 -40 61 36 -118 58 -30 -53 81 252 322 -204 -73
7831g3mJ02j22N4J37n7n1n4k74N91l59L54k82J54o7j76J98l84M25k11o3J67j67
$$ -73 -77 25 -97 -43 94 37 -14 -68 -342 249 -110 244 -38 116 49 -127 71 -313 112 -99 -162 5 -162
7854a62K13J01P4m72N06k09j87L93m92Q1n2Q7l1J65k6J01j30K18n4j11K1j39L6
$$ -162 51 152 226 -246 260 51 -136 257 -235 -154 -206 -119 -150 15 -11 90 -40 178 124 13 34 -105 -69
7877f9l0k5N3R7J66K7l14q2J90j13J54l32L06j30L92k70Q2p5m09L83m6L78o28
$$ -69 -99 -124 -71 26 192 219 -95 -177 13 -100 54 -278 28 -102 290 20 102 27 -382 1 -45 333 -295
7900b95J19K81j91k71K14L14r58O35j13j7l7M67L35l87K61l05J12Qj79J32J16
$$ -295 -176 105 -86 -357 -143 171 -787 -152 -265 -282 -319 148 483 96 357 52 164 172 -7 125 241
7921B41m10N36p52L20J00Rk03m0J21K24j34L1L97p24J95R6J13k58K86l27J28J11
$$ 241 -169 367 -385 -65 35 44 -159 -199 -78 146 12 43 440 -284 -89 7 120 -138 148 -179 -51 60
7943F0j25j2K78j69l43M63k04r5m9nL36J88m47R1K6k25J78o3J4m0L56j84j14j00
$$ 60 -65 -77 201 32 -311 152 -52 -147 -196 -201 135 323 -124 -33 -7 -232 -54 -117 -103 -143 213 29 -85 -185
7967a85M4J04R7j09K8K96m40L01l36K28J09j32J54j27k74J82j06L51k60J30J18
$$ -185 -141 -37 60 -49 -21 275 -165 136 -200 28 137 5 159 32 -242 -60 -166 185 -75 55 173
7988A73L5r1k59P6K02k41J79J7r0K07j67j71L44n01J54J83r5k80M35k8R2r3k51
$$ 173 208 117 -142 -66 136 -105 74 91 1 208 41 -130 214 -287 -133 50 -45 -325 110 82 174 81 -170
8011a70K36J8j49p1o9J24J72J46k90j55J95M00m55M9j20J03j26L28N0m50J47J84
$$ -170 66 84 -65 -136 -205 -81 91 237 -53 -208 -13 387 -68 -19 -139 -36 -162 166 216 -234 -87 97
8033I7k58o2q2J14K66j11J78M8K43j58j85j09j67K70j7J67N5k08k26j16P6l4L6
$$ 97 -161 -223 -305 -191 75 -36 142 190 433 275 90 -19 -186 84 67 234 289 81 -145 -261 -185 -219 -183
8056a83L9J38R7M2J55l49q5J57J03o47Q93j65m90O79m17L36o0J25l52P14p88L51
$$ -183 -144 -6 91 133 288 -61 -146 11 114 -533 360 195 -295 384 -33 303 243 368 16 730 -58 293
8078B93k65p18Q98J85p30nL18K73k50J44Q8m94J33j74J81J02m10K45J05L32k44
$$ 293 28 -690 208 393 -337 -342 -24 249 -1 143 231 -263 -130 -304 -123 -21 -431 -186 -81 251 7
8099GM7J56l77N0J97j51Q6k18K50K81k74K75l29l06O44m45K90m70L17pl73M87
$$ 7 54 210 -167 -117 80 -71 15 -203 47 328 54 329 0 -306 338 -107 183 -287 30 23 -350 137
8121A37k9J77n07M4K45k11o7O6j01K22M7r9j81M7K29L1k37M47l20j09M7j96J28
$$ 137 108 285 -222 -178 67 -144 -211 -145 -246 -24 23 -76 -257 -210 19 50 -187 260 -60 -169 -122 -318 -190
8144a90J85P6k18m2Q3L00K51j62l05Pl6j3K1J59Q0k96K42n58O71m35J86k35l1
$$ -190 -5 71 -147 -189 -106 194 445 283 -22 -15 -51 -64 -43 116 196 -100 142 -416 255 -180 6 -229 -260
8167b60P3J54M07n09J79k03p1J69pJ94k77R9Q7R9J1k78K4L34J62o44J14N84o39
$$ -260 -187 -33 374 -135 44 -159 -230 -61 -68 126 -151 -52 35 134 145 -133 -109 225 387 -257 -143 441 -198
8190a98j68
$$ -198 -366
8191c66
$$ Imaginary data points
##PAGE= N=2
##DATA TABLE= (X++(I..I)), XYDATA
0@%%%%%%%qJ6j6J6j6K4l2M0m8N6p0Q3r7J13j33J54j76K03k33K66l04L46l91M41
$$ 0 0 0 0 0 0 0 0 -8 8 -8 8 -8 16 -16 24 -24 32 -38 45 -52 61 -72 82 -94 109 -124 142 -162 184 -207 234
31B34m96N54o20O94p74Q61r57J063j179J305j445J600j769J959k174K415k688
$$ 234 -262 292 -328 366 -408 453 -504 559 -620 685 -760 840 -929 1030 -1144 1271 -1417
48a417L000l362L787m294M912n683O682q029R958j2975J8402l1222J15879J05277
$$ -1417 1583 -1779 2008 -2286 2626 -3057 3625 -4404 5554 -7421 10981 -20241 95638 200915
62B00915j88800r3783K3420J25364P6149j7525j12840o8312K8602Q8965M8888
$$ 200915 12115 -81668 -58248 67116 143265 125740 12900 -55412 -26810 62155 111043
73A11043j6945p8838n3663K3593O5116K7226q104l4957n0654k1648M8700N8506
$$ 111043 94098 15260 -38403 -14810 50306 77532 69428 34471 -16183 -37831 10869 69375
85F9375N285m3131n0620k3996L9038O4391Q841n4477m6107K794L7818L1731r364
$$ 69375 74660 31529 -19091 -43087 -4049 60342 69183 14706 -31401 -28607 9211 40942 31578
98C1578l5127o052J4185j1247j2114L1849L3672j9272n1646l0641K1149O7604
$$ 31578 -3549 -9601 4584 -6663 -18777 13072 46744 27472 -24174 -54815 -33666 33938
110C3938M5850m5712r1430k7856O3708Q5106K1462p2467r2520M00R0379O7066
$$ 33938 79788 34076 -57354 -85210 -21502 63604 85066 12599 -79921 -79521 10858 77924
122G7924j9287o9958n9084P060P7641O1988k7596p2797l5670J8904M9337M2451
$$ 77924 58637 -11321 -70405 -63345 14296 76284 48688 -24109 -59779 -40875 8462 50913
134E0913o384n0025m0497J89L7283N2188J2147n7589o0687J1297O0697M0105j0058
$$ 50913 44529 -5496 -45993 -45804 -8521 43667 55814 -1775 -62462 -51165 9532 49637 39579
147C9579n4218m9232J9361O8088K5922l8838m4236p417K4848K8863j004k4507
$$ 39579 -14639 -63871 -44510 23578 49500 10662 -33574 -40991 -16143 12720 11716 -12791
159a2791m464J5135l868j7031K286J6724J3356O68k6577l4571J4028N6354K0685
$$ -12791 -17255 -2120 -5988 -23019 -20733 -4009 9347 10015 -16562 -51133 -37105 19249 39934
172C9934m1368n0208o490M3040N3849O26n6711m3903J5390M5119L2025k586m0625
$$ 39934 -1434 -51642 -58132 -15092 38757 39383 -17328 -61231 -45841 -722 31303 28717 -11908
185a1908l8016R552L9105K3465K587j8856l9996j9440L8000N4337Q982m3926n5799
$$ -11908 -49924 -40372 -1267 22198 24785 5929 -34067 -53507 -15507 38830 47812 3886 -51913
198e1913j0048N9169O6760j0085p1645m7352K2091O4042M4611k8624p2025k2535
$$ -51913 -61961 -2792 63968 53883 -17762 -65114 -43023 21019 65630 37006 -35019 -57554
210e7554M8919M7463k397l2884k7759N21K8614J9158j2400j4259K215k57m854
$$ -57554 -8635 38828 36431 3547 -24212 -23691 4923 24081 11681 -2578 -363 -620 -5474
223e474K958P379O710M841j4828k5747M250L2877J4367j7106k0150j0153N978
$$ -5474 -2516 4863 11573 16414 1586 -24161 -19911 12966 27333 10227 -9923 -20076 -14098
236a4098K1853J3753j3345j6974m656p12Q615J9095O209j7531k1427r266J2272
$$ -14098 7755 21508 8163 -8811 -13467 -14179 -5564 13531 19740 2209 -19218 -28484 -16212
249a6212L6208K2232l2182n1758n535M2805M5018L887m6959n2822Q829O3002L9861
$$ -16212 19996 42228 10046 -41712 -47247 -4442 40576 44463 -2496 -55318 -46489 16513 56374
262E6374k5129n5007k9380K6726N8757K1153m1746m6205j051L1053L1712P378
$$ 56374 31245 -23762 -53142 -26416 32341 53494 11748 -34457 -35508 -4455 27257 34635
274C4635k6504l2264K239K5282J4557J413p679j8290r670J2752J7337N272n335
$$ 34635 8131 -24133 -21894 3388 17945 19358 11679 -6611 -16281 -3529 13808 19080 13745
287A3745j5831j5536J0632K5486M538j7011j2353j476P607J4007M28j5971k987
$$ 13745 -2086 -17622 -6990 18496 23034 6023 -6330 -7806 -199 13808 14236 -1735 -4722
300d722J2893q9j1992k977R360J1458L391j8111k4870R388L6470J3616k6067l3072
$$ -4722 8171 8082 -3910 -6887 2473 13931 17322 -789 -25659 -16271 20199 33815 7748 -25324
314b5324q337K8117M0407P74m6255l4059J9196M0566J9876j6189l9121j9767K4993
$$ -25324 -33661 -5544 34863 35637 -10618 -44677 -25481 15085 34961 18772 -20349 -40116 -15123
327a5123L4659M666j9836k0864j0112J0714K6703R257j4385j8665r895L146K4792
$$ -15123 19536 24202 4366 -16498 -26610 -15896 10807 20064 5679 -12986 -22881 -19735 5057
340E057K1251j3602l3100j1176J7101K7258J3518j9724l4172k728L1798K1169
$$ 5057 26308 12706 -20394 -31570 -14469 12789 26307 6583 -27589 -30317 1481 22650
352B2650j0303k2269j2130R852K2887L025k0816r292J3928J0674n938r785m759
$$ 22650 12347 -9922 -22052 -12200 10687 13712 -7104 -16396 -2468 8206 2268 -7517 -12276
365a2276Q766J7533j041k4975j1211J8583K0336Q93j5743k1513k019K5434K0309
$$ -12276 -3510 14023 12982 -11993 -23204 -4621 15715 16608 865 -20648 -22667 2767 23076
378B3076r625k1774j0645M122J7338J8468n939k3072j2661O214J5415J8166J981
$$ 23076 13451 -8323 -18968 -14846 2492 20960 15021 -8051 -20712 -14498 917 19083 21064
391B1064k4607k4320P724K8096J9455o416k9228k6284J4385L9384J6007k3271
$$ 21064 -3543 -27863 -20139 7957 27412 20996 -8232 -34516 -20131 19253 35260 11989
403A1989l1965j0641K1765L5840O426l3432k7491Q820K6275J6730n482k4889j5199
$$ 11989 -19976 -30617 -8852 26988 33414 -18 -27509 -18689 7586 24316 18834 -6055 -21254
416b1254J4842K1182m5j1566o886j348N183Q637k482p419L285M424n509l550M182
$$ -21254 -6412 14770 14725 3159 -3727 -5075 108 8745 6263 -1156 2129 6553 1044 -2506 1676
431A676K341Q36J935o286o733M996Q479p90j629j263p672l078Q741Q000j46n088
$$ 1676 4017 4853 6788 502 -6231 -1235 7244 6454 4825 3562 -4110 -7188 1553 9553 9407 4319
447D319j0590q697J1257K2294J020k0279j7970Q22K1148K3962n510l4203j8242
$$ 4319 -6271 -14968 -3711 18583 19603 -676 -18646 -17824 3324 27286 21776 -12427 -30669
460c0669J9271K9932R722j8512l0778p702K8413K8299p325k6009j4013N304K0223
$$ -30669 -11398 18534 28256 9744 -21034 -28736 -323 27976 20651 -5358 -19371 -14067 6156
473F156J5532r209k1510m544J0090R235N795j528j2031p731P074Q523L033J95
$$ 6156 21688 12479 -9031 -13575 -3485 5750 11545 10017 -2014 -9745 -2671 5852 8885 9080
487I080p784j0530M369J4448K067r019o449l85O085R781l711j4523m81J3275N292
$$ 9080 1296 -9234 -4865 9583 11650 2631 -3818 -4203 1882 11663 7952 -6571 -7052 6223 11515
502A1515p599r782k904Q344J5194j748k1739r395J4749J7149J295j3852j9160
$$ 11515 3916 -5866 -8770 -426 14768 13020 -8719 -18114 -3365 13784 15079 1227 -17933
515a7933j544K2377J6957j0530k1200q835P657J8294J1735j2601k2207l720J4031
$$ -17933 -19477 2900 19857 9327 -11873 -20708 -13051 5243 16978 4377 -17830 -21550 -7519
528g519J2507M470q495j8030o391J5088J5599J98j0647j4444n513J4375J8370
$$ -7519 4988 9458 963 -17067 -23458 -8370 7229 7427 -3220 -17664 -23177 -8802 9568
541I568k362j6724j0070J715J2779J4319l586j9471p879J2229J2816K198p055
$$ 9568 7206 -9518 -19588 -17873 -5094 9225 5639 -13832 -21711 -9482 3334 5532 -1523
554a523j1093l030J3446R882o969r278N31M898O319J168r182n423J0005J0196
$$ -1523 -12616 -15646 -2200 7682 713 -8565 -8034 -3136 3183 4351 -4831 -10254 -249 9947
568I947n127q848l077M093R495P308r340j3095K391J2803Q215l336j0294j0150
$$ 9947 4820 -4028 -7105 -3012 6483 13791 4451 -8644 -6253 6550 14765 11429 1135 -9015
582i015M599J6052O301q813j0102n551L330J3144J0609r224j7041l121Q164J2997
$$ -9015 -4416 11636 17937 9124 -978 -6529 -3199 9945 20554 11330 -5711 -8832 -668 12329
596A2329P378j0548j9357l776J6592J5894p51j5729j7239k49K3064J4650j2216
$$ 12329 19707 9159 -10198 -13974 2618 18512 17761 2032 -15207 -15456 7608 22258 10042
609A0042j8951n890Q062J5792P121j4230j7297L342J3808O088l992r696n986M596
$$ 10042 -8909 -14799 -6737 9055 16176 1946 -15351 -12009 1799 7887 3895 -5801 -11787 -7191
623g191J0016J026p027k642R8J92L944K692n804l538M876K654k262l62j766k182
$$ -7191 2825 3851 -3176 -5818 -5720 -5528 -1584 1108 -4696 -8234 -3358 -704 -2966 -3328 -5094 -7276
639g276L671O992k057p458k519K520P554O254o793j3279L25J4432P606m123j0467
$$ -7276 -3605 3387 1330 -6128 -8647 -6127 1427 7681 888 -12391 -12066 2366 9972 5849 -4618
654d618q848M085J8035Q061j3528j5716J27J2101J1780J814j4777j2829N875J4678
$$ -4618 -13466 -9381 8654 16715 3187 -12529 -12402 -301 11479 13293 -1484 -14313 -8438 6240
668F240N732m562j0014r600N620J6526L331j0785r317j755N612J0573L865j0215
$$ 6240 11972 7410 -2604 -12204 -6584 9942 13273 2488 -6829 -8584 -2972 7601 11466 1251
682A251r191K123P816N053m1r092p878O385R868o3p486l456o50L315P925k01r017
$$ 1251 -7940 -5817 1999 7052 7011 -2081 -9959 -3574 6294 6231 -1255 -4711 -5361 -2046 5879 5678 -3339
699c339l489P073M396o24m164o856O50J0126O110q128q965o1M889R411N717j1631
$$ -3339 -6828 245 4641 4017 -147 -7003 -6353 3773 9883 1755 -7210 -7271 -2382 7029 12746 1115
715A115j3447M969J4947N092n680j1220p402P771J6740K591j2261j0769j282J0434
$$ 1115 -12332 -7363 7584 12676 6996 -4224 -11626 -3855 12885 15476 3215 -7554 -8836 1598
729A598J2526J159j4696j0025N608J0334N859K66j0753j0534M929J4698M010p011
$$ 1598 14124 15283 587 -9438 -3830 6504 12363 12629 1876 -8658 -3729 10969 14979 7968
743G968r546n206N669J2364N083j1030j0193J87P823Q013J644j1385q504P037
$$ 7968 -1578 -6784 -1115 11249 16332 5302 -4891 -4704 3119 11132 12776 1391 -7113 -76
757g6R922j730n234m199q52N604N853l702q148l73O500J483n50m050m828L723
$$ -76 9846 8116 2882 -1317 -2169 3435 9288 5586 -2562 -2935 3565 5048 4498 448 -4380 -657
773f57P854n26p837l082J191L698O205R13r694p094N153Q283L515k275q595o482
$$ -657 7197 6671 -1166 -4248 -3057 641 6846 7759 -1935 -9029 -3876 4407 7922 5647 -2948 -9430
789i430O322J2021J211q397q951k033R139J3190q82j5160p855N921J0273O223
$$ -9430 -3108 8913 10124 1727 -7224 -9257 -118 13072 12190 -2970 -10825 -4904 5369 11592
803A1592k744j2554o923Q983J1713K6p367q205j669Q804R987k876j0389m340L068
$$ 11592 8848 -3706 -10629 -1646 10067 10093 2726 -5479 -7148 1656 11643 8767 -1622 -5962 -2894
818b894N977N989j848j0451m237P801N902j318m387m603m27O997N508o311p514
$$ -2894 3083 9072 7224 -3227 -7464 337 6239 4921 534 -4069 -4496 2501 8009 1698 -5816
833e816J48M496M868J538o920p705L523Q722O77n520m005k336L633P991L35r445
$$ -5816 -5668 -1172 3696 5234 -1686 -9391 -5868 2854 3531 -1989 -5994 -8330 -4697 3294 3629 -5816
849e816o281L430O443N295j409r509o411O118R224R13m901p084l898P545J0829
$$ -5816 -12097 -8667 -2224 3071 1662 -7847 -14258 -8140 1084 1997 -2904 -9988 -13886 -6341 4488
864D488j625j1599n146M099P603O268l231j0563m147Q286P161L79m863o112p61
$$ 4488 2863 -8736 -13882 -9783 -2180 4088 857 -9706 -13853 -5567 1594 1973 -2890 -9002 -9763
879i763P830O091m367o507k23K664M094L990k788p351o87O618L483p61k767m349
$$ -9763 -1933 4158 -209 -6716 -6939 -4275 -181 3809 1021 -6330 -7017 -399 3084 2323 -444 -4793
895d793O16P485K742n731m307Q54M030N045R86q053o075O188P942J03n076m614
$$ -4793 -4177 3308 6050 319 -3988 -3134 896 5941 6927 -1126 -7201 -1013 6929 7032 1956 -2658
911b658j630O539P162k730q834k760M493O091L837m030j0014k041Q201O494r30
$$ -2658 -4288 2251 9413 6683 -2151 -4911 -418 5673 9510 5480 -4534 -6575 1626 8120 7190
926G190m586o437j618Q016P790l786r071l301L569P127N416n662j0853j388Q454
$$ 7190 2604 -3833 -5451 2565 10355 6569 -2502 -5803 -2234 4893 10309 4647 -6206 -7594 860
941H60O805J75n798q663K22J0433N313n306p435j401K738O498L442o148p447J364
$$ 860 7665 7840 2042 -6621 -6399 4034 9347 4041 -3394 -4795 -2057 4441 7883 1735 -5712 -4348
957d348O374K944N3m216n717J412P043J945l846l377q77J794N544J246p025m477
$$ -4348 2026 4970 5023 807 -4910 -3498 3545 5490 1644 -1733 -2610 -816 4728 5974 -1051 -5528
973e528M405M973J406k158n786k685O187O109k942o037j567K046M809L709m601
$$ -5528 -1123 3850 5256 3098 -2688 -5373 814 6923 3981 -2056 -3623 -1577 3232 6941 2340
988B340p923N13P377L207q64m590n645O11P999M118m839n444j656K650N810L643
$$ 2340 -5583 -5070 2307 5514 4650 60 -5585 -4974 3025 7143 2304 -3140 -4796 -2146 3664 7307
1004G307n994q111J089O542M793n53n928p198J996R694L279n669n696j289L159
$$ 7307 1313 -6798 -5709 833 5626 5073 -855 -8053 -6057 3637 6916 1247 -4449 -5738 -2579
1019b579P482J046p814n296L371N672J997j108o192l660N056O141q31m642k093
$$ -2579 4903 5949 -1865 -7161 -3790 1882 3879 2771 -3421 -7081 -2025 4116 3285 -1357 -3450
1034c450p82L350N117j516o608j898L796L774J602k462o200j523O990N398k908
$$ -3450 -4232 -882 4235 2719 -3889 -5787 -1991 1783 3385 923 -5277 -6800 190 5588 2680
1049B680n674k855J340O572M127n523p808O48O581M187r9n667o410K065Q882K705
$$ 2680 -2994 -5849 -4509 2063 6190 667 -7141 -6493 88 4275 4176 -1491 -7901 -5836 3046 5751
1065E751m295n160k359K117O690L098o358n604J375L944M361J191n779o175K653
$$ 5751 1456 -3704 -6063 -3946 2744 5842 -516 -6120 -4745 -801 3560 4751 -1028 -7203 -4550
1080d550P420J925k966m695l093L106P512N43o524l210J981L903K657p70o098
$$ -4550 2870 4795 1829 -2866 -5959 -2853 4659 5202 -1322 -4532 -2551 1352 4009 3239 -2859
1095b859k059N111M209j944k679k253O8L843L650l005m770Q25K959J743J011k721
$$ -2859 -4918 193 4402 2458 -221 -2474 -2406 1437 5087 2082 -2688 -1863 1096 2839 3850 1129
1111A129m939J176O111J775k931l520k331J794O030K926o254n564J691M506M130
$$ 1129 -3810 -2634 3477 5252 2321 -1199 -3530 -1736 4294 7220 966 -4598 -2907 1599 5729
1126E729r26n987n127L971P420R63m620m782k009M275P254n91p320l426J956M162
$$ 5729 4803 -1184 -6311 -2340 5080 6043 1423 -3359 -5368 -1093 6161 5570 -1750 -5176 -3220 942
1142I42L669p58o420l917M344N862P79k943m813k697M728O453j155o346k626J528
$$ 942 4611 3853 -2567 -6484 -2140 3722 4501 1558 -3255 -5952 -1224 5229 4074 -2272 -4898 -3370
1158c370M351M116k160p419j114N893L857r71l430l831K30N890L636m494m239
$$ -3370 981 5097 2937 -4482 -5596 297 4154 3183 -247 -4078 -3848 2042 5678 1184 -3055
1173c055J63K337L338J720l554n388K155M611J011r64l017k735J096N610J879
$$ -3055 -2892 -555 2783 4503 949 -4439 -2284 2327 3338 2374 -643 -3378 -2282 3328 5207
1188E207m409l397j97K959M166J002n961m399L289N150R29k301m420k834M577
$$ 5207 798 -2599 -2796 163 4329 5331 -630 -5029 -1740 3410 4339 2038 -2382 -5216 -639
1203f39O266j524n718k279J533L638K988j866o012j117M450K909n68j967l698
$$ -639 5627 4103 -1615 -3894 -2361 1277 4265 2399 -3613 -4730 -280 2629 2061 94 -3604
1218c604p32M400L860k846l983o72R11K855K988k793m986j66N023J437j000l143
$$ -3604 -4336 64 3924 1078 -2905 -3577 -2666 189 3177 384 -4602 -4768 255 1692 692 -2451
1234b451k944J518N035K342n091k363q70L135L698J207o032l249L366M788K89
$$ -2451 -5395 -3877 1158 3500 -1591 -3954 -4824 -1689 2009 3216 -2816 -6065 -2699 2089 2378
1249B378k047l261k507L989N126p98m007k710L28L223M635p02o472k343L751M311
$$ 2378 331 -2930 -5437 -1448 3678 2880 -1127 -3837 -3509 -286 4349 3647 -2825 -5168 -1417 2894
1265B894R09j822n016k103N348N242j531m727k965J177M827L290k884n754m13
$$ 2894 3803 1981 -3035 -5138 210 5452 3921 -806 -3771 -2594 2233 5523 2639 -3115 -3528
1280c528L645L138K43k540m493k65N139L056k789k917j287Q30L322K518k679m195
$$ -3528 117 3255 3498 958 -3535 -3800 1339 4395 1606 -1311 -2598 -1768 1554 4072 1393 -2802
1296b802L01K470J898R18k788m427J915M873O66k739k440o87J664M220N9n047
$$ -2802 -2501 -31 1867 2785 -3 -4430 -2515 2358 3024 285 -2155 -2842 -1178 3042 3101 -1946
1312a946k603K955L239P51j289m050p00M319K963j924l041j008L52L029L131j829
$$ -1946 -4549 -1594 1645 2396 1107 -2943 -3643 676 3639 1715 -1326 -2334 -1982 1047 4178 2349
1328B349n262K51L357J789P19k071l495l91M268L167j958k990k362P34M823L130
$$ 2349 -2913 -2662 695 2484 3203 1132 -2363 -2754 1514 4681 2723 -267 -2629 -1895 2928 6058
1344F058m057n044J171L488K483N48l233m606J344N400J590l384l351q02K333
$$ 6058 2001 -3043 -1872 1616 4099 4647 1414 -3192 -1848 3552 5142 1758 -1593 -2395 -62
1359f2M532l0m442k723J550K542J988J27l969l531L142M611n36l052j848r27K124
$$ -62 4470 4440 -2 -2725 -1175 1367 3355 3482 -487 -4018 -876 3735 3199 147 -1701 -2628 -504
1376e04L966j67m914k013J950K872K015j454n138j097M430K819j603k372k151
$$ -504 3462 3295 -1619 -3632 -1682 1190 3205 1751 -3387 -4484 -54 2765 1162 -1210 -3361
1391c361j72M086L360k904m783J32K662K543Q56k434l746J58M177J631o54k525
$$ -3361 -3533 553 3913 1009 -3774 -3642 -980 1563 2419 -15 -3761 -3603 574 2205 1551 -974
1407i74k756P72M707K205l900l581Q82K284K321J375l621l355J655M333Q44j810
$$ -974 -3730 -2958 1749 3954 54 -3527 -2645 -361 1960 3335 -286 -3641 -1986 2347 3191 1381
1423A381k749j080K217M020r39m042j30J211J419J505P9l657j693L031K651j176
$$ 1381 -1368 -2448 -231 3789 2850 -1192 -1322 -111 1308 2813 2892 -765 -2458 573 3224 2048
1439B048j357j411l38K231K732j809l004o77R15K504K661k898m556K08M749K082
$$ 2048 691 -720 -1058 1173 3905 2096 -908 -1585 -670 1834 4495 1597 -2959 -2751 1998 4080
1455D080k019k348k719J253M050K407m355l553M84K872L175mm400l324K461L805
$$ 4080 2061 -287 -3006 -1753 2297 4704 349 -3204 -2720 152 3327 3323 -1077 -4401 -1940 1865
1471A865P80j201k442k611J424M614M44l587k167K26K203K522P13l983k922J845
$$ 1865 2645 1444 -998 -3609 -2185 2429 2873 -714 -2881 -2655 -452 2070 2783 -1200 -4122 -2277
1487b277L407J012o82l171k537L186M043j199l340j168N74K271K900j213m541
$$ -2277 1130 2142 1460 -1711 -4248 -1062 2981 1782 -1558 -2726 -2152 119 3019 1806 -2735
1502b735m79K741K491j78j855k752M02L107J660k119j569m03P19K033J918k630
$$ -2735 -3214 -473 2018 1840 -15 -2767 -2365 742 2402 283 -1286 -1689 -970 1063 2981 351
1518C51l368M01L059J608o87j762k695L07M635N17j965k741R9K331K359N20m655
$$ 351 -3017 -2616 443 2051 1364 -398 -3093 -2786 1849 2366 401 -2340 -2241 90 2449 2969 -1686
1535a686j803J897K462K38O3k146k113J706L616n43k865j031L28K029J895j106
$$ -1686 -3489 -1592 870 1108 1171 -975 -3088 -1382 2234 1691 -1174 -2205 -1877 152 2047 941
1551I41l292n10K122J655P39q61k930j545L805K804j930k961l68Q85K519J848
$$ 941 -2351 -2861 -739 916 1655 794 -2136 -3681 124 2928 998 -1963 -2331 -1446 1073 2921
1567B921k546l613J020K736J825l01k726k859J646M099N12k566j913j49J415K785
$$ 2921 375 -3238 -2218 518 2343 2042 -684 -3543 -1897 2202 2714 148 -1765 -1914 -499 2286
1583B286O75l176k542J014K752J214K18k947k645J806L340R02j893k064j260J768
$$ 2286 2961 -215 -2757 -1743 1009 2223 2441 -506 -3151 -1345 1995 2897 1004 -1060 -2320 -552
1599e52L765n5m359j423K052K390Q75q28l143j891L378K833q81k216j401R2K259
$$ -552 3213 3158 -1201 -2624 -572 1818 2693 1865 -1278 -3169 209 3042 2161 -55 -1456 -1364 895
1616H95K017j595l157L13J709J046R17j130l022k30L320J616j068j866j173J21
$$ 895 2912 1317 -1840 -1527 182 1228 2145 1015 -2007 -2237 1083 2699 1631 -235 -1408 -1287
1632a287K588J546k156k314P4J877J556M42k374k628J471L476J97j975j255j023
$$ -1287 1301 2847 691 -1623 -1549 328 1884 2326 -48 -2676 -1205 2271 2468 493 -762 -1785
1648a785J206K464J08l197q14J602J384J071o01k787j306K579K041o51j493j314
$$ -1785 -579 1885 1993 -1204 -2018 -416 968 2039 1438 -1349 -2655 -76 1965 1314 -179 -1493
1664a493o42J721K597r23k953n67K036J612L47j376k976l3L440J775j342k002
$$ -1493 -2135 -414 2183 1260 -1693 -2260 -224 1388 1735 359 -2617 -2650 790 2565 1223 -779
1680g79j778M26L546J568k848k954R60J828J648K26k457k501R98L221Q00j045
$$ -779 -2557 -2131 1415 2983 135 -2819 -1859 -31 1617 1843 -614 -3115 -2117 1104 1904 859
1696H59j728j568M15L256J273k586j966J46J270J876R29k818k688J642L047O18
$$ 859 -869 -2437 -2022 1234 2507 -79 -2045 -1899 -629 1247 2176 -642 -3330 -1688 1359 1977
1712A977j237k077j297J910L252q15k722j154J168J406J220q62k648m84K599J420
$$ 1977 740 -1337 -2634 -724 2528 1713 -1009 -2163 -995 411 1631 769 -1879 -2363 236 1656
1728A656p18j276j232j2K102J448j051j980o80Q59J192J702j196k755QK622J176
$$ 1656 938 -338 -1570 -1582 520 1968 917 -1063 -1743 -884 308 2010 814 -1941 -1933 689 1865
1745A865o28j535j833N33K913J102k132j966L53J007J578O11k185k073J571K218
$$ 1865 1237 -298 -2131 -1598 1315 2417 285 -1681 -1328 -321 1257 1868 -317 -2390 -819 1399
1761A399k9r67j253p90J052K652k87k443n58M06O89J676j2k785n81J937J560m54
$$ 1399 1370 403 -850 -1640 -588 2064 1777 -666 -1224 -818 -129 1547 1535 -1250 -1831 106 1666 1212
1779A212o41k007n56K272K279j009k710k90Q56J821J207j530l250M87K611J221
$$ 1212 571 -1436 -1992 280 2559 1550 -1160 -1450 -594 1227 2434 904 -2346 -1859 752 1973
1795A973p37j683j479N06L065J342k604j710j6R05J831R00j975k574J141J769
$$ 1973 1236 -447 -1926 -1420 1645 2987 383 -1327 -1343 -438 1393 2293 318 -2256 -1115 654
1811F54J085j52j783k105J051L083P47k213j711m40J269K651P8k710j685J456
$$ 654 1739 1587 -196 -2301 -1250 1833 2580 367 -1344 -1784 -515 2136 2214 -496 -2181 -725
1827g25J688N20n43k024j213K035K204r18j889n32K8J306J647n21k697J12J401
$$ -725 963 1483 940 -1084 -2297 -262 1942 1024 -865 -1397 -1369 -63 1584 1063 -1634 -1522 -121
1844a21O70L14k36j902l78K032J218j083j093r15OJ710J932j793k360M64J890
$$ -121 549 863 627 -1275 -1653 379 1597 514 -579 -1494 -1488 222 2154 361 -1999 -1535 355
1861C55J035k83j748j480Q39K656M59k141p16l18R31K067N7k471j214J410J480
$$ 355 1390 1107 -641 -2121 -1282 1374 1833 -308 -1024 -1342 -411 1656 1713 -758 -1972 -562 918
1878I18K82l98j262j402J662J845k61j453j206L15Q87K267q90k429m59J180J394
$$ 918 1200 802 -460 -1862 -200 1645 1384 -69 -1275 -960 -73 2194 1304 -1125 -1584 -404 990
1895I90O70r71k379k63K475J820j326j524j067P49J848J069j436j909J19J077
$$ 990 1660 689 -1690 -1953 522 2342 1016 -508 -1575 -826 1022 2091 655 -1254 -1135 -58
1911e8J184K74r38k379L09K657P19j130j464p63M93J989J374k358j303L70J631
$$ -58 1126 1400 462 -1917 -1608 1049 1768 638 -826 -1589 -1096 893 2267 -91 -1394 -1024 607
1928F07P52K80j293k678J679K957N2k719o78M6L43L196j229j930j198J175J103
$$ 607 1359 1639 346 -2332 -653 2304 2356 -363 -1041 -995 -652 2544 1315 -615 -1813 -638 465
1945D65J139m50j873j006J743J260k47q93j319J23J635J550r78j833l00Q40M51
$$ 465 1604 1154 -719 -1725 18 1278 1031 138 -1181 -1058 577 2127 1149 -684 -984 -144 307
1962C07J061r06k132M3K057J185r10r52j366O96K018O99j739j096M01N51R38K79
$$ 307 1368 462 -1670 -1627 430 1615 705 -247 -1613 -917 1101 1800 61 -1035 -634 -83 855 1134
1980A134j539j287J064J902l26r97n13m79O48J819j42k048o21P12R36J034k45
$$ 1134 -405 -1692 -628 1274 948 -49 -562 -1041 -393 1426 1284 -764 -1385 -673 263 1297 1052
1997A052k032q34J372J542M5p27j342n81J684K203j322k145m80J018J559R31j878
$$ 1052 -980 -1814 -442 1100 1145 418 -924 -1505 179 2382 1060 -1085 -1565 -547 1012 1943 65
2014F5j697K15J789R86m49r94j644R02J787O61j324j466M5J33J752M63j221j784
$$ 65 -1632 -1417 372 1358 909 -85 -1729 -827 960 1621 297 -1169 -1124 -991 761 1224 3 -1781
2032a781L94J860P74m41j074j203m9K422N83j349j452j95R23J896K12k088j358
$$ -1781 -1387 473 1247 806 -268 -1471 -1520 902 1485 136 -1316 -1511 -588 1308 1520 -568 -1926
2049a926Q82K251j37q16j140j059J448J695p33j331n44N81P35J352j54k228o34
$$ -1926 -1044 1207 1070 254 -886 -1945 -497 1198 465 -866 -1410 -829 -94 1258 1104 -1124 -1758
2066a758J814L02K50k93j417o9Q94J226m48j122l65J40J100P20m92k075j4J665
$$ -1758 56 358 608 315 -1102 -1171 -277 949 501 -621 -986 -846 254 974 482 -1593 -1607 58
2084E8L74L84j644j028J80K492R09k054o23N75J38J125O24j347j140P09J165L25
$$ 58 432 816 -828 -1856 -1676 816 1725 -329 -952 -377 -239 886 1510 163 -977 -268 897 1222
2102A222r28M83j736O85K019o34q81j191L34P92J029L84j768j352J713J606j27
$$ 1222 294 777 -959 -274 1745 1111 230 -961 -627 165 1194 1578 -190 -1542 171 1777 1650
2119A650o16j691o3K038L25k57j898k22L93O49J906j169j680k69R37O38N32n68
$$ 1650 1034 -657 -720 1318 1643 1386 -512 -734 -341 308 2214 1045 -635 -904 33 671 1203 635
2137F35j570m72J971J217p88j034j204KK027J048k026l02o12J116O33l31k07j569
$$ 635 -935 -1407 564 1781 993 -41 -1245 -1243 784 1832 -194 -496 -1108 8 641 310 103 -1466
2155a466M22J824L17p31j445j480K666J078o88j321J61L81L78O94j8j232q22P95
$$ -1466 -1044 780 1097 366 -1079 -2559 107 1185 497 -824 -663 -282 96 790 772 -460 -1282 -487
2173d87J062r7j29j22j146Q19R75K41j170n78M59K88O13l29j733l24J378J453
$$ -487 575 478 349 227 -919 -100 875 1116 -54 -632 -173 115 728 399 -1334 -1658 -280 1173
2191A173r19j019j48O19Q31J011j775j493R37N27J458l5j510j638Q26K152M19
$$ 1173 254 -765 -913 -294 537 1548 -227 -1720 -783 -256 1202 1167 -343 -1981 -1155 997 1416
2208A416j124r52k49K31J461O4j096q71M58N46N10R95j855q11K61J483L27r48
$$ 1416 292 -660 -909 -678 783 847 -249 -1120 -662 -116 394 1389 -466 -1277 -1016 467 794 -154
2226a54p82J30K173k08j217k78l16K86J254n85m8q35o9J433J45q21l12q15j085
$$ -154 -936 -806 1367 1159 -58 -336 -652 -366 888 303 255 -580 -649 784 929 108 -204 -1019 -2104
2245b104K400K03M83j698q9K11J384P82j393k275J032J627J040q13r49m41K05
$$ -2104 296 499 982 -716 -805 -594 790 1572 179 -2096 -1064 563 1603 790 -159 -600 -395
2262c95J296K16k520j78Q67Q46J17O36k207k54J518J097o33j55j504P32J097q8
$$ -395 901 1117 -1403 -1581 -714 132 249 885 -1322 -1576 -58 1039 406 251 -1253 -521 576 488
2280D88J69r58N80M77o79K74J67o17p33N37J330l79n65j53p36J536m47J113k114
$$ 488 657 -301 279 756 77 351 518 -99 -832 -295 1035 656 91 -62 -798 738 291 1404 -710
2299g10M36r44J117J125j035k039Q18J716L58J65j462q26Q57J489K10j581n52
$$ -710 -274 -1218 -101 1024 -11 -2050 -1232 484 842 1007 -455 -1281 -424 1065 1275 -306 -858
2316h58Q87o24K476j311j931p00J296Q32L48L26q90n16O78P96M9j374L47p26P76
$$ -858 29 -595 1881 570 -1361 -2061 -765 67 415 741 -149 -665 13 809 858 -516 -169 -895 -119
2335a19O13Pj060j470J032J707L07K25k004J68l4J769N80j808r25J493jl62J50
$$ -119 494 501 -559 -2029 -997 710 1017 1242 -762 -594 -628 1141 1721 -87 -1012 481 480 118 268
2354B68j473NK083L10N8j023j289k35J404J382j272Op70l83K217O9j283r15L28
$$ 268 -1205 -1200 883 1193 1251 228 -1061 -1296 108 1490 218 224 -546 -929 1288 1357 74 -841 -513
2373e13J748k68n30q96m34P01J198n94n38k7l45K95O50N36j322l36j97J168O94
$$ -513 1235 967 437 -459 -893 -192 1006 412 -126 -153 -498 -203 447 983 -339 -675 -872 296 990
2392I90l12o57q64O42L71O74o16q90j43M65R09nn28p50J002O38j035K65j469N7
$$ 990 678 21 -843 -201 170 844 228 -662 -805 -340 569 564 36 -714 288 926 -109 156 -1313 -1256
2412a256J901N14j084p81p3N69P36O97j190j064J113L02J11p92n64k1K73O00N36
$$ -1256 645 1159 75 -706 -779 -210 526 1223 33 -1031 82 384 495 -297 -861 -882 -609 -9 527
2431E27n22k68n34j19P59Q75p10n48j8R7Q83M38r17r45M20J334oo45r07k45J251
$$ 527 5 -263 -797 -916 -157 718 8 -540 -558 -461 422 860 -57 -1002 -582 752 746 101 -806 -1051 200
2452B00J134J46k274j300K274J028j026k45q89J20M08K292r62j512l30Q54J742
$$ 200 1334 1480 -794 -2094 180 1208 182 -63 -952 -832 -424 1868 906 -606 -936 -82 1660
2469A660j440n80o74Q40R18L51j018Q86j436O50m68J629j272Q04n33j070P27M28
$$ 1660 220 -360 -1034 -194 724 1075 57 943 -493 157 -311 1318 46 850 317 -753 -26 402
2487D02r13M64q26O67jJ211q74j399J077K76O96N0m40j631m68J942N48r18l90
$$ 402 -511 -47 -873 -206 -207 1004 130 -1269 -192 84 780 830 390 -1241 -1709 233 781 -137 -527
2506e27nP70M1N92j677M3J673l67m0r05n30Q7Q89J036o32j472Q35K84L40l22j043
$$ -527 -532 238 279 871 -806 -763 910 543 503 -402 -932 -845 44 1080 448 -1024 -189 95 435 113 -930
2527i30J003m90O18o46J53m31K64j46N46R29j164P4j0l85N77J054j038r04k07
$$ -930 73 -417 201 -445 -292 -723 -459 -605 -59 870 -294 -220 -230 -615 -38 1016 -22 -926 -1133
2546a133R53J234l22o53j249m54K170O71j768j181P14J265O62m62j431q56K062
$$ -1133 -180 1054 732 79 -1170 -1624 546 1217 -551 -1732 -1018 247 909 447 -984 -1840 222
2563B22L96j20j007q80J303M33K30l20o61J42K91N68j029O75j171K1J023r6m70
$$ 222 618 498 -509 -1389 -86 347 577 257 -404 -262 29 597 -432 243 -928 -907 116 20 -450
2582d50O94m04l17O96Q43p35l97l53p84P13J682m73r93k59Q76Q9J317j981j727
$$ -450 244 -160 -477 219 1062 327 -70 -423 -1207 -494 1188 715 -278 -537 339 428 1745 -236 -1963
2601a963L49J808J125q51r56k32J271r22R49j120l17J163m88j33m88n28J595K84
$$ -1963 -1614 194 1319 468 -488 -720 551 -371 578 -542 -859 304 -184 -317 -805 -1333 262 546
2619E46JK37l93o65l55Q16P11q12k60Q1j55M04M8L57r45k01O45Q05l61q51j80
$$ 546 547 784 391 -274 -629 187 898 86 -174 -93 -248 156 204 561 -384 -585 60 865 504 -347 -527
2640e27L09K01J118m09m52j146P03M76N96q40j032k30K414l67l01j100K3L17R37
$$ -527 -218 -17 1101 692 240 -906 -203 273 869 29 -1003 -1233 1181 814 513 -587 -564 -247 690
2659F90L38j283j088Q98J085J36n69m82o54P99R70q51l60l14J83O51J55p2o89
$$ 690 1028 -255 -1343 -445 640 776 207 -275 -929 -130 840 -11 -371 -685 -502 149 304 232 -457
2678d57O4P32k06L9k00k29n42J14J158L43o11p47j46Q2J409k18o97q77O47Q0R67
$$ -457 -393 339 133 172 -28 -257 -799 -685 473 816 205 -542 -688 -606 803 585 -112 -989 -342 -262 705
2699G05n69p20n11J326N80m16j043l07J62J295R8r56q47O49J138q89P13j169l08
$$ 705 136 -584 -1095 231 811 395 -648 -955 -793 502 600 -356 -1203 -554 584 -305 408 -761 -1069
2718a069N72P64j00k9O6o21O06l06K45k13O9J32p09O64k05K19m26j117J890j49
$$ -1069 -497 267 167 138 204 -417 189 -117 128 -85 -16 116 -593 71 -134 85 -341 -1458 432 283
2738B83q19L38m29J61J200rj248N3K43O33M35l21j011k49J049P11k61r45m01L95
$$ 283 -536 -198 -627 -466 734 725 -523 -470 -227 406 841 520 -491 -740 309 1020 759 -186 -587 -192
2758a92P33O56j009r82O61N79K68l42k82o21J41J110J45j073lL4K85O85j61r33
$$ -192 541 1197 188 -794 -133 446 714 372 90 -531 -390 720 865 -208 -211 -177 108 793 632 -301
2778c01J54j1L08j46K77n12m3q8O18O46p98J41j352J390K81m22n83j31l77R14
$$ -301 -147 -158 150 4 281 -231 -274 -362 256 902 104 245 -1107 283 564 142 -441 -572 -949 -35
2798c5L43k45p70l67J522N34q82n73l07M6R08Q43p03j095P4Q66L06p9m7j131L46
$$ -35 308 63 -707 -1074 448 982 100 -473 -780 -734 174 1017 314 -781 -707 159 465 386 339 -792 -446
2819d46J529q7r43K41q36J08O42M08m87k64N35k77K91Q76j745K57o61J357n47
$$ -446 1083 996 53 294 -542 -434 208 616 129 -135 400 123 414 1290 -455 -198 -859 498 -49
2838d9p98M67rLJ093r83q41R54n10L38J18J382j144j323P98R63p21M56m26l58
$$ -49 -847 -380 -389 -386 707 -276 -1117 -163 -673 -335 -217 1165 21 -1302 -504 459 -262 194 -232 -590
2858e90Q95P49p33j028K97N26K45M49q20q61O37Q70k06m61k19p0J78P27j60l94
$$ -590 305 1054 321 -707 -410 116 361 810 -10 -871 -234 636 430 -31 -250 -320 -142 585 425 31
2878C1l43J56J61R9L48k32o97k32O03J31K97m61p09L58J138l3n32o02r5K53J032
$$ 31 -312 -156 5 104 452 220 -477 -709 -106 25 322 -139 -848 -490 648 615 83 -519 -614 -361 671
2899F71j59p69p14O40P65J7l92o61k49P49P62m40q34L33k06O70J18j75n94M2N04
$$ 671 512 -257 -971 -331 434 451 59 -602 -851 -102 660 220 -614 -281 -487 183 301 126 -468 -426 78
2920G8L55m63m4k13m01Q16K40m41m04J98j04K67N78m24p94L73M01K5L97k21n64
$$ 78 433 -30 -74 -287 -688 128 368 -73 -477 -279 -383 -116 462 38 -756 -383 18 43 440 219 -345
2941c45l57J040L48o39l7n40J87O81M92n86j093P02L58J46o1r01l1L34J126l61
$$ -345 -702 338 686 47 10 -530 -343 338 830 244 -849 -147 211 357 296 -605 -636 -302 824 463
2961D63o97k93J73O18M02n11n53k63P27M34l33j48j27l03O32M10q61k60N55R6
$$ 463 -234 -527 -354 264 666 155 -398 -661 66 500 167 19 -108 -411 221 631 -230 -490 65 161
2981A61O1J91Q7m91l59N99k60O05k85q80J46R07k33J22k83l01j43Q22O25p60j077
$$ 161 222 413 500 9 -350 249 -11 594 309 -571 -425 482 249 371 88 -213 -356 466 1091 331 -746
3002g46N29O18J41J49p15n27L97J040l67o49j07Q7L61M45q3q46j39O44M2K9OJ43
$$ -746 -217 401 542 691 -24 -551 -154 886 519 -130 -237 -150 211 656 573 -273 -412 232 274 303 309 452
3024D52q81O87M39n46O3k61P9j28N49n5l36k11j33J14O00K83j090j21Q78J29j44
$$ 452 -429 258 697 151 214 -47 32 -96 453 398 62 -149 -282 -168 432 715 -375 -496 382 511 367
3045C67l22k37QJ88Q57r07k94P0L50J17L41n25n36K91O21k73j37j61j96M7O33
$$ 367 45 -192 -184 4 861 -46 -340 -270 80 197 538 13 -523 -232 389 116 -21 -182 -378 -331 302
3066C02j48n05k56P05r4J74k14n55K80N86J5l06l94K60k85N00L21l12n96K31Q0
$$ 302 154 -351 -607 98 4 178 -36 -591 -311 275 290 -16 -410 -150 -435 65 386 74 -522 -291 -211
3087b11J97K80k17l31l55N51M98l44j74l62k00L79R60n65q45K89K47M70r1j13
$$ -211 -14 266 49 -282 -637 -86 412 68 -106 -468 -668 -289 671 106 -739 -450 -203 267 176 63
3107F3q34K33O42J94j26l19l54L64Q04j32r42J79P7J61K77k0j07p72M13L15K9
$$ 63 -771 -538 104 298 172 -147 -501 -137 667 535 -407 -228 -151 10 287 267 160 -612 -199 116 145
3128A45l0k42j72O8M89j53m45J86K60j99N22j8o39l63O66J50n6K05n81l90N34
$$ 145 115 -127 -299 -231 258 105 -340 -154 106 -93 429 411 -228 -591 75 225 169 374 -207 -597 -63
3149f3O82l68o43k16L88L45M35l78n24J19N68k53k1j52m21L31K8L97m80j3k38
$$ -63 619 251 -392 -608 -220 125 560 182 -342 -223 345 92 71 -81 -502 -171 -143 254 -226 -239 -477
3170d77L47K33n9o3m24J30M12J32k86l11j34K62J94L77l84k57j25K52P5M66k41
$$ -477 -130 103 44 -19 -443 -313 99 231 -55 -366 -500 -238 -44 333 -51 -308 -433 -181 -106 360 119
3191A19q62L18P76l01j72k54J01L63L05j49l47j25K52r8N19l33n74o1P60P5j1
$$ 119 -743 -425 351 50 -122 -376 -275 88 393 244 -103 -228 24 -74 445 112 -462 -523 237 312 301
3212C01q3l04k81N48L82m65j41k10K25L69L06o10n51K56N81j46L33m45l38J07
$$ 301 218 -86 -367 181 563 98 -43 -253 -28 341 647 37 -514 -258 323 177 510 65 -273 -166
3232a66L45O6n16L35j76L31J31P8r72K27J55L72J59P0p94N3M24M05m64j03k64
$$ -166 179 245 -271 64 -112 219 350 428 -544 -317 -162 210 369 439 -355 -302 122 527 63 -40 -304
3253c04k8O5K57L88q87J66L11L44k52K72p03j40M68K85j22m90K29m0J89J29r0
$$ -304 -332 -267 -10 378 -509 -343 -32 312 60 332 -371 -511 -43 242 120 -370 -141 -181 8 137 47
3274D7m96J64J51J36L58j52k68m79O28J61j20l38k44K60q3R93o74j05q5O77L0
$$ 47 -449 -285 -134 2 360 208 -60 -539 89 250 130 -208 -452 -192 -275 718 44 -61 -146 531 561
3295E61q25n08J98J045l02J56j179P90m31J084l80r84J388j005L2k5J93n2l80
$$ 561 -264 -772 -574 471 169 325 -854 -64 -495 589 209 -775 613 -392 -360 -385 -192 -244 -624
3314f24r13J823L10P73k001O86n18J00N42N57j454J54M59QP13j019j13O0j21N31
$$ -624 -1537 286 596 1369 -632 54 -464 -364 178 735 -719 -565 -106 -98 615 -404 -517 -457 -578 -47
3334d7p2J34j58k05K56K54q2o86L14L09nJ43k91l15k72Q40K9l2n25J42P3N40R
$$ -47 -119 15 -143 -348 -92 162 80 -606 -292 17 12 155 -136 -451 -723 117 146 114 -411 -269 -196 344 353
3357C53p10P0J68%O36j93j47m44P7N99j87p7l73J44L11L73p18j26j54N39l38O62
$$ 353 -357 -287 -119 -119 517 324 177 -267 -190 409 222 145 -228 -84 227 600 -118 -244 -398 141 -197 465
3379D65q1m06l22R09j55m84L04m54r6N37L15l12j54p9J24nM05m35k76j72M38M2
$$ 465 384 -22 -344 565 410 -74 230 -224 -320 217 532 220 66 -13 111 106 511 76 -200 -372 66 108
3401A08J3M8k90P5L09j7m70Q2J02K13K29k87k70k04N28J63m4l08K95n19L3N13
$$ 108 121 169 -121 -46 263 246 -224 -142 -40 173 402 115 -155 -359 169 332 288 -20 275 -244 -211 302
3423C02k08k50L69m34K81nJ62l77j3J05J28J39J5m50l75O87K73k67m03K45J04
$$ 302 94 -156 213 -221 60 55 217 -160 -173 -68 60 199 214 -236 -611 76 349 82 -321 -76 28
3444B8l1M78l75m73m85Q00O19p68P48l92o0O33k20o5r85J89M02j43M90o43P36
$$ 28 -3 475 100 -373 -858 -58 561 -207 541 149 89 722 502 437 -548 -359 43 -100 390 -253 483
3465D83p26N28n14R51j027J239j212J243k47k62L55n39k70O69l23q21k33R34J94
$$ 483 -243 285 -229 722 -305 934 -278 965 718 456 811 272 2 671 348 -473 -706 228 422
3484D22q64J161n58O32p51K1l87M04J7J96k90k9k0L07j175L67J79R67j31k19q37
$$ 422 -442 719 161 793 42 63 -324 80 97 293 3 -26 -46 261 -914 -547 -368 599 468 249 -588
3505e88M74R64j367P06J43m82N06O45j416k38R64j91J092P8j202l2r90M24K054
$$ -588 -114 850 -517 189 332 -150 356 1001 -415 -653 311 120 1212 1290 88 56 -934 -510 1544
3524A544j589j246J374j15L95M15m21r21J768k88n58n40m43M31L81l55P18q67
$$ 1544 -45 -1291 83 -32 363 778 357 -564 1204 916 358 -182 -625 -194 187 -168 550 -317
3542c17l26P37o44k64J648j237o23J068k404K186J058j621Q86k05l0J99m50l98
$$ -317 -643 94 -550 -814 834 -403 -1026 42 -2362 -176 882 -739 147 -58 -88 111 -339 -737
3560g37P74R67K41j187m87M74l50N01k62j94R3J32m98J020J90j347l66O51R04
$$ -737 37 1004 1245 58 -429 45 -305 196 -66 -260 -167 -35 -533 487 677 -670 -1036 -385 519
3579E19m06q07l78J640p77nJ52k89m94P89J13p38J001j037N67M98P1j78l14O48
$$ 519 113 -694 -1072 568 -209 -214 -62 -351 -845 -56 57 -681 320 -717 -150 348 419 241 -73 575
3599E75j173j013N86R89q80Q14J55J06J99j23r28N8O67q49J183q51N65k97P13
$$ 575 -598 -1611 -1025 -36 -916 -102 53 159 358 235 -693 -635 32 -817 366 -485 80 -217 496
3618D96j38o2n87P3J061m23o58J2j26L27k81N91j95q29J048k99L08o48M9P83m33
$$ 496 358 296 -291 -218 843 420 -238 -226 -352 -25 -306 285 90 -739 309 10 318 -330 -281 502 69
3639F9N62o77J62J1p30N92M73k36j08l02M03j28k33M34l10M85r02Q74q45J113
$$ 69 631 -46 116 127 -603 -11 462 226 118 -184 219 91 -142 292 -18 467 -435 439 -406 707
3659G07p58k75N57J160j750R5M00n64J086m73n70p5K84M85p18N69j74K85m64N82
$$ 707 -51 -326 231 1391 -359 -264 136 -428 658 185 -385 -460 -176 309 -409 160 -14 271 -193 389
3679C89k56q26P61o6Q4p9r1r7K52l43K87L64k67J90o35J91O10j79m44m06M62j70
$$ 389 133 -693 68 2 86 7 -84 -181 71 -272 15 379 112 302 -333 -142 468 289 -155 -561 -99 -269
3701b69K07K31L4p38O86l83N09p1L16p85O52k3n87k40N69j36k35J5K78m19L22
$$ -269 -62 169 203 -535 151 -232 277 206 522 -263 389 366 -221 -461 108 -28 -263 -248 30 -389 -67
3722f7J31M00l77j77r0K25k60J49M2k06n97Q64o8M31n57l02K69Q83n34k24L89
$$ -67 64 464 87 -90 -180 45 -215 -66 -24 -230 -827 37 -31 400 -157 -459 -190 693 159 -65 324
3743C24j054M94K17j84K11j081Q05Q9L09K04J35o99Q3L82k37K93p79r9M97L83
$$ 324 -730 -236 -19 -203 8 -1073 -268 -179 130 334 469 -230 -147 235 -2 291 -488 -587 -90 293
3763B93j91k40P7j72K67k2K45l57j22K10J12n1n2m6l29M32K15n95K02r2MK45q6
$$ 293 102 -138 -61 -233 34 12 257 -100 -222 -12 100 49 -3 -49 -378 54 269 -326 -124 -216 -212 33 -53
3786e3K76m31J21j40J65K71k85J10l75J69J57k7j5j15M0K89J66k85n39M07n3P9
$$ -53 223 -208 -87 -227 -62 209 -76 34 -341 -172 -15 -42 -57 -172 -132 157 323 38 -501 -94 -147 -68
3808f8Q6k5o48O06L43l54n1L11l77m8R5M5o1K4J96k28m0K62l47K60K63k53K46
$$ -68 18 -7 -655 -49 294 -60 -111 200 -177 -225 -130 -85 -146 -122 74 -154 -194 68 -279 -19 244 -9 237
3831B37j90j39PJ67J12j43j24JM6L05l15K78o7l83N12r9k84J62k79L41o7Kp1j04
$$ 237 47 -92 -85 82 194 51 -73 -72 -26 279 -36 242 175 -208 304 205 -79 83 -196 145 78 80 9 -95
3855i5R3j0L9O9j89k76J59J18K34k70K08r4M8J61J84l65m27M84L99k55l67k8J75
$$ -95 -2 -12 27 96 -93 -369 -210 -92 142 -128 80 -14 34 195 379 14 -413 71 470 215 -152 -180 -5
3878eJ5K36j35m9j14j23J84M52o83Q3l15L36K32R6j66p4k94M06K57l84J08j20
$$ -5 10 246 111 62 -52 -175 9 461 -222 -139 -454 -118 114 210 44 -30 -324 82 339 -45 63 -57
3900e7k4p2L35k97M2j30K67R7j1k93j11J19K85O4j14j66j72J03K08L59o80OJ43
$$ -57 -81 -153 182 -115 -73 -203 64 161 150 -143 -254 -135 150 214 100 -66 -238 -135 73 432 -248 -242 -99
3923i9J01R7J70l35j16R0J58n1k58L25o41O78K28Kl20o7K75m9j95R7n31K98M37
$$ -99 2 99 269 -66 -182 -92 66 15 -243 82 -559 119 347 349 29 -38 237 188 -7 90 -441 -143 294
3946B94k40Q0j49j86p4O62k82j93j8Q0n0K80l09Q1k17L36J26nM5l75O5r8M24k00
$$ 294 54 134 -15 -201 -275 387 105 -88 -106 -26 -76 204 -105 -24 -241 95 221 216 261 -114 -49 -147 277 77
3970G7m48N32j97k22L53l4l59P5K77n1J85M4k64l6p3K18j82j08K27L3J11k06R
$$ 77 -371 161 -36 -258 95 61 -298 -223 54 3 188 232 -32 -68 -141 77 -105 -213 14 47 158 -48 -39
3993c9k32L37k76N93l12j52l1LL19l3j62J12m28J40M30l40Qn9P9Q8M7Q0P0k78
$$ -39 -271 66 -210 383 71 -81 -112 -109 210 177 15 127 -301 -161 269 -71 -63 -122 -43 45 92 172 242 -36
4017c6k06L43N3m4k31k2J20mK46j55L2l15L12J6k05K59k13J96P8j55j1j20M5n2
$$ -36 -242 101 154 110 -121 -143 -23 -27 219 64 96 -219 93 109 -96 163 -50 146 224 69 58 -62 -17 -69
4041f9l0M71m36j47K77Kk18L64j71l89M59K13m00p8J15r7K09j62P9j05j34N9M33
$$ -69 -99 372 -64 -211 66 68 -150 214 43 -346 113 326 -74 -152 -37 -134 75 -87 -8 -113 -247 -188 245
4064B45l14O2j88mJ28L1K15n22l8J91L61K59k07m88L14N4j14P0r2Q8m56N85p9
$$ 245 -69 -7 -195 -199 -71 -40 175 -347 -385 -194 167 426 219 -269 45 99 -15 55 -37 51 -405 180 101
4087A01K33m63K58l91L26j14j59J10J28L33o5k32j58P8K37j20k12J29j80K77q1
$$ 101 334 -129 129 -262 64 -50 -209 -99 29 362 297 65 -93 -15 222 102 -110 19 -161 116 35
4108C5K98j3l27k17r0L38j23J54j60R2L05j87k66K2K41k79J52J25j40j85L5K89
$$ 35 333 320 -7 -224 -314 24 -99 55 -105 -13 292 105 -161 -139 102 -177 -25 100 -40 -225 -190 99
4130I9k29L43K9k90o6J49M4J40j13m05M96k28N7j37RO9K50j41l6J36j58j9M4q1
$$ 99 -130 213 242 -48 -114 35 79 219 106 -299 197 -31 26 -111 -102 -33 217 76 40 176 18 -1 43 -38
4154c8J27j33j45J1M39Mn1j18P2l52L18J58k48m78L96K84l55L2K37k85M09k14
$$ -38 89 -44 -189 -178 261 265 214 96 168 -184 134 292 44 -434 -38 246 -109 -77 160 -125 284 70
4176G0O3m13J57k00O03l26n9M5M6Jj66L22K1k21J16J8k32J65q6Rj7K44j13K6m55
$$ 70 133 -280 -123 -323 280 -46 -105 -60 -14 -13 -179 143 164 -57 59 77 -155 10 -76 -67 -84 160 47 73 -382
4201c82K7L67N2J12o15J79Q1L37N4p4l30J16o1J83K85m88k7L0J65M2J57l85J24
$$ -382 -355 12 64 176 -439 -260 -179 158 212 138 -192 -76 -137 46 331 -157 -184 -154 11 53 210 -175 -51
4224e1k76N10j35R2k80K30J4j45J8l6M8pJ46J6j42nn7P6J80l30R9K7j61L25Q8
$$ -51 -327 183 48 140 -140 90 104 -41 -23 -59 -11 -18 128 144 2 -3 -60 16 196 -134 -35 -8 -169 156 244
4249B44q4m25K94J10M4j19l84L7K36L29p2l85J30q3j47M29j16j77lM25J36n12
$$ 244 160 -265 29 139 183 64 -320 -283 -47 282 210 -175 -45 -128 -275 154 38 -139 -142 283 419 -93
4271i3Jj62J58J28J61r5l69K99j6J09R0j01j70J45P0n2o6k49J96o2qK47kj22j8
$$ -93 -92 -254 -96 32 193 98 -271 28 12 121 211 110 -60 85 155 103 37 -212 -16 -78 -86 161 159 37 19
4296A9J8J32K25j76m02K35P5K58m08J3k2r2L5M27l18m05L41k25P73K2m26k48J94
$$ 19 37 169 394 218 -184 51 126 384 -24 -11 -33 -125 -90 337 19 -386 -45 -270 503 525 99 -149 45
4319D5J68ol30L87m95K27J34j75j98L28L1k60L51k17l46J93K24k18R9K18j12k44
$$ 45 213 207 -123 264 -231 -4 130 -45 -243 85 116 -144 207 -10 -356 -163 61 -157 -58 160 48 -196
4341a96K59J93m26P1M8J91M5l11K30l50J92K2J61k28l0L09j64N8O2l12K14j15
$$ -196 63 256 -170 -99 -51 140 185 -126 104 -246 -54 -32 129 -99 -129 180 16 74 136 -176 38 -77
4363g7L1Q5j0N9k42J66j67J85O0k05n0p8K98j40Q6L36m47r9M08k73J51j17q5r
$$ -77 -46 39 29 88 -154 12 -155 30 90 -115 -165 -243 55 -85 1 337 -110 -209 199 -74 77 -40 -125 -134
4387a34K26l58K25j70J70Q6p1Q8o9j75K09J96j07k91J99K38q8m6l77J75J48R0
$$ -134 92 -266 -41 -211 -41 45 -26 62 -7 -182 27 223 116 -175 24 262 174 128 -249 -74 74 164
4409A64J8j12k49j23K16L26k37k52N4N92n25K20Q5m06J49L44o3l48j93M2K66j62
$$ 164 182 70 -179 -302 -86 240 3 -249 -195 397 -128 92 177 -229 -80 264 201 -147 -340 -298 -32 -194
4431a94L41l93K46l57L12k01L06P6L77p95N64p07m4Q21n37M51q34L12N59L16q08
$$ -194 147 -246 0 -357 -45 -246 60 136 513 -282 282 -425 -469 352 -185 266 -568 -256 303 619 -189
4452a89J68r48Q28l38N91j142J385l50O43l79p14M38Q40j083k27K85J35k10L50
$$ -189 -21 -969 -141 -479 112 -1030 355 5 648 269 -445 -7 833 -250 -477 -192 -57 -267 83
4471H3N21J39o55m53O20k1L20k98q23n76P63O71m71J83j83j35rM90k31M16n60
$$ 83 604 743 88 -365 255 234 554 256 -567 -1143 -380 291 -180 3 -180 -315 -324 166 -65 351 -209
4492b09K2J75J63m74L70j83N68j36m89R7J17N1k25J83k23j17N34N3k04m10M27
$$ -209 -187 -12 151 -323 47 -136 432 296 -193 -96 21 72 -153 30 -193 -310 224 277 73 -337 90
4513I0l03L49R5j99q7J5J19J74k12j95P3O9J50j72K66k28l96k63J069l52M40l41
$$ 90 -213 136 231 32 -55 -40 79 253 41 -154 -81 -12 138 -34 232 4 -392 -655 414 62 502 161
4535A61l44N06l81L73m36N9J00N8p7O2m9l60K50J33j1j04n2R2q5K02l9k26L19
$$ 161 -183 323 -58 315 -121 -62 38 96 19 81 32 -328 -78 55 44 -60 -112 -20 -105 97 58 -168 151
4558A51k93k3M35j96rJ26m86K03j42K08J26k88J69m24P75l0m16M96n70P06p57
$$ 151 -142 -165 270 74 65 191 -295 -92 -234 -26 100 -188 -19 -443 332 302 -114 382 -188 518 -239
4579b39K18j35k2P6J48j05j1K4K41Jq0j4O9J8R4j19M6k95Q3j22K29m08M70k0j6
$$ -239 -21 -156 -178 -102 46 -59 -70 -46 195 196 116 102 171 189 283 164 210 -85 -2 -124 105 -303 167 147 131
4604A31O4k40J82m17M65l66N2K49K4m73K62O4J30j53m1J69k44K04j10k48K67q8
$$ 131 195 -45 137 -280 185 -181 -129 120 144 -329 -67 -3 127 -26 -67 102 -142 62 -48 -296 -29 -117
4626a17j75M41Lm41M07k3O0k92L33k54k64N31k5m72J06K82J79l58L80l25k84J76
$$ -117 -292 149 152 -289 118 95 155 -137 196 -58 -322 209 184 -288 -182 100 279 -79 301 -24 -308 -132
4648a32K18k56J66J36m6j18J17K59l80Q8m6m2N2J29oo9R8L1p7J04l49K13k17L86
$$ -132 86 -170 -4 132 86 -32 85 344 -36 52 6 -36 16 145 139 70 168 199 122 226 -123 90 -127 259
4672B59L8m07J60J8J01k1O9k98j56M00k91M46j65j54k82L21k1j43K19k94J34J07
$$ 259 297 -110 50 68 169 148 217 -81 -237 163 -128 318 153 -1 -283 38 17 -126 93 -201 -67 40
4694D0k71M69n79J48M92j14M8k70mJ26m09L56K53n35J42J20qL1J31k10J22mj27
$$ 40 -231 238 -341 -193 299 185 233 -37 -41 85 -324 32 285 -250 -108 12 4 35 166 -44 78 74 -53
4717e3K8Oj7J98j59m8j60L6Q3R5j06L88k09J60l49L96n06K56k04K82Q8j55j60
$$ -53 -25 -19 -36 162 3 -45 -205 -169 -86 9 -97 291 82 242 -107 289 -217 39 -165 117 205 50 -110
4740a10K1R7L3L42l76M2k28K0K04J19k48K20l0J23k19j91K58j77J26O4J06k7k44
$$ -110 -89 8 41 383 7 49 -179 -159 45 164 -84 136 106 229 10 -181 77 -100 26 90 196 169 -75
4763g5j33L46O2l00L75m02k29L99O8o0O5k38J75mk25J71L65n76J58J83n9J5k21
$$ -75 -208 138 200 -100 275 -127 -356 43 111 51 116 -122 53 49 -176 -5 360 -216 -58 125 66 81 -140
4786a40J38j43M24j91j93L0n1J24J74k69K40k45j49K91j40J64j74J06P6k8j10
$$ -140 -2 -145 279 88 -105 -75 -126 -2 172 -97 143 -102 -251 40 -100 64 -110 -4 72 44 -66
4807f6j02L70j09l3k48R7O0O3J57j30J94l00j78J89K3J14q8J38J5J6P9k44J13
$$ -66 -168 202 93 60 -188 -91 -31 32 189 59 253 -47 -225 -36 -13 101 13 151 166 182 261 17 130
4830A30l10K15K91m19L92l80k78L99q0M27m31j58r0R2L60k72J52j55K54j52J29
$$ 130 -180 35 326 -93 299 -81 -359 40 -40 387 -44 -202 -292 -200 160 -112 40 -115 139 -13 116
4851A16k4J51k28J36m9j33K9K8j6J31k29M46l52J20Lj99rO4J79k29L35l33l35
$$ 116 92 243 15 151 102 -31 -2 26 10 141 -88 358 6 126 129 -70 -79 -15 164 -65 270 -63 -398
4874c98L61l4J7L67k90j46q9L36j31O6j91q7RK67q5ok18J31K57r4K62l99K17q7
$$ -398 -37 -71 -54 313 23 -123 -212 124 -7 59 -132 -219 -210 57 -28 -34 -252 -121 136 42 304 -95 122 35
4898C5K12m14L5N10m70r7L83l54R6k54L79r1J07L38m45p1L09o6j53J11J37k34
$$ 35 247 -167 -132 378 -92 -189 194 -160 -64 -318 61 -30 77 415 -30 -101 208 142 -11 100 237 3
4920CJ65k28J89N6j0k68L53k12J38j55N2J74l89K26j62l9n6j4M21J50l83k48J74
$$ 3 168 -60 129 185 175 -93 260 48 186 31 83 257 -132 94 -68 -107 -163 -177 244 394 11 -237 -63
4943f3L23j51j90j65L96k67J70k8K4k75N18l02q3J11j34K05j80L08k58J99n09
$$ -63 260 109 -81 -246 150 -117 53 25 49 -226 292 -10 -93 18 -116 89 -91 217 -41 158 -351
4964c51M79l4p8PQ5J02j02o9k17L08j28oL6k0j58L5K35k70J08L1L1O4j66L2Q4
$$ -351 128 94 16 23 108 210 108 39 -178 130 2 -4 32 12 -146 -111 124 -146 -38 -7 24 88 -78 -46 38
4989C8J56m13N0K35j22k1K17k54J17M9l6k9J33j74l0K44j69P6j93J17K58n8m17
$$ 38 194 -219 -169 66 -56 -77 140 -114 3 52 16 -13 120 -54 -84 160 -9 67 -126 -9 249 191 -226
5012b26M3R3j25K19k6j6K3k06J44N3j39k5M33k74L35l44J80K20l70K86kj73o9
$$ -226 -183 -90 -215 4 -22 -38 -15 -221 -77 -24 -163 -188 245 -29 306 -38 142 362 -8 278 276 103 34
5035C4k07J27j62L37l13M7J08j98J32J42m51K92J20K44k08p5K54l67n1J46J94
$$ 34 -173 -46 -208 129 -184 -137 -29 -227 -95 47 -404 -112 8 252 44 -31 223 -144 -195 -49 145
5056A45Jk2o0k04L53l17J38j35K62P8k52j18n1J82q4J26Jj80J53r6M13k46j19
$$ 145 146 124 64 -140 213 -104 34 -101 161 239 -13 -131 -182 0 -84 42 43 -137 16 -80 333 87 -32
5079c2k2j01M04l73O0J22l58pM58q3kK87k99k46J15J20j02J58j14r5k03M46L9
$$ -32 -54 -155 249 -124 -64 58 -300 -307 151 68 66 353 54 -192 -77 43 -59 99 -15 -110 -313 133 172
5102A72l66K66J43k70r3L03l12J11J33k08j39O08j15j21r7r9l0pk61L06J53r8
$$ 172 -194 72 215 -55 -148 155 -157 -46 87 -121 -260 348 233 112 15 -84 -114 -121 -382 -76 77 -21
5124b1l4J02j28L07mj94m4K34l74K49j69j47M0K00jK29o3l30J32km2P1J85k49
$$ -21 -55 47 -81 226 222 28 -16 218 -156 93 -76 -223 -183 17 16 245 182 -148 -16 -18 -60 11 196 -53
5148e3j6J5Q3k75K79J70k04%j78L67k48k22N78p0k60j44M6L65o8P9l24M0J92k80
$$ -53 -69 -54 29 -246 33 203 -1 -1 -179 188 -60 -282 296 226 -34 -178 -132 233 165 244 -80 -40 152 -128
5172a28K83J72j07m53J92J98k78M26k14J31k00k50J43j1M11l63N17m08q3m40k3
$$ -128 155 327 220 -233 -41 157 -121 305 91 222 22 -228 -85 -96 315 -48 469 61 -22 -462 -485
5193d85L40k28j52M70l6M01j020J089m73j36L48O0q3k30K99m6R17j023M0L5j56
$$ -485 -145 -373 -525 -55 -91 310 -710 379 -94 -230 118 178 95 -135 164 118 1035 12 52 87 -69
5214f9Pm81m08Q72J26r1k85L05J76l95O67q35J51r94J013l1L85j6J23j275P84
$$ -69 -62 -543 -951 -79 47 -44 -329 -24 152 -243 424 -411 -260 -1254 -241 -272 113 97 220 -1055 -271
5235b71N91l14J38n4j78k15N48j25Q3o34O70m48K49k9o7J00K22k52K32j72k85
$$ -271 320 6 144 90 -88 -303 245 120 203 -431 239 -209 40 11 -56 44 266 14 246 74 -211
5256b11K57M1L5J5J7j81j98J5L25j04l9J64q8L0Q8k22p6L73l48N1r7K23M0J27
$$ -211 46 87 122 137 154 -27 -225 -210 115 11 -28 136 48 78 166 -56 -132 241 -107 -56 -153 70 110 237
$$ [...]
8191B71
##END NTUPLES=NMR FID
##END=
