##TITLE=1H_CA-8705
 DMSO, 8 sc, 
 24.3.2020
##JCAMPDX= 6.0         $$ Bruker NMR JCAMP-DX V2.0
##DATA TYPE= NMR FID
##DATA CLASS= NTUPLES
##ORIGIN= UXNMR, Bruker Analytische Messtechnik GmbH
##OWNER= root
$$ XWIN-NMR		Version 3.5
$$ Tue Mar 24 14:24:20 2020 Russian Standard Time (UT+4h)  she@DPX200
##.OBSERVE FREQUENCY= 200.1315
##.OBSERVE NUCLEUS= ^1H
##.DELAY= (6, 6)
##.ACQUISITION MODE= SIMULTANEOUS
##.ACQUISITION SCHEME= undefined
##.AVERAGES= 8
##.DIGITISER RES= 18
##SPECTROMETER/DATA SYSTEM= spect
##.PULSE SEQUENCE= zg30
##.SOLVENT NAME= CD3CN
##.SHIFT REFERENCE= (INTERNAL, CD3CN, 0, 15.7039)
##AUDIT TRAIL= $$ (NUMBER, WHEN, WHO, WHERE, WHAT)
$$ ##TITLE= Audit trail, XWIN-NMR		Version 3.5
$$ ##JCAMPDX= 5.01
$$ ##ORIGIN= Bruker BioSpin GmbH
$$ ##OWNER= she
$$ F:/spectra/data/she/nmr/H-F/1/audita.txt
$$ ##AUDIT TRAIL=  $$ (NUMBER, WHEN, WHO, WHERE, WHAT)
(   1,<2020-03-24 14:23:10.06 +0400>,<she>,<DPX200>,
      <created by zg, POWCHK disabled, PULCHK disabled
       configuration hash MD5:
       00 E9 B6 7A A2 85 ED C7 34 08 36 98 17 FE 4E 26
       data hash MD5: 16K
       DB EE 3D A1 4D CE 4F A2 03 01 CD CC EB 36 B6 D0>)
$$ ##END=
$$ 
$$ hash MD5
$$ FB 6E 35 4D 03 37 12 F5 AA 3F 8E 6E BF 73 93 48
##$RELAX= 
##$RELAX= 
##$RELAX= 
##$RELAX= 
##$RELAX= 
##$RELAX= 
$$ Bruker specific parameters
$$ --------------------------
##$DU= <F:/spectra>
##$EXPNO= 1
##$NAME= <H-F>
##$PROCNO= 1
##$TYPE= <nmr>
##$USER= <she>
##$AMP= (0..31)
100 100 100 100 100 100 100 100 100 100 100 100 100 100 100 100 100 100 
100 100 100 100 100 100 100 100 100 100 100 100 100 100 
##$AQSEQ= 0
##$AQ_mod= 1
##$AUNM= <au_zg>
##$AUTOPOS= <>
##$BF1= 200.13
##$BF2= 200.13
##$BF3= 200.13
##$BF4= 200.13
##$BF5= 200.13
##$BF6= 200.13
##$BF7= 200.13
##$BF8= 200.13
##$BYTORDA= 1
##$CFDGTYP= 0
##$CFRGTYP= 5
##$CHEMSTR= <none>
##$CNST= (0..31)
1 1 145 1 1 1 1 1 1 1 1 1 1 1 1 1 1 1 1 1 1 1 1 1 1 1 1 1 1 1 1 1 
##$CPDPRG= <>
##$CPDPRG1= <>
##$CPDPRG2= <>
##$CPDPRG3= <>
##$CPDPRG4= <mlev>
##$CPDPRG5= <mlev>
##$CPDPRG6= <mlev>
##$CPDPRG7= <mlev>
##$CPDPRG8= <mlev>
##$CPDPRGB= <>
##$CPDPRGT= <>
##$D= (0..31)
0 1.2 0 0 0 0 0 0 0 0.06 0 0.03 0 0 0 0 0.0002 0 0 0 0 0 0 0 0 0 0 0 0 
0 0 0 
##$DATE= 1585045389
##$DBL= (0..7)
120 120 120 120 120 120 120 120 
##$DBP= (0..7)
150 150 150 150 150 150 150 150 
##$DBP07= 0
##$DBPNAM0= <>
##$DBPNAM1= <>
##$DBPNAM2= <>
##$DBPNAM3= <>
##$DBPNAM4= <>
##$DBPNAM5= <>
##$DBPNAM6= <>
##$DBPNAM7= <>
##$DBPOAL= (0..7)
0.5 0.5 0.5 0.5 0.5 0.5 0.5 0.5 
##$DBPOFFS= (0..7)
0 0 0 0 0 0 0 0 
##$DE= 6
##$DECBNUC= <off>
##$DECIM= 24
##$DECNUC= <off>
##$DECSTAT= 4
##$DIGMOD= 1
##$DIGTYP= 9
##$DL= (0..7)
0 120 120 120 120 120 120 120 
##$DP= (0..7)
150 150 150 150 150 150 150 150 
##$DP07= 0
##$DPNAME0= <>
##$DPNAME1= <>
##$DPNAME2= <>
##$DPNAME3= <>
##$DPNAME4= <>
##$DPNAME5= <>
##$DPNAME6= <>
##$DPNAME7= <>
##$DPOAL= (0..7)
0.5 0.5 0.5 0.5 0.5 0.5 0.5 0.5 
##$DPOFFS= (0..7)
0 0 0 0 0 0 0 0 
##$DQDMODE= 0
##$DR= 18
##$DS= 0
##$DSLIST= <SSSSSSSSSSSSSSS>
$$ [...]
##$SUBNAM2= <"">
##$SUBNAM3= <"">
##$SUBNAM4= <"">
##$SUBNAM5= <"">
##$SUBNAM6= <"">
##$SUBNAM7= <"">
##$SUBNAM8= <"">
##$SUBNAM9= <"">
##$SW= 24.9337058887773
##$SWIBOX= (0..15)
0 0 2 0 0 0 0 0 0 0 0 0 0 0 0 0 
##$SW_h= 4990.01996007984
##$TD= 16384
##$TD0= 1
##$TE= 0
##$TE2= 300
##$TE3= 300
##$TEG= 300
##$TL= (0..7)
0 120 120 120 120 120 120 120 
##$TP= (0..7)
150 150 150 150 150 150 150 150 
##$TP07= 0
##$TPNAME0= <>
##$TPNAME1= <>
##$TPNAME2= <>
##$TPNAME3= <>
##$TPNAME4= <>
##$TPNAME5= <>
##$TPNAME6= <>
##$TPNAME7= <>
##$TPOAL= (0..7)
0.5 0.5 0.5 0.5 0.5 0.5 0.5 0.5 
##$TPOFFS= (0..7)
0 0 0 0 0 0 0 0 
##$TUNHIN= 0
##$TUNHOUT= 0
##$TUNXOUT= 0
##$USERA1= <user>
##$USERA2= <user>
##$USERA3= <user>
##$USERA4= <user>
##$USERA5= <user>
##$V9= 5
##$VALIST= <valist>
##$VCLIST= <CCCCCCCCCCCCCCC>
##$VD= 0
##$VDLIST= <DDDDDDDDDDDDDDD>
##$VPLIST= <PPPPPPPPPPPPPPP>
##$VTLIST= <TTTTTTTTTTTTTTT>
##$WBST= 1024
##$WBSW= 4
##$XGAIN= (0..3)
0 0 0 0 
##$XL= 0
##$YL= 0
##$YMAX_a= 256975
##$YMIN_a= -110546
##$ZGOPTNS= <>
##$ZL1= 120
##$ZL2= 120
##$ZL3= 120
##$ZL4= 120
##$ABSF1= 10
##$ABSF2= 0
##$ABSG= 5
##$ABSL= 3
##$ALPHA= 0
##$AQORDER= 0
##$ASSFAC= 0
##$ASSFACI= 0
##$ASSFACX= 0
##$ASSWID= 0
##$AUNMP= <proc_1d>
##$AZFE= 0.1
##$AZFW= 0.1
##$BCFW= 1
##$BC_mod= 2
##$BYTORDP= 1
##$COROFFS= 0
##$CY= 11.3945322036743
##$DATMOD= 1
##$DC= 2
##$DFILT= <>
##$DTYPP= 0
##$F1P= 16.9975609425685
##$F2P= -3.02152046262296
##$FCOR= 0.5
##$FTSIZE= 0
##$FT_mod= 4
##$GAMMA= 1
##$GB= 0.15
##$INTBC= 1
##$INTSCL= 1
##$ISEN= 128
##$LB= 0.24
##$LEV0= 0
##$LPBIN= 0
##$MAXI= 10000
##$MC2= 0
##$MEAN= 0
##$ME_mod= 0
##$MI= 1.114404
##$NCOEF= 0
##$NC_proc= 0
##$NLEV= 6
##$NOISF1= 3.799351
##$NOISF2= 2.8
##$NSP= 1
##$NTH_PI= 0
##$NZP= 0
##$OFFSET= 15.70392
##$PC= 1
##$PHC0= -9786.344
##$PHC1= 7.000821
##$PH_mod= 1
##$PKNL= yes
##$PPARMOD= 0
##$PSCAL= 0
##$PSIGN= 0
##$REVERSE= no
##$SF= 200.130013532006
##$SI= 16384
##$SIGF1= 3
##$SIGF2= 2
##$SINO= 400
##$SIOLD= 16384
##$SREGLST= <1H.CDCl3>
##$SSB= 0
##$STSI= 0
##$STSR= 0
##$SW_p= 3612.71676300578
##$SYMM= 0
##$S_DEV= 0
##$TDeff= 0
##$TDoff= 0
##$TI= <>
##$TILT= no
##$TM1= 0
##$TM2= 0
##$TOPLEV= 0
##$USERP1= <user>
##$USERP2= <user>
##$USERP3= <user>
##$USERP4= <user>
##$USERP5= <user>
##$WDW= 1
##$XDIM= 8192
##$YMAX_p= 0
##$YMIN_p= 0
$$ End of Bruker specific parameters
$$ ---------------------------------
##NTUPLES= NMR FID
##VAR_NAME=  TIME,          FID/REAL,        FID/IMAG
##SYMBOL=    X,             R,               I
##VAR_TYPE=  INDEPENDENT,   DEPENDENT,       DEPENDENT
##VAR_FORM=  AFFN,          ASDF,            ASDF
##VAR_DIM=   8192,          8192,            8192
##UNITS=     SECONDS,       ARBITRARY UNITS, ARBITRARY UNITS
##FACTOR=    0.0002004,     1,               1
##FIRST=     0,             0,               0
##LAST=      1.6414764,     0,               0
##MIN=       0,             -110546,         0
##MAX=       1.6414764,     256975,          0
$$ Real data points
##PAGE= N=1
##DATA TABLE= (X++(R..R)), XYDATA
0@%%%%%%%%qJ6j6J6j6K4l2L3m1N2o0P2q7J01j16J34j53J75k00K28k59K94l34L75
$$ 0 0 0 0 0 0 0 0 0 -8 8 -8 8 -8 16 -16 17 -24 28 -32 40 -47 54 -62 72 -81 94 -106 122 -137 157 -177 198
32A98m21M72n26N87o54P27q08Q95r92J099j216J348j493J655j837K042k276K546
$$ 198 -223 249 -277 310 -344 383 -425 470 -522 577 -639 709 -784 871 -966 1076 -1200 1346
50A346k863L238l690M251m967N917p251R277j2757K0399o9830N5469J03019q6612
$$ 1346 -1517 1721 -1969 2282 -2685 3232 -4019 5258 -7499 12900 -56930 -1461 101558 14946
64A4946r1282l4210O8760O7444q038q6313k8831N6173P0529O792m2424n5986p73
$$ 14946 -76336 -110546 -41786 25658 17620 -68693 -97524 -41351 29178 35970 -6454 -62440 -63213
77f3213O0206N0229k0641m2010j8064J4459L7317L4216j5055m2576j2074K5693
$$ -63213 -3007 47222 26581 -15429 -33493 -19034 18283 52499 37444 -5132 -17206 8487
89H487L1070K3319j0485m6089k2598M1511N2383P303l9621m9855k965O7120N9326
$$ 8487 39557 62876 52391 6302 -16296 25215 77598 84901 45280 -4575 -7540 59580 118906
102A18906l2931q0267k2543N5108O9933R172p0406o9754K7566Q9867L1932n6069
$$ 118906 85975 5708 -16835 38273 108206 117378 46972 -22782 4784 94651 126583 70514
114G0514o9469j1268N8338O5807j2790p9294m0297M0206N7004J4254l8189n5898
$$ 70514 1045 -10223 48115 113922 101132 21838 -18459 21747 78751 93005 54816 -1082
126a082j0771N1113M1905k0985m5590k1437J0698L2475K2391k1251m0333j0365
$$ -1082 -11853 39260 81165 60180 14590 -6847 3851 36326 58717 37466 -2867 -13232
138a3232J7328K0696J5278j1422m2323k2049K9935M0075M159l3334m4983p712
$$ -13232 4096 24792 40070 28648 -13675 -35724 -5789 34286 38445 5111 -39872 -47584
150d7584N2837M8606k7005o7038k2898M0135N7207J2985n5835o2770J6550P3052
$$ -47584 5253 53859 26854 -40184 -63082 -22947 34260 47245 -8590 -71360 -54810 18242
162A8242L2808l8817n9274j8629M5532O3589j746o6631m0380L1177N4881K0684
$$ 18242 51050 12233 -47041 -65670 -20138 43451 41705 -24926 -65306 -34129 20752 41436
174D1436l0615n2415r329M9506M0500j5794l8577j7979J2556L1145K1325j6906
$$ 41436 10821 -41594 -50923 -1417 39083 23289 -15288 -33267 -20711 10434 31759 14853
186A4853l1865o170J5739J9090J5197p029l4218j8162K5358L5112O652k5773l8479
$$ 14853 -17012 -23182 -7443 11647 26844 19815 -14403 -32565 -7207 27905 34557 8784 -29695
199b9695q411M4578M3565j9512n4942k3141K8948M9564J7953m5276n8537P117
$$ -29695 -38106 6472 50037 30525 -24417 -47558 -18610 30954 48907 3631 -54906 -47789
211d7789O1512L4030k8533n5351k5232L7026O0025K818o0399m2092K3030M9522
$$ -47789 13723 47753 19220 -36131 -61363 -24337 35688 38506 -21893 -63985 -40955 8567
223H567K1735k7366n0340j1766M2391L6365j3658l3732j8419O539K7203K1287
$$ 8567 30302 2936 -47404 -59170 -16779 19586 5928 -27804 -46223 -39684 -12481 8806
235H806j3815k9687q599J2742J8358J5658o963l2178j4883K3800K9981N781k0594
$$ 8806 -5009 -34696 -43295 -30553 -12195 3463 -3500 -35678 -50561 -26761 3220 9001 -11593
248a1593l1191p099L7261L7847j3164m2838k0062K1071M3747K1545l3558n1503
$$ -11593 -42784 -49883 -12622 25225 12061 -30777 -50839 -29768 13979 35524 1966 -49537
260d9537K621N3810L5192j8122m7375k5808L1726N7271Q268n0629l7656J7680
$$ -49537 -46916 6894 42086 23964 -23411 -49219 -17493 39778 48046 -2583 -40239 -22559
272b2559M4527K5583j8938m5764j3584L7233L6383o068k8483k0990L570K7724
$$ -22559 21968 47551 28613 -17151 -30735 6498 42881 36813 8330 -12660 -9090 18634
284A8634K4819j3584k9406q764J3312K0619J2741j0159k8924j0259K1940K3682
$$ 18634 43453 29869 463 -8301 5011 25630 38371 28212 -712 -10971 10969 34651
296C4651J699j6448k4840p760K8127L0612r091l6069j9443J2424L5512K1121k7361
$$ 34651 36350 19902 -4938 -12698 15429 46041 36950 881 -18562 -6138 29374 50495 23134
309B3134m6614l449M3094L2137j3383m2032k7855K3271N1161Q235m4041l5724
$$ 23134 -23480 -26929 16165 48302 34919 -7113 -34968 -11697 39464 47699 3658 -32066
321c2066J0099L6507K5219j4199m2793j7271K9741L4307j697k7384k3628K05K7566
$$ -32066 -21967 14540 39759 25560 -17233 -34504 -4763 29544 27847 463 -23165 -22960 4606
334D606K4649j3366k9013r031J2292J9732J0169j0870k5535q679J9406J9336L306
$$ 4606 29255 15889 -13124 -22155 -9863 9869 20038 9168 -16367 -25046 -5640 13696 17002
347A7002j3383k3745q832K5142K8406m713l1775k0341R081L4981K1672k5292m3322
$$ 17002 3619 -20126 -28958 -3816 24590 19877 -11898 -32239 -23158 11823 33495 8203 -35119
360c5119l011L9032K9244r174l6857k7181J8190M6757J1025l6470l3673N056L2169
$$ -35119 -38130 902 30146 20972 -15885 -43066 -24876 21881 32906 -3564 -37237 -32181 -12
373a2K6816r247l9230j9594K5337L3936K176k3989k4414k542K7680K4628j1839
$$ -12 26804 17557 -21673 -41267 -15930 18006 20182 -3807 -28221 -30763 -3083 21545 9706
386I706k8488q794J1627J8463J1309r223k4175q014J6815J8449M472j1447k2890
$$ 9706 -18782 -27576 -15949 2514 13823 4600 -19575 -27589 -10774 7675 12147 700 -22190
399b2190q468K5043K6770o815k7291j8138Q825L0999K0694k2202l7671k292L2162
$$ -22190 -30658 -5615 21155 14340 -12951 -31089 -22264 8735 29429 7227 -30444 -32736 -574
412e74K6328m941l1233k5485J3793M1395J2938k9837k9482p79K8450K8483m435
$$ -574 25754 20813 -10420 -35905 -22112 19283 32221 2384 -27098 -27877 573 29056 24621
425B4621l7426k1176K2136L3206N302k1373k5536l557K6686K4642r845k6251j0420
$$ 24621 -12805 -33981 -11845 21361 26663 5290 -20246 -23803 2883 27525 17680 -8571 -18991
438a8991R898J8385J2563r408k3409p656J6118J7639M167j1300k2735n935K3461
$$ -18991 -9093 9292 21855 12447 -10962 -18618 -2500 15139 19306 8006 -14729 -20664 2797
451B797K3512p404k4705j4727P540K5891J7619j8170l1976l998K6496K3135j250
$$ 2797 26309 18905 -5800 -20527 -12987 12904 30523 12353 -19623 -23621 2875 26010 24760
464B4760k5107k6241R689L5866J5183k4417k8022l784K3245K9460j856l3955k2148
$$ 24760 -347 -26588 -16899 18967 34150 9733 -18289 -22073 1172 30632 28776 -5179 -27327
477b7327J9018L1033O996j8483k4888n076K4562K3986p351k4125j0896P065J8158
$$ -27327 -8309 22724 29720 11237 -13651 -18727 5835 29821 22470 -1655 -12551 -5486 12672
490A2672J4568q672k4662p387J5764J7995M359j2165k1555n091K2329K0491o632
$$ 12672 27240 18568 -6094 -13481 2283 20278 24637 12472 -9083 -14174 8155 28646 22014
503B2014k1510j3938M823K3574J6604j5414k9504n599K1513K2413J453k4021k6668
$$ 22014 504 -13434 -8611 14963 31567 16153 -13351 -18950 2563 24976 26429 2408 -24260
516b4260O762L4043J5094k1328k8833o096K1402K7148r85l2142k0817J4822K6536
$$ -24260 -17498 16545 31639 10311 -18522 -24618 -3216 23932 22947 -9195 -30012 -15190 11346
529A1346P406j4619k3656q068J9593K2888m456k1432j3607L552J7564J5574p978
$$ 11346 18752 4133 -19523 -27591 -7998 14890 10434 -10998 -24605 -21053 -3489 12085 4107
542D107k4797q682J4845J7542M116j1650k0884m457K0747J8732n829j9030j2830
$$ 4107 -20690 -29372 -14527 3015 7131 -4519 -25403 -29860 -9113 9619 3790 -15240 -28070
555b8070L808K1765J6904j3142k7222n268J9512K1458K857k0970k4529P062L1700
$$ -28070 -24262 -2497 14407 1265 -25957 -31225 -11713 9745 12602 -8368 -32897 -25835 5865
568E865J4297j7575k4662n861J8518K5941J892k7280j8818J1730K3413J1247r895
$$ 5865 20162 2587 -22075 -27936 -9418 16523 18415 -8865 -27683 -15953 7460 18707 8812
581H812k2492j0310J8247K4487o82j9852j5404K417J9078J7379q092k3848q136
$$ 8812 -13680 -23990 -5743 18744 18062 -1790 -17194 -14777 4301 21680 13588 -10260 -18396
594a8396J4520J6818M515j1429j8884m023J8780J6524n034j6234j2712K044J9525
$$ -18396 -3876 12942 17457 6028 -12856 -16879 1901 18425 13391 -2843 -15555 -13511 6014
607F014J5695j1873k4902n642J6562J8751L575j9619k2493N017K6546J2732j4320
$$ 6014 21709 9836 -15066 -20708 -4146 14605 18180 -1439 -23932 -18915 7631 20363 6043
620F043k1097p950J3421K3794M299k3295j9787P230K0980J3115p021k2980j1880
$$ 6043 -15054 -23004 -9583 14211 18510 -4785 -24572 -17342 3638 16753 9732 -13248 -25128
633b5128J6938K3975O19j8978j5022J458J8881J7383p248k2367p308J3640J5280
$$ -25128 -8190 15785 16404 -2574 -17596 -16138 2743 20126 12878 -9489 -16797 -3157 12123
646A2123O079q739j7821m885J7861J7459k704j4764j2718K130K0308J6099j1018
$$ 12123 18202 9463 -8358 -13243 4618 22077 19373 4609 -8109 -5979 14329 30428 19410
659A9410k2449m740J5481J7979M370j6160k0585L829K4124J2568j0892j8566q790
$$ 19410 -3039 -7779 7702 25681 30051 13891 -6694 -2865 21259 33827 22935 4369 -4421
672d421J0881K2627N549k0304j9232M592J8921J3420o037k1760j3048J4311K2047
$$ -4421 6460 29087 34636 14332 -4900 -308 18613 32033 25996 4236 -8812 5499 27546
685B7546qj6797j4688o13J5124J5201n893k1103q755Q664J3854O725q860j9369
$$ 27546 27538 10741 -3947 -4560 10564 25765 19872 -1231 -9986 -1322 12532 19257 10397 -8972
699h972p065J5749J6035k813j6331j4284R43J8708J3746j1997k1931m949J3172
$$ -8972 -16037 -288 15747 12934 -3397 -17681 -16738 1970 15716 3719 -18212 -23161 -9989
712i989J5040L431j5303j9369K045K0434J1451q417j7675j0111Q813K1318O546
$$ -9989 5051 8482 -6821 -26190 -24145 -3711 7740 -677 -18352 -28463 -19650 1668 8214
725H214j8398j7845L134J7177J3431l655j9701j2010J2861K0459K696j3003j3578
$$ 8214 -10184 -28029 -24895 -7718 5713 2058 -17643 -29653 -16792 3667 6363 -6640 -20218
738b0218k183J4283J7523k606j8039r390P998J5111R826o771j9178n633J6933
$$ -20218 -22401 -8118 9405 6799 -11240 -20630 -12632 2479 12305 5534 -13644 -19277 -2344
751b344J6248j129j4273j1897K222J7864J2962r302j7763l858J0862J3989N507
$$ -2344 13904 12775 -1498 -13395 -11173 6691 19653 10351 -7412 -11270 -408 13581 19088
764A9088j2244j7416P69J8566J1495n787j5479j1035P862K0259O674j7019j6733
$$ 19088 6844 -10572 -9803 8763 20258 14471 -1008 -12043 -4181 16078 22752 5733 -11000
777a1000J640J4704J3150k989j8358j2691R920J7810L922j1733j4465m483J2436
$$ -11000 -9360 5344 18494 15505 -2853 -15544 -5624 12186 16108 4375 -10090 -14573 -2137
790b137J6802k295j8680j0762O267J3828R142p552j8965o312J5196J4228k176
$$ -2137 14665 12370 -6310 -17072 -10805 3023 12165 4613 -14352 -20664 -5468 8760 6584
803F584j2574j1688M38J5440J2085p825j6505n412Q062J3826O862j0701j8533
$$ 6584 -5990 -17678 -17240 -1800 10285 2460 -14045 -19457 -11395 2431 9293 -1408 -19941
816a9941k01J7735J1981m961j4637r865O454J9579O770j4580j4922J508J2746
$$ -19941 -20142 -2407 9574 4613 -10024 -19889 -13435 6144 12914 -1666 -16588 -15080 -2334
829b334J2933o38j5567j1644Q655J7245M836q730j1571o052J0701J7279n43j5727
$$ -2334 10599 9961 -5606 -17250 -8595 8650 13486 4756 -6815 -12867 -2166 15113 14570 -1157
843a157j0318N619J3702J0037o603j6550n542J2762J3797n8j0373j1980j032J5042
$$ -1157 -11475 -5856 7846 17883 11280 -5270 -10812 1950 15747 15689 5316 -6664 -7696 7346
857G346J2793o638j6208o415P460J3998P051j1517j7535q8J6297J0580n099j3443
$$ 7346 20139 13501 -2707 -9122 -1662 12336 19387 7870 -9665 -9753 6544 17124 12025 -1418
871a418j0275N487J7232N932j3165j3209q35J0010J1760J211j4901j2965O265
$$ -1418 -11693 -6206 11026 16958 3793 -9416 -10251 -241 11519 12730 -2171 -15136 -8871
884h871J4834N827o999j3771p167J0777J6203j75j5646j0236M154J1812R817n049
$$ -8871 5963 11790 4791 -8980 -16147 -5370 10833 10658 -4988 -15224 -11070 742 10559 5510
898E510j6337o308J1213J3132Q46r394j1716k315J4485J2975o108j4757o409P131
$$ 5510 -10827 -17135 -5922 7210 8056 -1338 -13054 -15369 -884 12091 5983 -8774 -15183 -8052
912h052J3343O681j0127j6063O16J4715R375k711j1282r571L989J5815O796r910
$$ -8052 5291 11972 1845 -14218 -13602 1113 10488 7777 -3505 -13076 -9087 6728 13524 3614
926C614j2515j989Q733J3272K927j4005j3380N686J4984O933o414j3363o676J0791
$$ 3614 -8901 -10890 -2157 11115 14042 37 -13343 -7657 7327 14260 7846 -5517 -12193 -1402
940a402J5697m33j3938r267L085J0987R945l954j4982o999J0074J2114K326q272
$$ -1402 14295 13862 -76 -9343 -6258 4729 14674 10720 -4262 -11261 -1187 10927 13253 4981
954D981j2472l089J3521J2634n454j4026o057N570J2149O800r234j4905n69J2030
$$ 4981 -7491 -10580 2941 15575 10121 -3905 -9962 -4392 7757 14557 5323 -9582 -10151 1879
968A879R516j767r926j0729K512J5386O928r101j2599l071Q096J2966K346j3695
$$ 1879 11395 9628 -298 -11027 -8515 6871 13799 4698 -7901 -10972 -2876 10090 12436 -1259
982a259j2064N171J3666N394n241j2137o493R020J3417P42j1547q869J077R225
$$ -1259 -13323 -8152 5514 10908 5667 -6470 -12963 -3943 9474 10216 -1331 -10200 -9123 102
996A02J0866k162j4667p839Q700J1887L614p650j2959k798J2976J2557n048j3241
$$ 102 10968 8806 -5861 -13700 -5000 6887 10501 2851 -10108 -12906 70 12627 7579 -5662
1010e662n939M617J1586P376q237j4044j214J1132R206o31r241j0974K173J4535
$$ -5662 -11601 -6984 4602 11978 3741 -10303 -11517 -385 8821 8190 -1051 -12025 -9852 4683
1024D683P143q337j1714l335P543J2159K584j2436j1184M281J2039N628l698j0432
$$ 4683 11826 3489 -8225 -11560 -4017 8142 10726 -1710 -12894 -8613 3426 9054 5356 -5076
1038e076p117O703J3384J739r241r364r91Q922J1408j770j4100p648Q026J1375
$$ -5076 -12193 -5490 7894 9633 392 -8972 -9963 -1041 10367 8597 -5503 -13151 -5125 6250
1052F250L748o881j2068k867J2303J0864l977j1168n926L496J0197P932o913j3109
$$ 6250 9998 3117 -8951 -11818 485 11349 7372 -3796 -9722 -6226 3971 11903 4990 -8119
1066h119k208R679R102P01q341j1377J649J4385O916p377j1106l340O478J1187
$$ -8119 -10327 -648 8454 9155 814 -10563 -8914 5471 12387 5010 -6096 -9436 -2958 8229
1080H229L485j1316j0934L397J0274O478k102j0085q546O234J3533K330r732r125
$$ 8229 11714 398 -10536 -7139 3135 9613 7511 -2574 -11120 -4886 8647 10977 1245 -7880
1094g880j071Q898J0984j501j4302o684P138J0588L428o007j1105l074J0323R918
$$ -7880 -8951 -53 10931 9430 -4872 -11556 -4418 6170 9598 3591 -7514 -10588 -265 9653
1108I653k525r390o438J138J0022Q268n367j3018k816Q309R395J233q263j0994
$$ 9653 7128 -2262 -8700 -7562 2460 10728 5361 -7657 -10473 -2164 7231 8464 201 -10793
1122a0793J793J2566P681p262q943m442M897J1689K832q975j0117J963R277O794
$$ -10793 -9000 3566 11247 3985 -4958 -9400 -4503 7186 10018 1043 -9074 -7111 2166 8960
1136H960j147j0125q301N788J3010K870q890q667j577Q374J0622j331j2060o559
$$ 8960 7813 -2312 -10613 -4825 8185 11055 2165 -6502 -8079 295 10917 9586 -2474 -9033
1150i033N813R122M222m219j0428m504R256J0062j061q916p147P62R759Q885n516
$$ -9033 -3220 5902 10124 5905 -4523 -9027 229 10291 9230 314 -6833 -6071 3688 12573 7057
1165G057j2976l129Q171Q969J668q177j0064M91J1627O625n521q681m434L618
$$ 7057 -5919 -9048 -877 8092 9760 1583 -8481 -7990 3637 10262 4741 -3940 -8374 -4756
1179d756J0350M363q732j0584J148P951P271k84r888q698N221J1915K604p143
$$ -4756 5594 9957 1225 -9359 -8211 -260 7011 6727 -3161 -11859 -6638 5277 7881 738
1193G38q783k040P317J0144m98j1316o588M342Q295N059l356j0598m696Q649J0206
$$ 738 -8045 -10085 -2768 7376 6878 -4438 -11026 -6684 1611 6670 3314 -7284 -11980 -3331 6875
1208F875p78q082p296N42R946P912m963j1184k457P208P971J985o361r865L36
$$ 6875 6097 -1985 -9281 -8739 1207 9119 4156 -7028 -9485 -2277 5694 7679 1318 -8547 -8211
1223h211J0840O240l196q008n294K920J0926N326q202j0484N29Q572P567n28r308
$$ -8211 2629 8869 5673 -2335 -7629 -4709 6217 11543 3341 -7143 -6614 1958 9525 8997 -311
1238c11q412N031J1668K455o378p607k272N921J0009l14r578o849L016Q713M864
$$ -311 -8723 -3692 7976 10431 4053 -3554 -5826 95 10104 9790 212 -6637 -3621 5092 9956
1253I956k743j0627m600P611R403m32p872o460n25Q092Q852m848j0535l029N641
$$ 9956 7213 -3414 -8014 -403 9000 8568 696 -5764 -6289 1803 10655 5807 -4728 -7757 -2116
1268b116O644L350n663r539j085Q627P101k572p803o384K238J0878N185q345r617
$$ -2116 4528 7878 2215 -7324 -8409 218 7319 4747 -3056 -9440 -7202 3676 8861 516 -9101
1283i101k04P658P367l41r014p781M455J0251K571n222p130l378N625R704Q87
$$ -9101 -9305 -1647 5720 5379 -3635 -11416 -6961 3290 5861 639 -6491 -9869 -4244 5460 6347
1298F347r346o787K645P564N806k141j0067m808Q137Q659p6o444o673p1O660Q595
$$ 6347 -2999 -9786 -7141 423 6229 4088 -5979 -10787 -2650 6009 5933 -511 -7184 -7255 -595 8000
1314H000k607r920l033M040P482M090m508r963j324Q996P365k213p285o267J800
$$ 8000 5393 -4527 -7560 -3520 3962 8052 3544 -6419 -7743 1253 8618 6405 -880 -7147 -5347
1329e347J0913M691p311q686P0N842O518J271p808p947L097Q974L586l914o966
$$ -5347 5566 10257 2946 -5740 -5670 172 6690 7961 153 -7794 -4697 4277 7863 3949 -3017
1344c017m451M522R869J338r022p036K290O614O330k459r545n147O604Q528J14
$$ -3017 -7468 -2946 6923 8261 -761 -7797 -5507 1107 7437 4978 -4567 -9714 -3110 5418 5532
1359E532n519o793j265O951P730k894q645l755L613O664M381m572r961j477R118
$$ 5532 13 -6780 -8045 -1094 6636 3742 -4903 -8658 -5045 1619 6000 1428 -8533 -10010 -892
1374h92O005j503o760n929J676R498M931o244p789r04M895O981K235p131q360
$$ -892 5113 3610 -3150 -9079 -7403 2095 7026 782 -7007 -7911 -3016 3965 6200 -931 -9291
1389i291K379R055M153k949p313m633N022R841J369q462n933J724O487N639j572
$$ -9291 -6912 2143 6296 3347 -3966 -8599 -3577 6264 7633 -829 -6762 -5038 1449 7088 5516
1404E516q659m190O024P434P94m316o409j893O308P892j899p984l723K769O868
$$ 5516 -3143 -7333 -1309 6125 6919 2603 -3806 -5699 609 8501 6602 -1382 -5105 -2336 4532
1419D532M382m224r243j565P876N973j001n880o171J014Q580M905m927p577j686
$$ 4532 8914 4690 -4553 -6118 1758 7731 6730 850 -5321 -4307 4273 9178 4251 -3326 -5012
1434e012M346O891K541p523p957J902Q770L874l166p069m491M632R188R90p933
$$ -5012 -666 6225 8766 1243 -6714 -4812 3958 7832 4666 -2403 -6894 -2262 6926 7916 -17
1449a7n584J211N586N425r85q122m549M583P095J639l811o441l008O510Q169j558
$$ -17 -5601 -4390 1196 6621 5636 -2486 -7035 -2452 4643 6282 2471 -3970 -6978 -468 7701 6143
1465F143q235m239K735O548M837m054q786j204O716N619k15n197o138P29P806
$$ 6143 -2092 -6331 -3596 2952 7789 3735 -5051 -6255 461 6080 5865 668 -5470 -4741 3065
1480C065N546m905o935k206L767P109K565o327q143J824P649M120k367o310m571
$$ 3065 8611 3706 -3229 -5435 -1668 5441 8006 1679 -6464 -4640 3009 7129 4762 -1548 -6119
1495f119L929Q477J288o498n243j30M720O416o20p933n056M433O709J991l796
$$ -6119 -2190 6287 7575 1077 -4166 -4296 424 6840 6220 -1713 -6769 -2336 4373 6364 2568
1510B568o806k481O595P264k172p169m110K355N768M485l206q572j357N685N035
$$ 2568 -4238 -6719 -124 7140 4968 -2201 -6311 -3956 1812 6297 3091 -5481 -6838 -1153 3882
1525C882L67m512o306m40P708N470m327o438k744L076O832K926o124p510J416
$$ 3882 4249 -263 -6569 -7009 699 6169 1842 -4596 -7340 -4264 2568 5494 -630 -8140 -6724
1540f724O731M181j948n638m992L055Q363J763n882n200q54M717O833K69q135
$$ -6724 7 4188 2240 -3398 -8390 -5335 3028 4791 -1091 -6291 -7145 -2428 4405 4674 -3461
1555c461n028L832O825K283l078o808k364O000P047j652n950l556J379N144M877
$$ -3461 -8489 -4657 2168 4451 1373 -5435 -7799 -1799 5248 3596 -2354 -5910 -4531 613 5490
1570E490k461p605k182N314N156J196m221o561n59P856N318l305o531k776L023
$$ 5490 3029 -4576 -6758 -1444 3712 4908 687 -5874 -6433 1423 6741 3436 -3095 -5871 -2848
1585b848O699L243o211o605J141O292L621p63n623n152K752Q401J968n313n390
$$ -2848 3851 7094 883 -5722 -4581 1711 5332 4569 -1054 -6206 -3454 4947 6915 1602 -3788
1600c788j038M242O521M76p639m576L751N745K270k614o136k652N086O294o42
$$ -3788 -4826 -584 5937 6413 -1226 -5802 -2051 3694 5964 3350 -2786 -5438 -352 5942 5300
1615E300n429m036O25N001N715k240p813k737M943N351J408m145o539k2P213M687
$$ 5300 -129 -4165 -3540 1461 7176 4936 -2877 -5614 -671 4680 6088 1943 -4596 -4618 2595 7282
1631G282l248n995k559K397O268K932m935o432M58N184M065N6n119n708K371P740
$$ 7282 4034 -1961 -4520 -2123 4145 7077 2142 -4290 -3832 1352 5417 5473 354 -5354 -2983 4757
1647D757K196m564n577j551M388O302O0o885m409L025N348K573j857o162l199
$$ 4757 6953 2389 -3188 -4739 -351 5951 6011 -874 -5283 -2258 3090 5663 3806 -2356 -5555
1662e555M665O405k16n086m182k67N357N515k199p666k175M142M994J500l856
$$ -5555 -890 5515 5299 213 -3969 -4236 1121 6636 4437 -3229 -5404 -1262 3732 5232 1376
1677A376o230l58O599M123k782m628k681J218N511L520m070o689m0M528M439M20
$$ 1376 -4854 -5212 1387 5510 2728 -1900 -4581 -3363 2148 5668 1598 -5091 -5131 -603 3836 4256
1693D256m903o191K386P244K707m238m871j475K510P361q12o182l699K400M382
$$ 4256 -647 -6838 -4452 2792 5499 1261 -3610 -5085 -2575 4786 3974 -2208 -5907 -3507 875
1708H75J537M43n723l918M470O278K72m833m238l70N064N372k039p001k076L576
$$ 875 2412 2855 -2868 -6786 -2316 3962 4234 -599 -4837 -5207 -143 5229 3190 -3811 -5887 -2311
1724b311M411K023l389n716p97N900M570k112m667k999Q36N776L869m002o401
$$ -2311 2100 4123 734 -4982 -5779 121 4691 2579 -2088 -5087 -4251 1525 5394 1392 -5009
1739e009j188N143M857J13n543n095J966O255K877l071n035j426L170M620J676
$$ -5009 -6197 -1054 3803 3916 -1627 -6722 -4756 1499 4376 1305 -3730 -5156 -1986 2634 4310
1754D310n614l738P99M904L098o08o221l609L793O483L84m086m214n28M379N537
$$ 4310 -1304 -5042 -4243 661 3759 3151 -3070 -6679 -2886 3597 3981 -105 -4319 -4847 -468 5069
1770E069j625o325k148L061M419K111k721n954r34N412M530j451m424l782J225
$$ 5069 3444 -2881 -5029 -1968 2451 4562 1841 -4113 -5047 365 4895 3444 -980 -4762 -3537
1785c537O230L165l621o117m09M348M228O91m350n283J612O149K034k348l916
$$ -3537 2693 5858 2237 -3880 -4289 59 4287 4978 628 -4655 -3043 3106 5140 2792 -1124
1800a124k265K159N901J669n344m484Q75M465L748m92o035l664L875N890O93m072
$$ -1124 -3389 -1230 4671 6340 996 -3488 -2613 1852 5600 5108 -927 -4591 -716 5174 5867 1795
1816A795m237j024M734M936j450n640k607K582L907K662k269n990j546M926M287
$$ 1795 -2442 -3466 1268 6204 4754 -886 -3493 -911 2996 5658 3389 -2601 -4147 779 5066
1831E066p88m367l565L61N897L708l918n404p49L368L966Q17m099m863R86N403
$$ 5066 4278 -89 -3654 -3293 2604 6312 2394 -3010 -3759 -391 3575 4392 293 -4570 -3584 1819
1847A819K366j927m093l006J962O191J459n445m338Q03M171L923o55o127l292
$$ 1819 4185 2258 -1835 -4841 -2879 3312 4771 -674 -5012 -4209 -38 3885 3230 -2897 -6189
1862f189L640N236P24l623l395j320L901N186j361n340k651K466L806K732k258
$$ -6189 -2549 2687 3411 -212 -3607 -4927 -1026 4160 2799 -2541 -5192 -2726 1080 3812 1554
1877A554n818j544N234L948m14l988l462j02N877L090l126m983p42L089L737J505
$$ 1554 -4264 -5808 -574 3374 2960 -1028 -4490 -4592 1285 4375 1249 -3734 -4476 -1387 2350 3855
1893C855m028m753R16N584K501k020l705l381K226O288J113m809l645O01L410
$$ 3855 -173 -4926 -4010 1574 4075 2055 -1650 -5031 -2805 3483 4596 -213 -3858 -3257 153
1908A53L327k59m786l219K751M752Q66k566l583j923L497N245j46n229l015J574
$$ 153 3480 3221 -1565 -4784 -2033 2719 3585 1019 -2564 -4487 -990 4255 4109 -1120 -4135 -2561
1924b561L918L236j946n895j592M641M056k17l479l872N24M477L696k693n006
$$ -2561 1357 4593 2647 -3248 -4840 -199 3857 3640 161 -3711 -3187 1290 4986 2293 -2713
1939b713q45K712L747J829l440n403O70N136K834j062m355k986K181N346J507
$$ -2713 -3558 -846 2901 4730 1290 -4113 -3443 1693 4527 3465 -890 -3876 -1695 3651 5158
1954E158m523l661O48L090L448J81m731l427K180M843J025j922m153k384L837
$$ 5158 635 -3026 -2378 712 4160 4341 -390 -3817 -1637 3206 4231 2309 -1844 -4228 -391
1969c91N477o58m792l101J526L962K931j899n738j315M313L473m73k815l490j89
$$ -391 5086 4428 -364 -3465 -1939 2023 4954 3055 -2683 -3998 315 3788 3315 500 -2990 -3179
1985c179M283L523k238m500j279J504M224K197l490n105J80M586K919j244l718
$$ -3179 1104 4627 2389 -2111 -3390 -1886 2338 4535 1045 -4060 -3880 706 3625 2381 -1337
2000a337l503J956N311J423l867l513k19K670L868K05m360l830K238M383J867
$$ -1337 -4840 -2884 2427 3850 -17 -3530 -3749 -1079 2789 2994 -1366 -5196 -2958 1425 3292
2015C292k356l837k043L378N286j040m451k487J015L558K536j269m758j477L564
$$ 3292 936 -2901 -4944 -1566 3720 2680 -1771 -4258 -3243 315 2851 1582 -3176 -4653 -1089
2030a089L089O03k164l693r37L964M288j229n079j714J316M538K127l546m815
$$ -1089 2000 2603 439 -3254 -4191 -227 4061 2832 -2247 -3961 -2645 1893 4020 474 -4341
2045d341J177M007K799j241k940l251J570N489J061l182l588j26K134L895j88
$$ -4341 -3164 843 3642 2401 -539 -3790 -2220 3269 4330 1148 -2440 -2566 -432 3463 3275
2060C275l468m315K253M182K080j389m596j437L706M094j047l756k498R15L525
$$ 3275 -193 -4508 -2255 1927 4007 2618 -1978 -3415 291 4385 3338 -418 -2916 -2001 1524
2075A524J792k77m582k113K483L338J090k411l201r16M160K276o86l928j974J774
$$ 1524 3316 3039 -1543 -3656 -1173 2165 3255 844 -2357 -3273 887 3163 2477 -1451 -3425 -1651
2091a651L393L355l503m635R68K029K772l13l362l675K077N158K32j547m295j109
$$ -1651 1742 5097 1594 -3041 -2073 -44 2728 2415 -947 -4622 -2545 2613 2845 1298 -2997 -4106
2107d106K492N221J19l989m172J412M617J703j341m448j958L778M068j736k222
$$ -4106 -1614 3607 3726 -263 -4435 -3023 1594 3297 1956 -2492 -4450 -672 3396 1660 -562
2122e62k294o0L880K925o62m560k297L249L127O96j874l728j176M314L287j479
$$ -562 -2856 -2916 964 3889 3227 -1333 -3630 -381 2746 3442 1568 -2160 -3336 978 4265 2786
2138B786l675j246J137L100K403k567m071k25L081K676O34k910m126Q45M818K238
$$ 2786 -889 -2135 -998 2102 4505 1938 -2133 -2358 723 3399 4033 1123 -3003 -2158 2660 4898
2154D898k753l797j004K221M308P36m473l430J849L661J310j155l400k317K965
$$ 4898 2145 -1652 -2656 -435 3873 4609 136 -3294 -1445 2216 3526 2371 -1029 -3346 -381
2169c81L943k78l327k047j94K286L352m10m576k185K690K559J000j214l901r34
$$ -381 3562 3284 -43 -2090 -2284 2 3354 2944 -1632 -3817 -1127 1432 2432 1218 -2683 -3617
2185c617L313L636j511k978j841k8L648K609k111m317q42K781K839O98k937l865
$$ -3617 -304 3332 1821 -1157 -2998 -3026 622 3231 1120 -3197 -4039 -1258 1581 2279 -658 -4523
2201d523O78M745K250k489l628j074J816L713J479m468k910J695L105J386o76
$$ -4523 -3845 900 3150 661 -2967 -4041 -2225 1488 2967 -1501 -4411 -2716 389 1775 1099
2216A099l224k268K162L931M54k778k720r3K739L268o24l931j649J788L150Q46
$$ 1099 -2125 -4393 -2231 1700 2154 -624 -3344 -3437 -698 2570 1946 -1985 -3634 -1846 1304 2150
2232B150j602k869j324L330K896o66k411k366K79K930L399k179l884p46K357K895
$$ 2150 548 -2321 -3645 -315 2581 1915 -496 -2862 -2583 347 3746 1567 -2317 -3063 -706 2189
2248B189N85k423m001R10M279K320k297l053j242J249M253P24l452l264J030L024
$$ 2189 2774 351 -3650 -2740 1539 3859 1562 -1491 -2733 -1484 2769 3493 41 -3223 -2193 831
2264H31J962k18l443k422K079L993L76k671k419m35K507L272p23m080j346K027
$$ 831 2793 2575 -868 -3290 -1211 2782 3158 487 -1932 -2367 140 3412 2689 -1391 -2737 -710
2280g10K153J334j088k930j268K603K781k05k096k506o3K842L003j670l858p27
$$ -710 1443 2777 1689 -1241 -2509 94 2875 2670 574 -1932 -1995 847 3850 2180 -1678 -2405
2296b405K026L078J123k738l668K9M500J722j330k714k289J456M290J257l736
$$ -2405 -379 2699 3822 1084 -2584 -2555 1945 3667 2337 -377 -2666 -1210 3080 4337 601
2311F01l125Q18L066K198n51l777k360K621L964k74k703k207l53K715K714j049
$$ 601 -2524 -1706 1360 3558 3007 -770 -3130 -509 3455 3181 478 -1729 -2082 633 3347 2298
2327B298l141j208J425J885J308o52k913j655K502K620J26k088k346n89L032K670
$$ 2298 -843 -2051 -626 1259 2567 1915 -998 -2653 -151 2469 2595 507 -1839 -2428 604 3274
2343C274j287l715r40J613K776J306k307l820m9L767K486j486k967k020J147L997
$$ 3274 1987 -1728 -2668 -1055 1721 3027 720 -3100 -3149 618 3104 1618 -1349 -3369 -2222 1775
2359A775J450l124l494O58K673K551m80l519k444K168L715K2k340k090j20J849
$$ 1775 3225 101 -3393 -2735 -62 2489 2009 -1510 -3954 -1786 1929 1951 -389 -2479 -2599 -750
2375g50K790m40k899j544Q92K586J413n70k998j461J105L419Q08j977l071j181
$$ -750 2040 1600 -1299 -2843 -1951 635 2048 1478 -1520 -2981 -1876 1543 2351 374 -2697 -3878
2391c878L936K316q12l733k09R21K477J616j786l868K50L092K151p61k674k547
$$ -3878 58 2374 1562 -2171 -2380 -1459 1018 2634 848 -3020 -2770 322 2473 1712 -962 -3509
2407c509J032M497J232k927l347K95K563L117q45l782k005K090K915O23j966j890
$$ -3509 -2477 2020 3252 325 -3022 -2727 -164 2953 2108 -1674 -3679 -1589 1326 1949 -17 -1907
2423a907j084K029L212o48l371j226P54K451J270m25l334n22K008J835L31j524
$$ -1907 -2991 -962 2250 1602 -1769 -2995 -2241 210 1480 1055 -2279 -2801 -793 1042 1373 -151
2439a51k302n51K602J398nk314j702Q65J604K246l6m153j107L294K784j246j944
$$ -151 -2453 -3004 -402 996 991 -1323 -3025 -2160 -556 1690 1654 -2499 -3606 -312 2472 1226 -718
2456g18k587N66L793J822k768k884J98K177L224p89k738j668N54L965J49j304
$$ -718 -3305 -2739 1054 2876 108 -2776 -2578 -401 2823 2034 -704 -2372 -1818 2147 2296 992
2472I92k441n82K257K729m34k713j172J178K062J281p09k685j011K300J578n2
$$ 992 -1449 -2031 226 2955 2521 -192 -1364 -186 1876 3157 2448 -237 -1248 1052 2630 2578
2488B578p81j915o94J719K732q78k391r35J98K472K196j507l777p63L058K459
$$ 2578 1797 -118 -812 907 3639 2761 370 -565 -367 2105 4301 2794 -983 -1746 1312 3771
2504C771j94k834k438P44L622J554k532l010l90K404K346K20l153k366J148K995
$$ 3771 3577 743 -1695 -951 2671 4225 1693 -1317 -1707 697 3043 3263 110 -2256 -1108 1887
2520A887P46j327k169j466J857L247r00k684j411J077J829J262j139k733n4J950
$$ 1887 2633 1306 -863 -2329 -472 2775 1875 -809 -2220 -1143 686 1948 809 -1924 -1978 -28
2536b8Q25n94o72k240n36K562J991p16j560j651j94L185K131k267k864j031K829
$$ -28 797 203 -469 -2709 -3245 -683 1308 592 -968 -2619 -2813 372 2503 236 -2628 -3659 -830
2553h30J541N25j953k690O84K894K000j546l322m61K510K170J78k529k711J756
$$ -830 711 1236 -717 -3407 -2723 171 2171 625 -2697 -3158 -648 1522 1700 -829 -3540 -1784
2569a784K235J361j290k342j185K043K170j93k208j485J397J688J104o33k160
$$ -1784 451 1812 522 -1820 -3005 -962 1208 1015 -1193 -2678 -1281 407 1511 878 -1282
2584a282r46K071N59Q64j95j923r24J699K427p41k394j155K22J616K417q64l058
$$ -1282 -2228 -157 402 1266 1071 -852 -1776 -77 2350 1609 -785 -1940 -1718 -102 2315 1451 -1607
2601a607l25J800J803N69k197k518k9L025K235j411l091m40J476K823N96l321
$$ -1607 -1932 -132 1671 2240 43 -2475 -2504 521 2756 1345 -1746 -2186 -710 2113 2709 -612
2617f12k390J271K666J571j390k313j400K451K297l95k541p91K66J383J932o06
$$ -612 -3002 -1731 935 2506 1116 -1197 -2597 -146 2151 1756 -785 -1576 -1310 73 2005 1399
2633A399k452p75J382J488K38n28j872o73J841J816k89j531j132p07K140K151
$$ 1399 -1053 -1828 -446 1042 1280 752 -1120 -1793 48 1864 1575 44 -1088 -1795 345 2496
2649B496p30k867p71J818K002N6j368k695o12L909K448k477j954j329J617K854
$$ 2496 1766 -1101 -1872 -54 1948 2004 636 -2059 -2671 1238 3686 1209 -745 -2074 -457 2397
2665B397R67l271k828J802J785K068j119k330j780K005K941o14j898j370N45J123
$$ 2397 3364 93 -2735 -933 852 2920 1801 -529 -2309 -304 2637 2023 125 -1245 -700 423
2681D23J811m13k386j020J388J708K51q62j839n53J440J979k68j776j095L0J446
$$ 423 2234 1821 -565 -1585 -197 1511 1762 900 -939 -1492 -52 1927 1659 -117 -1212 -1182 264
2698B64J826l41k675j099J552J736J088j426l173k9L152J793j527k129j487J017
$$ 264 2090 1749 -926 -2025 -473 1263 2351 925 -2248 -2277 875 2668 1141 -988 -2475 -1458
2714a458L097J136k729k545Q11K401J334n66k316j786J509L061l1k360j137k65
$$ -1458 1639 2775 46 -2499 -1688 713 2047 1481 -835 -2621 -1112 1949 1918 -442 -1579 -1844
2730a844J551K103p72k471p20J573J379N11j166j433l99J683J066P2j313j007
$$ -1844 -293 1810 1038 -1433 -2153 -580 799 1310 144 -1289 -1688 -5 1061 1133 -180 -1187
2746a187m99J564J728k78k581j079J504J577J322j703k669k69K862J831j207k144
$$ -1187 -1686 -122 1606 1328 -1253 -2332 -828 749 2071 368 -2301 -2570 292 2123 916 -1228
2762a228r44N36K817J147k245k618K83K700J114k40k372j921J420K832J33k060
$$ -1228 -2172 -1636 1181 2328 83 -2535 -2252 448 1562 1322 -1050 -2971 -1551 1281 1414 -646
2778f46j409K32J475J900o33k466p39J473J280M54o25j309j144J554J434K59j679
$$ -646 -2055 -1823 -348 1552 919 -1547 -2286 -813 467 921 296 -1013 -2157 -603 831 1090 -589
2795e89l59r31J407K397q34k104q69R26J437J464j234k597p4K280J617p01j906
$$ -589 -948 -1879 -472 1925 1091 -1013 -1882 -956 481 1945 711 -1886 -1960 320 1937 1236 -670
2812f70j377R41K680J134j973k975O17K090J570p1k117j953J441K761J05j609
$$ -670 -2047 -1106 1574 2708 735 -2240 -1623 467 2037 1966 -151 -2104 -663 2098 2203 594
2828E94j621J17J677J359n71j958p62J073J309K91o7k091o96J371J855j96j160
$$ 594 -1027 -910 767 2126 1555 -403 -1165 -92 1217 1508 1441 -650 -1346 25 1880 1684 524
2845E24j216l55J614J537l33k524p49J423J259J191j467k848P5K664J727p62j214
$$ 524 -692 -1047 567 2104 1771 -753 -1502 -79 1180 2371 904 -1944 -1869 795 2522 1760 546
2862E46j139n60K798Q55j107k534o29K850J95L88k482j869K116L114o34k294p54
$$ 546 -593 -1153 1645 2500 1393 -1141 -1770 1080 1275 1663 -819 -2688 -572 2542 1908 -386 -1140
2879a140l89J579J434p77j306l36P0J452K59K3j870p30Q61K161l21j355l55m43
$$ -1140 -1529 50 1484 707 -599 -935 -865 587 846 869 -1001 -1731 -870 1291 970 -385 -740 -1183
2897a183J508J257n91j748q00R99J170P02k16k613n36K106J804r49m43k476K14
$$ -1183 325 1582 991 -757 -1557 -558 612 1314 1098 -1515 -2051 55 1859 910 467 -2009 -1795
2914a795K913J390k022k189M5J033J565M54k273j897J384J941N41n19j768p74
$$ -1795 1118 2508 486 -1703 -1658 -625 940 1394 -879 -2776 -1392 549 1090 571 -1197 -1971
2930a971J607J145M70k208o76Q27Q66N02j67j756p44J964K52K12k64j552O15K378
$$ -1971 -364 781 1251 -957 -1633 -806 60 562 395 -1361 -2105 -141 111 323 59 -1493 -878 1500
2948A500j124M85l158M26j73K791q0L67k005j303J108K642r40j233j408L55K196
$$ 1500 376 861 -2297 -1871 -2044 747 667 1034 -971 -2274 -1166 1476 536 -697 -2105 -1750 446
2965D46J427k217j100k17J110J706p7k029j393J596J575M20m77k159k53R66K119
$$ 446 1873 -344 -1444 -1661 -551 1155 1078 -951 -2344 -748 827 1247 770 -1389 -1642 -676 1443
2982A443J30k135o03K45J329R62l30j853p20J260J330j39o67j306m08J139J682
$$ 1443 1573 -562 -1165 -920 409 1371 1041 -812 -1532 -272 1058 919 252 -1054 -1462 -323 1359
2999A359l13j518n19j78J411J368l61k279q19J635J687m43r54j719M7K526J245
$$ 1359 1046 -472 -991 -1169 242 1610 1249 -1030 -1849 -214 1473 1030 76 -1643 -1596 930 2175
3016B175j058j989m77j48K433O81j810j999Q68L096L55j076k145n38J187K300
$$ 2175 1117 -872 -1349 -1497 936 1617 -193 -2192 -1324 1772 2127 1051 -1094 -1632 -445 1855
3032A855o04j508j544J346M47J461o72j680l96O68K058m43m68j095k33J153J275
$$ 1855 1251 -257 -1801 -455 -8 1453 781 -899 -1295 -627 1431 988 520 -575 -808 345 1620
3049A620l27j241q75O4J697Q90q2k135l73J203J072K30j037j483R0J897J247j408
$$ 1620 1293 52 -823 -759 938 1828 1746 -389 -762 441 1513 1743 706 -777 -687 1210 2457 1049
3067A049j198o72Q91J356J143j696k079P72J957R98j034j880p43Q64K600l48j924
$$ 1049 -149 -821 70 1426 2569 873 -1206 -434 1523 2521 1487 -393 -1136 -272 2328 1980 56
3084E6q24J72J298J132k72j938r00J160J343l10l83j032r50J689J385o05j929
$$ 56 -768 -596 702 1834 1562 -376 -1276 -116 1227 917 534 -498 -1448 241 1626 1021 -908
3101i08j59k58J656J038j050j773r35K032J034Q4k27k458J98J222J567p21j932
$$ -908 -1067 -1325 331 1369 319 -1454 -2389 -357 677 761 534 -1924 -1726 -504 1063 342 -1590
3118a590k83K24K273M80j441k543Q95K090J024o34j626j226J354J926J33j584
$$ -1590 -1873 -1649 624 1104 -337 -2880 -1985 105 1129 495 -1131 -2357 -1003 923 1056 -528
3134e28j040K44J036J058J58j642p60R76J232j6n19r74r34J683J563l62j386q21
$$ -528 -1568 -1324 -288 770 928 -714 -1474 -498 734 718 199 -775 -1709 -26 1537 1175 -211 -1032
3152a032K71R32J194j13k238q9R20J106L30p53j439o21J661J562m87j801m76M10
$$ -1032 -761 171 1365 1252 -986 -1075 -155 951 1281 528 -911 -1532 129 1691 1204 -597 -1073 -663
3170f63J817P82j664j938M03K188M69J2j835q60L02K531n32j148j893J364O99
$$ -663 1154 1936 272 -1666 -1263 925 1394 1406 -429 -1289 -987 1544 1012 -136 -2029 -665 34
3187C4J196m82j543o24k70J869M60l80j456n69K211K67j94j588j50M13K65J089
$$ 34 1230 748 -795 -1419 -1689 180 640 260 -1196 -1765 446 713 519 -1069 -1219 -806 -541 548
3205E48n64p28j317J176J303J27l50k011k3R32K249q24j575o07O25J593N51j056
$$ 548 -16 -744 -2061 -885 418 545 195 -1816 -1839 -907 1342 518 -1057 -1664 -1039 554 1105 49
3223D9j395K35J022N21Q75r74k312R25J687P2j91k128J086O9J141o0j020j139
$$ 49 -1346 -1111 -89 432 1307 333 -1979 -1054 633 705 514 -1614 -528 -459 682 622 -398 -1537
3241a537N20J677R81j874j200J304j38P26L80p05m54j8m06K072j040q20r04M28
$$ -1537 -1017 660 1641 -233 -1433 -129 -267 459 839 134 -320 -338 -744 1328 288 -532 -1436 -1008
3259a008K503n91q31q64l32K115O55j010k82j128J057M32J491k046j070K97M44
$$ -1008 1495 904 73 -791 -1123 992 1647 637 355 -773 284 716 2207 161 -909 -612 -168
3276a68J131J06q34j423N76K008P3j172r23p52J000J543J67j576q02M12J108O42
$$ -168 963 1069 235 -1188 -612 1396 1469 297 -626 -1378 -378 1165 1332 -244 -1046 -634 474 1116
3294A116n42j423p0N64J169r9m60j041j28Q75J469n06j715k45P63J166j55r9j610
$$ 1116 574 -849 -919 -355 814 715 255 -786 -914 -39 1430 924 -791 -1036 -273 893 738 639 -971
3313i71l54J505P89k14r28q26K43J283P47q70j616J73Q79J067J79r80j874J100
$$ -971 -1325 180 969 755 -173 -999 -756 527 1274 404 -1212 -1039 -160 907 1086 106 -1768 -668
3331f68J541P57j127j462R1O33J390J87j626r85O62R32P42m13j017r57J169J262
$$ -668 873 1630 503 -959 -868 -235 1155 1342 -284 -1269 -607 325 1067 654 -363 -1320 -151 1111
3349A111k85p63o46l20J094J313n88j585l28P65R11M93p30j038n06J299Q99l16
$$ 1111 826 63 -583 -903 191 1504 916 -669 -997 -232 679 1172 442 -596 -1102 197 1096 780
3367G80o23q75k24J455Q59r21j877O82O64Q59L43j180j320L57J933J04q63q14
$$ 780 157 -718 -942 513 1372 451 -1426 -744 -80 779 1122 -58 -1378 -1021 912 1016 153 -661
3385f61m34O41J360J08j379n46L41P28Q33j78j265q01Q48J468k96q66p34K1N88
$$ -661 -1095 -454 906 1014 -365 -911 -570 158 991 813 -452 -1253 -405 1063 767 -99 -833 -812 -224
3404b24J424k53j603k37N10P40N49l53j339k6J117J138n03q70j245L53J352J009
$$ -224 1200 947 -656 -893 -383 357 906 553 -786 -812 305 1443 940 70 -1175 -822 530 1539
3422A539j042j400k5R21P62M30j183j194L30J176O46p23n27p64Q15J358O6j370
$$ 1539 497 -903 -928 -7 755 1185 2 -1192 -862 314 960 237 -290 -1054 -239 1119 1185 -185
3440a85j088M15P65P20L52j510r02J000J149k5m30r31n35Q19J435l70j275n36
$$ -185 -1273 -858 -93 627 979 -531 -1433 -433 716 691 261 -670 -1205 -386 1049 679 -596 -1132
3458a132M41R29P86n62j279l07J290Q46k52r68q79L1J587Q18j356o70m53P87Q84
$$ -1132 -691 238 1024 462 -817 -1124 166 1012 760 -208 -1087 -1056 531 1349 -7 -677 -1130 -343 541
3477E41K45o67j342L10J177O05k17p78j029L32J534O19j622o67L64N97R76oj364
$$ 541 786 119 -1223 -913 264 869 652 -126 -1155 -823 711 1330 -292 -959 -595 2 978 972 -392
3496c92j014R88J002L60o62o21p34J077R62j34j124l45M20M03Q31l68j204q31
$$ -392 -1406 -418 584 944 282 -339 -1073 4 966 832 -292 -637 -217 186 1017 649 -555 -1386
3514a386J170R89j52p55r86L26J307N58o66j031q2L74O66N51n68j435J23J483
$$ -1386 -216 773 621 -134 -1120 -794 513 1071 405 -626 -708 -334 332 883 315 -1120 -997 486
3532D86N74n73o90q81L27J469K62j158j053L33Q74Q20l34o73r35R54M33O07m51
$$ 486 1060 487 -203 -1084 -757 712 974 -184 -1237 -904 -30 790 456 -217 -1152 -198 235 842 391
3551C91p49o52P68J311k78j236k63J28N55J533j310j088n3Q65J357m56r29j109
$$ 391 -358 -1010 -242 1069 791 -445 -708 -580 -25 1508 198 -890 -943 -78 1279 823 -106 -1215
3569a215K67J390M56p59j78p93N79Q28O67o27j580J09J359M40k57q48p99N21J503
$$ -1215 -948 442 898 139 -39 -832 -253 575 1242 615 -965 -856 503 943 686 -162 -961 -440 1063
3588A063J30p37j220M25L41P92J16j038p01N99O83L79j30j112l67P56J036j76
$$ 1063 1193 456 -764 -339 2 794 910 -128 -829 -230 453 832 702 -410 -777 -21 1015 839
3606H39p62p29M01J024jJ66j506j79P64R48K1o13q39k55P70J054l66j297p0N81
$$ 839 77 -652 -251 773 772 938 -568 -747 17 965 986 373 -466 -721 49 1103 737 -560 -630 -49
3626d9O03O97o99j249N8J290M42n27o64p59N95J103K69p88j033J09J81J154N89
$$ -49 554 1251 552 -697 -639 651 1093 566 -98 -857 -262 841 1110 322 -711 -602 -421 733 1322
3645A322j544p59P13R28J87m31q20q86R78J229k41q67n56K61O23O81k82j305q1
$$ 1322 -222 -981 -268 660 847 416 -404 -1290 -312 917 676 -191 -747 -486 137 818 536 -769 -850
3664h50P13M25K84l93p86n44R76J078l31j072l25K03P71R35j022j283J21J232
$$ -850 -137 288 572 179 -607 -1151 -175 903 572 -500 -825 -622 149 1084 62 -1221 -1100 132
3682A32K72k11o19m85J26J361J20q23o66p2J85J260j40j201o00K28Q88J25P47
$$ 132 404 193 -426 -911 -785 576 696 -127 -793 -865 -680 580 440 -761 -1361 -1133 -245 -120 627
3701F27j203p89L85J959k08j136m49N1M31R93l98j057m75O21J000j5k92r27n91
$$ 627 -576 -1365 -980 979 771 -365 -814 -763 -332 661 263 -794 -1269 -648 352 337 45 -882 -1473
3720a473J176J026o01r22l15K43R30P23r99q10R0P71K56L38q89m06M1R12P19m99
$$ -1473 -297 729 128 -794 -1109 -866 64 787 -212 -1022 -932 -161 95 433 -456 -862 -821 91 810 311
3740C11q01l08N15M48L94j052p72R64K89O91K73j774m3M2J360P91j628K54j98
$$ 311 -490 -798 -283 165 559 -493 -1265 -301 -12 679 952 -822 -865 -823 537 1328 -300 -46 -244
3759b44J26Q11J21j416k55N07O59N68o35p48o22J258O71m50q84M8K15R05J64p15
$$ -244 -118 693 814 -602 -857 -350 309 877 242 -506 -1128 130 801 351 -533 -485 -270 635 799 84
3779H4k55P9r48L56J261o33j127l99J624J035o89j030j17N55R39j16l27q93k22
$$ 84 -171 -92 -1040 -684 577 -56 -1183 -1582 42 1077 388 -642 -759 -204 735 619 292 -601 -823
3798h23Q71Q59o3p55j249P25J209r6p30r44P25M93O04o17k79p13O76O75M08n99
$$ -823 48 907 844 89 -1160 -435 774 678 -52 -996 -271 222 826 209 -70 -783 -107 568 976 377
3818C77p92J54M16J149p88n51j81j91J136O2k13r84l55Q22N79J05o41j354O24
$$ 377 -415 -261 155 1304 516 -35 -216 -407 729 791 578 -406 -761 61 640 745 104 -1250 -626
3837f26J670K64o81m23n92M62O32M33o73j049L39L79Q70J11p66j114L73J210R7
$$ -626 1044 1308 627 204 -388 74 706 1139 466 -583 -244 135 1005 1116 350 -764 -391 819 916
3856I16n20m55o21Q12J020J35j628j12P46J96O0j3q96l27O99Q23m0r46n15K43
$$ 916 396 -59 -680 132 1152 1287 -341 -453 293 489 549 536 -360 -687 12 835 795 -151 -666 -423
3876d23R18L30l81q66m9K57J114l80m76r79L72Q34L89n05p97o35R29L65K46j23
$$ -423 495 825 444 -422 -471 -214 900 520 44 -935 -563 271 660 155 -642 -1277 -348 17 263 140
3896A40q23k89N29M31j9J94j315K28J781m40l68r32l48R39J033k29r47m11K01
$$ 140 -683 -972 -443 -12 -31 163 -1152 -924 857 417 49 -883 -1231 -292 741 512 -435 -846 -645
3915f45P75L60m95q50k26O88Q53j77o28m39n0J004N54m12j043k07Q13K62L59k12
$$ -645 130 490 -5 -855 -1081 -393 460 283 -345 -784 -834 170 724 312 -731 -938 -125 137 496 284
3935B84j064J24J188k5j19r67j30K10N93O87p79p17j35M43Q69J53r99q23O27J195
$$ 284 -780 -656 532 507 388 -579 -709 -499 94 781 2 -715 -850 -407 462 615 -384 -1207 -580 615
3955F15m27L19p83l01K08N81L60q36l65K28L85O94j86j132k35P24R30k62n43o31
$$ 615 188 507 -276 -577 -369 212 572 -264 -629 -401 -16 678 492 -640 -875 -151 779 517 -26 -657
3975f57l7N91R69p11p34k37O25N92K9n64o18K10M21P03k33k62k17M5L96O14n09
$$ -657 -694 -103 866 155 -579 -816 -191 401 430 -134 -752 -542 -121 582 349 87 -130 -85 311 925 416
3996D16j187j6J058K07L61o87r03N06P20Qn38j33l30L95O61K36p50k40j25P37
$$ 416 -771 -787 271 478 839 152 -751 -245 475 483 -55 -188 -518 -123 538 774 24 -216 -341 396
4016C96M04j30q64n21N96P99l4m63o53p4P96O57l26q71j5N10j2Q59p20r77j47
$$ 396 800 670 -194 -715 -119 680 646 183 -470 -544 252 909 583 -288 -303 207 195 1054 334 -643 -790
4037g90P63P89n58K9q01K45P09P70j382%m1K56P11m4j139k82L12Q70p7K0o40p6
$$ -790 -27 762 204 233 -568 -323 386 1156 -226 -226 -267 -11 700 656 -483 -765 -453 417 340 360 -280 -356
4059c56K78P49J17q64o46J71R08K17Pj138p8O81P46l63k75o56k60J102K20k06
$$ -356 -78 671 788 -76 -722 -551 357 574 581 -557 -635 46 792 429 154 -502 -762 340 560 354
4079C54p68M7J82O4N26k63m56j71Q43L71k54m24j022K50J161N58p80p54K84K87
$$ 354 -414 -367 -185 -121 405 142 -314 -485 358 729 475 51 -971 -721 440 998 218 -536 -252 35
4099C5L59J65o13o47K72P43L35k10n81m76N19O44J14r50m19M24K15Q75m01r20
$$ 35 394 559 -54 -701 -429 314 649 439 -142 -618 -99 545 659 -291 -710 -286 -71 804 403 -517
4119e17r4M56M73j27j10n93J3N49N95m08n91k98M3P68M35l77m81n66P32L88q9
$$ -517 -611 -155 318 191 81 -512 -499 50 645 237 -354 -652 -609 159 594 217 -264 -830 -98 290 201
4140B01k06o08P5J020K51o02q59J30K51O27M00q37l92L75M15L70l5j119j32M91
$$ 201 -5 -613 -538 482 733 131 -728 -598 -347 280 680 -157 -549 -174 241 611 576 -543 -675 -184
4160a84P00o6p49j43M2O38qP7o95n33J082K78L36o14l96n92O15Q15j13r79%J34
$$ -184 516 450 -299 -442 -400 238 230 307 -388 -921 161 439 775 161 -235 -827 -212 603 490 -489 -489 -355
4182c55N55N59m38r64j32P39O03j05n49j86N9Q72L7m75n83K15j95O29O24p98o50
$$ -355 200 759 321 -643 -775 -36 567 462 -87 -273 -214 658 695 220 -363 -148 -343 286 910 112 -538
4203e38O0O11K83o4n17m82M27N52K65n00l42l14Q72O68k92r55j69L41N13J34k80
$$ -538 -478 133 416 352 -165 -647 -220 332 597 97 -245 -559 313 981 689 -266 -435 -94 419 553 273
4224B73p18k07O97O61n35k06k36n2N28O01n18r22K87K79O26m61K34q64K53O50
$$ 273 -445 -652 45 706 171 -35 -271 -323 205 806 288 -634 -347 -68 558 97 331 -533 -280 370
4244C70K50j48n31n23R0J001M03j019n54K99J088M47n06m42j521J294L73o84j02
$$ 370 620 472 -59 -582 -492 509 912 -107 -661 -362 726 1173 667 225 -1296 -2 371 -313 -415
4263d15MP0K05Q22k6r65k68K11O41p6M4n79l63O30Q76o25o35J05k69N96K99j10
$$ -415 -411 -341 -136 686 660 -305 -573 -362 279 203 247 -332 -695 -65 811 186 -449 -344 -613 -17 282 172
4285A72o13j98L41N29P8l63m71j69R90K38o49m06k0k04J039k3n41l29K25N91n8
$$ 172 -441 -639 -298 231 309 -54 -525 -694 296 534 -115 -521 -541 -745 294 271 -270 -599 -374 217 159
4306A59j56k97n69N48Q36l16k14J9n46QJ371j067J18m29k72Q22P43p27r05n6Q94
$$ 159 3 -294 -863 -315 521 205 -9 10 -536 -528 843 -224 -106 -535 -807 15 758 31 -874 -930 -36
4327c6Q11l33j553R39p48R63J194j178m56k56Q72J70K00m63p56J93P69K17k68
$$ -36 775 442 -1111 -172 -920 43 1237 59 -397 -653 219 389 589 126 -630 -437 332 549 281
4346B81l74L3J64n6O81l30j393P07L08J82M81Q4j114K89N64R8m69L63j530P72
$$ 281 -93 -60 104 48 729 399 -994 -287 21 203 684 768 -346 -57 507 605 136 499 -1031 -259
4366b59J755m53k136O44O69L5L44O78j035l50k3M23j27l33K96k58L79M48k79o97
$$ -259 1496 1043 -1093 -449 220 255 599 1277 242 -108 -131 292 165 -168 128 -130 249 697 418 -279
4386b79l45O02M57K35n09m07j50Q89L00l69m25j79l29J184L63j023k67M4M49K84
$$ -279 -624 -22 435 670 161 -246 -396 493 793 424 -1 -180 -509 675 1038 15 -252 -208 241 525
4406E25j32l29o03M43N66J63o24k84j47J07J026J3n12o89L73L49r6K48n14j62
$$ 525 393 64 -539 -96 470 633 9 -275 -422 -315 711 724 212 -477 -104 245 149 397 -117 -279
4426b79L16O99n26m21J37k11M20N27k24o85l43N61M68J76m40n81m95J088K44l04
$$ -279 37 736 210 -211 -74 -285 135 662 438 -247 -590 -29 439 615 175 -406 -901 187 431 127
4446A27k92l83J14O44J18l10l83r0M27J91J93m64n55J35O44K56l81l96j17J14
$$ 127 -165 -548 -434 210 328 18 -365 -455 -28 163 356 -108 -663 -528 116 372 -9 -405 -522 -408
4466d08J065k46n76k31j97L62K96R9l54l70K17P36r7o19k01j52K82R94q55l91
$$ -408 657 411 -165 -396 -593 -231 65 164 -190 -560 -343 393 296 -323 -524 -676 -394 600 -255 -646
4486f46j91L97L78L24l87o03J24M22J40M6k41p33K96P19L28l78q22J38M25K86
$$ -646 -837 -440 -62 262 -125 -728 -604 -182 -42 4 -237 -970 -674 45 373 -5 -827 -689 -264 22
4506B2K22n55m59J18Q47k44N5l43m00J83O19L07r30p6K65M03J9J83o40m34Q28
$$ 22 244 -311 -770 -652 195 -49 6 -337 -737 -554 65 372 -558 -634 -369 34 53 236 -404 -838 -10
4527a0J52k7l33k79J3L19O26p1q18j80M35L51K32k70n65k0L22M96j99J13q41K76
$$ -10 142 115 -218 -497 -484 -165 461 390 -428 -608 -173 178 410 140 -425 -445 -123 373 174 287 -554 -278
4549b78M72M29p42j87M4L77J88M93o35l62J81O95j69k37k51Km6P62l04l21k01
$$ -278 194 623 -119 -306 -262 115 303 796 161 -201 -20 675 506 269 18 20 -26 736 432 111 -90
4570i0K60Q9L77m44M8p01N95O01l52o05N59j032L21J058l94k36k87K07L16L82
$$ -90 170 259 636 192 240 -461 134 735 383 -222 337 -695 -374 684 290 54 -233 -26 290 672
4590F72k34o22j34L56K13N2j55m59K76K48N50l61q39K16L9P84R6p65l66m1P36
$$ 672 438 -184 -318 38 251 303 148 -311 -35 213 763 402 -437 -221 -182 602 698 -67 -433 -474 262
4611B62Rk29J70q64O19K92K12o68j90J82K04K80J00m64l06M56N6M46m73l86j70
$$ 262 271 42 212 -652 -33 259 471 -197 -387 -205 -1 279 379 -85 -391 65 121 567 94 -292 -462
4632d62P30K32k49n1l76Q6J0P06m89o89L22N83K17m81j21o9l81P08J79n6n80r7
$$ -462 268 500 251 200 -176 -90 -80 626 137 -552 -230 353 570 89 -32 -101 -482 226 405 349 -231 -328
4654c28L62J18L05k89n43J24P41R3p80L36l23j63R17kn70j86O6J29L26n0p52j2
$$ -328 34 152 457 168 -375 -251 490 583 -197 139 -184 -347 570 568 -2 -188 -122 7 333 283 -469 -481
4676d81N62K42l06N4n08N2M01L41k6o38K00j88M86L99p84l60MO26j16L13k95n64
$$ -481 81 323 17 71 -437 -385 16 357 331 -307 -107 -295 191 590 -194 -554 -550 76 -40 273 -22 -586
4698e86J28L75N42n67n02R8J29K22M78o11m02N00L41J19l20mp52N49N62r5o36
$$ -586 -458 -83 459 -108 -610 -512 -383 -161 317 -294 -696 -196 145 264 -56 -60 -812 -263 299 204 -432
4719d32J01l5j1N89J74p83k13M72J28L25m26k89j56P17K92k47n33J61j4J06O31
$$ -432 -331 -366 -377 212 386 -397 -610 -138 -10 315 -111 -400 -556 161 453 206 -327 -166 -180 -74 557
4740E57k42p43L01M2N49l67k64j84J86L48K51m61j57j34O1N37L49p98m2R3L06
$$ 557 315 -428 -127 -85 464 97 -167 -351 -165 183 434 -27 -184 -318 -257 280 629 -169 -211 -118 188
4761A88J32lo33p3M24N37j61o61J86J56j88P26j61l42k92J76J46K62k50k07k56
$$ 188 320 317 -316 -389 35 572 411 -250 -64 92 -96 630 469 127 -165 11 157 419 169 -38 -294
4782b94L59K69p9k81n8j39L23N20p87J01J03o1M27k55k00J25j09O8M27l51k98
$$ -294 65 334 255 -26 -84 -223 100 620 -167 -66 37 -24 403 148 -52 73 -36 32 459 108 -190
4803a90k63L58M87N5l12k84l02O43l6J91m47l5J02M51j55k47l33r1M44L47J67
$$ -190 -453 -95 392 447 135 -149 -451 192 156 347 -100 -135 -33 418 263 16 -317 -408 36 383 550
4824E50o47j42J31K98o8O8m47J59l66Q92n02ql89J39N30K71n1q20O5J94N50O4
$$ 550 -97 -239 -108 190 122 190 -257 -98 -464 428 -74 -82 -471 -332 198 469 418 -402 -337 -143 407 471
4846D71l26m83k60M82N79l19k48j47J5M25J64j66l70k48M77k3J17k72l28L86M69
$$ 471 145 -338 -598 -116 463 144 -104 -251 -236 189 353 187 -183 -431 46 23 140 -132 -460 -74 395
4867C95J60o41l34r2M1P17L8p15j4L61q5L84K7k73k27K60OK31m2k20k89Q9N55
$$ 395 555 -86 -420 -512 -471 246 284 -431 -445 -84 -169 215 242 -31 -258 2 8 239 197 -23 -312 -223 332
4890C32k76k96J1L15Q4K58k44k69k57L32N77o28j07k6k11M48J86k54m14L24J71
$$ 332 56 -240 -229 86 170 428 184 -85 -342 -10 567 -61 -168 -194 -405 43 229 -25 -439 -115 56
4911E6K18N2k52l66J85K66J01j99k14L9N4L94J64p20M2K11L47j64R3k72m25O05
$$ 56 274 326 74 -292 -107 159 260 61 -153 -114 -60 334 498 -222 -180 31 378 214 307 35 -390 215
4933B15j90K55k40l37o4J78N90j20m74pr4O49m8k95l76J15L99K34k01k56j30K06
$$ 215 25 280 40 -297 -361 -183 407 287 -187 -194 -288 361 313 18 -358 -243 156 390 189 -67 -197 9
4955IK15J80n27j29J23J75K24L1j86p70O62M23j87J81m92j24K92j3K99l91j4L
$$ 9 224 404 -123 -252 -129 46 270 301 115 -655 7 430 243 424 -68 -192 100 87 386 -5 -19 -16
4977a6J31L62k78k44k35K67J44K46o34Q2q5K87K56j09n72j69L41L59K68k34m39
$$ -16 115 477 199 -45 -280 -13 131 377 -257 -175 -260 27 283 174 -398 -567 -226 133 401 167 -272
4998b72j82M67N5l07n7L2l60O51M03l98o32M32j5L81J42k59n10P8L76J53k51l77
$$ -272 -454 13 68 -239 -296 -264 -624 27 430 32 -600 -168 -183 198 340 81 -429 -351 25 178 -73 -450
5020d50K28o3M55j48n61%L70J64J83l7o82O2M79K25n3l11j86j23L78M98m09j97
$$ -450 -222 -285 170 22 -539 -539 -169 -5 178 141 -541 -479 0 225 172 -139 -325 -448 -70 428 19 -178
5042a78k07L53J08M41j83n88P4J10P03m59k57Lj86L21N82p44r0J21N90l08k2l24
$$ -178 -385 -32 76 517 334 -254 -180 -70 633 174 -83 -80 -266 55 637 -107 -197 -76 514 206 184 -140
5064a40rJ92L11R83j098o99L20n50P72J47k78l3rL18l81M44o15K61P0K80k09m0
$$ -140 -149 43 354 1337 239 -460 -140 -690 82 229 -49 -82 -91 227 -154 290 -325 -64 6 286 77 37
5086C7j03J96J30l51K42J1k67j64N92kp8m42O0M08k08L94o40P8N65l88j46O15
$$ 37 -66 130 260 -91 151 162 -105 -269 323 321 243 -199 -139 269 61 455 -185 -107 458 70 -76 539
5108E39r30M42p24Q22O84p90l58K52N67n30M29k66J59m01K54J59l90l16K67J05
$$ 539 -391 51 -673 149 833 43 -315 -63 504 -26 403 137 296 -105 149 308 -82 -398 -131 -26
5128b6L69n38m66M46N24J02l86J68J76j12m13N32K98j362J540j233mM22p6k68
$$ -26 343 -195 -661 -215 309 411 25 193 369 257 -156 376 674 -688 852 -381 -385 37 -39 -307
5148c07%N66m76O00j738M83O91J73Q12r27J18q12L58R92p4n33m50O7K93M25o89
$$ -307 -307 259 -217 383 -1355 -872 -181 -8 804 -123 -5 -817 -459 533 459 -74 -524 -457 -164 261 -428
5169d28j59Q20q87O49M27r42M75M62m36m71o7J07J36m64Q19N66m94O41m55p20
$$ -428 -587 233 -654 -5 422 -520 -45 417 -19 -490 -557 -450 -314 -778 41 607 113 754 299 -421
5189d21K38M8Q12j123NL47J81J79o89j6M63m21O97o75N4k56O91R38o28n33r1j10
$$ -421 -183 -135 677 -446 -441 -94 87 266 -423 -439 24 -397 300 -375 -321 -577 114 1052 424 -109 -200 -310
5211c10N77L43o11l70q9N86K24l69j80k47J58R59n71j11j64K44Q1J77k69k56K5
$$ -310 267 610 -1 -371 -460 126 350 -19 -199 -446 -288 671 100 -11 -175 69 150 327 58 -198 -173
5232a73J96J36K42p6l27k49L66J67p3R7n26J97M26Om32k11J52l2L25k45J51k14
$$ -173 23 159 401 325 -2 -251 115 282 209 306 -220 -23 403 409 -23 -234 -82 -114 211 -34 117 -97
5254i7k67M84N04l79m86J28k3L87J25k06l57l2M91p4K5l22k00K83J65J9m77J69
$$ -97 -364 120 624 245 -241 -113 -136 251 376 170 -187 -219 272 198 223 -99 -299 -16 149 168 -309 -140
5276a40J43M7k8K43m71J06L26j92j13j3k52K01L14J57n38LR5R8J21L8k04o0k31
$$ -140 3 50 22 265 -206 -100 226 34 -79 -92 -344 -143 171 328 -210 -207 -112 -14 107 145 -59 -119 -350
5299c50J46K26P2J07l75k92P82n57M9J36p1N79o58O80l68l29J07M71j64J13k31
$$ -350 -204 22 94 201 -174 -466 316 -241 -192 -56 -127 452 -206 474 106 -223 -116 355 191 304 73
5320G3j08q0M63j5k32l17M32J8K58k59m48K28j56K83Rp8J64o7j72N31m26k37J82
$$ 73 -35 -115 348 333 101 -216 216 234 492 233 -215 13 -143 140 149 71 235 168 -4 527 101 -136 46
5343D6k19N5K38l4j10k41M8K66N2k02M8j29K16J63N6m10Pq1J18J84k25J0R4O0
$$ 46 -173 -118 120 86 -24 -265 -217 49 101 -101 -53 -182 34 197 253 -157 -150 -231 -113 71 -154 -144 -50 10
5367A0K09r1r57O55m94J087p29N71o26m41N10J140j168L95m81M96n1J43o59l76
$$ 10 219 128 -829 -174 -668 419 -310 261 -365 -806 -296 844 -324 71 -410 86 35 178 -481 -857
5387h57M94M86L73j041j3K072j741N66m75j00P93k67o59K63J212n64N7j377J192
$$ -857 -363 123 496 -545 -558 1514 -227 339 -136 -236 557 290 -369 -106 1106 542 599 -778 414
5406D14n13O79j258P13r49J700n18q57N26l54J55n18J212J23j644K81J057N84
$$ 414 -99 580 -678 35 -914 786 268 -589 -63 -417 -262 -780 432 555 -1089 -808 249 833
5424H33p88p77N5R04J90r90k03J56K040j778L70l75K87J46m14N15P46p36Q3r92
$$ 833 45 -732 -677 227 417 -573 -776 -620 1420 -358 12 -363 -76 70 -344 171 917 181 264 -728
5444g28M98L37r8j69L61p23J18Q87r6n38l20J010m75j22J63l19N2N14l96L94Q4
$$ -728 -230 107 9 -160 201 -522 -404 483 387 -151 -471 539 64 -58 105 -214 -162 352 -44 350 434
5465D34j292N23M96J10m7l95K17O04m38p16J10P04j31K53o05M61r60L12O25L87
$$ 434 -858 -335 161 271 224 -171 46 650 212 -504 -394 310 179 432 -173 288 -672 -360 265 652
5485F52n52l35j78J70P85m28O8m75J05K01K11j11J64k33J28p4J67m60k19O29k92
$$ 652 100 -235 -413 -243 542 114 182 -293 -188 13 224 113 277 44 172 98 265 -195 -414 215 -77
5506g7L88r77J34K71n00R17l48O97O2j079J240p48K27R6k83l80J117j69j032P13
$$ -77 311 -666 -532 -261 -761 156 -192 505 567 -512 728 -20 207 303 20 -360 757 588 -444 269
5526B69j019j37J049j303O24K37P73r97P20k88l80q64J398M53l88m79k03k82J392
$$ 269 -750 -887 162 -1141 -517 -280 493 -504 216 -72 -452 -1316 82 535 147 -332 -535 -817 575
5545E75P5j685J293L42Q82j581O10P47j742J21j07J41J9M14o86J110n95J10pr11
$$ 575 650 -1035 258 600 1482 -99 511 1258 -484 -363 -470 -329 -310 104 -582 528 -67 43 36 -875
5565h75L09R60n11k6J06o4M57m91M04L24l18o19N94mQ32j078l10Q59j103R43J95
$$ -875 -566 394 -117 -143 -37 -101 356 -135 269 593 275 -344 250 246 1078 0 -310 549 -554 389 584
5586E84j013m45P59L6M78p68R7p71M89Q41K63j225P36J00m78R1K48o86O45L12
$$ 584 -429 -874 -115 -79 399 -369 -272 -1043 -554 287 550 -675 61 161 -317 -226 22 -664 -19 293
5606B93o9m39J67j75J1J1J10R7%j04L6M06j26n7l14K91l10N11j90j67P5k11M56
$$ 293 224 -215 -48 -223 -212 -201 -91 6 6 -98 -62 344 218 161 -153 138 -172 339 149 -18 57 -154 302
5629C02o4l91PJ45J15R5n4l02q3K18K2Q1k89L26j08R5P6j62J51m56K82J26k4p5
$$ 302 238 -153 -146 -1 114 209 155 -147 -230 -12 10 91 -198 128 20 115 191 29 180 -276 6 132 108 33
5653C3k68r2O15k7m52M26k22r9K44O1j75J7O4p2j42K38o1k90J52P7K76p7J5k55
$$ 33 -235 -327 288 261 -191 235 13 -86 158 219 44 61 125 53 -89 149 88 -202 -50 27 303 226 241 -14
5677a4j91M4M90n32Pm5N5K35J87m47j89K62J84j1j46J32k33O2K98k06K1J99l26
$$ -14 -205 -161 329 -203 -196 -241 -186 49 236 -211 -400 -138 46 35 -111 21 -212 -150 148 -58 -37 162 -164
5700a64L53n8k42Kj22K59J88j52j18J99m98L78M50p76R3k23J46J089n16K05q46
$$ -164 189 131 -111 -109 -231 28 216 64 -54 145 -353 25 475 -301 -208 -431 -285 804 288 493 -353
5721c53K05p82J191l46m79O37L6k83K45J95o55K36j16M33PK82n98K4L69l30j4
$$ -353 -148 -930 261 -85 -564 73 109 -174 71 266 -389 -153 -269 164 171 453 -145 -121 248 -82 -96
5742i6j47K21k83J39N63p08K77J57O97j039O82o06O2P87m29k54j8J2m00O23n76
$$ -96 -243 -22 -305 -166 397 -311 -34 123 820 -219 463 -143 -81 706 277 23 5 17 -383 240 -336
5763c36Q16m08k54k9p9r58Q89j62J220Op52Q82m88j167M65J253l87l68m32L8j37
$$ -336 480 72 -182 -211 -290 -1248 -359 -521 699 705 -47 835 347 -820 -355 898 511 143 -289 -251 -388
5784c88j4Q32m37k26l80O89k35J63M48n88o37O92K12p28K59j20k30J019m53p98
$$ -388 -402 430 -7 -233 -613 76 -159 4 452 -136 -773 -81 131 -597 -338 -458 -688 331 -122 -920
5804i20J038N96l36M79j540N32O12o09L24p81j39P20K47l20Q93n26p11J05M19
$$ -920 118 714 378 857 -683 -151 461 -148 176 -605 -744 -24 223 -97 796 270 -441 -336 83
5823H3K74o94p3P60k69m45J061l69r93J151l12p6j46M91n94O29j033R62r10k3
$$ 83 357 -337 -410 350 81 -364 697 328 -665 486 174 98 -48 443 -151 478 -555 407 -503 -526
5843e26k9P69r30L21O29l65p79R21N5p17O79n10M85n14L85J59l10j12M12l21M29
$$ -526 -555 214 -716 -395 234 -131 -910 11 66 -651 28 -482 3 -511 -126 33 -277 -389 23 -298 131
5864A31o87L00J70M0P92n10m22o82J980j045l26M48L07K03q83n0R9Q7K57N73j070
$$ 131 -556 -256 -86 -46 746 236 -186 -868 1112 67 -259 189 496 699 -184 -234 -135 -48 209 782 -288
5885b88M13n96Q15j99M7k44L53m90L26l4q3J39K70l97J91M00p8n97M78j138J083
$$ -288 125 -471 344 145 192 -52 301 -189 137 103 20 159 429 32 223 623 545 -52 426 -712 371
5906C71n05M03o2l61K11J141p85L89l63n8l94k08R77O7n68P9O8r2j60j52K77n26
$$ 371 -134 269 207 -154 57 1198 413 802 439 381 -13 -221 756 823 255 334 402 310 150 -2 275 -251
5928b51J08j24L05j24N71k65R57j647Q64p88J90L46k03O3N4K02n03N95m78n89
$$ -251 -143 -267 38 -86 485 220 1177 -470 394 -394 -204 142 -61 2 56 258 -245 350 -128 -717
5948g17M65J020m88l63L15j39M87m21j21j48M92l55M88m01P3n17j146J277K0K89
$$ -717 -252 768 280 -83 232 93 580 159 38 -110 382 27 515 114 187 -330 -1476 -199 -179 110
5968A10k42l41O09l3o4l87M25j74K3J9J44j55j49n9K3M33k25K91n43J14p5N37
$$ 110 -132 -473 136 103 39 -348 77 -97 -74 -55 89 -66 -215 -274 -251 182 -43 248 -295 -181 -256 281
5990B81k60k10K72j50J06K15j44j83K44q3q6K69k05k21P3J2j69L77j34j94N89
$$ 281 21 -189 83 -67 39 254 110 -73 171 88 2 271 66 -155 -82 -70 -239 138 4 -190 399
6011C99l49Pk81J50rJ28p6J98j60l34K64J54j25O2j93K71k03K71Nk49QJ26k97
$$ 399 50 57 -224 -74 -83 45 -31 167 7 -327 -63 91 -34 28 -165 106 -97 174 179 -70 -62 64 -233
6034b33M62j43L4k97J17rK03j59j2j15J20K92k46k35K62j84K05J36k51j02K62
$$ -233 229 86 120 -177 -60 -69 134 -25 -37 -152 -32 260 14 -221 41 -143 62 198 -53 -155 107
6055A07j59K4L1L6l38K95j05M61l16k6j30J18M8J02l04L7n4L26o0j02q9l8K86
$$ 107 -52 -28 3 39 -299 -4 -109 352 36 10 -120 -2 46 148 -156 -119 -173 153 93 -9 -98 -136 150
6078A50k63L38k24J49j89j72L60K89n97L43j97N7J88m11K06l38M31j24K44J04
$$ 150 -113 225 1 150 -39 -211 149 438 -159 184 -13 44 232 -179 27 -311 120 -4 240 344
6098C44j23m00J38K76n3m20P4k1J07Mk48L32M6K4j18Q6o4j27J50J91p1O1k20J23
$$ 344 221 -179 -41 235 182 -238 -164 -185 -78 -74 -322 10 56 80 -38 48 -16 -143 7 198 127 188 -32 91
6122I1j99L36pj42j65J61L0Q6n69P2J05K69j23pl7o7K23L6r5J58l73J95KK97m75
$$ 91 -108 228 221 79 -86 75 105 191 -378 -306 -201 68 -55 -62 -99 -166 57 93 -2 156 -217 -22 -20 277 -198
6147a98K62j50p5j83K28q5L56l17K72K21l06L51n72J31n5J84j88J30m9p5L81j57
$$ -198 64 -86 -161 -344 -116 -201 155 -162 110 331 25 376 -196 -65 -120 64 -124 6 -43 -118 263 106
6169A06l60M07J9k44J83N3j32n14N00Q4j48r9K25qk91L31P2k03k17J64M9J07j76
$$ 106 -254 153 172 -72 111 164 32 -482 18 102 -46 -145 80 72 -219 112 184 -19 -236 -72 -23 84 -92
6192i2l80L57M6J34J77m32K71q2RO6M4l12P7J74q0L34k44k84p8L03P4j53K14l8
$$ -92 -472 -115 -69 65 242 -190 81 -1 8 74 118 -194 -117 57 -23 311 67 -217 -295 8 82 -71 143 105
6216A05j42M6K78Q2m63J37l41M03j94q8Q6J63k86K74J55k89j55J20Jk1k6NJ44
$$ 105 -37 9 287 369 -94 43 -298 105 -89 -177 -91 72 -214 60 215 -74 -229 -109 -108 -129 -155 -150 -6
6239fJ47K30m20M9k80L77K04j88L88l91k27K32P8m61No8K66J81k44K83o20L69
$$ -6 141 371 -49 0 -280 97 301 113 501 110 -117 115 193 -268 -263 -331 -65 116 -128 155 -465 -96
6261i6J67m9K24j25p9k11J36m2L5p3p2K18k00K79j09j46Q7K42k65L39l63l3J67
$$ -96 71 22 246 121 42 -169 -33 -75 -40 -113 -185 33 -167 112 3 -143 -56 186 -79 260 -103 -136 31
6284C1k21K14l4M6j52L03n0j42k24K02K14J14J6m33K02k26L65k5m57L05q2k06
$$ 31 -190 24 -10 36 -116 187 137 -5 -229 -27 187 301 317 -116 86 -140 225 200 -257 48 -34 -240
6306b40LJ97L2p8M2K28k18N07o66K2M09l77L84l25j35J70%Q0L37k85j32o7J11
$$ -240 -237 -40 -8 -86 -44 184 -34 473 -193 -171 238 -139 245 -80 -215 -45 -45 35 372 87 -45 -112 -1
6329aL6L81m77j82J04K05k04P1J76l13L78r1K15k68l54L55Qm0j0l15L92J40nj31
$$ -1 35 416 -61 -243 -139 66 -138 -67 109 -204 174 83 298 30 -324 31 39 -1 -11 -326 66 206 201 70
6353G0j23K01l41L20ml84L33j05K48m15K57j19o6OJ10l32j7M89j15k71J18K4j21
$$ 70 -53 148 -193 127 123 -261 72 -33 215 -200 57 -62 -128 -122 -12 -344 -361 128 13 -258 -140 -116 -237
6376b37J86j71nL04l81N17k55l4J00L6k31P5J12k60j26L54j78P0J4J28j77j5k35
$$ -237 -51 -222 -227 77 -304 213 -42 -76 24 60 -171 -96 16 -244 -370 -16 -194 -124 -110 18 -159 -174 -409
6399d09L57Q5Jj87m4O8J0M39M7m46r5L62j53j39j30K13j69L6J97m7k07K70j96
$$ -409 -52 33 34 -153 -197 -129 -119 320 367 -79 -174 188 35 -104 -234 -21 -190 -154 43 -4 -211 59 -137
6422a37L90M2k55j3k81L90L2l97J05j9J73j19J15O6j01J58k64k7J34J31l27Lj6
$$ -137 253 295 40 27 -254 136 168 -229 -124 -143 30 -89 26 92 -9 149 -115 -142 -8 123 -204 -201 -217
6445b17R9J30J62j64k13L14OP7j62k47J08J02j7j48O9j20K36J17j64J23l00R3
$$ -217 -118 12 174 10 -203 111 117 194 32 -215 -107 -5 -22 -170 -101 -221 15 132 -32 91 -209 -116
6467a16l0J46K25j34k33K13j23K84j16P1r4j33J60k16l1oJ12j69L31k1l76J49
$$ -116 -146 0 225 91 -142 71 -52 232 116 187 93 -40 120 -96 -127 -133 -21 -190 141 120 -256 -107
6489a07J9J19j57l4J13P2K9j9l39M98k62m3M18m57L08M5m57K64m9J72k15k95N87
$$ -107 -88 31 -126 -160 -47 25 54 35 -304 194 -68 -111 307 -150 158 203 -254 10 -39 133 -82 -377 210
6512B10m73K86J71jj70L22k13J64j49l02q9j49J088q87K87o82l31O96L47j14j095
$$ 210 -263 23 194 193 23 345 132 296 147 -155 -244 -393 695 -192 95 -587 -918 -222 125 11 -1084
6533a084J577l71n70r9J012J30q38L60L30o35K48j70%J87j83L0m09P81M3n9k66
$$ -1084 493 122 -448 -547 465 595 -243 117 447 -188 60 -110 -110 77 -106 -76 -485 296 339 280 14
6554A4M35o76L96j77l41M52l71K64O4j40M3J95j78K4q2K19r1m12O3O25j89J38
$$ 14 449 -227 169 -8 -349 103 -268 -4 60 -80 -37 158 -20 4 -78 141 50 -362 -299 326 137 275
6576B75l04n3J80j68L2q3QJ81M4j19J17k91K61r6J52M0k47L05j96j76P8k43J24
$$ 275 -29 -82 98 -70 -38 -121 -113 68 112 -7 110 -181 80 -16 136 176 -71 234 38 -138 -60 -303 -179
6599a79M50k2j73O8l59K72j3j87L61k72K3J01j00K03kk90N4o9L34o8o1Rn0q6L19
$$ -179 271 249 76 144 -215 57 44 -143 218 -54 -31 70 -30 173 171 -119 -65 -134 200 132 71 80 30 -56 263
6624B63l88J19j12j6%J80m0k71J93M41l04J4j08j7J96l31L51j1m30J37L1J94j98
$$ 263 -125 -6 -118 -134 -134 46 6 -265 -72 369 65 79 -29 -46 150 -181 170 159 -271 -134 -103 91 -107
6647a07K46j37j73K13k39L7kJ80l50J84M19l46o0K05J52l32M0j87N7J31M45m02
$$ -107 139 2 -171 42 -197 -160 -162 18 -332 -148 271 -75 -135 70 222 -110 -70 -257 -200 -69 376 -26
6669b6K20l05m30R8J17J44J00k41J49O44n15l2N63n72J1K39k76j87O82r39O46
$$ -26 194 -111 -541 -443 -326 -182 -82 -323 -174 470 -45 -77 486 -86 -75 164 -112 -299 383 -556 90
6690I0K75m46j07l17N41K74l96O82k58k38k39%m%j18j16O36R5K97j012J13k12
$$ 90 365 -81 -188 -505 36 310 -86 596 338 100 -139 -139 -143 -143 -261 -377 259 354 651 -361 -248 -460
6712d60J065o34n2J45m43K19L5O16p65O26N16o6j047l0k00L0K18J31l92O50o42
$$ -460 605 -29 -81 64 -379 -160 -125 491 -274 352 868 802 -245 -275 -475 -445 -227 -96 -488 162 -480
6733d80O26O4k04o76L46L50L08q16Q35P7k21n58R47p28j85N40J23j20P0j528O76
$$ -480 146 210 6 -670 -324 26 334 -482 353 430 209 -349 598 -130 -315 225 348 228 298 -1230 -554
6754e54O7N61r80N85O25M0p39L64N00j58L50r04r4L92n01J53M21m68N21j60o27
$$ -554 -487 74 -906 -321 304 344 -395 -31 469 311 661 -243 -337 55 -446 -293 128 -340 181 21 -606
6775f06M91O75q34p1L77L15r05P29l14M11k89L62p35K90K74k48j02M22l57J41
$$ -606 -115 560 -274 -345 32 347 -558 171 -143 268 -21 341 -394 -104 170 -78 -180 242 -115 26
6795B6J64j62J26n05L69J6M9k46J55Q9j14j04r6P1n8L31l8J09p0j58J25J5r6K3
$$ 26 190 28 154 -351 18 34 83 -163 -8 81 -33 -137 -233 -162 -220 111 73 182 112 -46 79 94 -2 21
6819B1k65L58j31J57l22M45m27j10P0Q1p2J45r8j19K05P9J04l44L49m4q6J69l71
$$ 21 -244 114 -17 140 -182 263 -164 -274 -204 -123 -195 -50 -148 -267 -62 17 121 -223 126 82 -4 165 -206
6842b06K03o5j47J65K33k88J06k53K46pk89N66n06k3L22p9J6l39N08J03k91K54
$$ -206 -3 -68 -215 -50 183 -105 1 -252 -6 -13 -302 264 -242 -265 57 -22 -6 -345 163 266 -25 229
6864B29k79n7n7P8L26l61j89M45k60L42l00L64j53k43L1o3K14m12J14N1K12j53
$$ 229 -50 -107 -164 -86 240 -121 -310 135 -125 217 -83 281 128 -115 -84 -147 67 -345 -231 -180 32 -121
6886a21l54O92l54K18p6l49o0O09n17N27m83M80J13o23K80j93J41L25k82j41K89
$$ -121 -475 217 -137 81 5 -344 -404 205 -312 215 -268 212 325 -298 -18 -211 -70 255 -27 -168 121
6907A21j14K78n1q3o3k97L98l36N99m30k3p7m3m2K6K08k46L27m39R9K10l0l40
$$ 121 7 285 234 151 88 -209 189 -147 452 22 -1 -78 -121 -163 -137 71 -175 152 -287 -188 22 -8 -348
6930c48K15l22M7M64L14L64j044Q06K30m15o29K71L03k14q02P42o9k27K63R4O7
$$ -348 -133 -455 -408 56 370 734 -310 496 726 311 -318 -47 256 42 -760 -18 -87 -314 -51 43 110
6951A10k51M95J23n15k48M57n24L46N3p5O6l68M88J79j90J46l4n20M86l04J4j87
$$ 110 -141 354 477 -38 -286 171 -353 -7 46 -29 37 -331 157 336 146 292 258 -262 224 -80 -66 -253
6973b53K16k7J71N2k93J04q1L17p0J06k42M8j3j31n6r4O4L39k06J65j11J0K22
$$ -253 -37 -64 107 159 -134 -30 -111 206 136 242 0 48 35 -96 -152 -246 -182 157 -49 116 5 15 237
6996B37j91k92P0k1K29j84Q8k0N4J60k27K39K8k30k63L40R2l7L1l61J96k39k47
$$ 237 46 -246 -176 -197 32 -152 -64 -84 -30 130 -97 142 170 -60 -323 17 109 72 103 -258 -62 -301 -548
7019e48J86J25l80M95K94k12L32j09p79N21r3L54n00J59M02m78k44P26J72o00
$$ -548 -362 -237 -617 -122 172 -40 292 183 -596 -75 -168 186 -314 -155 247 -231 -475 251 423 -177
7039a77j04J88j06l33N37j75K92k63K64J85n3k30n4K95R9j20l19p3J50j32J26
$$ -177 -281 -93 -199 -532 5 -170 122 -141 123 308 255 25 -29 266 365 245 -74 -147 3 -129 -3
7060cl42N22j87j66M23l43M8k22L57J9n55M86K6j37N8k90N55m2m10R1J04K46m92
$$ -3 -345 177 -10 -176 247 -96 -48 -270 87 106 -449 37 63 -74 -16 -306 249 207 -203 -112 -8 238 -254
7083b54J09M24j69j81p7J42l02K62j98O61M40m87p98K0K95J6l35l5L08M38k2j69
$$ -254 -145 279 110 -71 -148 -6 -308 -46 -244 417 857 370 -428 -408 -113 -97 -432 -467 -159 279 257 88
7105H8J14p4J48j026M29M13l54O03k59k60J26P4M79k51k26P22j199L06j26K82
$$ 88 202 128 276 -750 -321 92 -262 341 82 -178 -52 22 501 250 24 746 -453 -147 -273 9
7125Ij38m68K19O90r7k90M05o35P09p31l16L70N95k68M06j243p9J116L7k39l29
$$ 9 -129 -597 -378 312 215 -75 330 -305 404 -327 -643 -273 322 54 460 -783 -862 254 291 52 -277
7146b77R03m30n96R5M24l34M28k31J46r56K18J412m24J08q07L08j14j49M37L16
$$ -277 626 196 -400 -305 119 -215 213 -18 128 -828 -610 802 378 486 -321 -13 -127 -276 161 477
7166D77o62Q6K56k82l94K81Q7L83m75J07K43k04k84M20k31N3n5K62k0j17R4j83
$$ 477 -185 -99 157 -125 -519 -238 -151 232 -243 -136 107 -97 -381 39 -192 -139 -194 68 48 -69 25 -158
7188a58O8J51O6k42K34n89N93m37j58L80k83M72j37k17J50k30J80J81j02J04O9
$$ -158 -90 61 127 -115 119 -470 123 -314 -472 -92 -375 97 -40 -257 -107 -337 -157 24 -78 26 95
7209I5K4k67P5J13o0J08l59Q9Pn5J79M5J00l25M04l81m9K07J04l69L22j97R5q4
$$ 95 119 -148 -73 40 -20 88 -271 -182 -175 -230 -51 -6 94 -231 173 -208 -257 -50 54 -315 7 -190 -95 -179
7233a79L32k03K40l39J9L81k80Jj00Q2J95j03K42l16R5J6M6n4L07k25N8k5j87
$$ -179 153 -50 190 -149 -130 251 -29 -28 -128 -46 149 46 288 -28 67 83 129 75 382 157 215 190 3
7256CJK2k03J93L68m26L74k05l56N96p37L65m1L18o1m11J40K3J32q2j17L1J41
$$ 3 4 26 -177 16 384 -42 332 127 -229 367 -370 -5 -46 272 211 -200 -60 -37 95 13 -104 -73 68
7279F8J08k88K08q1m3M6k00L24k63k1J28N1k0M3j89K49K7J03j98j51K3J46l77
$$ 68 176 -112 96 15 -28 18 -182 142 -121 -142 -14 37 17 60 -129 120 147 250 52 -99 -76 70 -307
7302c07J57Q6k5j62J56K19J68j81j36q8J43P2j65n4J94j00q8pm6n5L64q1j11R1
$$ -307 -150 -64 -89 -251 -95 124 292 111 -25 -113 30 102 -63 -117 77 -23 -111 -118 -164 -219 145 64 -47 44
7326D4j7n0r1M57m37q2J38J89Kj87r9K05M7j96j0k46J17J40K78n6k64J59k81Q4
$$ 44 27 -23 -114 343 -94 -176 -38 151 153 -34 -133 72 119 -77 -87 -333 -216 -76 202 146 -118 41 -240 -156
7350a56K69j71J24n4o0l8K75L0k82m8O9K96K5M8l55rj2j81L35j80J61j13j21j1
$$ -156 113 -58 66 12 -48 -86 189 219 -63 -111 -42 254 279 327 -28 -37 -49 -230 105 -75 86 -27 -148 -159
7374a59j44K37K86k48j90K65J51l36O9J88q1R9R5l58J9J01M1J0k43M47k82j97
$$ -159 -303 -66 220 -28 -218 47 198 -138 -69 119 38 137 232 -126 -107 -6 35 45 -198 249 -33 -230
7396b30M30n07K51J17j05L66l62J03k13J52N9o5L11l96k8o7J41R8O8n6k53K26
$$ -230 200 -307 -56 61 -44 322 -40 63 -150 2 61 -4 307 -89 -117 -184 -43 55 123 67 -186 40
7418D0R5k09J76Qj41j03K11l07N00l44kL36k25j67l9K95k8p2K53l19l1R9N4o8
$$ 40 135 -74 102 110 -31 -134 77 -230 270 -74 -76 260 35 -132 -171 124 96 24 277 -42 -73 26 80 12
7442A2L25m80j38J12K60Mk01k68K66K55K4q7J6m6J60P9j53m3k69K03J69o1J49
$$ 12 337 -143 -281 -169 91 95 -106 -374 -108 147 171 84 100 54 214 293 140 97 -172 31 200 139 288
7465B88l58Q9J48k76J57j21L1l9MQ2k12L54k20n0K09o4l40K88n17O36RK58k07
$$ 288 -70 19 167 -109 48 -73 -42 -81 -77 5 -207 147 -73 -123 86 22 -318 -30 -547 89 98 356 149
7488A49O93j147J149p08j233J557k55q4j71M0J01j59n3J8L08k35M6l77M39j86
$$ 149 842 -305 844 136 -1097 460 205 121 -50 -10 91 -68 -121 -103 205 -30 16 -361 78 -108
7508a08M2JK2K39k48O0j46l5k06N79R3n01L27j76J5M34l52q1j22p4M39j87L45
$$ -108 -66 -65 -43 196 -52 8 -138 -173 -379 200 293 -208 119 -57 -42 392 40 -41 -163 -237 202 15 360
7531C60r2l08P23k8o00N3k28j09O50o23j108J036K8j96J217q98M99p86K1L97N30
$$ 360 268 -40 683 655 55 108 -120 -229 421 -202 -1310 -274 -246 -442 775 -123 376 -410 -389 8 538
7552E38j342J430J33j291J83M52k25kQ23j25n79K98n72M59r57O28o17O8J136j244
$$ 538 -804 626 759 -532 -349 103 -122 -124 699 574 -5 293 -279 180 -777 -149 -766 -698 438 -806
7572h06J668p45L49K17o47n42N91m59J315j639K80O2Q02j89j011R94l75O25q14
$$ -806 862 117 466 683 36 -506 85 -374 941 -698 -418 -356 446 257 -754 240 -135 490 -324
7591c24P81k82J00n59P06q7l00l7L20m70o10L15l8J046n51n09R2N68j81P5n94
$$ -324 457 175 275 -284 422 335 35 -2 318 -152 -762 -447 -485 561 10 -499 -407 161 -20 55 -539
7612e39M08kK86j53k03L1K17j65J99j85rj49N39l19j95M99m37J34JJ20k52L18
$$ -539 -131 -133 153 0 -203 -172 45 -120 79 -106 -115 -264 275 -44 -239 260 -177 -43 -42 78 -174 144
7634A44k70L89m35N9j14L50M9m31M18k08l24K48J41Q4l97J39L77j77Qj56J46j75
$$ 144 -126 263 -172 -113 -227 123 172 -259 159 -49 -373 -125 16 100 -297 -158 219 42 50 -106 40 -135
7656a35M75l53Q9l28M00m89L68K4k0n4pk6J7J13j02n9J55J83o5o3l01K16p1q0
$$ -135 340 -13 76 -252 148 -341 27 51 31 -23 -30 -56 -39 74 -28 -87 68 251 186 123 -178 38 -33 -113
7680a13J09K1M21n56L10j59r3P2k96K58K90n70L41j79J18R9k9K70j41L9l71K89
$$ -113 -4 17 438 -118 192 33 -60 12 -284 -26 264 -306 35 -144 -26 73 44 314 173 212 -159 130
7702A30l18n2K20l21J92K44k21L55k28L6q0KK79k90J37j7q9o7J63K02m50k6K88
$$ 130 -188 -240 -20 -341 -149 95 -126 229 1 37 -43 -41 238 -52 85 68 -21 -88 75 277 -173 -199 89
7725H9O3k6R6j18J25l79J33R3l07K1pK59O7J08j69q9LJ86k01L89k37j01K10m72
$$ 89 152 126 222 104 229 -150 -17 76 -231 -210 -217 42 109 217 48 -41 -38 148 -53 336 99 -2 208 -264
7749b64K42O4p4K5L43o14M15k40k6L23m03J89jj38O2M52m78K56m41N44j31r7k37
$$ -264 -22 42 -32 -7 336 -278 137 -103 -129 194 -209 -20 -21 -159 -97 355 -123 133 -308 236 105 8 -229
7772b29M72m0j92j2j15oJO8o7j2K16j08j33M1o4K54j57R1J46nj77j22j69M72p7
$$ -229 243 203 11 -1 -116 -122 -121 -53 -120 -132 84 -24 -157 -116 -180 74 -83 8 154 149 -28 -150 -319 153 76
7797G6j99J69j3l19J73K21l60j96N35j30n1L7L41l74J78j75K08j58L3M9J16J05
$$ 76 -123 46 33 -286 -113 108 -252 -448 87 -43 -94 -57 284 -90 88 -87 121 -37 -4 45 161 266
7819B66L0l51j23L59j90K50k26K3k09K29j59NMJ36O9M5j14k3J2k22O2J19Q9j35
$$ 266 296 -55 -178 181 -9 241 15 38 -171 58 -101 -96 -92 44 113 158 44 21 33 -189 -127 -8 81 -54
7843e4J27j49j8k9K08j40L8Q4J04j56J1m01L35q7K1J25J21k1l45R4o1k06J97L42
$$ -54 73 -76 -94 -123 85 -55 -17 67 171 15 26 -375 -40 -127 -106 19 140 119 -226 -132 -193 -399 -202 140
7867A40k70J91jJ7j4p7j99M35m98J40K1J82l70j8K98k05K00K36l8j41J92l22L3
$$ 140 -130 61 60 77 63 -14 -213 222 -276 -136 -115 67 -303 -321 -23 -228 -28 208 170 29 221 -101 -68
7890f8J4J01J11O1j01j34K09m4k37j54n5L44K4J82j36j85K70Q0m54R2O7j87M71
$$ -68 -54 47 158 219 118 -16 193 149 -88 -242 -297 47 71 253 117 -68 202 282 -172 -80 -13 -200 271
7913B71O8m21L60l74P88o82J73m2P2k89m63Q65K95q45L9op0L35K64j36n41N76
$$ 271 339 -82 278 -96 692 10 183 141 213 -76 -539 326 621 -224 -185 -191 -261 74 338 202 -339 237
7935B37k34R9N4k56j33J84k3Q9q7q4M59k79K28k98o9j23K45J69P1m10o8K83k32
$$ 237 3 102 156 -100 -233 -49 -72 17 -70 -154 305 26 254 -44 -113 -236 9 178 249 -161 -229 54 -178
7958a78M17j35j40j51K96p5l2K49j59j95Q8n7J55j88K63l40P9L90r0r2J2j12l59
$$ -178 239 104 -36 -187 109 34 2 251 92 -103 -15 -72 83 -105 158 -182 -103 287 197 105 117 5 -354
7981c54L69k49M69k6Ro0q4K24j73j10J87m0j42J7j19K08k03J7M7O6R4K3J02k50
$$ -354 15 -234 235 209 218 158 74 298 125 15 202 162 20 37 -82 126 -77 -60 -13 53 147 170 272 22
8005B2P2M6k50J68J13l3N1M4k30r0p1j33M39n2P8j87J49k8m59K75Q0n2k53J54
$$ 22 94 140 -110 58 171 138 189 233 3 -87 -158 -291 148 96 174 -13 136 108 -351 -76 4 -48 -301 -147
8029a47N64m4n32J37k88J02L71k83J34J2J0J23l1j56J32k96R3l16L64m9R3L85
$$ -147 417 373 -159 -22 -310 -208 163 -120 14 26 36 159 128 -28 104 -192 -99 -415 -51 -100 -7 378
8051C78m69J85l39R3k55K6N14J5M9p2k99J73j16J26L07n52M5K13j53M1J93j22
$$ 378 -91 94 -245 -152 -407 -381 133 148 197 125 -174 -1 -117 9 316 -236 -191 22 -131 -90 103 -19
8073a9k1L85n29O1K60O8M4l60J40k85L65j54K34n27M52J4l28N46l16k72O8J16
$$ -19 -40 345 -184 -123 137 205 249 -111 29 -256 109 -45 189 -338 114 128 -200 346 30 -242 -174 -58
8095e8k78K43l8J87j24O2K34m11R0pL2J8K25r5L7l1K6j93J24M8k24L9J19o0rQ5
$$ -58 -336 -93 -131 56 -68 -6 228 -183 -93 -100 -68 -50 175 80 117 86 112 -81 43 91 -133 -94 25 -35 -44 41
8121D1k50L36q6K25k92L17l47N8K73j4j002M92K94l93K63k07J49K50R6n87N63
$$ 41 -209 127 41 266 -26 291 -56 2 275 261 -741 -249 45 -348 -85 -292 -143 107 203 -384 179
8142A79k47J25K96k81%M97q11L49k87M27m8poJ25o95M34k00L89J6k29L24o28j59
$$ 179 -68 57 353 72 72 569 -242 107 -180 247 199 192 186 311 -384 50 -150 239 255 26 350 -278 -437
8165d37N75L57K15j362M83j75p07R92P61k62m04l03K91K78m71K70j99M02m31J86
$$ -437 138 495 710 -652 -169 -344 -1051 -59 702 440 36 -267 24 302 -169 101 -98 304 -127 59
8185E9n3m28N53nK15k87
$$ 59 6 -422 131 126 341 54
8191E4
$$ Imaginary data points
##PAGE= N=2
##DATA TABLE= (X++(I..I)), XYDATA
0@%%%%%%Qj6J6j6J7k5L2m0M8n6P2q6J00j18J37j59J84k11K43k81L22l65M14m68
$$ 0 0 0 0 0 0 0 8 -8 8 -8 9 -16 16 -24 24 -32 40 -46 54 -64 73 -86 98 -113 130 -151 171 -194 220 -248
30b48N28n94O68p48Q35r32J037j151J278j419J573j740J924k132K363k619K907
$$ -248 280 -314 354 -394 441 -491 546 -605 673 -746 827 -913 1011 -1121 1242 -1377 1530
47A530l236L612m045M556n166N905o831Q029r641J1948j5553K2035l7351J39150
$$ 1530 -1706 1906 -2139 2417 -2749 3156 -3675 4354 -5287 6661 -8892 13143 -24208 114942
61A14942J42033j75578q5601j828R4858M4232l0876q9272n159P0436N7806l2216
$$ 114942 256975 81397 -4204 -6032 88826 133058 102182 12910 7751 78187 135993 103777
73A03777o1056m1989K3641N9779K9099m7823n2097m397L0106K7820J0314l3510
$$ 103777 42721 732 24373 84152 113251 65428 13331 8934 39040 66860 77174 43664
85D3664m3765k628L6159K2350l145k7737m0347p887M6986L8661k1256n3625l2071
$$ 43664 -101 -2729 33430 55780 52635 24898 -15449 -23336 23650 62311 41055 -12570 -44641
98d4641J9457O2659L1059n6422p7278N553P2587M9183k5918p7242m3521N2473
$$ -44641 -25184 37475 68534 12112 -65166 -59613 12974 62157 36239 -41003 -84524 -32051
110c2051Q6870K216p9338n5739K4041O9809M2252l7720p9155j5576O4616N4538
$$ -32051 54819 57035 -22303 -78042 -54001 15808 58060 20340 -58815 -74391 -9775 44763
122D4763j2281n2070l8388J4737N9406K9976l8304m7759j207L1312L1052P517
$$ 44763 32482 -19588 -57976 -43239 16167 46143 7839 -39920 -41127 -9815 21237 28754
134B8754k9169l5279N807L2501J8909j245j9336l2162m611M0844L3728j5334m1774
$$ 28754 -415 -35694 -29887 2614 21523 20278 942 -31220 -35831 5013 38741 23407 -18367
147a8367k6654J4676N3226K9534m4723o3664K415N7974M3046j6690o2492m1574
$$ -18367 -45021 -30345 22881 52415 7692 -55972 -53557 4417 47463 30773 -31719 -73293
159g3293L8388P3128P983o1631n1425R919N6637M3652k6366p1765k2903N2188
$$ -73293 -34905 38223 46206 -15425 -66850 -56931 -294 43358 16992 -54773 -77676 -25488
171b5488N1596n600m7630m1079J0524N4834K7682l5543m4337k159K7247K7427
$$ -25488 26108 20508 -27122 -68201 -57677 -2843 24839 -10704 -55041 -57200 -29953 -2526
183b526O024k6791l0217N174K7375J5551k57j5017k7905m254L4641K9527j0531
$$ -2526 3498 -23293 -53510 -48336 -20961 -5410 -5667 -20684 -48589 -52843 -18202 11325 794
196G94l3429k3621J1852M6466K8457l4367n2293n49M6997M0711n252n0903m0114
$$ 794 -32635 -56256 -44404 2062 30519 -3848 -56141 -56690 -9693 31018 25766 -25137 -65251
209f5251L0006O6575J5975m8345m7818K766N1940M7762j7783o4747k3798M6410
$$ -65251 -35245 31330 47305 -1040 -48858 -46092 5848 53610 35827 -28920 -52718 -6308
221f308N0909J038m1004l8906Q663N1312K7489k8900l8191l358K2049K6727R109
$$ -6308 44601 45639 4635 -34271 -25608 25704 53193 24293 -13898 -17256 4793 31520 40629
234D0629k2945k8292K732K4157J5585J688j5056k6465l547L1250K4271j0653k8445
$$ 40629 17684 -10608 -7876 16281 31866 33554 18498 -7967 -11514 19736 44007 33354 4909
247D909k0376Q084L7838K3326k8214m4598l539L5024L4541n32m3023m0010K0094
$$ 4909 -15467 -7383 30455 53781 25567 -19031 -22570 12454 46995 46463 3440 -36570 -16476
260a6476N6870J7307l9691m5140m562M2756M4793j3133n9015k5299L6613M4603
$$ -16476 40394 57701 18010 -27130 -31692 11064 55857 42724 -16291 -41590 -4977 39626
272C9626M837l5242l9220K497M4607K7665k2818l6378q708J6908K7549J1576k2496
$$ 39626 44463 9221 -29999 -27502 17105 44770 21952 -14426 -23134 -6226 21323 32899 10403
285A0403l0344J109K3086J7104K44j7223k3438n42K8788J8632j0731k3093j6282
$$ 10403 -19941 -18832 4254 21358 21602 4379 -19059 -19601 9187 27819 17088 -6005 -22287
298b2287O561K9882K0592k1014l7828m839K6846K9885L812l5294l6057J3569M8193
$$ -22287 -15726 14156 34748 13734 -24094 -28933 -2087 27798 31610 -3684 -39741 -26172 22021
311B2021J8272l1496m0306p635L5484M3132q305n1763k5133K8443L9685Q749k8211
$$ 22021 40293 8797 -31509 -39144 -3660 39472 31167 -20596 -45729 -17286 22399 31148 2937
324B937l7161l110L8775K9312j6908l4306j1763J3795K7998J3331k2635l0673
$$ 2937 -34224 -37334 1441 30753 13845 -20461 -32224 -18429 9569 22900 265 -30408
336c0408J742K4209J5001k10j7923k0991K492K4833J4996r374j8103j5052L022
$$ -30408 -28666 -4457 10544 10334 -7589 -28580 -26088 -1255 13741 4367 -13736 -28788 -25766
349b5766K7630K0622j8518l3210o631K2658L0747O279l2842l6443J2820M4605
$$ -25766 1864 22486 3968 -29242 -35873 -13215 17532 23811 -9031 -45474 -32654 11951
361A1951J9132k6186l7437q710L1263M0218m517m5110k4021K2166L6665J2156
$$ 11951 31083 4897 -32540 -41250 -9987 30231 25714 -19396 -43417 -21251 15414 27570
373B7570k1740l7070m994L5434K9570j1869l1506j5426J2058K9219J5212k1063
$$ 27570 5830 -31240 -36234 -800 28770 16901 -14605 -30031 -17973 11246 26458 5395
385E395k9133J182K2576J4900J126j5426k0474J933K2821J5241o690j7990j3847
$$ 5395 -23738 -22556 20 14920 16046 620 -19854 -17921 4900 20141 13451 -4539 -18386
398a8386J725K6446J9523j6008l0635n959K0891K6342O703k9390l0947J1814L8002
$$ -18386 -16661 9785 29308 13300 -17335 -23294 -2403 23939 30642 1252 -29695 -17881 20121
411B0121J5441k1054l0890r765K5844L5762j473l7069k4888J6424L2414J6613
$$ 20121 35562 14508 -16382 -26147 -303 35459 33986 -3083 -27971 -11547 20867 37480
423C7480j7411l6101r174L2631K9746q662k9395j6666R293K8676J5994j9070k8473
$$ 37480 20069 -16032 -25206 7425 37171 28509 -886 -17552 -8259 20417 36411 17341 -11132
436a1132r51K0074J6236K256j5924k0918O84K2595J4139o136j7550j4486K723
$$ -11132 -12083 7991 24227 26483 10559 -10359 -9675 12920 27059 20923 3373 -11113 -8390
449h390K5247J5862j7112k6050n280J7260K2215N444k4772k7239P258L1420J4314
$$ -8390 16857 32719 15607 -10443 -15723 1537 23752 29196 4424 -22815 -15557 15863 30177
462C0177j5467k6812j3886J8458L3930J929l2785k4904R807K9395J7505j4649
$$ 30177 14710 -12102 -25988 -7530 26400 28329 -4456 -29360 -19553 9842 27347 12698
474A2698l5077j1741K8615K8724o576k6708j8600O223K6971J6281j7679k6805
$$ 12698 -22379 -34120 -5505 23219 16643 -10065 -28665 -22442 4529 20810 3131 -23674
486b3674l006J6777J6865M077j5258k1999L64K2629J4017o333j6782j4194M205
$$ -23674 -26680 -9903 6962 11039 -4219 -26218 -25854 -3225 10792 4459 -12323 -26517 -22312
499b2312K4114J4312j5955k3256l683J5278K0918O586k1581k5240O043K8528J5466
$$ -22312 1802 16114 159 -23097 -26780 -11502 9416 16002 -5579 -30819 -24776 3752 19218
512A9218j0906k5117j4695J7261L3520M768l0171k3414Q510K7846J8197j1579
$$ 19218 8312 -16805 -31500 -14239 19281 24049 -6122 -29536 -21026 6820 25017 13438
524A3438l2340j0593K5957K5816l791k1969j6864L189K4200J7044j2850k4331
$$ 13438 -18902 -29495 -3538 22278 18487 -3482 -20346 -17157 7043 24087 11237 -13094
536a3094n682J4036J7412O472j3869k2661o82K1653J4497n848j6641j4047M213
$$ -13094 -18776 -4740 12672 19144 5275 -17386 -18068 3585 18082 12234 -4407 -18454 -14241
549a4241K2599J2265j5020k0688m263J2026J9643O605j9903k4227M305K5314J4497
$$ -14241 8358 20623 5603 -15085 -19348 -7322 12321 18926 -977 -25204 -20899 4415 18912
562A8912r215k4079j4592J5268L0512L933k7013k1408O424K3487J7587r117k9000
$$ 18912 9697 -14382 -28974 -13706 16806 20739 -6274 -27682 -21258 2229 19816 10699 -18301
575a8301j1392K1178K3926j26j8106j8047m88K3082J9137r473k4050q065J3118
$$ -18301 -29693 -8515 15411 15285 -2821 -20868 -21356 1726 20863 11390 -12660 -20725 -7607
588g607J8861R290j4477k2305O05K1508J4189m515j5161j2496M377K1961J1930
$$ -7607 11254 20544 6067 -16238 -15633 5875 20064 15549 388 -12108 -7731 14230 26160
601B6160j2892j7530m141J1045J8718P537j6971k1813M106K3002J4273p110k0945
$$ 26160 13268 -4262 -8403 2642 21360 28897 11926 -9887 -5781 17221 31494 24384 3439
614C439j3416J3359K6955M773k2684j8699L279J9008J7680n222k5658j3138J6382
$$ 3439 -9977 3382 30337 35110 12426 -6273 -2994 16014 33694 28472 2814 -10324 6058
627F058K1810L269j6271j9901k999K1664J9677r187k4622r111J0724J8280P884
$$ 6058 27868 31137 14866 -5035 -8034 13630 33307 24120 -502 -9613 1111 19391 27275
640B7275j4715k2162j157J9040J2178m379j4534j4074K129J9431J1092j1894j8138
$$ 27275 12560 -9602 -10759 8281 20459 16080 1546 -12528 -10399 9032 20124 8230 -9908
653i908o553R387J7082O986j7534k1810L328K0351J2079o577j9173j3958J0880
$$ -9908 -16461 -7074 10008 16994 -540 -22350 -19022 1329 13408 6831 -12342 -26300 -15420
666a5420K4141M357j9445j7476R96J6528J7014k827k4073j3231J3383K1175M795
$$ -15420 8721 13078 -6367 -23843 -22847 -6319 10695 7868 -16205 -29436 -16053 5122 9917
679I917j3517j9456l744K0223J9105p309k1059q371Q963J6764R407j1203k0030
$$ 9917 -3600 -23056 -26800 -6577 12528 5219 -15840 -24211 -15248 1516 10923 -280 -20310
692b0310j609J6331J3567o87j2709j4642J547J9846J2372r944j7227o329R749
$$ -20310 -21919 -5588 7979 7292 -5417 -20059 -18512 1334 13706 3762 -13465 -19794 -10045
705a0045J8714O207j6297j9303L613J9220J1177n331j6805j2424R852K1821N259
$$ -10045 8669 14876 -1421 -20724 -17111 2109 13286 7955 -8850 -21274 -11422 10399 15658
718A5658j5788j6129p14J4003J7800j788k2090j3404J1737J9094N847j1137j8485
$$ 15658 -130 -16259 -16973 -2970 14830 13042 -9048 -22452 -10715 8379 14226 3089 -15396
731a5396n040J7753J8199n432j8877r003N635J5899J0807r217j9913l933J4359
$$ -15396 -20436 -2683 15516 10084 -8793 -17796 -12161 3738 14545 5328 -14585 -18518 -4159
744d159J3635R60j1843j5821P91J9728J2284r812j6872n586Q782J6784N989j4701
$$ -4159 9476 10436 -1407 -17228 -16437 3291 15575 5763 -11109 -16695 -7913 8871 14860 159
758A59j6889L126J6096J0115k858j4296j2328P458J9973O328j3430j4561k631
$$ 159 -16730 -13604 2492 12607 9749 -4547 -16875 -9417 10556 16884 3454 -11107 -13738
771a3738J3002J7274L92k0686j2798J0008J8048O319r338j7255n929J6124J7293
$$ -13738 -736 16538 16930 -3756 -16554 -6546 11502 17821 8483 -8772 -14701 1423 18716
784A8716l574j6096r864L746J4561J2514q561j9578m648J3640J3686J331j1596
$$ 18716 15142 -954 -10818 -7072 7489 20003 11442 -8136 -12784 856 14542 15873 4277
797D277j6039J082J8386J0995r129j5074n827P225J5126O232j3496j5854J471
$$ 4277 -11762 -10680 7706 18701 9572 -5502 -11329 -4104 11022 17254 3758 -12096 -10625
810a0625J3349J0883j601j3748j3554O035J8937O670j2343j4842l239J1933J6102
$$ -10625 2724 13607 12006 -1742 -15296 -9261 9676 16346 4003 -10839 -14078 -2145 13957
823A3957k52j8801j1970Q825J5049O217p607j5633o136J3285J5777j544j4182
$$ 13957 13705 -5096 -17066 -8241 6808 13025 5418 -10215 -16351 -3066 12711 11167 -3015
836c015r717P59J4497J2262o015j8446n691J2104J2990K925j0600j5295K53J7156
$$ -3015 -12732 -11973 2524 14786 8771 -9675 -15366 -3262 9728 12653 2053 -13242 -12989 4167
850D167J0931o733j3746o790N617J4939P727j1533j6373O19J3297J1322n43j3932
$$ 4167 15098 8365 -5381 -12171 -6554 8385 16112 4579 -11794 -11175 2122 13444 12901 -1031
864a031j3652O542J8855O004j1921j3363k861J1061J4819N5j6318j0824O324J3019
$$ -1031 -14683 -8141 10714 16718 4797 -8566 -11427 -366 14453 14508 -1810 -12634 -6310 6709
878F709P086m888j4964p444J1318J5500o39j2016j0930r8J3130J2962o243j7518
$$ 6709 13795 8907 -6057 -13501 -2183 13317 12678 662 -10268 -10366 2764 15726 9483 -8035
892h035n487J0172J2487L500r718j5053p26J5112J0953n801j2252p338L765J4464
$$ -8035 -13522 -3350 9137 12637 2919 -12134 -12860 2252 13205 7404 -4848 -12186 -8421 6043
906F043Q234j1205j5223l55J1613J1157J67j3384j2497N711J6821N370r460j1603
$$ 6043 14277 3072 -12151 -12506 -893 10264 10431 -2953 -15450 -9739 7082 12452 2992 -8611
920h611l910Q530J4224J497j4128j0790M706J1848Q357l696j4663q397J0787J5744
$$ -8611 -12521 -3991 10233 11730 -2398 -13188 -8482 3366 11723 8027 -6636 -15033 -4246 11498
934A1498P65j2305j0890Q2J3166J2572n768j6253m989R158J1327M006q391j3694
$$ 11498 12263 -42 -10932 -10850 2316 14888 9120 -7133 -12122 -2964 8363 12369 3978 -9716
948i716j608J3873J0352m145j1178q368L312J4418Q072r940j4889q24J0863J0617
$$ -9716 -11324 2549 12901 8756 -2422 -10790 -7478 6940 15012 5072 -9817 -10641 222 10839
962A0839L60j1853j1757M353J4891N340p687j0848m879P372J3992K452j3649j0998
$$ 10839 11199 -654 -12411 -8058 6833 12173 4486 -6362 -11241 -3869 10123 12575 -1074 -12072
976a2072L348J1290Q837l228j4568q143J0270J4012M40j0656r720q27J1213J1555
$$ -12072 -8724 2566 11403 8175 -6393 -14536 -4266 9746 10186 -470 -10190 -11017 196 11751
990A1751m528j4128n287O679J0490N228o716j3672l057J2765J0797k595j0718
$$ 11751 7223 -6905 -12192 -5513 4977 10205 3489 -10183 -13240 -475 10322 7727 -2991
1003b991r441K818J4336Q593j0144j3813q84R676J0415Q50j0576j1828L698J4355
$$ -2991 -12432 -9614 4722 13315 3171 -10642 -11526 -1850 8565 9415 -1161 -12989 -9291 5064
1017E064N520o307j0309n917O922J3646K870j2607j0359K631J0733Q546k887j3429
$$ 5064 10584 4277 -6032 -11949 -5027 8619 11489 -1118 -11477 -8846 1887 10433 7546 -5883
1031e883p372Q959J2722Q75q378r300k244J0227J1324k784j2881o180N339R846
$$ -5883 -13255 -4296 8426 9301 923 -8377 -10621 -394 10930 8146 -4735 -10915 -5576 4270
1045D270O833o201j3860l194J2040J0869k218j0233q913K470J3580P358q568j2474
$$ 4270 11103 4902 -8958 -12152 -112 10757 8539 -1694 -10607 -8137 5443 12801 4233 -8241
1059h241j291Q323R153K313r587j1137K711J2485O433n115r986o158N798J3760
$$ -8241 -9532 -1209 7944 10257 670 -10467 -7756 4729 11162 6047 -3939 -10097 -4299 9461
1073I461L139j1288j0291K279R393Q542j500j3043p490P805J2082J902o993r382
$$ 9461 12600 1312 -8979 -6700 2693 11235 9735 -3308 -10798 -2993 9089 10991 3998 -5384
1087e384l254R247J2070k238j2835o448M640J0067O766n698j4061k852J1441R969
$$ -5384 -8638 609 12679 10441 -2394 -8842 -4202 5865 12631 6933 -7128 -9980 1461 11430
1101A1430k488q957q270J822J1208P317p115j0663k815O170Q756L992q830j1562
$$ 11430 8942 -15 -8285 -6463 4745 12062 4947 -5716 -8531 -2361 6395 10387 1557 -10005
1115a0005J118J2022O421l782j0492o513N650J2148L374r337j0756Q34Q887P184
$$ -10005 -8887 3135 9556 5774 -4718 -11231 -5581 6567 9941 604 -10152 -9318 -431 6753
1129F753R54j2714p375O139J1001K629n955r467m061Q749J2126k062j1497o629
$$ 6753 7707 -5007 -12382 -6243 4758 7387 1432 -8035 -12096 -3347 8779 6717 -4780 -11409
1143a1409M120R434O702n122j2876k464R936Q800q83p481q025K28J1061Q034n683
$$ -11409 -7289 2145 8847 3725 -9151 -11615 -1679 7121 6238 -1243 -9268 -9040 2021 10055 4372
1158D372j0286l420N541R971M179q525j1471J313J1517O460l260r332o344M660
$$ 4372 -5914 -9334 -3793 6178 10357 1832 -9639 -8326 3191 9651 6391 -2941 -9285 -4625
1172d625J2411L510r618p808J08O558Q713M51j0995p967N404J0341L437m928r931
$$ -4625 7786 11296 1678 -6130 -6022 536 9249 9700 -1295 -9262 -3858 6483 9920 4992 -4939
1187d939m028Q572J0831j253j0434o263K464Q467O618m010j1797l421Q388P936
$$ -4939 -8967 -395 10436 9183 -1251 -7514 -5050 3417 10035 6025 -5772 -9193 -805 7131
1201G131L01o384q764o23J0218Q288n052j0685l714M708R366M143q016j1080J216
$$ 7131 7432 1048 -7716 -8339 1879 10167 5115 -5570 -9284 -4576 4790 8933 917 -10163 -8947
1216h947J0299N798k884q237o646M035J1270L201p581q146j353O662Q965Q23j0332
$$ -8947 1352 7150 4266 -3971 -10617 -6582 4688 7889 308 -7838 -9191 -2529 6436 7259 -3073
1231c073q313M521J0400M037m495r436m618Q260J0991j162r702n946K167Q078
$$ -3073 -11386 -6865 3535 7572 3077 -6359 -10977 -2717 8274 7112 -2590 -8536 -6369 1709
1245A709P119l589j0475l888P786Q842M8n964q068j140J0122P874m982q670l645
$$ 1709 8828 5239 -5236 -9124 -1338 7504 7552 1588 -6480 -7620 2502 10376 5394 -3276 -6921
1260f921M185Q494L715o793r361O70Q376N592j180o624p368J565J1428M160o666
$$ -6921 -2736 5758 9473 2680 -6681 -6011 2365 7957 6777 153 -7215 -5650 5778 9938 3272
1275C272q406j766N187R315J586j0355q469M623R480L352m108q978m460P182J0037
$$ 3272 -5134 -6900 -1713 7602 9188 -1167 -9636 -5013 4467 7819 3711 -5267 -9727 -2545 7492
1290G492j088q668n736J024O859P254k787j0734m080O529P837J818n582r174r90
$$ 7492 6404 -2264 -8000 -6976 -117 7137 4350 -6384 -10464 -3935 3902 5720 138 -9036 -10026
1305a0026R622P460l777q928l581L139Q344L952o662p303q76P472N698J7o658
$$ -10026 -404 7056 3279 -5649 -9230 -6091 2253 6205 -457 -7760 -8636 -1164 4534 4551 -2107
1320b107p544K092J0463M796o059p599k433N620R228J280r181p518M066Q129M210
$$ -2107 -9651 -7559 2904 7700 1641 -5958 -8391 -2771 6457 7737 -1444 -8962 -4896 3233 7443
1335G443k972p373n079O134R322M76o995n724q4O536P602j668j0321m466O225
$$ 7443 4471 -2902 -7981 -1847 7475 7951 956 -4768 -4852 1684 9286 7618 -2703 -7169 -944
1350i44P465K186n119q075j807R034P099l411p518m011K433P771M829n580q785
$$ -944 6521 8707 3588 -4487 -6294 2740 9839 6428 -1090 -5101 -2668 5103 9932 4352 -4433
1365d433j243O542O255O97o935q104J980R837M470n511p885k062M165Q485J854
$$ -4433 -5676 866 7121 7818 883 -7221 -5241 4596 9066 3555 -4330 -6392 -2227 6258 8112
1380H112q260p595K883O895M391j645p890n406M790R368J183o629o692p35O774
$$ 8112 -148 -7743 -4860 2035 6426 4781 -3109 -8515 -3725 5643 6826 197 -6495 -7230 -456
1395d56Q235k209r944m104N776P148K122m887p509j594Q046O181k597o202l870
$$ -456 7779 5570 -4374 -8478 -2702 4446 6568 1681 -5828 -7422 624 6805 4208 -1994 -5864
1410e864J412O998N783m869q560q81N890N880J297n812p993J660R387M228m695
$$ -5864 -4452 2546 8329 3460 -5100 -5981 -91 5789 7086 1274 -6719 -5059 4328 8556 3861
1425C861o247k773L698Q508K217p822o745J888O770M790j433p306o115M956R466
$$ 3861 -2386 -5159 -1461 7047 9264 1442 -5303 -3415 3355 8145 6712 -594 -6709 -1753 7713
1440G713R64o343o365p48O810P289k038r750l410M541O172K069l347p546k393
$$ 7713 8677 2334 -4031 -4779 2031 9320 7282 -2468 -5878 -1337 4835 6904 3557 -3989 -6382
1455f382P289O087j601o012m993Q75O868N962m729r072j148N566N613J019n743
$$ -6382 907 6994 5393 -619 -5612 -4737 2131 8093 3364 -5708 -6856 -1290 4323 5342 -401
1470d01p596J616Q249L777l868n967l297K911P954K205o538o851J076N744M973
$$ -401 -7997 -6381 1868 5645 1777 -4190 -7487 -4576 3378 5583 -955 -7806 -6730 -986 3987
1485C987m04p833n714N005Q246J352o080n213j470N818P100j356p908m070M153
$$ 3987 3583 -4250 -9964 -4959 3287 4639 -1441 -6654 -8124 -2306 4794 3438 -4470 -8540 -4387
1500d387N423L422k846p870k597O749O854j008o338m694R63P251N778m728p983
$$ -4387 1036 4458 1612 -6258 -8855 -2106 4748 3740 -2598 -7292 -6329 922 6700 1972 -6011
1515f011m88N025N180J424n152o819J219P760L491k827n432l408J960Q262L069
$$ -6011 -6499 -1474 3706 5130 -22 -6841 -5622 2138 5629 2802 -2630 -6038 -4078 4184 7253
1530G253o451o641Q26N369N380rp582n771M544P732J518m601n381k013N172P177
$$ 7253 802 -5839 -5013 356 5736 5727 -1855 -7626 -3082 4650 6168 1567 -3814 -5827 -655 6522
1546F522n63p717l925K744N637L830k549p937k826O701O412j224n338m730N38
$$ 6522 5959 -1758 -5683 -2939 2698 6528 3979 -3958 -6784 -83 6329 5105 -233 -4963 -4425
1561d425O832N058m048p555q31M287M918J651m206o801L76O587M478k145n546
$$ -4425 2407 7465 3417 -4138 -4969 -682 4236 5887 1681 -5120 -4744 1843 6321 4176 -1370
1576a370m336K261Q089L384o280o911Q21N290N308L5p366n500M178P369J460m024
$$ -1370 -5706 -3445 4644 8028 1748 -5163 -4342 948 6256 6291 -1075 -6575 -2397 4972 6432 2408
1592B408n005k434M655O949l34o678m544K605N242M410k856p656k609O181O017
$$ 2408 -2597 -5031 -376 6573 6239 -439 -4983 -2378 2864 7274 4418 -3238 -5847 334 6351
1607F351r55m738m585j38O369M907l322o583j538K903M849L052m087p234j16O648
$$ 6351 5396 658 -3927 -4065 2304 7211 3889 -2694 -4232 -1329 3520 6572 2485 -4749 -4865 1783
1623A783M400j421n754m478J917P981K603o049n665O78M320M987j43o206n048
$$ 1783 6183 4762 -992 -5470 -3553 4428 7031 982 -4683 -4005 315 5302 5159 -1047 -6095
1638f095K929O228K039k957n183k949M157P029J56o703m656J431N531M260k237
$$ -6095 -3166 3062 5101 2144 -3039 -5988 -1831 5198 5354 -1349 -6005 -4574 957 5217 2980
1653B980o953l296N704N521k41m276m582o94O072N229l143o166k280K974N246
$$ 2980 -3973 -7269 -1565 3956 3715 -561 -5143 -5837 235 5464 2321 -3845 -6125 -3151 2095
1668B095K794m138p435L20O584L875j476m820m383J769P165K632n324m673l19
$$ 2095 4889 751 -6684 -6364 220 4095 2619 -2201 -6584 -4815 2350 4982 -342 -5015 -5334
1683e334L673M790R48n706n091K193N964K386j808n571l324L916P154J60o089
$$ -5334 -1661 3129 4077 -1629 -6720 -4527 1437 3823 2015 -3556 -6880 -2964 4190 4350 -1739
1698a739m267J146N293M127j493o394l312N306N349r0l501m773j261O020N008
$$ -1739 -6006 -4860 433 4560 3067 -3327 -6639 -1333 4016 3926 425 -4348 -5609 411 5419
1713E419k292n916k887K925N354L004m025o709q0N925L927j148m342l938R95O494
$$ 5419 3127 -2789 -5676 -2751 2603 5607 1582 -5127 -5207 718 4645 3497 -845 -4783 -3788 2706
$$ [...]
8191E32
##END NTUPLES=NMR FID
##END=
