##TITLE=1H_CA-8702-3
 CDCl3, 8 sc, 
 28.12.2020
##JCAMPDX= 6.0         $$ Bruker NMR JCAMP-DX V2.0
##DATA TYPE= NMR SPECTRUM
##DATA CLASS= NTUPLES
##ORIGIN= UXNMR, Bruker Analytische Messtechnik GmbH
##OWNER= root
$$ XWIN-NMR		Version 3.5
$$ Mon Dec 28 11:48:54 2020 Russian Standard Time (UT+4h)  she@DPX200
##.OBSERVE FREQUENCY= 200.1315066352
##.OBSERVE NUCLEUS= ^1H
##.ACQUISITION MODE= SIMULTANEOUS
##.ACQUISITION SCHEME= undefined
##.AVERAGES= 8
##.DIGITISER RES= 18
##SPECTROMETER/DATA SYSTEM= spect
##.PULSE SEQUENCE= zg30
##.SOLVENT NAME= CDCl3
##.SHIFT REFERENCE= (INTERNAL, CDCl3, 0, 15.9833)
##AUDIT TRAIL= $$ (NUMBER, WHEN, WHO, WHERE, WHAT)
$$ ##TITLE= Audit trail, XWIN-NMR		Version 3.5
$$ ##JCAMPDX= 5.01
$$ ##ORIGIN= Bruker BioSpin GmbH
$$ ##OWNER= she
$$ F:/spectra/data/she/nmr/H-F/1/pdata/1/auditp.txt
$$ ##AUDIT TRAIL=  $$ (NUMBER, WHEN, WHO, WHERE, WHAT)
(   1,<2020-12-28 11:45:33.67 +0400>,<she>,<DPX200>,
      <created by zg, POWCHK disabled, PULCHK disabled
       configuration hash MD5:
       00 E9 B6 7A A2 85 ED C7 34 08 36 98 17 FE 4E 26
       data hash MD5: 16K
       AD 09 DF 77 32 64 E6 01 53 F0 3F 30 83 8F F8 C1>)
(   2,<2020-12-28 11:47:22.39 +0400>,<she>,<DPX200>,
      <Start of raw data processing
       efp BC_mod = 2 LB = 0.24 FT_mod = 6 PKNL = 1 PHC0 = -10755.76 PHC1 = 6.400954 SI = 16K 
       data hash MD5: 16K
       39 37 F6 EC 50 40 A2 6D 2A 5F 9E 48 F4 1E C1 05>)
(   3,<2020-12-28 11:47:40.26 +0400>,<she>,<DPX200>,
      <pk PHC0 = -2.185631 PHC1 = 1.8 
       data hash MD5: 16K
       E0 DB B1 10 FB C3 63 66 6C D4 1F 56 87 65 F8 E6>)
(   4,<2020-12-28 11:47:43.54 +0400>,<she>,<DPX200>,
      <abs ABSG = 5 
       data hash MD5: 16K
       4E 41 F5 97 59 B7 6A 2C 48 CC A4 E1 A6 51 22 AD>)
$$ ##END=
$$ 
$$ hash MD5
$$ 58 FD 1F 94 47 F5 89 F1 04 DB 22 A1 CA B6 B1 12
##$RELAX= 
##$RELAX= 
##$RELAX= 
##$RELAX= 
##$RELAX= 
##$RELAX= 
$$ Bruker specific parameters
$$ --------------------------
##$DU= <F:/spectra>
##$EXPNO= 1
##$NAME= <H-F>
##$PROCNO= 1
##$TYPE= <nmr>
##$USER= <she>
##$AMP= (0..31)
100 100 100 100 100 100 100 100 100 100 100 100 100 100 100 100 100 100 
100 100 100 100 100 100 100 100 100 100 100 100 100 100 
##$AQSEQ= 0
##$AQ_mod= 1
##$AUNM= <au_zg>
##$AUTOPOS= <>
##$BF1= 200.13
##$BF2= 200.13
##$BF3= 200.13
##$BF4= 200.13
##$BF5= 200.13
##$BF6= 200.13
##$BF7= 200.13
##$BF8= 200.13
##$BYTORDA= 1
##$CFDGTYP= 0
##$CFRGTYP= 5
##$CHEMSTR= <none>
##$CNST= (0..31)
1 1 145 1 1 1 1 1 1 1 1 1 1 1 1 1 1 1 1 1 1 1 1 1 1 1 1 1 1 1 1 1 
##$CPDPRG= <>
##$CPDPRG1= <>
##$CPDPRG2= <>
##$CPDPRG3= <>
##$CPDPRG4= <mlev>
##$CPDPRG5= <mlev>
##$CPDPRG6= <mlev>
##$CPDPRG7= <mlev>
##$CPDPRG8= <mlev>
##$CPDPRGB= <>
##$CPDPRGT= <>
##$D= (0..31)
0 1.2 0 0 0 0 0 0 0 0.06 0 0.03 0 0 0 0 0.0002 0 0 0 0 0 0 0 0 0 0 0 0 
0 0 0 
##$DATE= 1609141533
##$DBL= (0..7)
120 120 120 120 120 120 120 120 
##$DBP= (0..7)
150 150 150 150 150 150 150 150 
##$DBP07= 0
##$DBPNAM0= <>
##$DBPNAM1= <>
##$DBPNAM2= <>
##$DBPNAM3= <>
##$DBPNAM4= <>
$$ [...]
##$SUBNAM3= <"">
##$SUBNAM4= <"">
##$SUBNAM5= <"">
##$SUBNAM6= <"">
##$SUBNAM7= <"">
##$SUBNAM8= <"">
##$SUBNAM9= <"">
##$SW= 16.9725356469052
##$SWIBOX= (0..15)
0 0 2 0 0 0 0 0 0 0 0 0 0 0 0 0 
##$SW_h= 3396.73913043478
##$TD= 16384
##$TD0= 1
##$TE= 0
##$TE2= 300
##$TE3= 300
##$TEG= 300
##$TL= (0..7)
0 120 120 120 120 120 120 120 
##$TP= (0..7)
150 150 150 150 150 150 150 150 
##$TP07= 0
##$TPNAME0= <>
##$TPNAME1= <>
##$TPNAME2= <>
##$TPNAME3= <>
##$TPNAME4= <>
##$TPNAME5= <>
##$TPNAME6= <>
##$TPNAME7= <>
##$TPOAL= (0..7)
0.5 0.5 0.5 0.5 0.5 0.5 0.5 0.5 
##$TPOFFS= (0..7)
0 0 0 0 0 0 0 0 
##$TUNHIN= 0
##$TUNHOUT= 0
##$TUNXOUT= 0
##$USERA1= <user>
##$USERA2= <user>
##$USERA3= <user>
##$USERA4= <user>
##$USERA5= <user>
##$V9= 5
##$VALIST= <valist>
##$VCLIST= <CCCCCCCCCCCCCCC>
##$VD= 0
##$VDLIST= <DDDDDDDDDDDDDDD>
##$VPLIST= <PPPPPPPPPPPPPPP>
##$VTLIST= <TTTTTTTTTTTTTTT>
##$WBST= 1024
##$WBSW= 4
##$XGAIN= (0..3)
0 0 0 0 
##$XL= 0
##$YL= 0
##$YMAX_a= 463288
##$YMIN_a= -189030
##$ZGOPTNS= <>
##$ZL1= 120
##$ZL2= 120
##$ZL3= 120
##$ZL4= 120
##$ABSF1= 15.98335
##$ABSF2= -0.9893122
##$ABSG= 5
##$ABSL= 3
##$ALPHA= 0
##$AQORDER= 0
##$ASSFAC= 0
##$ASSFACI= 0
##$ASSFACX= 0
##$ASSWID= 0
##$AUNMP= <proc_1d>
##$AZFE= 0.1
##$AZFW= 0.1
##$BCFW= 0
##$BC_mod= 2
##$BYTORDP= 0
##$COROFFS= 0
##$CY= -3
##$DATMOD= 1
##$DC= 0
##$DFILT= <>
##$DTYPP= 0
##$F1P= 0
##$F2P= 0
##$FCOR= 1
##$FTSIZE= 16384
##$FT_mod= 6
##$GAMMA= 0
##$GB= 0
##$INTBC= 1
##$INTSCL= 2.992141e-10
##$ISEN= 128
##$LB= 0.24
##$LEV0= 0
##$LPBIN= 0
##$MAXI= 10000
##$MC2= 0
##$MEAN= 0
##$ME_mod= 0
##$MI= 1.114404
##$NCOEF= 0
##$NC_proc= -5
##$NLEV= 6
##$NOISF1= 3.799351
##$NOISF2= 2.8
##$NSP= 0
##$NTH_PI= 0
##$NZP= 0
##$OFFSET= 15.98335
##$PC= 1
##$PHC0= -10757.95
##$PHC1= 8.200953
##$PH_mod= 1
##$PKNL= yes
##$PPARMOD= 0
##$PSCAL= 0
##$PSIGN= 0
##$REVERSE= no
##$SF= 200.130006256424
##$SI= 16384
##$SIGF1= 3
##$SIGF2= 2
##$SINO= 5.538805
##$SIOLD= 16384
##$SREGLST= <1H.CDCl3>
##$SSB= 0
##$STSI= 16384
##$STSR= 0
##$SW_p= 3396.73913043478
##$SYMM= 0
##$S_DEV= 0
##$TDeff= 16384
##$TDoff= 0
##$TI= <>
##$TILT= no
##$TM1= 0
##$TM2= 0
##$TOPLEV= 0
##$USERP1= <user>
##$USERP2= <user>
##$USERP3= <user>
##$USERP4= <user>
##$USERP5= <user>
##$WDW= 1
##$XDIM= 16384
##$YMAX_p= 304841487
##$YMIN_p= -164520
$$ End of Bruker specific parameters
$$ ---------------------------------
##NTUPLES= NMR SPECTRUM
##VAR_NAME=  FREQUENCY,     SPECTRUM/REAL,   SPECTRUM/IMAG
##SYMBOL=    X,             R,               I
##VAR_TYPE=  INDEPENDENT,   DEPENDENT,       DEPENDENT
##VAR_FORM=  AFFN,          ASDF,            ASDF
##VAR_DIM=   16384,         16384,           16384
##UNITS=     HZ,            ARBITRARY UNITS, ARBITRARY UNITS
##FACTOR=    0.207333158178281, 1,           1
##FIRST=     3198.7478954946, 0,             0
##LAST=      -197.99123494018, 0,            0
##MIN=       -197.99123494018, -164520,      0
##MAX=       3198.7478954946, 304841487,     0
$$ Real data points
##PAGE= N=1
##DATA TABLE= (X++(R..R)), XYDATA
$$ [...]
6199D363179k12929k20127j62789k11195k14081j29536j66639q2543l4860j16694
6189B811786r1013r8317m5064j8243q6396j14473l0425m4609p2697q7153p9673
6178B043723q2400q3770o0461o3491p5041k216n4414j381m1213r469N8859J7062
6166A645788l6378n4496j6737l7854p0723l8558k9017J9045L1130o2674o1158
6155A288368O766K3926N2671j6761J0022L8512P8043J07247K5109J38668J43486
6144A896057J57845K56778K87405K19709J37435L404j17817k44098l30491k77799
6134A988428k93141j91851j59393j67101p3944l9689k9314j2930m3547j5429k3651
6123I38438p1854n9806l1803j5145l1261R275k6103j8291K1282j5046m7876o019
$$ y = [4363179, 4150250, 3930123, 3767334, 3556139, 3342058, 3212522, 3045883, 2963340, 2928480, 2811786, 2720773, 2622456, 2577392, 2559149, 2472753, 2358280, 2327855, 2283246, 2210549, 2123396, 2043723, 1961323, 1877553, 1817092, 1753601, 1678560, 1676344, 1621930, 1620549, 1579336, 1569867, 1628726, 1645788, 1609410, 1554914, 1538177, 1500323, 1429600, 1391042, 1362025, 1381070, 1412200, 1349526, 1288368, 1295134, 1319060, 1371731, 1354970, 1364992, 1403504, 1481547, 1588794, 1613903, 1752571, 1896057, 2053902, 2310680, 2598085, 2817794, 2955229, 2958633, 2840816, 2596718, 2266227, 1988428, 1695287, 1503436, 1344043, 1176942, 1102998, 1063309, 1033995, 1021065, 977518, 962089, 938438, 866584, 806778, 774975, 759830, 728569, 737844, 711741, 693450, 714732, 699686, 651810, 645791]
6111F45791K7130j6396n4914k6467P162n0358k2844Q21l6411k3616J1165L096
6099D64159j6332O974J4889j6835j6276J0724k6403k3747J692m6446L1274l611
6087C80062L8639J7932m7566r663k6062q372J2822l64j6096J5226o2599L2866
6075C26825k4316n2123P043J1000n9133m225N4738j1716m9295K9856j8191j1725
6063A98738L8094R219M561j3723m5834K4862R888l0867l6023K9693K32m747K9241
6050B13334m4818o1385j0561j3559P3285K2080m1156N2271j5149k1080L7686k765
6038A88183j4786k8708j6989j7316J3467K3942l083k4366K6454L6215m7069n5531
6026H0413K1676K8528j7128L2739j4218n4450n448L7566j917Q958L7540J6215
$$ y = [645791, 672921, 656525, 601611, 575144, 582306, 531948, 509104, 509925, 473514, 449898, 461063, 464159, 447827, 454801, 469690, 452855, 436579, 447303, 420900, 397153, 398845, 352399, 383673, 380062, 418701, 436633, 389067, 379404, 353342, 344970, 357792, 357428, 341332, 356558, 293959, 326825, 302509, 250386, 257429, 268429, 209296, 205071, 259809, 248093, 198798, 228654, 210463, 198738, 236832, 246051, 250612, 236889, 191055, 215917, 225805, 194938, 158915, 188608, 188840, 184093, 213334, 168516, 107131, 96570, 83011, 156296, 178376, 137220, 189491, 174342, 153262, 190948, 188183, 173397, 144689, 127700, 110384, 123851, 147793, 144710, 120344, 146798, 183013, 135944, 80413, 102089, 130617, 113489, 146228, 132010, 77560, 72112, 109678, 107761, 116719, 154259, 170474]
6014A70474m243n805Q650l0608n910L6703k7131l7793J8251L2649p522J6750n3448
6001A11017k9324K302K8963l9990k2506K6360K0938j6044l8116K6414L6710L8449
5989A45173J2365j3950k7505n215K9838l9186k3765R166j4233K464Q781R987K9973
5976A23893k0978r01J9282j0829m5664M00L8274J811N42L0458k3557L3330j7138
5963A28923l7289J7317R513J1308J6611j9394l4262j3555J4000j3772O3J7856
5951I7319J5479m3504l8314K4826p786j0306k7289J1712m627l146j9744j6391
5939b1771J6083M8130L1275j234j9090Q78l149Q584J6326J7334M938k369j8006
5926G7929J0052l5958l8079k620O185P655L561K6909k8098K8483K535K0672K892
$$ y = [170474, 166231, 160426, 169076, 138468, 132558, 169261, 142130, 104337, 122588, 155237, 147715, 164465, 111017, 81693, 83995, 112958, 72968, 50462, 76822, 97760, 81716, 43600, 70014, 106724, 145173, 157538, 143588, 116083, 110868, 140706, 101520, 77755, 86921, 72688, 75152, 83933, 93920, 123893, 102915, 102014, 121296, 110467, 64803, 65203, 103477, 105288, 105830, 136288, 112731, 146061, 128923, 91634, 108951, 118464, 129772, 146383, 126989, 92727, 79172, 93172, 79400, 79463, 97319, 112798, 69294, 30980, 55806, 48020, 37714, 10425, 22137, 17510, 14364, -5380, -21771, -5688, 42442, 73717, 72483, 53393, 54271, 51122, 59706, 76032, 93366, 98304, 95935, 77929, 87981, 52023, 13944, 11324, 17509, 25164, 28725, 55634, 27536, 56019, 58554, 79226, 82118]
5913H2118j7249k3459K9608r567L6279J3063k779k3227l7757L997k0503j0188
5901B0336N0993m908j7470N0116K8611L134k9122j4402j0311r842q017j9414L9214
5888G8918L9262l9729J9289j5351k8594J2924M7279k9384j7582r856P0767M362
5876A32305o538k4755P186L5175O496N447L6816j9729j3106L8346K9803l0030
5864A97416M7277r12L985J6962l3176m4253N0072l350L2284J11377L772O6662
5852D48116M3077N419M8239k2577j1334q604n7246j06056o8724n775j5864m5534
5840B03137j8232j0653j3280N689m3828m255N359J8290L5598K380l5055j5948
5828A29202k3344l2601L4168M0462K574J303p349l7276k4370M5730K2894K0433
$$ y = [82118, 64869, 41410, 71018, 61451, 97730, 110793, 108014, 84787, 47030, 51027, 30524, 20336, 71329, 66421, 48951, 99067, 127678, 130812, 101690, 87288, 76977, 67135, 59118, 39704, 78918, 118180, 78451, 97740, 82389, 53795, 66719, 113998, 84614, 67032, 57176, 127943, 132305, 125767, 101012, 108198, 143373, 149869, 155316, 192132, 172403, 159297, 197643, 227446, 197416, 244693, 243781, 247766, 264728, 231552, 187299, 237371, 234021, 266305, 377682, 381454, 448116, 491193, 496612, 544851, 522274, 510940, 502336, 445090, 339034, 270310, 264535, 248671, 203137, 184905, 174252, 160972, 166661, 122833, 118578, 123937, 142227, 177825, 180205, 145150, 129202, 105858, 73257, 107425, 147887, 150461, 151764, 144415, 107139, 82769, 128499, 151393, 171826]
5816A71826m5261K934k7319k1136k0055J7181j7503K9395n434p020J3418K812
5804I3838Q429N388p003O719M2749L2196n2161l4926K6724K323k2450N1193N5949
5791B08968j7695l0822J2918L4926m5779Q627J2971l4825j9147j1386n778p645
5779A05333j3397K6506L1314J3368j3564n2741Q423J6181L578j1898J3261Q233
5767A34597J7525j1162j0836q317k94J7511l6535l382N9193j1910k7059L4710
5755A54041O600K6890M577m0755m9659j599K2569N4431N8242M1170J7810j8900
5743B75417r674j6325m840n332N1134N7321l0341j4665p3491M9117o877Q103J1527
5730B91074P0713L6562k5338K984j5698O034L0460O7588O6131O7788K832K3274
$$ y = [171826, 126565, 129499, 102180, 81044, 60989, 78170, 60667, 90062, 84628, 77608, 91026, 93838, 102267, 107655, 100652, 107371, 150120, 182316, 130155, 95229, 121953, 124276, 101826, 153019, 208968, 191273, 160451, 173369, 208295, 162516, 171143, 184114, 149289, 130142, 118756, 112978, 105333, 91936, 118442, 149756, 163124, 149560, 96819, 105242, 121423, 125001, 113103, 126364, 134597, 152122, 140960, 130124, 121807, 121513, 139024, 102489, 99107, 158300, 146390, 119331, 154041, 160641, 187531, 192108, 151353, 101694, 100095, 122664, 177095, 235337, 276507, 294317, 275417, 265743, 249418, 244578, 239246, 290380, 347701, 317360, 302695, 229204, 278321, 271444, 279547, 291074, 361787, 398349, 373011, 375995, 360297, 366331, 396791, 464379, 530510, 598298, 601130, 624404]
5718F24404K958P2071J10993J0668m9412p4685n3776K588q012o5l230K172k4817
5705F11857k1386K6118L6896N3818P2674N8263R0082Q6666Q2772M8672J8398r63
5693A163867K1837O7422P9574P4998k689J46q7021j20550n8010p5553l6519J9954
5681A047456N4579R6832R6060M3614J1229J1429K1549M094O4089O8404K9800O9100
5669A618235J3745j11615p6126l8587M2270K4023N823K9225J0325K4046R708M1531
5657A592603J4098n5308n0295j4992M3075P1521J18845R5221p2129r9960j46526
5646A496153q6808m4287K0837r70l5042p9414j02675n5735j6738q140L6056R1289
5634A214526J42356R8856R0697Q7452l9621o5202q1783r6786r4969l6957n360
$$ y = [624404, 627362, 699433, 810426, 821094, 771682, 696997, 643221, 645809, 637797, 637732, 634502, 636674, 611857, 590471, 616589, 653485, 707303, 779977, 838240, 928322, 1014988, 1097760, 1146432, 1164830, 1163867, 1185704, 1253126, 1332700, 1407698, 1405009, 1405155, 1318134, 1197584, 1139574, 1064021, 1027502, 1047456, 1102035, 1198867, 1294927, 1338541, 1349770, 1361199, 1382748, 1386842, 1450931, 1519335, 1549135, 1618235, 1631980, 1520365, 1444239, 1405652, 1447922, 1471945, 1477768, 1506993, 1517318, 1541364, 1551072, 1592603, 1606701, 1551393, 1501098, 1486106, 1529181, 1600702, 1719547, 1814768, 1742639, 1642679, 1496153, 1409345, 1365058, 1385895, 1384925, 1349883, 1270469, 1167794, 1112059, 1095321, 1087181, 1123237, 1214526, 1356882, 1455738, 1546435, 1633887, 1594266, 1529064, 1447281, 1350495, 1255526, 1218569, 1213209]
5623A213209k9724q7098q7322j54973p2505k7195o7624l0108k9204O727k6776
5612F07407k4629L4019K9859L1886N380O2198Q0797Q0769O98k4134o0397j44024
5600F79829r3256j5039k3135n5149j4910l9656Q668K4994n2830o2002J064R037
5588C67615M7690n5407n9389M5728M224n5915j2328M1524K5665o141K9096k9743
5576C42619k4317K4625l5859j2165l548l3585m968J8595M9835j6939l5045J9836
5564B89084k5884M6312m4370K077N0311J3726q909j9306k7960O797R394O4655
5552C55927L7808l2446k5453p4422L609J2549L1891J6219j6506L6652M0272n4306
5540C31794N5139r92n8495l261J740K2194m7306m1075L7310K7511n200O714P4039
$$ y = [1213209, 1183485, 1096387, 1009065, 854092, 781587, 754392, 686768, 656660, 627456, 634183, 607407, 582778, 616797, 646656, 678542, 683922, 746120, 826917, 907686, 908384, 884250, 823853, 679829, 586573, 571534, 548399, 493250, 478340, 438684, 447352, 472346, 419516, 357514, 358578, 367615, 415305, 359898, 300509, 346237, 350461, 294546, 282218, 323742, 349407, 343266, 372362, 342619, 318302, 342927, 307068, 294903, 291355, 257770, 252802, 271397, 321232, 304293, 269248, 289084, 263200, 309512, 265142, 267219, 317530, 331256, 322347, 303041, 275081, 281878, 291272, 355927, 393735, 361289, 335836, 261414, 265023, 277572, 309463, 325682, 309176, 345828, 386100, 331794, 386933, 385941, 327446, 324185, 325925, 348119, 300813, 259738, 297048, 324559, 319359, 326073, 400112]
5527D00112k1809j8797N455K0420r376O7180r559j8147K0872m8900Q656J9693
5515D15800m311L5824Q9543N1110k6630m7354Q983m8135m725q2j5626j1278j7104
5502D26015p3662m1819J1944j607k6052J460l3519L5325N8377O4158K8811j9256
5490D30175k8203n4682m4245K7644N2543L1979L1580r336k9553K5409n0729m3864
5478C38718k6918M3677P8924J5624J49J6898r889r347m4161N970J2958P5J5682
5465D38360j8574L9471j1532p6596J9127M4687k3172M8186L1705J813J3807N696
5453E12978j196o5519k4003l6058l2503l3409j7010l1715n399L3538q154p260
5441B84290r631L2778K1693j2565L9823J2259K4925P550j5614j775l2767k7990
$$ y = [400112, 378303, 359506, 364961, 385381, 376005, 443185, 433626, 415479, 436351, 387451, 396107, 415800, 411489, 447313, 536856, 587966, 561336, 513982, 522965, 474830, 470105, 470023, 454397, 443119, 426015, 352353, 310534, 322478, 320871, 294819, 296279, 262760, 298085, 356462, 420620, 449431, 430175, 401972, 347290, 303045, 330689, 383232, 415211, 446791, 437455, 407902, 433311, 382582, 338718, 311800, 355477, 434401, 450025, 450174, 467072, 457183, 447836, 403675, 409645, 422603, 422678, 438360, 419786, 459257, 447725, 371129, 390256, 434943, 411771, 459957, 491662, 493475, 507282, 512978, 511782, 446263, 422260, 386202, 353699, 320290, 303280, 271565, 266166, 299704, 291550, 284290, 274659, 307437, 329130, 316565, 356388, 368647, 393572, 401122, 385508, 383733, 350966, 322976]
5429C22976k5502Q582L0353k288j5706m3414k0411L4864j2946J1426K2701J1138
5417C21773j8276O675l4233N8508j3618l5975l6518Q6555N4247o022l1775K380
5405C53721J0761k5206j3114l0504K8638k268j5064K5925O835N598K390j9812
5393C27900J0546l25j6966O1401K9183O260J3542r661M919J0044j7073J5306P5508
5380E10584K7275j7714M218n4299P018O9249l4786N1296O0557M9858Q357J7134
5368F98747L9228L3536K1711K5436N1019Q8384O5183O4441J21324J8499n5428
5357A172080p6899p655k2455m4457K1489j7155J2717O0396L3733K8688J9451P102
5345A187035K8514M3149Q4744O3210Q1147J19194J47321J85338K39866K48261
$$ y = [322976, 297474, 306056, 336409, 334121, 318415, 275001, 254590, 289454, 276508, 287934, 310635, 321773, 303497, 310172, 275939, 334447, 320829, 284854, 248336, 334891, 389138, 383116, 351341, 353721, 364482, 339276, 326162, 295658, 324296, 322028, 306964, 332889, 339724, 345322, 347712, 327900, 338446, 338121, 321155, 382556, 411739, 417999, 431541, 421880, 426799, 436843, 419770, 435076, 510584, 537859, 520145, 524363, 470064, 477082, 546331, 511545, 562841, 623398, 673256, 681613, 698747, 737975, 771511, 793222, 818658, 869677, 958061, 1023244, 1087685, 1209009, 1227508, 1172080, 1095181, 1087526, 1065071, 1020614, 1042103, 1024948, 1037665, 1098061, 1131794, 1160482, 1179933, 1187035, 1215549, 1258698, 1343442, 1406652, 1487799, 1606993, 1754314, 1939652, 2179518, 2427779]
5335B427779N9916j44161l19449k55769j50736j15928j07916l6158m8333o7637
5325A241608l8182m515k95R163J2462L6903L4948J169O9681J3702M9837N2851
5313A479332j0196L7713M9957O7906J23755M6696O0909J24115J18531P5406N9365
5302B233489J42672J36472J23917K23738L00535L56675L94205K81562J35869J25600
5292D454734j54535n31413o21506m44263k53500k47238j34712j16837j02631m7801
5282A800298j08379K8468n2549n3576M1681N919k3203Q9370M3790k3053l0125
5271A718641m3633K0546K2075M1480O9404M7879J15838R195N8901N5100J6656
5260B132082M6262J15397K19598K34751K56478M18376L13474P8707k39011m69779
$$ y = [2427779, 2487695, 2343534, 2024085, 1768316, 1617580, 1501652, 1393736, 1357578, 1309245, 1241608, 1203426, 1198911, 1198616, 1207779, 1220241, 1257144, 1292092, 1293261, 1362942, 1376644, 1426481, 1479332, 1469136, 1506849, 1556806, 1624712, 1748467, 1795163, 1856072, 1980187, 2098718, 2174124, 2233489, 2376161, 2512633, 2636550, 2860288, 3160823, 3517498, 3911703, 4193265, 4329134, 4454734, 4300199, 3768786, 3147280, 2703017, 2449517, 2202279, 2067567, 1950730, 1848099, 1800298, 1691919, 1720387, 1667838, 1614262, 1655943, 1661862, 1638659, 1728029, 1771819, 1748766, 1718641, 1675008, 1695554, 1717629, 1759109, 1828513, 1876392, 1992230, 2001425, 2060326, 2115426, 2132082, 2178344, 2293741, 2513339, 2748090, 3004568, 3422944, 3736418, 3815125, 3576114, 3106335]
5250C106335l31029k44069j23375n0925o9258l4966q2278n604k1131k6154N8412
5239B175958M60J9040L5236K8584k122m6659J6911M8096o8699N8507q649j2663
5227B244000J7612J4155O0617L9402J3530J3220K1459N2593O7976L9959K7889
5216B612412o730o95N4344Q9044P1856M0337O3624R2218R7038N0715J12695P2293
5204C349151R7932J39583J23070J66013J34954J69430J73914J86463J77684J91399
5194D909593K43728K08240K54569L11911L91514M06786M20001M14776N50750N97220
5184H709088P55255Q43811R86927J161118J333115J715468K118876K609594L042889
5175B3276141K602211J175955p68977k029744k005398j307344r31815p43650k23607
$$ y = [3106335, 2775306, 2531237, 2407862, 2356937, 2287679, 2252713, 2170435, 2164831, 2143700, 2117546, 2175958, 2176418, 2195458, 2230694, 2259278, 2257156, 2210497, 2227408, 2275504, 2206805, 2265312, 2256663, 2244000, 2261612, 2275767, 2336384, 2375786, 2389316, 2402536, 2423995, 2476588, 2544564, 2584523, 2612412, 2605682, 2604987, 2659331, 2748375, 2820231, 2860568, 2924192, 3016410, 3113448, 3164163, 3276858, 3349151, 3447083, 3586666, 3709736, 3875749, 4010703, 4180133, 4354047, 4540510, 4718194, 4909593, 5153321, 5361561, 5616130, 5928041, 6319555, 6726341, 7146342, 7561118, 8111868, 8709088, 9464343, 10308154, 11295081, 12456199, 13789314, 15504782, 17623658, 20233252, 23276141, 25878352, 27054307, 26285330, 24255586, 22250188, 20942844, 20011029, 19267379, 19043772]
5166A9043772L86736R96888J718935K123938J732527K45319j828925l122110l139350
5157A8157730k461323j794765j319543j081790p37736n71306m32155k13249j19427
5148I426436m7390R3779R4673K17208L35140L03225K32598j28580l39312l04005
5138I883772j00262j6031J42044L13121L25795M78748O40971P11054R30427J111576
5128A4421215J209805J229131J185628J497977J960650K599742L288033L614143
5120C1006324K742344M77923k016110l317030l018315j893658r99332l35355L15640
5111B2962431R89665J785002K502913K840992K053120l49628k860483m315482
5103B5608530m060048k927758k148150j713393j445475j366577j203743r28566
$$ y = [19043772, 19430508, 20427396, 22146331, 24270269, 26002796, 26248115, 24419190, 21297080, 18157730, 15696407, 13901642, 12582099, 11500309, 10762573, 10191267, 9759112, 9545863, 9426436, 9379046, 9472825, 9567498, 9784706, 10119846, 10423071, 10655669, 10527089, 10187777, 9883772, 9783510, 9767479, 9909523, 10222644, 10548439, 11027187, 11668158, 12379212, 13309639, 14421215, 15631020, 16860151, 18045779, 19543756, 21504406, 24104148, 27392181, 31006324, 33748668, 34226591, 32210481, 28893451, 25875136, 23981478, 22982146, 22646791, 22962431, 23952096, 25737098, 28240011, 31081003, 33134123, 32784495, 29924012, 25608530, 21548482, 18620724, 16472574, 14759181, 13313706, 11947129, 10743386, 9814820]
5095I814820o90041n51194m53541m15825l72300l71559k77297k88807k85814k07141
5085E901301k12830k27609k03751k09609j59337j44609j71336j48157j40921j44449
5075D138693j49746q5907o6214q8335j03979r2369n2827j06778j30597k8195j6778
5064C216968n9227r7202m7859p5447p4575l6108n8727m3215o0429l3948k2283
5053B607948l9518n4283m2766k792N539L5021k284M2351n1773m7053o6429p849
5041B376112J710n2900j8934M495m881L4551O4329m9295j7150K2507J6186k1745
5029B354985l9674k8713n7902n24P943j5688k5578k4287P255j6367O2412o767
5017B217095k1334N3259J8107m8483J7834K5927P140J8506n2509k4027m8053J4662
$$ y = [9814820, 9124779, 8573585, 8120044, 7704219, 7331919, 6960360, 6683063, 6394256, 6108442, 5901301, 5688471, 5460862, 5257111, 5047502, 4888165, 4743556, 4572220, 4424063, 4283142, 4138693, 3988947, 3903040, 3836826, 3748491, 3644512, 3552143, 3499316, 3392538, 3261941, 3233746, 3216968, 3157741, 3060539, 3012680, 2937233, 2862658, 2826550, 2767823, 2724608, 2664179, 2630231, 2607948, 2568430, 2514147, 2471381, 2468589, 2474128, 2509149, 2506865, 2549216, 2497443, 2450390, 2383961, 2376112, 2377822, 2324922, 2305988, 2310483, 2305602, 2340153, 2404482, 2355187, 2338037, 2360544, 2376730, 2354985, 2315311, 2286598, 2228696, 2228172, 2236115, 2220427, 2194849, 2170562, 2177817, 2161450, 2223862, 2217095, 2195761, 2249020, 2267127, 2218644, 2236478, 2262405, 2269545, 2288051, 2235542, 2211515, 2163462, 2178124]
5005B178124K0976J3975J4214L5287L0581M7600M5286M8277M6146O7804Q378j4670
4993B541978L7538O3639J0926N1048K441m9438K1158j9213n580o755P5820O5062
4981B788624j2257P4940M8411K2413j419Q661N1775L7779O6190J1999O1725L9929
4969C198770Q4399O8420L5340P2535J18635L4263N2967J42646Q9812J40215R6832
4958D134834O7824J6435K1318j4217O4686J14795P4546Q5229J73709J40860R1385
4947D971404J96588K34874J86337J22689J08107Q5682Q3352O7825Q5197R4003
4937F236058J21950J70526J18862J46004J58286J10497J62346J41701J38298J70924
4927G675452K66758K16365J79640K35982K80038K37244K63890K87190L47417L80121
$$ y = [2178124, 2199100, 2213075, 2227289, 2262576, 2293157, 2340757, 2386043, 2434320, 2480466, 2548270, 2556648, 2541978, 2579516, 2643155, 2654081, 2705129, 2707570, 2658132, 2679290, 2660077, 2654497, 2647742, 2723562, 2788624, 2776367, 2851307, 2899718, 2922131, 2920712, 2929373, 2981148, 3018927, 3085117, 3097116, 3158841, 3198770, 3283169, 3351589, 3386929, 3459464, 3578099, 3612362, 3665329, 3807975, 3897787, 4038002, 4134834, 4202658, 4219093, 4240411, 4226194, 4290880, 4405675, 4480221, 4565450, 4739159, 4880019, 4971404, 5167992, 5402866, 5589203, 5711892, 5819999, 5905681, 5989033, 6056858, 6142055, 6236058, 6358008, 6528534, 6647396, 6793400, 6951686, 7062183, 7224529, 7366230, 7504528, 7675452, 7942210, 8158575, 8338215, 8574197, 8854235, 9091479, 9355369, 9642559, 9989976, 10370097]
4917A0370097M36495M85006M31155M66731M97647O47375O95573Q14350R29007
4908A5773436J024998J188452J299972J396348J579975J647356J494546J316410
4900B6721493J276074J168920J140902J057966Q39930N36113J18422l02354n59123
4891C1998343o90377q10790p87722q74259q74115r21556j065973r63320q70588
4882B4139643q14322p02341o46340o01121o90854p54106p36988q13285q24060
4873A7556226p74707p19293o46516n83834m67755m29067m38706l48615l26864
4864A2820869k78127j97217k38973j52651j00287q3092P028K5551K822K2097j5632
4853A1812388j8162k33555l77930m46897m26709l08428k16947j29985j31787o3176
$$ y = [10370097, 10806592, 11291598, 11722753, 12189484, 12687131, 13334506, 14030079, 14844429, 15773436, 16798434, 17986886, 19286858, 20683206, 22263181, 23910537, 25405083, 26721493, 27997567, 29166487, 30307389, 31365355, 32205285, 32741398, 32859820, 32557466, 31998343, 31307966, 30497176, 29709454, 28835195, 27961080, 27039524, 25973551, 25010231, 24139643, 23325321, 22622980, 21976640, 21375519, 20684665, 19930559, 19193571, 18380286, 17556226, 16781519, 16062226, 15415710, 14831876, 14364121, 13935054, 13496348, 13147733, 12820869, 12542742, 12345525, 12106552, 11953901, 11853614, 11770522, 11777550, 11803101, 11805923, 11828020, 11812388, 11794226, 11560671, 11182741, 10735844, 10309135, 10000707, 9783760, 9653775, 9521988, 9458812]
4843I458812M6757j0733L3068R0769J29584K18036K82299L67615M46908N14697
4833A1577812O63656Q35805R69930J170734J465704J860582K371938K975637L397582
4824B7289380K875063J002383j772235l727876l733649k933756k136802j535890
4816A5326618j092593p78982o37864m81402k90297j34915K520Q2634K02277K93359
4806A2491355L68989M93374O48820Q40321J045972J335275J696500K190080K796826
4797B3907512L364949L428806K074455p72613l489737m264831l619084k654828
4789A7974629j990934j442127j130333r08922o01087m76233k95955m6240J44P2180
4779A1155122J97133K39203M65151N81608O95822R73629J243449J637023K125629
$$ y = [9458812, 9505569, 9494836, 9527904, 9618673, 9748257, 9966293, 10248592, 10616207, 11063115, 11577812, 12241468, 13077273, 14047203, 15217937, 16683641, 18544223, 20916161, 23891798, 27289380, 30164443, 31166826, 29394591, 25666715, 21933066, 18999310, 16862508, 15326618, 14234025, 13455043, 12817179, 12335777, 12045480, 11910565, 11913085, 11995719, 12197996, 12491355, 12860344, 13353718, 14002538, 14842859, 15888831, 17224106, 18920606, 21110686, 23907512, 27272461, 30701267, 32775722, 32003109, 28513372, 24248541, 20629457, 17974629, 15983695, 14541568, 13411235, 12502313, 11901226, 11424993, 11129038, 11082798, 11082942, 11155122, 11352255, 11591458, 12056609, 12638217, 13334039, 14307668, 15551117, 17188140, 19313769]
4770A9313769K422109J932632K90538j861677l032695k714520k052110j437038
4762A2861008j069904q48411n97563m90078m18345k20547j73390m7431P8968J44822
4752I219129J81870K32031L11595M13475O10634P27040R94213J321941J607549
4743A5619477K150506K653962K418944J121479j186009l046000l421957k657806
4735A3652596j949855j491158j168546r43169p17633n75262n02650l46804l16102
4726E641417k82541k48753k25126k22077j93455j86604k18188j85301j24497q7869
4716C667006n0365n6001p8233p8734j05677n2000m4872n1594m9000n7648l6048
4705C006834l6950l4350q759q3482m0523n6225o6580l8234l7381o372J0399m2588
$$ y = [19313769, 21735878, 23668510, 23959048, 22097371, 19064676, 16350156, 14298046, 12861008, 11791104, 10942693, 10345130, 9855052, 9436707, 9216160, 9042770, 8995339, 9074307, 9219129, 9400999, 9633030, 9944625, 10358100, 10968734, 11695774, 12689987, 14011928, 15619477, 17769983, 20423945, 22842889, 23964368, 22778359, 19732359, 16310402, 13652596, 11702741, 10211583, 9043037, 8099868, 7382235, 6806973, 6304323, 5957519, 5641417, 5358876, 5110123, 4884997, 4662920, 4469465, 4282861, 4064673, 3879372, 3754875, 3667006, 3616641, 3560640, 3482407, 3403673, 3297996, 3245996, 3201124, 3149530, 3100530, 3042882, 3006834, 2969884, 2935534, 2926775, 2843293, 2802770, 2746545, 2679965, 2641731, 2604350, 2597978, 2608377, 2565789]
4693B565789j1309n444q5543n522M710k1537J5753k290J6036m1973n7948o1051
4681B309671m8582M5063j6951n9290m55m074K3010m5061j7740m046m6285m5100
4669B090160Q176J098L3798k5904q692L2334j1113L6084l0774l3783M5572j6449
4657B120507n7046j6003m2233o9778o7123j8395m9903k7184k9232l1520J4944
4646A727034k638o739l2907l3061J5662L2087N021K3620Q6792J9431k1247m5751
4634A767304k4733l8994j2720q407k8676n1714m9038o722J0451J2126o8518m4350
4622A456009L7856k2060l0339k0423l8963L642K3641p196l342R4398K7191K2328
4610A542742j1614J7422J9891r529m1990j2960K0063j0495J4861m1911o6575l4118
$$ y = [2565789, 2554480, 2549036, 2463493, 2457971, 2462681, 2441144, 2456897, 2454607, 2470643, 2428670, 2370722, 2309671, 2261089, 2306152, 2289201, 2229911, 2229456, 2225382, 2248392, 2203331, 2185591, 2181545, 2135260, 2090160, 2098336, 2099434, 2133232, 2107328, 2098636, 2130970, 2119857, 2155941, 2125167, 2091384, 2136956, 2120507, 2063461, 2047458, 2005225, 1935447, 1868324, 1849929, 1800026, 1772842, 1743610, 1712090, 1727034, 1724396, 1717657, 1684750, 1651689, 1667351, 1699438, 1704459, 1728079, 1814871, 1834302, 1813055, 1767304, 1742571, 1703577, 1690857, 1682450, 1653774, 1602060, 1553022, 1546300, 1556751, 1568877, 1500359, 1456009, 1493865, 1471805, 1441466, 1421043, 1382080, 1385722, 1409363, 1402167, 1398825, 1493223, 1520414, 1542742, 1531128, 1548550, 1568441, 1558912, 1516922, 1503962, 1524025, 1513530, 1528391, 1486480, 1419905, 1385787]
4598A385787j8998M1722q840K6725M1543j7108N0360O9317P3314N5523M8041J19129
4586A866515Q9773j4670j09287j23407l2608p9735k3820j05821q066K2256J0709
4575A491839M1273L1557m698n0567J6503j963m8795p712L7083k5716Q6355R7445
4563A662604K7942L7045Q8448P499l8790k3430k4433l5983k7881M754K9015l8470
4551A668320n972N9666M4902m146k0099J7181K9475M6765P3034M1821k6669M4576
4539A968854R1971J23914J51104J69073J38966K05557K41844L44035L62078M92511
4529D289907N94616L78009j2770m70234n92857m34370l09026j60452q3990j04127
4519C094706l9530J2193P0598J02352J33502J45852J74159J59885K62430L33477
$$ y = [1385787, 1366789, 1408511, 1399671, 1426396, 1467939, 1450831, 1501191, 1570508, 1643822, 1699345, 1747386, 1866515, 1956288, 1941618, 1832331, 1708924, 1676316, 1596581, 1572761, 1466940, 1458874, 1481130, 1491839, 1533112, 1564669, 1559971, 1509404, 1525907, 1523944, 1475149, 1467437, 1504520, 1478804, 1565159, 1662604, 1690546, 1727591, 1816039, 1823538, 1784748, 1761318, 1736885, 1700902, 1673021, 1677775, 1706790, 1668320, 1662348, 1722014, 1766916, 1762770, 1742671, 1759852, 1789327, 1836092, 1909126, 1950947, 1924278, 1968854, 2060825, 2184739, 2335843, 2504916, 2643882, 2849439, 3091283, 3435318, 3797396, 4289907, 4884523, 5262532, 5249762, 4779528, 4186671, 3752301, 3443275, 3282823, 3198833, 3094706, 3055176, 3067369, 3137967, 3240319, 3373821, 3519673, 3693832, 3853717, 4116147, 4449624]
4509D449624M39479N65382O73782P50553P79067L99517m1990k80190n62970q92856
4499F279398q29048n60751l74606k44290j45709m3391m7217M9734J28227J90833
4489D403180K66500L75144M36719L99131P9158m14580p00701n49311l74952k67591
4479C652697j84469j25257q7521j5313o9118k6005M7284O0691N3082L9319Q534
4468C353924J9567M2217j6000o827L0573o0255l225K8434N4101Q4882M0459L1808
4456C599658L9444K6392J7336O466N6487O1736J02275P9309P5949Q9339L2181
4445D186572j03303n4142M2774L3475J09505J13002J41551J81553K31843K62194
4435E145024L06054L02445J96338J04132L0153n0808M363N5577R3851J3441J32803
$$ y = [4449624, 4889103, 5454485, 6128267, 6878820, 7657887, 8057404, 8015414, 7735224, 7172254, 6279398, 5450350, 4889599, 4514993, 4270703, 4124994, 4081603, 4034386, 4084120, 4212347, 4403180, 4669680, 5044824, 5481543, 5880674, 5959832, 5545252, 4844551, 4295240, 3920288, 3652697, 3468228, 3342971, 3255450, 3240137, 3171019, 3145014, 3192298, 3252989, 3306071, 3345390, 3353924, 3373491, 3415708, 3399708, 3392881, 3423454, 3363199, 3359974, 3388408, 3442509, 3527391, 3567850, 3599658, 3639102, 3665494, 3682830, 3689296, 3745783, 3807519, 3909794, 3989103, 4065052, 4154391, 4186572, 4083269, 4029127, 4071901, 4105376, 4214881, 4327883, 4469434, 4650987, 4882830, 5145024, 5451078, 5753523, 5949861, 6053993, 6084146, 6033338, 6037701, 6093278, 6187129, 6200570, 6333373]
4424F333373K02566K68002L62511M56460N53848O63467O72439O19909N29240L33849
4414A0995664J73224J06481J33830J88511J75673J16359J55123J92649K80152
4405A2517666L27201L75464M30462L80881M28129K87115J8222q9837j57924j13512
4395A4403867j43192j69149j32049k28724l37533m17838m80765n82137n22952
4386A1389528l90215l45703l71941l79607l77644l51499l65401k80284k83055
4377H244179k71316l07393l51520m63446n29874m40876l72061k48284k20884q7454
4367D951071m6493J7030P3529n0121k03665k31488k61298l12725k59419j46811
4357C529610j30325j44817q5445p6400K1469j1244q6067P335N5046j8799q2501
$$ y = [6333373, 6535939, 6803941, 7166452, 7622912, 8176760, 8840227, 9512666, 10132575, 10661815, 10995664, 11168888, 11275369, 11409199, 11597710, 11773383, 11889742, 12044865, 12237514, 12517666, 12844867, 13220331, 13650793, 14031674, 14459803, 14746918, 14765140, 14675303, 14517379, 14403867, 14260675, 14091526, 13959477, 13730753, 13393220, 12975382, 12494617, 11912480, 11389528, 10999313, 10653610, 10281669, 9902062, 9524418, 9172919, 8807518, 8527234, 8244179, 7972863, 7665470, 7313950, 6850504, 6320630, 5879754, 5507693, 5259409, 5038525, 4951071, 4904578, 4921608, 4995137, 4945016, 4741351, 4509863, 4248565, 3935840, 3676421, 3529610, 3399285, 3254468, 3169023, 3092623, 3114092, 3102848, 3016781, 3024116, 3079162, 3060363, 2977862]
4346B977862j35539o6516n2430r0472m7126p4043n3096o3593q0285L5232N153
4335B355147m3861m9356m049L6198j2401k1426l1540o7906o224k2459q0400k6639
4323B025084q4044o8913q7241p0473J6570k3453L693m9354j8726k2832n5811j2897
4311A551603K2516j3378P137M5323m662N805m7886k0654j9415n9813j2815l4084
4299A419677o4222L0258M4769K8969r6351l1700m2139k2082N0519j0358O784N2354
4287A366478k4737J655n1279j2544J3577M7301K4531n7349P451k2472P992O9458
4275A370062N115O270L1060K4852M4072P442k4104r886K951M1611L142J4970M0459
4262A558016L763K328K2286k2814N9170M0401L4497K5840K0803M7938K5483O9523
$$ y = [2977862, 2842323, 2775807, 2723377, 2632905, 2585779, 2511736, 2458640, 2395047, 2314762, 2349994, 2355147, 2311286, 2261930, 2257881, 2294079, 2281678, 2260252, 2228712, 2160806, 2154582, 2132123, 2051723, 2025084, 1941040, 1872127, 1784886, 1714413, 1730983, 1707530, 1711223, 1661869, 1643143, 1620311, 1564500, 1551603, 1574119, 1560741, 1567878, 1613201, 1608539, 1614344, 1566458, 1545804, 1526389, 1466576, 1453761, 1419677, 1355455, 1385713, 1430482, 1459451, 1363100, 1331400, 1289261, 1267179, 1317698, 1307340, 1314124, 1366478, 1341741, 1343396, 1292117, 1279573, 1293150, 1340451, 1364982, 1307633, 1315084, 1292612, 1300604, 1370062, 1375177, 1381447, 1412507, 1437359, 1481431, 1488873, 1464769, 1454883, 1457834, 1499445, 1502587, 1517557, 1558016, 1561779, 1564107, 1586393, 1563579, 1622749, 1663150, 1697647, 1723487, 1744290, 1792228, 1817711, 1887234]
4250A887234n001O535J9925J3910K4152O2888O1898L1485Q8287L9111N8320N6759
4238B345503J260N8954O5497K7097P671P3671O5120P7752J15343O1337M7708O1041
4226C007954P1857O3175J10831P6175N3232J38674P1130J43576J17290R0785J22334
4215D067013J66892J72958J80304J62839J83389K14871K89458K53132L08950L61651
4205F361457L79738M49726N20452O33021P80951R10529R65587Q57842L16117k12798
4195A1962622m01041j28418N4848K74718N36041P81812J020893J346745J719681
4186A7167901J806916J394921J97407q16674r32345l72536K82626O23244Q11088
4177B0162548N12510O5948J60945N82513J041665J050500P09410L03766K13343
$$ y = [1887234, 1882233, 1888768, 1908693, 1922603, 1946755, 2009643, 2071541, 2103026, 2191313, 2230424, 2288744, 2345503, 2346763, 2405717, 2471214, 2498311, 2505982, 2579653, 2644773, 2722525, 2837868, 2899205, 2946913, 3007954, 3079811, 3142986, 3253817, 3329992, 3383224, 3521898, 3593028, 3736604, 3853894, 3944679, 4067013, 4233905, 4406863, 4587167, 4750006, 4933395, 5148266, 5437724, 5690856, 5999806, 6361457, 6741195, 7190921, 7711373, 8344394, 9125345, 10035874, 11001461, 11859303, 12175420, 11962622, 11561581, 11433163, 11488011, 11762729, 12298770, 13080582, 14101475, 15448220, 17167901, 18974817, 20369738, 20567145, 19750471, 18818126, 18445590, 18728216, 19351460, 20162548, 20675058, 20741006, 20901951, 21484464, 22526129, 23576629, 24286039, 24589805, 24803148]
4168B4803148J62241L05175P15553O66134l24387j425781j546211q95019p5777
4159B2385076N78938J015071J176987O08391l81989o62409j64696N0510j85626
4150B4420253n47426p67917j122284j239254p32767k90765r7961j98246m92446
4141A8931187m63865K2822N39070Q70805P98784K2177j322877k155313j827200
4132A5415590j313577r80197o83380m93726k79417R48K36836M39198M06328r0309
4122A2658294p02390r75671q51378o45831m63605l04890l06023k71529k02927
4113G934050j17969m1504o8160k33209k22273j83986j65332j08817o8217N940
4103F730523J8892O8459M7561P8285Q0576J00484R2822O8353N4604P3957J36282
$$ y = [24803148, 24965389, 25270564, 25986117, 26652251, 26327864, 24902083, 23355872, 22460853, 22385076, 22964014, 23979085, 25156072, 25764463, 25382474, 24720065, 24555369, 24605879, 24420253, 23872827, 23104910, 21982626, 20743372, 20010605, 19719840, 19621879, 19423633, 18931187, 18467322, 18490144, 19029214, 19900019, 20698803, 20720980, 19398103, 17242790, 15415590, 14102013, 13121816, 12438436, 11944710, 11665293, 11666241, 11903077, 12342275, 12748603, 12658294, 11955904, 10980233, 10128855, 9483024, 9019419, 8714529, 8408506, 8136977, 7934050, 7816081, 7774577, 7706417, 7473208, 7250935, 7066949, 6901617, 6792800, 6724583, 6730523, 6749415, 6817874, 6865435, 6943720, 7024296, 7124780, 7217602, 7285955, 7340559, 7414516, 7550798]
4092G550798K65164M64129M48419K64606O5057j36911R9161Q2271n2204k66241
4082H784249k40076m8894k4641j08763j32610o858J27994K38423L66336N40795
4072I495955N82605M56208J80967j37647j6973J78341J60095Q3229l4075j09623
4062A0839082L8596M75933P74389Q12428M74382j43456m70695m65672k74947j15595
4052A1944445l6664j77384l19600o28535q34581p67937o33178m53331k96511k90086
4042G506638k62829j34024M51M1634n9561j99144l73212l77887j66312L1339Q227
4031F015320q3412j47133j74473j80838j44881j72905r5647l4924j8891q0232
4021D881984k14136k90445k90037k65982k02627j11685K2154R999j3894N1048
$$ y = [7550798, 7815962, 8280091, 8728510, 8993116, 9058173, 8921262, 9020423, 9102694, 9050490, 8784249, 8544173, 8495279, 8470638, 8361875, 8229265, 8222407, 8350401, 8588824, 8955160, 9495955, 10078560, 10534768, 10715735, 10578088, 10561115, 10739456, 10899551, 10982780, 10948705, 10839082, 10877678, 11353611, 12128000, 12940428, 13414810, 13271354, 12800659, 12334987, 12060040, 11944445, 11907781, 11730397, 11410797, 10782262, 9947681, 9179744, 8546566, 8093235, 7796724, 7506638, 7243809, 7109785, 7110236, 7151870, 7092309, 6893165, 6519953, 6142066, 5975754, 6007093, 6015320, 5931908, 5784775, 5610302, 5429464, 5284583, 5111678, 5016031, 4981107, 4962216, 4881984, 4667848, 4377403, 4087366, 3821384, 3618757, 3507072, 3529226, 3539225, 3525331, 3576379]
4011C576379R4143j02800k63245l12499k31989j31644q7133q3402m7025q0949
4001B329836k7851j2731k4158j171M5945K4800M034k3128n8221r2431p3472j8723
3989B072729m8241q6875M759k9189L33K4301N757J8639k5491M6406k2582l015
3977A957531N5328k8127j8324k2376o0475j4962m357k5779K2591O5093K9011L2361
3965A987515L1424m0545J0165K6596J1477M7664J5015j384P3810L4918j9431O5564
3953B242788K1223P6297P5712R7866J49931J83070K53455K29098K86188L40751
3943C956379L17149K61491K77427K69915J58002j60510n21133n98124n16799l69334
3933C074463k53007j83956k01867j39157n9500p3656j8168k5532k6840m7763O014
$$ y = [3576379, 3670522, 3567722, 3304477, 2991978, 2759989, 2628345, 2541212, 2457810, 2410785, 2329836, 2301985, 2289254, 2265096, 2263925, 2309870, 2334670, 2338704, 2315576, 2257355, 2164924, 2091452, 2072729, 2024488, 1937613, 1942372, 1913183, 1913516, 1937817, 1943574, 1962213, 1936722, 1983128, 1960546, 1957531, 2012859, 1984732, 1966408, 1944032, 1883557, 1868595, 1864238, 1838459, 1861050, 1926143, 1955154, 1987515, 2018939, 1978394, 1988559, 2015155, 2026632, 2074296, 2089311, 2087927, 2161737, 2196655, 2177224, 2242788, 2264011, 2340308, 2416020, 2513886, 2663817, 2846887, 3100342, 3329440, 3615628, 3956379, 4273528, 4535019, 4812446, 5082361, 5240363, 5079853, 4558720, 3960596, 3443797, 3074463, 2821456, 2637500, 2435633, 2296476, 2236976, 2163320, 2145152, 2119620, 2092780, 2045017, 2051031]
3922B051031j7107p159N1297K5926N0570K6026P4013M0452R3937J01203J26114
3911B616303J99909J78913J29646j087l796J11770J25413K16107K49020L46375
3901D168573M59788M54025M99073M74340L72654q2711o86519p42658m58389k02872
3891D255304j46187m8323M8005N9729N3318K0786J19656L27300M47425N27375
3881E664388L81987j56520o09183o29102n29408l80316l26600k99206j86629j11871
3871B817540n0172m9723q997m5889j03224p9392r8705n5240l1055l9645m6781
3860B208717o739J2614o5929j3982q59k6055N7118L1478l2693J06115P0115M230
3848B344130L0378L4930J35251Q9607P2685J31209J39422K16970K39843J51789
$$ y = [2051031, 2033924, 2026765, 2078062, 2103988, 2154558, 2180584, 2254597, 2295049, 2388986, 2490189, 2616303, 2816212, 2995125, 3124771, 3123684, 3119888, 3231658, 3357071, 3573178, 3822198, 4168573, 4628361, 5082386, 5581459, 6055799, 6428453, 6345742, 5659223, 4916565, 4458176, 4255304, 4109117, 4060794, 4108799, 4168528, 4221846, 4242632, 4362288, 4689588, 5137013, 5664388, 6046375, 5889855, 5280672, 4651570, 4122162, 3741846, 3415246, 3116040, 2929411, 2817540, 2767368, 2717645, 2708648, 2662759, 2559535, 2480143, 2381438, 2326198, 2295143, 2255498, 2208717, 2201978, 2214592, 2148663, 2134681, 2133822, 2107767, 2164885, 2196363, 2163670, 2269785, 2339900, 2344130, 2374508, 2409438, 2544689, 2634296, 2706981, 2838190, 2977612, 3194582, 3434425, 3586214]
3838C586214M006q7089p0248j3198m2717K1566L0489R6386J33610J92353K11326
3827D062698K74409M31232M68272L61554P0813j80316j27262O8699Q7067L7052
3817E554218j73633k22857j68558q5355r531J39816K46090L39875L52410L85692
3807F358167L27656K31282J93000K35208M71245M95500K82262k31052o48829m97337
3797G217102k04332q8065n828j04891j22350q4474j46946q9037m1524M8872J61988
3786F540515J04265Q267N6388R8131N6747j6778O2076Q0996j4294k47101m60956
3775F268256l04370j88637j21099o328r017L7466J04184N9183J35260J64891J82246
3764F322035J71197J75305J98712K49193K52570L70080L41623M56822M57687N31597
$$ y = [3586214, 3590220, 3503131, 3432883, 3419685, 3376968, 3398534, 3429023, 3525409, 3659019, 3851372, 4062698, 4337107, 4768339, 5236611, 5598165, 5668978, 5488662, 5361400, 5430099, 5517166, 5554218, 5380585, 5157728, 4989170, 4903815, 4894284, 5034100, 5280190, 5620065, 5972475, 6358167, 6685823, 6917105, 7110105, 7345313, 7816558, 8312058, 8594320, 8363268, 7714439, 7217102, 7012770, 6924705, 6918877, 6813986, 6691636, 6607162, 6460216, 6371179, 6329655, 6378527, 6540515, 6644780, 6653047, 6709435, 6807566, 6864313, 6847535, 6909611, 6990607, 6976313, 6729212, 6268256, 5963886, 5775249, 5654150, 5647822, 5638805, 5676271, 5780455, 5839638, 5974898, 6139789, 6322035, 6493232, 6668537, 6867249, 7116442, 7369012, 7739092, 8080715, 8537537, 8995224, 9526821]
3754I526821P24010Q30348R51596J115995J362547J638128K121667K691280L252120
3745B4214512L354962K164815p11773l193996l447628k434619j591888j025722
3737A7328663n86636j94132J01362M59901P21849J008380J400569J779649K150875
3728B4170480K665267L503808M292352M796153M501546K959428R65365l24163
3720D7530236k487790n458785o326424n066606l609547k602383j856944j271997
3712A8849760q60533m37646j37674J71112M58956P09106J080322J511115K109459
3703B3453977K861935L325504K699077J04036l509022n015109m158734l013259
3695A6748405k228895j706767j363305j087077r15830o85152n83802m58300l77142
$$ y = [9526821, 10250831, 11081179, 12032775, 13148770, 14511317, 16149445, 18271112, 20962392, 24214512, 27569474, 29734289, 29022516, 25828520, 22380892, 19946273, 18354385, 17328663, 16742027, 16547895, 16649257, 17109158, 17831007, 18839387, 20239956, 22019605, 24170480, 26835747, 30339555, 34631907, 39428060, 43929606, 46889034, 47854399, 47530236, 45042446, 39583661, 33257237, 28190631, 24581084, 21978701, 20121757, 18849760, 17989227, 17551581, 17413907, 17585019, 18043975, 18753081, 19833403, 21344518, 23453977, 26315912, 29641416, 32340493, 32444529, 28935507, 23920398, 19761664, 16748405, 14519510, 12812743, 11449438, 10362361, 9446531, 8761379, 8177577, 7719277, 7342135]
3686G342135l29716l49561l29533k70270k16410k31486k38727k13190j73478j31040
3676D858724j11763j13059j10686j04268n8692o4424j53797j39546j07272r3048
3666C802169j19169l2816n8110l0020K9550p5447K4315k3492p0489l3552r901
3655C403038q0753k6235p138k7631K7985m0669j7296l5441j6792J4697K8212K4150
3643C246127P4785L3067N1012P9518j4438O4069j942L1029J0008M2078N8156J8739
3631C692208M2927J5945L6742O608l7139n966M9581L2150M6093M7364P0646o270
3619C990889O6616J13456M9295R4492O8415M0227L0210M9220J26223P2798J31370
3608D833211J55502J27331J04439J43048Q4673O4670R6409P6238J49349J75532
$$ y = [7342135, 7012419, 6662858, 6333325, 6063055, 5846645, 5615159, 5376432, 5163242, 4989764, 4858724, 4746961, 4633902, 4523216, 4418948, 4360256, 4295832, 4142035, 4002489, 3895217, 3802169, 3683000, 3650184, 3592074, 3562054, 3591604, 3516157, 3540472, 3516980, 3446491, 3412939, 3403038, 3322285, 3296050, 3288912, 3261281, 3289266, 3248597, 3231301, 3195860, 3179068, 3193765, 3221977, 3246127, 3320912, 3353979, 3404991, 3484509, 3470071, 3534140, 3532198, 3563227, 3573235, 3615313, 3673469, 3692208, 3735135, 3751080, 3787822, 3794430, 3757291, 3751325, 3800906, 3833056, 3879149, 3926513, 3997159, 3990889, 4057505, 4170961, 4220256, 4314748, 4383163, 4423390, 4453600, 4502820, 4629043, 4701841, 4833211, 4988713, 5116044, 5220483, 5363531, 5448204, 5512874, 5609283, 5685521, 5834870, 6010402]
3598F010402J64641K61587K38100K10388K34884K89676K96781K56269L09915L91445
3588H664088M24974N50325O16223O66002P67110Q99501J003146J142156J391494
3579A6125019J646296J964179K499863L106710L750808L899546K870211M66312
3571C6328944k124726l306093k807124j778790p65617J32991P81984J568390K390728
3562C0420687L050237L044716J658915q60809k986119l445022k461438j389526
3554B7031641l65844N17911J395337K060650J809920L21431j699289k902202k738375
3545B5431180j872859j140349m99922m0977L64771R67346J581690J775127J098627
3536B7664634n86705k553693l371155l025399k265826j698637j359854j186766
$$ y = [6010402, 6175043, 6436630, 6674730, 6885118, 7120002, 7409678, 7706459, 7962728, 8272643, 8664088, 9089062, 9639387, 10255610, 10921612, 11688722, 12588223, 13591369, 14733525, 16125019, 17771315, 19735494, 22235357, 25342067, 29092875, 32992421, 35862632, 36328944, 34204218, 30898125, 28091001, 26312211, 25546594, 25679585, 26461569, 28029959, 30420687, 33470924, 36515640, 38174555, 37313746, 34327627, 30882605, 28421167, 27031641, 26665797, 27183708, 28579045, 30639695, 32449615, 32771046, 31071757, 28169555, 25431180, 23558321, 22417972, 21918050, 21877073, 22241844, 23209190, 24790880, 26566007, 27664634, 27077929, 24524236, 21153081, 18127682, 15861856, 14163219, 12803365, 11616599]
3528A1616599j075009q60443n82449m88910l69115k92522k68309k25957k24498
3519G229387l08145l29683l07588k71321k91741j45249j14527j48120p4202k0755
3509E218056o3375l9557p6572j75532j47731j50110j37185j24460n4230j09218
3499D140086q2497j12371m9008m6855n1137q6466n068K5655M9397O8078M3249
3488C893063P9016J13696J20304Q7591J57978J60375K75007K57224K81856L98090
3478E824200N83999O52602O34512L40876q8246m21840o00892l41023j26665L5570
3468F493093K41333M08883N47926N08730O3997o36320q31329n58772l03768j65335
3458E768438q7883R1178J80343L10927L98360M63555L43927K5723k18404k23751
$$ y = [11616599, 10541590, 9681147, 9098698, 8609788, 8240673, 7948151, 7679842, 7453885, 7229387, 6921242, 6591559, 6283971, 6012650, 5720909, 5575660, 5461133, 5313013, 5238811, 5218056, 5154681, 5115124, 5038552, 4863020, 4715289, 4565179, 4427994, 4303534, 4249304, 4140086, 4057589, 3945218, 3896210, 3849355, 3798218, 3711752, 3706684, 3732339, 3781736, 3849814, 3893063, 3972079, 4085775, 4206079, 4293670, 4451648, 4612023, 4887030, 5144254, 5426110, 5824200, 6408199, 7060801, 7695313, 8036189, 7947943, 7526103, 6925211, 6584188, 6457523, 6493093, 6734426, 7143309, 7691235, 8199965, 8263962, 7627642, 6796313, 6237541, 5933773, 5768438, 5680555, 5771733, 5952076, 6263003, 6661363, 7124918, 7468845, 7494568, 7276164, 7052413]
3448G052413k12670j76252p332K08562L61269M74227L07738o9370n87142r15109
3438F436334p80888n79909n13249l76626l18696k64494j83661j50291j72815j42892
3428B952813o1223n6395n9649q4430o0389O724m7917q6809j15140m6966m4327
3417B296292r511L942M0210J5604l330R6183J9619j3755o7312n8599l5473k3983
3405B259887J646j5478K8352J9204k6940o9837m7865o3446r6141p0955o8721p0092
3393A779614r0760J4927l79j2345j4997j1211K7773K1127o965K3602M0453L0683
3381A801522O5329N3508K6117O5866k3207q52J8831K7504M907j9735j8028m3931
3369A957831j8282L2821p004o2128k7261k2811l9146n0685r977K188r1594p992
$$ y = [7052413, 6839743, 6663491, 6656159, 6864721, 7225990, 7700217, 8007955, 7938585, 7351443, 6436334, 5655446, 5075537, 4562288, 4185662, 3866966, 3602472, 3418811, 3268520, 3095705, 2952813, 2891590, 2835195, 2775546, 2691116, 2630727, 2637451, 2589534, 2502725, 2387585, 2340619, 2296292, 2286781, 2290723, 2330933, 2346537, 2343207, 2439390, 2459009, 2445254, 2377942, 2319343, 2283870, 2259887, 2261533, 2246055, 2274407, 2293611, 2266671, 2196834, 2148969, 2085523, 1989382, 1918427, 1849706, 1779614, 1688854, 1703781, 1703402, 1691057, 1676060, 1664849, 1692622, 1713749, 1706784, 1730386, 1770839, 1801522, 1866851, 1920359, 1946476, 2012342, 1989135, 1988283, 2007114, 2034618, 2039525, 2019790, 2001762, 1957831, 1939549, 1972370, 1965366, 1903238, 1875977, 1853166, 1814020, 1763335, 1753358, 1755546, 1663952, 1655960]
3357A655960l0714J3516L3582L1208O2200M2244L3288j314k9248k3029R690j8273
3345A779110m4085p2465m9085j5492L123K3255J0042J8880k5565p831K5669l2330
3333A613226K3116J17285p82P985J2240M3755k852p2825O2513J9147J0928k928
3321A830808L3988j6982L0567l025j2295K9098K6369L9255j6203l1834l4065l367
3309A872314R642k4207J3270P7190K1507k51J3987K8543n767n979O5695j0190
3297B055754M9011L1128j4070M9561N5699M2273J3536j4866k6305l1931Q906O4996
3285B283692J0205O7765N5217O5914L6363K5864K0103M786k9330L304L3082N145
3273B582110N160m6552K3049J7307l5514o770J1820K1563K9003L3264O5963N4867
$$ y = [1655960, 1625246, 1638762, 1672344, 1703552, 1765752, 1807996, 1841284, 1839970, 1810722, 1787693, 1797383, 1779110, 1735025, 1662560, 1613475, 1597983, 1601106, 1624361, 1634403, 1653283, 1627718, 1619887, 1645556, 1613226, 1636342, 1753627, 1752845, 1760830, 1773070, 1816825, 1813973, 1741148, 1803661, 1822808, 1833736, 1830808, 1864796, 1847814, 1878381, 1875356, 1863061, 1892159, 1918528, 1957783, 1941580, 1909746, 1875681, 1872314, 1881956, 1857749, 1871019, 1948209, 1969716, 1969465, 1983452, 2011995, 2006228, 2000249, 2065944, 2055754, 2104765, 2135893, 2121823, 2171384, 2227083, 2269356, 2282892, 2268026, 2241721, 2209790, 2218696, 2283692, 2293897, 2361662, 2416879, 2482793, 2519156, 2545020, 2565123, 2569909, 2540579, 2543883, 2576965, 2582110, 2587270, 2540718, 2563767, 2581074, 2545560, 2538790, 2550610, 2572173, 2601176, 2634440, 2700403, 2755270]
3261B755270k021J7668R8846J16023O4054N7720R80O733M7162P0188M5638P8340
3249C356601Q8184L9335N9871L9833M1742M4282J8140M6104P2478M1838Q3869
3238C932277J13653J04975J14011J01786J75459K27918J94569L22635L59176M95350
3228F141809L49207Q1247j17641j96947j96072q2591N5865P3359M6505R9205J60178
3217F414124J69311J49316K38491K05498J76086J88153J65951J52392K02333K81169
3207H342824L52826L11483J88206K06643J50519J27162J59298J44403J41917J13462
3197A0238743J47881J19451J49305J35131R3468J41720J33144J02641J14921R6306
3187A1472711J76837K58982L24245L65751L53242L87985M09123L79650M68793
$$ y = [2755270, 2753249, 2770917, 2869763, 2985786, 3049840, 3107560, 3108540, 3115273, 3162435, 3232623, 3278261, 3356601, 3444785, 3484120, 3543991, 3583824, 3625566, 3669848, 3687988, 3734092, 3806570, 3848408, 3932277, 4045930, 4150905, 4264916, 4366702, 4542161, 4770079, 4964648, 5287283, 5646459, 6141809, 6491016, 6572263, 6454622, 6257675, 6061603, 5979012, 6034877, 6108236, 6154741, 6253946, 6414124, 6583435, 6732751, 6971242, 7176740, 7352826, 7540979, 7706930, 7859322, 8061655, 8342824, 8695650, 9007133, 9195339, 9401982, 9552501, 9679663, 9838961, 9983364, 10125281, 10238743, 10386624, 10506075, 10655380, 10790511, 10883979, 11025699, 11158843, 11261484, 11376405, 11472711, 11649548, 11908530, 12232775, 12598526, 12951768, 13339753, 13748876, 14128526, 14597319]
3178A4597319M48815M58073M80065N35684M91341N37985O27754O12184P18840
3169A9508060P36881R13123R88508J091483J146580J323133J376261J420504J633432
3160C0137965J761952J900009K051858K168585K304259K419766K657736K921535
3152D8323665L339055L758734M206290M800546N688216O704564P983206R382543
3144I4186819J1043850J3060686J5770464J9483508K4767709L1185216L6839107
3137B46337359L6328341K2175787k122915k3192589l4270225l2747340k7850690
3130A84657728k5657108k3331744j9793702j5359521j1919184r148102o950352
3123G2498015n189689m219588l830260l939758m048692m064374l738063l384354
$$ y = [14597319, 15046134, 15504207, 15984272, 16519956, 17011297, 17549282, 18177036, 18789220, 19508060, 20244941, 21158064, 22146572, 23238055, 24384635, 25707768, 27084029, 28504533, 30137965, 31899917, 33799926, 35851784, 38020369, 40324628, 42744394, 45402130, 48323665, 51662720, 55421454, 59627744, 64428290, 70116506, 76821070, 84804276, 94186819, 105230669, 118291355, 134061819, 153545327, 178313036, 209498252, 246337359, 282665700, 304841487, 302718572, 279525983, 245255758, 212508418, 184657728, 159000620, 135668876, 115875174, 100515653, 88596469, 79448367, 72498015, 67308326, 63088738, 59258478, 55318720, 51270028, 47205654, 43467591, 40083237]
3115D0083237k906999k471825k135450j814928j580306j382350j239762j176543
3107B5375074j066652r57843q76636q99733q04956q10699p58505o58793n62945
3098A7978312o36875p37767q22900p41533o09382n23276m90965m80273m57031
3089A2478310m03041l17677k43334k91471k47370k30065k19058k27752k32098
3080A0066444k24384k56688k68085k37913k07157k59160k50137j67634j50033
3071H045253k29694j94099k01003k22878o7556n6766q8213r5508q2925j15651
3061F690960r1826j02415m6967n8550j23465l0504n8998j7866m1719m0497l421
3050F074732j9233n375m7864L0409N546k2922J9478K0347J9596M0000k7357l419
$$ y = [40083237, 37176238, 34704413, 32568963, 30754035, 29173729, 27791379, 26551617, 25375074, 24308422, 23350579, 22473943, 21574210, 20769254, 19958555, 19200050, 18541257, 17978312, 17341437, 16603670, 15780770, 15039237, 14429855, 13906579, 13415614, 12935341, 12478310, 12075269, 11757592, 11514258, 11222787, 10975417, 10745352, 10526294, 10298542, 10066444, 9842060, 9585372, 9317287, 9079374, 8872217, 8613057, 8362920, 8195286, 8045253, 7815559, 7621460, 7420457, 7197579, 7130023, 7073257, 6985044, 6889536, 6806611, 6690960, 6599134, 6496719, 6449752, 6391202, 6267737, 6237233, 6178235, 6160369, 6118650, 6078153, 6074732, 6055499, 6050124, 6002260, 6032669, 6038215, 6015293, 6034771, 6055118, 6074714, 6114714, 6087357, 6083938]
3038F083938Q830M5705N9318J49970J83327J25065k968k68934l78992l17488k36866
3027E450905j43673n9169j14658n926L2921r218N4003J7869m5916n4436l8717
3016E083985Q424L9422P1108N6396Q3033R0959R1763O1630P2775R4969M3179J7112
3004E814755K7366j7945l8657n8261q8550k9712q1359k02555j78441k39101j90400
2993D717140j55087j77069j93790j67182j56286j28387j17509j88090j75417r5339
2983C162984l6287m6921k8687L7032q1439m0589n8661j33084n3747l3455m9474
2972B637672l3807r9703m3150p9811j20915p1037p2650p6684m8951j6696o1888
2961A912380m0264j4893j01804n0775M6844n8138l340N2307m8720M506n1372m2412
$$ y = [6083938, 6092768, 6138473, 6197791, 6347761, 6531088, 6656153, 6653185, 6384251, 6005259, 5687771, 5450905, 5307232, 5248063, 5133405, 5127479, 5160400, 5151182, 5205185, 5223054, 5177138, 5122702, 5083985, 5092409, 5131831, 5202939, 5259335, 5342368, 5433327, 5525090, 5586720, 5659495, 5754464, 5797643, 5814755, 5842121, 5824176, 5785519, 5727258, 5638708, 5608996, 5527637, 5325082, 5146641, 4907540, 4717140, 4562053, 4384984, 4191194, 4024012, 3867726, 3739339, 3621830, 3433740, 3258323, 3162984, 3126697, 3079776, 3051089, 3088121, 3006682, 2966093, 2907432, 2774348, 2720601, 2687146, 2637672, 2603865, 2504162, 2461012, 2381201, 2260286, 2189249, 2116599, 2039915, 1990964, 1974268, 1912380, 1872116, 1857223, 1755419, 1704644, 1751488, 1693350, 1690010, 1742317, 1693597, 1698103, 1646731, 1604319]
2949A604319j2705l5093m0050m7943k9821J9840K0567j324m1995l5077K5044m4540
2937A381222m3247j09501o8947R516j9273k3316j4476l6911J8787l1769N628P968
2925A075681j5041j4979j0470J2046K2361j3210j15k1811p9285k3276q5409K314
2913H48806n081n4084l2640l2781k8012M953k2298K9798K423J6437J3633k6933
2901G14221M4998m9878J4635j7094l2262k6783j8888L8710k1110j2062o061q0443
2889E47983j0958r321q5863L5700L3542n699k7937l7964m1868m9433M3163j1733
2877C79612j3342m500J5694N8090L8978J0197J7715p178o752K7297j8274l6755
2865D60782j7383m9057j1852l8627j4965L0037k5755j8606Q9707J9688M5450L6482
$$ y = [1604319, 1591614, 1556521, 1516471, 1468528, 1438707, 1458547, 1479114, 1477790, 1435795, 1400718, 1425762, 1381222, 1337975, 1228474, 1159527, 1169043, 1149770, 1126454, 1111978, 1075067, 1093854, 1062085, 1067713, 1075681, 1060640, 1045661, 1035191, 1047237, 1069598, 1056388, 1056273, 1034462, 955177, 931901, 846492, 848806, 843725, 789641, 757001, 724220, 696208, 701161, 678863, 708661, 711084, 727521, 741154, 714221, 759219, 709341, 723976, 706882, 674620, 647837, 628949, 667659, 646549, 634487, 628426, 547983, 537025, 527704, 441841, 477541, 511083, 505384, 477447, 439483, 397615, 348182, 391345, 379612, 366270, 361770, 377464, 435554, 474532, 484729, 502444, 495266, 488514, 515811, 497537, 460782, 443399, 394342, 382490, 343863, 328898, 358935, 333180, 314574, 404281, 423969, 469419, 505901]
2853E05901l1951N1140K1560K6521o258p172M0403k358N038K9653n9N2498J4239
2840F99155K3315M0867J4683J3581L3322J09390P2070O5424J20836J28886J45495
2829A467024K06743J70819J72804j4843q5888j33975k09673j60553j67565j16774
2819A128119p8524o8867n3279l1288p9594p3080q7632m0126k2457m7717l8932
2808E06623q2782m5584M0815K655p0381n827K8600N1110l1405m5220K9406q120
2796C69890L7009o6223q8204K0613K6116p510j1541p2965K9230k3084n6123N314
2784A62522K1339l9845j9555J5473P327k4935m056l632l6277R953N559N0740J5269
2771A59882K0182j7537l3838J5261n564k9581K071l7483k6219j7576R414K7829
$$ y = [505901, 473950, 525090, 546650, 573171, 566913, 559741, 600144, 597786, 602824, 632477, 632418, 684916, 699155, 722470, 763337, 778020, 791601, 824923, 934313, 1006383, 1071807, 1192643, 1321529, 1467024, 1673767, 1844586, 2017390, 2002547, 1916659, 1782684, 1573011, 1412458, 1244893, 1128119, 1049595, 980728, 927449, 896161, 816567, 743487, 655855, 615729, 593272, 545555, 506623, 423841, 378257, 419072, 421727, 351346, 345519, 374119, 425229, 393824, 348604, 378010, 369890, 406899, 340676, 252472, 273085, 299201, 291691, 280150, 207185, 236415, 213331, 157208, 162522, 183861, 144016, 124461, 139934, 147261, 122326, 118270, 114638, 78361, 88314, 93873, 144613, 159882, 180064, 162527, 128689, 143950, 138386, 108805, 110876, 73393, 47174, 29598, 39012, 66841]
2759F6841l0307L662j7084j9864L1046N0095L8716O615N3504O266j2984j7688
2747A58818j5512l0236j4290k849M135N0650l7934j4809k840k2754K057K814K6369
2734A03619J7632j5376J2746K8416j8677k983J0514j6314J5755M3478o597M496
2722A76709J2161j0620L539L9780o469j6602n2379o9911l201n540k809j9521k876
2709D2261L1409k5058j1667L9360Q765r040Q551K7341M1243K989l0233M223J9265
2696A49409k046k7007j7332m6385r454n1303j5844K361P347M2177J9147j9757
2684C1313L9664q726m7751k7920J4322k0876Q745l908M679L0537J7210j7781R295
2671B8803j854P379k7106R007J0818k1061K5545m2140Q430k8646k5770n2430j3508
$$ y = [66841, 36534, 40196, 23112, 3248, 34294, 84389, 123105, 129720, 183224, 189490, 176506, 158818, 143306, 113070, 98780, 95931, 100066, 150716, 112782, 97973, 95133, 72379, 74436, 77250, 103619, 121251, 105875, 118621, 147037, 128360, 125377, 135891, 119577, 135332, 178810, 172213, 176709, 188870, 178250, 181789, 221569, 215100, 198498, 146119, 76208, 73007, 67467, 64658, 45137, 42261, 73670, 48612, 36945, 76305, 85070, 76030, 84581, 111922, 153165, 156154, 125921, 130144, 149409, 147363, 120356, 103024, 56639, 47185, -4118, -19962, -17601, -10254, 31923, 51070, 31313, 70977, 62251, 14500, -13420, 902, -19974, -11229, -15137, -10458, 20079, 37289, 19508, 28803, 26949, 34328, 7222, 16229, 27047, 5986, 31531, -10609, -2179, -30825, -56595, -109025, -122533]
2658a22533m728J7715N5928R246l4090K943O3148K3655N167L5944j3503Q748O872
2645E4512M7502k6615n8344j9398j4028j4385R22k4937p719l26J7077l4187q636
2632h8562J4433L9032p289k1720J5920j0550k071P814k4185o056L1660k5767L3234
2619d4107L7085M807M198l2745q371j0514k959k9325K0657M1403L2535k8874l1361
2606d7571j6644J7784k4213J9638o862L9053L7031j2644R456n2045M1452j8289
2594a3854n081k0259M6295J9987k3818J8553K2448j530o5983p91K1202O953O021
2581A0143P451L1303l4319L9169J4104L2263j7559n3962J8872N7258J6019J9662
2569A40404k3816M1367j7923m8829j9162k4418q04l4593k9702K8677J7197L9692
$$ y = [-122533, -127261, -109546, -53618, -44372, -78462, -75519, -12371, 11284, 16451, 52395, 38892, 47640, 54512, 102014, 75399, 17055, -2343, -16371, -30756, -29834, -54771, -62490, -62816, -45739, -79926, -88562, -74129, -35097, -42386, -64106, -48186, -58736, -60807, -52993, -77178, -83234, -51574, -77341, -44107, -7022, -2215, 1983, -30762, -39133, -49647, -52606, -81931, -61274, -19871, 12664, -16210, -47571, -64215, -46431, -70644, -51006, -57868, -18815, 18216, 5572, 15028, -37017, 4435, -13854, -18935, -39194, 7101, 27088, 3270, 21823, 44271, 42741, -23242, -24033, -2831, 4122, 10143, 17594, 48897, 14578, 53747, 67851, 100114, 82555, 28593, 47465, 104723, 120742, 140404, 116588, 157955, 140032, 91203, 72041, 47623, 46819, 12226, -17476, 11201, 28398, 68090]
2557F8090o670l9897K4835m5417L1805K452L2581N6845j1044k7372L8072k6649
2545I7631K214q379l5343L15m5767l1467p984p558l8312j9400M3906R621m9017
2532h9540L1976N515M7749K6023p1977M8999j5619m74P4341j0476k6814n9695
2520c9992j984L805n392j7655K0910j7455J3458Q251n0985L2209P009n321K7358
2507b5784n434p741l2556j771K7696J9999O258K4205L4806j4618R768J04J849
2494C6781j3321k739k7610m4501j0737J5695l3705J1756J7106o077k1859M1689
2482c7522K5820k5099M108j8109L0871j2616K0952O850N266K0094j0Q413L6655
2469F5673l2334K648J6185J826o811J5022k2755j5305J4219k7389L3300l842j212
$$ y = [68090, 61420, 21523, 46358, 941, 32746, 35198, 67779, 124624, 113580, 86208, 124280, 97631, 99845, 91466, 56123, 56438, 10671, -20796, -28780, -36338, -74650, -94050, -50144, -40523, -89540, -57564, -52049, -4300, 21723, -50254, -1255, -16874, -17348, 56993, 46517, 19703, -39992, -41976, -38171, -43563, -61218, -40308, -57763, -44305, -36054, -87039, -54830, -47821, -53142, -25784, -31218, -38959, -71515, -73286, -45590, -25591, -19333, 4872, 39678, 25060, 34828, 34932, 36781, 23460, 20721, -6889, -51390, -62127, -46432, -80137, -68381, -51275, -57352, -79211, -37522, -11702, -36801, -32693, -50802, -19931, -32547, -11595, -4745, 521, 20615, 20605, 29018, 65673, 33339, 35987, 52172, 53998, 47187, 62209, 39454, 24149, 38368, 10979, 44279, 40437, 39225]
2456C9225K3794P70J1004L1964k2942n159M9476M667j695N4900P886l7258m7063
2443A09569N259l1052j3315K5657j4074n2824j6427l7355j4679K0213J6555K0249
2431A7776L2312N3947M4087j1128J203j3628k8232O2540j9046m6325K9030j2802
2419A09734l2700l344K0085j4826k2854J938j0596o944o377j9992pp49k0466j283
2405h381j7705n4898K3440K796M3815J5954k7496R794L2296k982j9122j3090r360
2392b4939N5396L4797M2215o0911p4822j3321l8435n5941k8559L1170K6424N0960
2380e5966M1257J676R471R77K7771N508r091Q934O1984K9131l6105m7441P61r255
2366B9612k0086J2339m867J4234M9339L014N1678J037l3981j0159L9029R255m2707
$$ y = [39225, 63019, 63789, 74793, 106757, 83815, 78656, 128132, 132799, 131104, 186004, 193890, 156632, 109569, 114828, 83776, 70461, 96118, 82044, 29220, 12793, -24562, -39241, -19028, -2473, 17776, 50088, 104035, 148122, 136994, 138197, 124569, 96337, 158877, 139831, 93506, 122536, 109734, 77034, 73690, 93775, 78949, 56095, 58033, 47437, 40493, 34116, 14124, 14117, 13368, -7098, -8381, -26086, -80984, -57544, -54748, -10933, 5021, -22475, -12681, 19615, 16633, -2489, -15579, -24939, 30457, 65254, 107469, 46558, -28264, -41585, -80020, -135961, -164520, -133350, -106926, -55966, -14709, -13033, -3562, -2585, 25186, 30694, 21603, 30537, 92521, 121652, 85547, 38106, 38867, 29612, 9526, 21865, 16998, 31232, 80571, 83585, 135263, 136300, 102319, 92160, 131189, 140444, 97737]
2353I7737k970k6959N3094p082l5312M8350K3634Q898k063m3740j308M2362J6754
2340A71395k6493J5639k2342k1578L1111J4352j5117J9850O7585L0303P2157O7373
2328D04235K526K1479N7961J8262n799K6673R868r3241o9657n9860m6770m4582
2316B21095K6011n438k1435k3957J1852L841j9856m0648m2824M8743p205J1439
2304A61618K9469o2177m4264K3441r125J2205K4865K6917K3081O0402J0267K9982
2292B86681K7078J3903L4393j3426n639R033o1118k8617j38j4611n8173n0455
2280A38911K3216p197M5932L6947j0250l55j3520l1145L5118J2155r572J7633
2268B37873p141k1548j2309N796r695L1726L2072l787l1212K8148J00375p270
$$ y = [97737, 94767, 67808, 120902, 113820, 78508, 126858, 150492, 159390, 157327, 113587, 112279, 154641, 171395, 144902, 160541, 138199, 116621, 147732, 162084, 146967, 166817, 234402, 264705, 336862, 404235, 406761, 428240, 486201, 504463, 498664, 525337, 535205, 441964, 372307, 312447, 265677, 221095, 247106, 241668, 220233, 196276, 208128, 211969, 192113, 151465, 108641, 157384, 150179, 161618, 191087, 128910, 84646, 108087, 98962, 111167, 136032, 162949, 186030, 246432, 256699, 286681, 313759, 327662, 362055, 348629, 342990, 352023, 290905, 262288, 262150, 247539, 189366, 138911, 162127, 154930, 200862, 237809, 227559, 227204, 213684, 182539, 217657, 229812, 220240, 237873, 230732, 209184, 196875, 202671, 192976, 224702, 256774, 252987, 221775, 249923, 350298, 343028]
2256C43028r958k6232N35l5030R861K5827j3156m8150J9801J5297k7408L0034
2244B84449K0343N6329L137M1287J200l8027n0357o3900j9905O3857J9386J0957
2232C28756L3494L4978J5895L7110J2195J3406L1751Q8802O4937N4798J23820
2221H39942P388j3121n4191m6951o0215p8979l6866m9733K934J458K6274M3689
2209E81629o2327j4635K184k0480k0190j4742M9457M406O8175O4471J2488J2601
2197F63037J3200O9158P768n0477M5056P8703J11835J8660P5999N2456P636J6202
2185A109233m9602k0565k9551l3467J1965L0920R4982K4776j1668O6271N9553
2174A252847J01207P5688N1976K5113L5580R4720k6066m2590o9308j72220j37322
$$ y = [343028, 333070, 306838, 307373, 272343, 282204, 308031, 294875, 246725, 266526, 281823, 254415, 284449, 304792, 361121, 364258, 405545, 406745, 368718, 318361, 254461, 234556, 298413, 317799, 328756, 362250, 397228, 413123, 450233, 462428, 475834, 507585, 596387, 661324, 716122, 839942, 847330, 834209, 780018, 733067, 672852, 593873, 557007, 507274, 510208, 511666, 537940, 581629, 519302, 504667, 506851, 486371, 466181, 451439, 500896, 505302, 573477, 637948, 650436, 663037, 676237, 745395, 753163, 702686, 747742, 826445, 938280, 956940, 1032939, 1085395, 1093031, 1109233, 1059631, 1039066, 1009515, 976048, 988013, 1018933, 1113915, 1138691, 1127023, 1193294, 1252847, 1354054, 1429742, 1481718, 1506831, 1542411, 1637131, 1611065, 1568475, 1499167, 1326947, 1189625]
2163A189625n9297r6096p1090p1716l7987j1568l6923m3692j4188k5875l9232
2152F81961k3068p1048k765Q947j1182m1770j1791k5271K339l8358q68j3429j2411
2139D41286n2845j5736Q074m351J0497o0067j0849J8244l0525l0222m6398P144
2127B34252j0165J7004L758j8370K0860R1419J3754k0696j04154k496L8576J5083
2115B78825l1128n5057k1980j860j945L1329m036l1454j2612K9110K2567k0667
2103A81092j4668J4393J6410M437p828l6176L8595J9042l391j7878j7566k0220
2091A56242L5273j6954j4915j7720k3208o9142L6065L3438J9777K0574J3168j4542
2079A58056k4316j3330k592j7503j9856N2840K9801k7202J6019l441L0164L0835
$$ y = [1189625, 1130328, 1034232, 963142, 891426, 853439, 841871, 804948, 761256, 747068, 721193, 681961, 658893, 587845, 585080, 594027, 582845, 541075, 529284, 504013, 506352, 467994, 467126, 453697, 441286, 388441, 372705, 380779, 376428, 386925, 326858, 316009, 334253, 303728, 273506, 227108, 234252, 224087, 241091, 244849, 226479, 247339, 338758, 352512, 331816, 227662, 225166, 263742, 278825, 247697, 192640, 170660, 168800, 166855, 198184, 194148, 162694, 150082, 179192, 201759, 181092, 166424, 180817, 197227, 201664, 193836, 157660, 196255, 215297, 211906, 194028, 176462, 156242, 191515, 174561, 159646, 141926, 118718, 49576, 85641, 119079, 138856, 159430, 172598, 158056, 133740, 120410, 117818, 100315, 80459, 133299, 163100, 135898, 151917, 148476, 178640, 209475]
2067B09475L2947k1045k7983m1193n3386J5021K2319j5438J904j0559k6390l8169
2055D7503K1643L0526l1436k1273K3904L6062K6492k077L1317k7910q656o157
2043A19938n5428n596M8853l0810q816J7549p49j1580n1224L3696J7741o36m1389
2030C1549J8832q500J6900m9395j195k7058L4664N1824k6067J1625K5818J1825
2018I0822n0198m3133n459L4656K6970o173j5843J1450k7381Q3095m3745n8351
2006c290k917n7319L3970J5659N1920Q830M595n6737j8330P855K423k3588l4670
1993g1599N4593K9782J6835J4325j9562k0554j6538k2022j431P868K5950l012
1981e365j5481j832o095m1130k4046M6086O735K8515p590L300k3025N9881K0657
$$ y = [209475, 242422, 221377, 193394, 152201, 98815, 113836, 136155, 120717, 122621, 112062, 85672, 47503, 69146, 99672, 68236, 46963, 70867, 106929, 133421, 131344, 162661, 134751, 126095, 119938, 64510, 58914, 107767, 76957, 68141, 85690, 84941, 73361, 22137, 55833, 73574, 72938, 31549, 50381, 41881, 58781, 9386, 8191, -18867, 15797, 67621, 41554, 53179, 78997, 90822, 40624, -2509, -7968, 26688, 53658, 47485, 31642, 43092, 15711, 98806, 55061, -3290, -6207, -63526, -29556, -13897, 38023, 46853, 51448, -5289, -23619, -15764, -13341, -36929, -71599, -17006, 12776, 29611, 43936, 24374, 3820, -12718, -34740, -36171, -28303, -2353, -5365, -20846, -22678, -28773, -69903, -93949, -47863, -41128, -12613, -20203, -16903, -39928, 19953, 40610]
1968D0610k4950L0849n330N9453m8974l4774p276m727O865l3684l7182J6927P397
1955c4796M243j5239J229L2694J297J7477J3633J0364K4130m9779J5808K8615
1943D9676k2551j3744N35j456j2287K0245L2974O0073k5067m1080k0622M291q248
1930B2739m5170K2671j6921K3860K4767j167j3816j7929K9992j1040P214Q119
1918C3319m5264j3012M1995K1943m16L979j1005j0214m2051p458K4897Q26K0684
1905A8223J8961J5370k2394l1590j7063K1490N2220O0918j4940n0571n2215K4543
1893B2952J4045K6710n3437k877M780n410P821L5373j4694N056j0304j2128j99
1880A7688M2941O0236o6163k9603k6026J3402K8K2019k4594m623M1256N411k5246
$$ y = [40610, 15660, 46509, 41179, 100632, 51658, 16884, 9608, 4881, 11746, -21938, -59120, -42193, -34796, -30553, -45792, -44563, -11869, -10572, 6905, 20538, 30902, 55032, 5253, 21061, 49676, 27125, 13381, 13916, 12460, 173, 20418, 53392, 113465, 88398, 47318, 26696, 30987, 22739, -22431, 240, -16681, 7179, 31946, 30779, 16963, -966, 29026, 17986, 25200, 33319, -11945, -24957, 17038, 38981, 38565, 42544, 31539, 21325, -20726, -28184, -3287, -2461, 18223, 37184, 52554, 30160, -1430, -18493, 2997, 55217, 116135, 101195, 50624, -1591, 22952, 36997, 63707, 10270, 7393, 12173, 6763, 14584, 49957, 35263, 40319, 30015, 17887, 17688, 60629, 120865, 54702, 25099, -927, 12475, 12503, 34522, 9928, 5305, 46561, 51972, 26726]
1867B6726N498J4441L79m9250K9206n4277j742R1116K2614p5792j9646K4762l2683
1854a8648J4318J3263L3539q856k6542O793K2704K3181m5432L8711J7446L3220
1842A03697K266L133K8436R634p572p9658M0595m296J9217l7722J2275L9056K269
1829A31330J6769k2690j134J8394k1721l2138M5231j5124L6812K5104Q791L6904
1817B26528j0225R034K3498m6195j7188M547N9973K2017j2347Q384o455M031k830
1804B62772j2793J1834P759l601l5428m2933J085K44P69J5959L5226j0237k7853
1791B02803k2081M8067l998o8263K5752L324k5549L9360j2329k7903J0736R359
1779A79278R276L0486j6554j0734N663L222L2804M368Q052j7476p072k7725j6408
$$ y = [26726, 32224, 46665, 47044, -2206, 27000, -27277, -29019, 62097, 84711, 8919, -10727, 14035, -18648, -4330, 8933, 42472, 33616, 7074, 13867, 36571, 59752, 14320, 53031, 70477, 103697, 105963, 109096, 137532, 147166, 139594, 59936, 100531, 96235, 115452, 77730, 90005, 129061, 131330, 148099, 125409, 124275, 142669, 120948, 88810, 134041, 118917, 155729, 180833, 189624, 226528, 216303, 225337, 248835, 202640, 185452, 189999, 249972, 271989, 259642, 268026, 261571, 265602, 262772, 249979, 261813, 269572, 265971, 230543, 187610, 188695, 188939, 189708, 205667, 240893, 230656, 202803, 180722, 228789, 224791, 156528, 182280, 185604, 160055, 199415, 187086, 159183, 169919, 179278, 188554, 219040, 202486, 191752, 197415, 200637, 233441, 237809, 245861, 228385, 221313, 193588, 177180]
1766A77180k9995j9639J0836K969O7449l4653j3546J7464p5671k1536j4266K0735
1754H7327M1814n9793o697k0390L198K7560M80J072j5221K1821J8483j7025K2322
1741A04951j971l9467l0070J5823q75k2275n5590j2267L0396K8898k9253j7301
1729b9001M6489m0713l7666j0822K8362J3951K091m8695J9894k124k4134L5078
1717d7290K275M1925N9432l7610m5145J1603j9912P044l092O524q919K1450j6240
1704b7955j1687n4779k2967K9856L2457P889l7112J272L1507K6255j5004R954
1692c0314K719l7748K0271O1787k1242M5O302l9277k7083J827K4079M1180n8478
1679e5932l1492N3800L3700J7105n4674j1025K8620J6212r501k1760N3417l4799
$$ y = [177180, 147185, 127546, 138382, 141351, 208800, 174147, 160601, 178065, 102394, 80858, 66592, 87327, 129141, 69348, 62651, 42261, 45459, 73019, 73499, 74571, 59350, 81171, 99654, 82629, 104951, 102980, 63513, 33443, 49266, 48391, 26116, -29474, -41741, -11345, 17553, -11700, -29001, 17488, -23225, -60891, -71713, -43351, -29400, -27309, -76004, -56110, -58234, -82368, -47290, -45015, -3090, 56342, 18732, -26413, -14810, -34722, -27678, -30770, -24246, -33165, -11715, -27955, -39642, -94421, -117388, -87532, -55075, -47186, -84298, -83026, -51519, -25264, -40268, -30314, -27595, -65343, -45072, 16715, -4527, -4482, 1820, -37457, -64540, -62713, -38634, 2546, -55932, -87424, -33624, 76, 17181, -37493, -48518, -19898, -3686, -13187, -34947, 18470, -16329]
1667a6329J9162L1686j2027j5235j0445p444J6260K4902K6817m0534n7289o737
1655d7213m4793M5692o088p8503M290L7867K2662m372j2705J0653l8693Q2080
1643b9123L6355N18K244q63j7404l5489j7182M775J2481j7938k5008N465K9325
1630e1844j3726K1379L1322k1541j9106J9864k2626j0715r337K2696J2215L7224
1618d195P734k69j7479o60j0625m8273O230L6881j141k0210r791K2808k8277q024
1604g5291l1630M749k0926M3588R142J4495N241n699K2287k4021l800j0645l410
1591g5920q593l4022M5507Q5571j4748l2175j8946p20m0933L2757j0984r562O548
1578g6220J432M705j1944J7098j9237R536M9048m9007K135J5944O484j517J4325
$$ y = [-16329, 2833, 34519, 22492, 7257, -3188, -10632, 5628, 30530, 57347, 16813, -40476, -47213, -92006, -46314, -52402, -130905, -126615, -88748, -66086, -70458, -83163, -72510, -111203, -29123, 7232, 7750, 9994, 9131, -8273, -43762, -60944, -56169, -43688, -61626, -86634, -81169, -51844, -65570, -44191, -12869, -34410, -53516, -33652, -56278, -66993, -76330, -53634, -41419, -4195, 3539, 3270, -14209, -14869, -25494, -73767, -67537, -30656, -31797, -52007, -61798, -38990, -67267, -75291, -106921, -102172, -123098, -79510, -70368, -55873, -50632, -56331, -34044, -58065, -61865, -72510, -75920, -84513, -118535, -73028, 12543, -2205, -34380, -53326, -54046, -94979, -62222, -73206, -82768, -76220, -74788, -70083, -82027, -64929, -84166, -74630, -25582, -74589, -72454, -56510, -50026, -51543, -37218]
1565c7218J0689k3238k2624k3547o370O901J3335K8006j360j3295R784Q082J5588
1552c5267K444k9207k2404N0630N3548k5524k5133j6805k9730J6604K436L7617
1540b0791j1624j5095K3809m427J3721n6252K8926j1044K3944L2004j6591n1803
1528f5223j0710K4110j3540j4112J8225L1443Q602l2663J8685n313j9737N20K0769
1515c8944J9088l475n91L131l3375N8089L9760k9097k7923l9185l7552L3812M5262
1502a1000l4009l466r125l2331m9058N4736N0035k5604P772K9190l226J265L248
1489b1573K7630k5974R447l2169K8023K0809l1927r520Q295k6562J1280m3085
1477h5326l8754Q114J6529J1496j5872J1379l2105N148K9609J8687K6184N514
$$ y = [-37218, -26529, -49767, -72391, -95938, -102308, -95407, -82072, -54066, -55426, -68721, -58937, -50855, -35267, -32823, -62030, -84434, -33804, 19744, -5780, -30913, -47718, -77448, -60844, -58408, -20791, -32415, -47510, -23701, -28128, -14407, -70659, -41733, -52777, -28833, 3171, -13420, -65223, -75933, -51823, -65363, -79475, -61250, -29807, -21205, -53868, -35183, -40496, -60233, -59713, -38944, -19856, -23331, -23922, -20791, -54166, 3923, 43683, 14586, -13337, -52522, -90074, -56262, -11000, -45009, -48475, -57600, -89931, -138989, -84253, -34218, -59822, -52050, -22860, -26086, -24821, -21573, 6057, -19917, -10470, -42639, -14616, 6193, -25734, -35254, -26959, -53521, -42241, -85326, -124080, -115966, -99437, -87941, -103813, -92434, -124539, -119391, -89782, -71095, -44911, -39397]
1465c9397L815j1157k7743K1336p2336j6784M4832K4483M4929k4412m4432M0621
1453e6245L6886m415J6573l7746j0416K532K1210j9367j4635K832j1222J7162
1441e6851J5248j8353J6649j1393k7065N4405O899l2319k4048M473K2484p400
1429e7271K8546K4427p417l0936j8048m1707M1165L8174K7129L9064n1820o1156
1417f9850K0160J784J9322j3616L102k1038K2549L0050j9152J2660K288O036l293
1404h998k5311k2154K3245R118K1746k801k3096j152r099R3M5088l3129j0330
1391c6780P830N4183N322K8637m616p3063R03L2980m2587J9211m8406J3408j4445
1378e7423M9329O423n6287n4753k756M9730J5338j4464L7427R087n9600J0476
$$ y = [-39397, -35582, -46739, -74482, -53146, -125482, -142266, -97434, -72951, -28022, -52434, -96866, -56245, -19359, -23774, -7201, -44947, -55363, -52831, -31621, -50988, -65623, -62791, -74013, -56851, -41603, -59956, -43307, -54700, -81765, -27360, -20461, -52780, -76828, -72355, -49871, -57271, -28725, -4298, -11715, -42651, -60699, -102406, -61241, -23067, 4062, 43126, -8694, -69850, -49690, -47906, -28584, -42200, -39098, -60136, -37587, -7537, -26689, -14029, -11741, -5705, -8998, -34309, -56463, -33218, -24100, -2354, -5155, -28251, -29403, -38502, -38409, 6679, -26450, -36780, -28950, 25233, 30555, 59192, 54576, -18487, -17584, 15396, -27191, -7980, -56386, -42978, -57423, -8094, -1671, -57958, -112711, -115467, -65737, -50399, -64863, -27436, -18349, -77949, -67473]
1366f7473J1920r497l0986j5294K0949r32k8232L5215K0028L2891K266j0354j3158
1353e2657l8429Q937L6784m1012r977K5394j2644L4243O8937l2977k9157n2448
1341i5006N0221l850l942O637r917J2451j8003l4359M2695n170L5873j2544m0717
1328g5631j5893l5714L1580Q0087n1120r310J7713M13N21j2918K5283m7436J3834
1315g8591J1153k9656K4389L0707N306J2723n9567K8407r106m462N964P847P68
1302e4118K8253o658r929M180j3235P632M2842j659Q5344n590o372j7558n649
1289D7483l1567o1007j6037K2916L7209Q446j804P422K1159J9266k6287k6793
1277D06J576m8638M5802K619K028J1776N6344j346N497m7394K3503o2543j3837
$$ y = [-67473, -55553, -65050, -96036, -111330, -90381, -91313, -119545, -84330, -64302, -31411, -29145, -39499, -52657, -91086, -82149, -45365, -86377, -96354, -70960, -83604, -49361, 19576, -13401, -42558, -95006, -44785, -48635, -52577, -45940, -55857, -43406, -61409, -95768, -53073, -58243, -22370, -34914, -75631, -91524, -127238, -95658, -15571, -66691, -76001, -58288, -57875, -57354, -70272, -44989, -92425, -78591, -67438, -97094, -72705, -41998, -36692, -23969, -83536, -55129, -64235, -68697, -62733, -54886, -54118, -25865, -32523, -42452, -38272, -51507, -43875, -1033, -2692, 82652, 77062, 70690, 53132, 47483, 15916, -45091, -61128, -38212, -1003, 7443, 5639, 13061, 34220, 53486, 27199, 406, 1982, -46656, -854, 1765, 3793, 15569, 71913, 70567, 76064, 28670, 52173, -10370, -24207]
1264b4207O1183j5801J7557m2779L9107J4121l4246j3905J5813j2401n146j928
1252b632L1809p827k0801L9252r063L1004L0303k1344k006O354l403J4645k6029
1239F0262k5038M1968P224m0454J2360P251m1261m2778m694P023k2850q84k1336
1226f3207J1903L4547k9651L3453j2686m0626J4248K5274n1525K3422M6444k4667
1214c3071r804k9876o3177L2999K1042j7568R4370J0564k6858l7180L2415m758
1202c0902o8269r639K8829M4713K2549M1969K6377q359p8629j4227j6424j8956
1190h0968M3554M4302K840K152m59J1969l7750J1932k7556K298k3740Q548J3407
1177b9471j9746J2233k4289J0152J8559M0653k9945L9614n905J8812j2125M692
$$ y = [-24207, 36976, 21175, 38732, -4047, 35060, 49181, 14935, 1030, 16843, 4442, -704, -2632, 29177, 21350, 549, 39801, 30738, 61742, 92045, 70701, 68695, 75049, 71646, 86291, 60262, 35224, 77192, 84416, 43962, 56322, 63573, 22312, -20466, -25160, -18137, -40987, -41871, -63207, -51304, -16757, -46408, -12955, -25641, -66267, -52019, -26745, -78270, -54848, -8404, -33071, -42875, -72751, -135928, -102929, -81887, -99455, -5085, 5479, -21379, -58559, -26144, -30902, -99171, -108810, -79981, -35268, -12719, 29250, 55627, 47268, -31361, -45588, -62012, -80968, -37414, 6888, 9728, 11880, 11421, 23390, -14360, -2428, -29984, -27686, -51426, -42878, -29471, -49217, -36984, -61273, -51121, -32562, 8091, -21854, 17760, 11855, 30667, 18542, 23234]
1165B3234j0351P229L1536O173l3407j7679K2710K226j1122K098l2701l05R949
1152d10M9677J0201o384K1775p57l9651j6611k1253k0795O4584L9191m176k7290
1139D8101K239k8070k6543M7502l408l0942K4771O101J1407l259n476j1134m0661
1126i372n314J6342K4010N2516n153M218J7247J4251m2753p858N292P001K2256
1113I2683J9096j6229l5378j3491J6525J440O2109l016n3524L048j3953K1547
1101H0857L992l9179K8181o842J112J9799l4106M2480K6807j1935m1245k5998
1089D3923j9587K1967k105j4480k3585K0562j522M0248J015K6723M1071o1442
1077G2788k5134O5347L5516k8584J7347k2096J3436j6359M942J9222n275n364
$$ y = [23234, 12883, 20112, 51648, 57821, 24414, 6735, 29445, 31671, 20549, 22647, -10054, -10359, -410, 49267, 59468, 53084, 74859, 74102, 34451, 17840, -3413, -24208, 40376, 79567, 75391, 48101, 50340, 22270, -4273, 43229, 39821, 8879, 33650, 39751, 51158, 47899, 42423, 31289, -9372, -14686, 1656, 25666, 78182, 73029, 77247, 94494, 108745, 65992, 58134, 63426, 70427, 92683, 111779, 95550, 60172, 46681, 63206, 64646, 126755, 123739, 70215, 73263, 59310, 80857, 84849, 45670, 73851, 67009, 68121, 87920, 53814, 96294, 123101, 111166, 69921, 43923, 24336, 46303, 44198, 29718, 6133, 26695, 25173, 65421, 66436, 93159, 134230, 72788, 47654, 113001, 148517, 119933, 137280, 115184, 128620, 112261, 117203, 136425, 131150, 125786]
1065A25786r439M8314l0016j3781k4831r472J6559K2120O6380q524o5875K4970
1053A42191K943k6356M9376j413o1856J9176K3610N8806O8050k3126K924o106
1041B48219p702M4004L443l892J5566J2367K8000K7921J018J3733o038j4436O3378
1028D25581P436K8330k4794K9319J2667K0166K1525M2725j0973j5899L4494J5171
1016E85748J5818J1589O520L9520O897k2217j5775J5310L2589K8187J6927r195
1004G11918K6788q535p02K1838L7365O8722O2733L7207J5673N244Q580K6720M7645
991A061196M711M8471N4973j119J03603J36839O3037P2321M5324R8270J15856
980A803482Q5241J17594J64506J96825J43585J61458J64020J85308K50145K43039
$$ y = [125786, 116347, 164661, 134645, 120864, 96033, 86561, 103120, 125240, 191620, 183096, 117221, 142191, 145134, 118778, 168154, 166741, 104885, 124061, 147671, 206477, 274527, 251401, 254325, 248219, 240517, 284521, 287964, 284072, 299638, 312005, 340005, 367926, 368944, 382677, 376639, 362203, 425581, 433017, 461347, 436553, 465872, 478539, 498705, 520230, 562955, 551982, 536083, 570577, 585748, 601566, 613155, 619675, 659195, 666092, 643875, 628100, 643410, 675999, 704186, 721113, 711918, 738706, 730171, 729469, 751307, 788672, 857394, 920127, 957334, 973007, 978251, 986831, 1013551, 1061196, 1065907, 1114378, 1169351, 1168232, 1271835, 1408674, 1471711, 1544032, 1589356, 1687626, 1803482, 1888723, 2006317, 2170823, 2367648, 2511233, 2672691, 2836711, 3022019, 3272164, 3515203]
970C515203J26620J67336L18091L65955M57598N21712O29961Q01104R30853J159353
960H993786J410413J811774K579971L275803L477946J782754k566263m939683
952A5826501l640348k363435j737641j356279r88792p47960n74273m41199l66775
943C609799j71549j22808r7700j53389j40200j80138k60050k49676k46551j76369
933A811369j20716m8974r2224p9212q9818o5882q2191r2036j7445l2661j9190
922A071020L727r6133o5474m3205m3161p0123m6361k7544J708J7980o6474j2005
910F23955l984p0097o462J6470j8254M663k3249n2670K2496l2509j2339K1622
898D69642j8266k0025o070K3005M151Q558k1692k6876K1471k4350n6525o049m6937
$$ y = [3515203, 3641823, 3809159, 4127250, 4493205, 4950803, 5472515, 6102476, 6903580, 7834433, 8993786, 10404199, 12215973, 14795944, 18071747, 21549693, 23332447, 20766184, 15826501, 12186153, 9822718, 8085077, 6728798, 5740006, 4992046, 4417773, 3976574, 3609799, 3438250, 3315442, 3217742, 3064353, 2924153, 2744015, 2483965, 2234289, 1987738, 1811369, 1690653, 1641679, 1549455, 1470243, 1380425, 1314543, 1232352, 1140316, 1122871, 1090210, 1071020, 1074747, 978614, 913140, 869935, 826774, 756651, 710290, 682746, 684454, 702434, 635960, 623955, 619971, 549874, 543412, 559882, 541628, 546291, 523042, 470372, 492868, 460359, 448020, 469642, 451376, 431351, 425281, 448286, 452437, 460995, 439303, 412427, 433898, 409548, 353023, 346974, 300037]
885C00037m671p671n0807L4738K5606j8046J0859R34l1506j4315j5l1461j1677
872B02005J685L1236k1972J9866j7792K4417L7419L61m8867M2019j7234k8998
860B24145j7698l8544j9350K9173M7662m1866n0535l5698q899L299r106K4180
848A06763K6188l699k0713l075m972o6427P757M7919k698J43K374p826N2131k6024
834A07841j7807k7427l7642m640j3594M316K6130K9712q737l8491K2745M27j0193
821C2640k551j4827j7406M0089q552o87R048J9522l8387M4094K3282j8412j0613
808E7240l5980l532J3538k5778j5155J1641O642J8266K9202n044o9270j6746J0295
795b4681O3566J9957K2213k3714k5248J1521J4610p983j4096m4072J184J4491
$$ y = [300037, 295366, 287695, 236888, 271626, 297232, 279186, 290045, 290979, 259473, 245158, 245143, 213682, 202005, 203690, 234926, 212954, 232820, 215028, 239445, 276864, 277225, 228358, 270377, 253143, 224145, 206447, 167903, 148553, 177726, 225388, 183522, 132987, 97289, 88390, 91689, 82583, 106763, 132951, 129252, 108539, 105464, 100492, 34065, 41822, 89741, 87043, 87186, 89560, 81734, 133865, 107841, 90034, 62607, 24965, 20325, 6731, 11047, 37177, 66889, 58152, 19661, 42406, 42833, 32640, 30089, 15262, -2144, 37945, 29393, 28706, 37754, 57276, 18889, 62983, 86265, 67853, 57240, 21260, 17728, 31266, 5488, -9667, 1974, 8616, 26882, 56084, 51040, -18230, -34976, -24681, 38885, 58842, 81055, 57341, 32093, 43614, 58224, 50241, 36145, -7927, -6743, 7748]
783G748K7164L8729K147r793L554m2546j4091K5620j9502n4254M0936K3232l467
770B5477k6494L5470L9563q932j3833m0772M867K6512L1285K497K8370l6587j8358
757D9065l3670j6322M6683J555n4226l0493J5201L2605k840m0415K7972L709J1222
744A0046M1338m5221L716P4654j9320l6855k141J5655l4252K2653l4912k1157
732b5796L8129J0141m2985j958J2310M3832r54j6477L3753o159k599q975Q306
719D0568k6298M431q255K9690k4044K3969l3628L7368k4697k1514K9012m1672
707a5070j7243M1237q023J6368n102R230L997n5714P672m2341m7396N2834J7128
694d2423L2565K3302j1315L8623j4746l7332q677M8254J3764k5923k4564M5789
$$ y = [7748, 34912, 73641, 75788, 65995, 69549, 27003, 12912, 38532, 19030, -35224, 5712, 28944, 25477, -1017, 34453, 74016, 65084, 51251, 10479, 15346, 41858, 73143, 75640, 104010, 67423, 49065, 15395, -927, 45756, 47311, -6915, -37408, -22207, 10398, 7558, -32857, -4885, -1176, 10046, 51384, 6163, 9879, 84533, 65213, 28358, 26217, 41872, 7620, 30273, -4639, -25796, 12333, 22474, -20511, -22469, -10159, 33673, 32719, 16242, 49995, 43836, 41237, 32262, 40568, 14270, 18701, 10446, 40136, 16092, 40061, 6433, 43801, 19104, -2410, 26602, -15070, -32313, 8924, 901, 17269, 12167, 21397, 25394, -30320, -22648, -64989, -112385, -59551, -42423, -9858, 13444, 2129, 40752, 26006, -11326, -20003, 28251, 42015, 16092, -8472, 37317]
682C7317M739J378J7713m7514k1088N04o5P55R576N9445J8533J2974j1528l7472
668D5267L6884j4863l6993k0593J4542K7651O017q283l3472O3574J8714l8261
656F0184m5100m0075k558j4866j6533P6800O377l6207Q042O722l6770J6216j4575
643c2343J3290J5689N641J6097j8683N8948Q568l5182K7439m2049m2175j8671
631d3431K2362O2318l0608L9072j4851k5461j9707K3720k426m4465m4875L8170
619d0182M8114J23J602R836Q382o0858K503K6654j9441M5995J3968l3445L5248
606C8499J349j6192J1715M282j0096n7863p552N710M165K8751p873L1919l584
593B3230o4853l2433J0497o843K5435M2111L0453q001n0926q338M061r542K3870
$$ y = [37317, 42056, 43434, 61147, 13633, -7455, -6951, -7016, -6261, 3315, 62760, 81293, 94267, 82739, 45267, 82151, 67288, 30295, 9702, 24244, 51895, 57912, 49629, 16157, 79731, 98445, 60184, 15084, -24991, -27549, -42415, -58948, 17852, 24229, -11978, -3936, 2786, -33984, -17768, -32343, -19053, -3364, 2277, 18374, -309, 58639, 67207, 32025, 59464, 17415, -24760, -43431, -21069, 41249, 10641, 49713, 34862, 9401, -10306, 13414, 10988, -33477, -78352, -40182, 7932, 8055, 9657, 19493, 27875, -32983, -30480, -3826, -23267, 22728, 36696, 3251, 38499, 39848, 23656, 35371, 39653, 29557, -28306, -35858, -30148, -25983, 2768, -5105, 26814, 23230, -41623, -74056, -63559, -70402, -44967, -2856, 27597, 19596, -31330, -39668, -35607, -45149, -21279]
580b1279J3787P051k3480n4772J5732L3188l1203L1852J3055l8397J4152m1207
568h1521M1749J6618K4340K2141m1726J937J1127l808j027M1466m3259j20k1934
555c4017M0155J4852l6327L6588k1035j6308K4730n4626j3663k3251O6J5793K5428
542d1615O2498N719l3104l6190L477l3788R900N1628k188K7028L7565j2680m3187
529d937k2384k893j921j5530K6960K2982L8864N0757l1782j02554o582M0578j4509
516b2951p426j5228N6763L527k3405k1783K4544l520m0362K3171j147K3033P3942
503F9158n7711k8024j0658m6792K8733K6526R117L5178N120o8828J2686L3235
491G740j5498j9608n253N9047l4684j2826P15n6085R950L3970K2647J0828l0082
$$ y = [-21279, -7492, -441, -23921, -78693, -62961, -29773, -60976, -29124, -16069, -54466, -40314, -81521, -39772, -23154, 1186, 23327, -18399, -16462, -5335, -9143, -10170, 31296, -11963, -12083, -34017, 6138, 20990, -15337, 21251, 216, -16092, 8638, -45988, -59651, -82902, -82836, -67043, -41615, 20883, 26602, -6502, -42692, -39215, -73003, -63103, -11475, -13663, 13365, 50930, 38250, -4937, -27321, -30214, -32135, -47665, -20705, 2277, 41141, 91898, 60116, -42438, -49020, -8442, -22951, -30377, -45605, 11158, 14685, -8720, -30503, -5959, -9479, -49841, -26670, -27817, -4784, 69158, 11447, -16577, -27235, -74027, -45294, -18768, -9651, 25527, 30647, -38181, -25495, 7740, -7758, -27366, -32619, 26428, -8256, -21082, -20367, -76452, -66502, -32532, -9885, 943, -29139]
478b9139J6634j455K3593L073K051L7875k3315l9462J9454l1950J080n9141k2629
465a03331j0581k408P1020K2309R154M0210k5523j2988M7941j3908K9863m0042
453A1716p140J828j6001L971K6328M0445j6911n4828J672M755j2955P810k3141
440c2451L033M4572l1372k717L530l1656M607l022L7135J9742J1163l4172l2546
427d4154O6857k9366m2551K0314J110n113K2106j3583N2251k8881J7837j7206
415c79j1606K5138m2691O124M8344K2174J2130m8811j1726M7289k9989m9656j5268
402d8927Q871n360J2585j7012K6239l1113l260J0300K6121k7487j617p487j6830
389g4977M1581L1028j9218j6414N5867j2929j965O7146j3560n3796L4494K4067
$$ y = [-29139, -12505, -13960, 9633, 12706, 14757, 52632, 29317, -10145, 9309, -22641, -21561, -80702, -103331, -113912, -116320, -45300, -22991, -13837, 26373, 850, -12138, 35803, 21895, 51758, 11716, 4576, 6404, -9597, -5626, 20702, 61147, 44236, -10592, -8920, -4165, -17120, -9310, -32451, -29418, 15154, -16218, -18935, -15405, -47061, -42454, -45476, -8341, 11401, 22564, -11608, -44154, 22703, -6663, -49214, -28900, -27790, -32903, -10797, -24380, 27871, -1010, 16827, -379, -11985, 13153, -29538, -23414, 24930, 47104, 59234, 10423, -1303, 45986, 15997, -33659, -48927, -40056, -45416, -32831, -49843, -23604, -54717, -57977, -47677, -21556, -49043, -50660, -58147, -74977, -33396, -2368, -21586, -38000, 17867, 4938, 2973, 70119, 56559, 2763, 37257, 61324]
377F1324n2547l0946N0511J9835j3884l9556M8256l9522p9016o870J2147N7560
365a2708L8776j3830r550k1179r414Q972J9027K0361l5806k2509K162J5583J3522
352f593p940l477m50j8302l2061r832M1093j7473J9802O5716m7303k5980J4429
339b8371j677k1219M0260K9666K0043j5121p346K4531j7968o502m4669L6043M9715
326E7385n1705l9663P577k1176j4489L8839j5379o182j507l4989K3691j5119K0034
313e2683L3290j2450j6805J5364J0289R06K4992j2848M4968n2943m2413K8189
301c2144M824P3484l5573j1245p939o126k612j8727k4787L9373j9624k8382J1356
288e8122P566J3197L1517L1853j2714j4264k3951m0158K4149j9301K4169M4518
$$ y = [61324, 8777, -22169, 28342, 48177, 34293, -5263, 42993, 3471, -75545, -82415, -70268, -12708, 26068, 12238, 2688, -18491, -27905, -18933, 94, 20455, -15351, -37860, -35698, -20115, -6593, -14533, -18010, -18460, -36762, -68823, -78655, -37562, -55035, -35233, 30483, -16820, -42800, -28371, -30048, -51267, -11007, 18659, 38702, 23581, 16235, 40766, 22798, 16296, -28373, 7670, 57385, 5680, -33983, -26406, -47582, -62071, -23232, -38611, -44793, -46300, -81289, -57598, -72717, -52683, -19393, -31843, -48648, -33284, -22995, -22089, 2903, -9945, 35023, -17920, -60333, -32144, -27320, 46164, 10591, -654, -8593, -14719, -17331, -36058, -60845, -21472, -41096, -69478, -58122, -50556, -37359, -5842, 26011, 13297, -967, -24918, -65076, -40927, -60228, -36059, 8459]
276H459l714l973J588l5899k7391n3026k0297L9209q643Q5491O2048j0755j0780
263B2317R067p1580k1206J5786J4050L7021j7507O410k0621J8012n3526n504J9628
250d7653o2045O8375K124k5172j4010M0763J7927k6881L7476m519p885N5696l02
237C3894j5869N2186l0590m0384m2946M082J5264j792L0968l0193j1522k7072
225f3974J4252j2957n813J3969R283k7496K3028K8390j8047K975J4730k9115m03
212e1178k2135J8728K9703M6492l2221l4562K8561K5785K1107l114k3291L3607
200C7482J6756k0678k5392q9126j6157K0893Q924j4707K6783l4656K5351k6039
188i0566j5198K4733J6752L7251j4865O4754K4314n2710k2691j021J4796K5886
$$ y = [8459, 4745, 772, 2360, -33539, -60930, -113956, -134253, -95044, -103687, -18196, 43852, 33097, 22317, 31384, -40196, -61402, -45616, -31566, 5455, -12052, -5642, -26263, -8251, -61777, -67281, -47653, -109698, -41323, -39199, -64371, -78381, -37618, -19691, -46572, -9096, -13615, -21500, 34196, 33894, 18025, 70211, 39621, -763, -43709, -39627, -24363, -26155, 4813, -25380, -36902, -63974, -49722, -62679, -68492, -54523, -45240, -72736, -49708, -21318, -39365, -36390, -21660, -50775, -51178, -73313, -54585, -24882, 21610, -10611, -45173, -16612, 9173, 30280, 27166, 3875, 37482, 54238, 33560, 8168, -80958, -97115, -76222, -67298, -82005, -55222, -89878, -64527, -90566, -105764, -81031, -64279, -27028, -41893, 22861, 47175, -5535, -28226, -29247, -14451, 11435]
176A1435l1775j6920o905J6153P331n2587K5108N566J2456M3628m0754j9516K918
163d3862j5095J5501K0908j4935m4493k8676L4199J1349L0257j000J5290J065
151a9492j8368K9443k1598J505J8499J2881k1318k490j0491j6056m8452L0370
139f5567n755l4557N3867M3334j2805k7960M847j2629m922R3r242n23J4899K4292
125c2628J9304J8683k4791m4661l366j9311k985O1325J3340j3240l1670J2089
113d7911j4614k7904j1963K4110q018M9037J8163R717p612k8080K4315J0495k7003
100c7268L687N3588L3603j1762l0779k1043m3407k1462m0387K6132M1489K7360
88b0249K1210K4339m5664o561o153p238K2545M499K405j4979J25J493k7206j5758
$$ y = [11435, -20340, -37260, -44165, -28012, -20681, -73268, -48160, -42594, -30138, 13490, -27264, -46780, -43862, -58957, -43456, -22548, -37483, -81976, -110652, -76453, -65104, -34847, -35847, -20557, -19492, -37860, -8417, -30015, -28510, -10011, 2870, -18448, -20938, -31429, -47485, -95937, -65567, -71322, -105879, -52012, -8678, -21483, -49443, -44596, -57225, -62147, -62054, -71296, -71819, -56920, -32628, -13324, 5359, -19432, -64093, -67459, -86770, -89755, -28430, -15090, -28330, -60000, -47911, -62525, -90429, -102392, -78282, -86300, -37263, -19100, -9383, -16995, -45075, -20760, -10265, -37268, -33581, 20007, 53610, 41848, 11069, -9974, -53381, -74843, -115230, -89098, -47609, -20249, 961, 25300, -20364, -26925, -33078, -40316, -17771, -13272, -10867, -25846, -25721, -24228, -51434, -67192]
74f7192M211K4894O768k8414l015L4640k9627L462L0743J5343m0984j0140k8485
61h7796j3402K6768L978K4772J6258j7461l1927K51J4102K0683l70k843j5280
48f2267K0651n573o940j9513j6998J5970K2407k5808m3309J9472K5143l0237L4667
35g2335M0930j3100J9019l3313R193k2227J690J6676m245L2149j4956k463j1696
22e4678L6918j5898k1863J8274M161O770k6267k6090J5731K1622j7327l4695J2734
9h0608J3906l676J1372L960J1206J9721j1493o362M0185
0a789
$$ y = [-67192, -62981, -38087, -31319, -59733, -62748, -28108, -57735, -54273, -23530, -8187, -49171, -59311, -87796, -101198, -74430, -70452, -45680, -29422, -46883, -78810, -78559, -64457, -43774, -44144, -46987, -62267, -41616, -47189, -54129, -73642, -90640, -74670, -52263, -78071, -121380, -101908, -76765, -107002, -72335, -31405, -44505, -25486, -58799, -49606, -71833, -70143, -53467, -57712, -25563, -40519, -42982, -54678, -17760, -33658, -55521, -37247, -33086, -26316, -52583, -78673, -62942, -41320, -58647, -93342, -80608, -66702, -70378, -59006, -55046, -43840, -24119, -35612, -41974, -1789]
$$ Imaginary data points
##PAGE= N=2
##DATA TABLE= (X++(I..I)), XYDATA
16383g41902O14K7246J3154J4647N638l154L8688j8679J0701J580J6280K3319
16371f11868K8784M7578j0648O41K812M726M2083J8000k5752J3037Q32K6008K3252
16358d40515Q685J5307K2119J9119K3L4119J9792P647J3665L8495n5448j5105
16346c32097J761M4596L9323K324K44K793K5901M4326K9152J3973K2522N192r916
16333a09906j8607K2430J5706p574M724K3948J635L0241M8180J4862r470J7373
16321C3542O430k2725K8362N0537Q826L0838J6624k3072J218j6072J0238K4845
16309A49591J4370j3878J544K6021J5837P498K9103k2278K6035K2571j4179K4524
16297B66759q934Q9J0506L456N0807K1216p257J5087k9647L6739K9315J829J8739
$$ y = [-741902, -741288, -714042, -700888, -686241, -680603, -683757, -645069, -663748, -653047, -651467, -635187, -611868, -583084, -535506, -546154, -545513, -542701, -537975, -495892, -477892, -503644, -490607, -489775, -463767, -440515, -431830, -416523, -394404, -375285, -375262, -341143, -321351, -313704, -300039, -261544, -316992, -332097, -330336, -285740, -246417, -244093, -243849, -241056, -215155, -170829, -141677, -127704, -105182, -99990, -109906, -128513, -106083, -90377, -97951, -93227, -69279, -67644, -37403, 10777, 25639, 16169, 33542, 39972, 17247, 45609, 96146, 104972, 135810, 152434, 129362, 130580, 114508, 124746, 149591, 163961, 150083, 151627, 177648, 193485, 200983, 230086, 207808, 233843, 256414, 242235, 266759, 257825, 257914, 268420, 271876, 322683, 343899, 336642, 351729, 322082, 358821, 388136, 389965, 408704]
16284D08704k3101p960J7515j2904J5948J8333M5243l7180k9349O6671J981K0551
16272D84452J2467j2973N0930j1246O438O4346J4433j7434J2038K2215J42j2379
16260F13429j3217O3504L324K81l578j9304K5618j9274L1890p376N4406o309l6395
16247F86999K6120J4625J794l1021L9782L330j1204m096J9708J755J4510M6052
16235H08354K1247j2061k8812K3638Q538M26l2710K2785M0729j697r316n604L4410
16222H69927N2170j1115l2421L429J3953L5550K893j839L1922L645m2489k5654
16210H99971L1107M4055J18j9298J5645j8523m5946j6423L5740M914j2568M484
16198I23276J8071P11M5840k1184J7350L1539K0105J2484o744Q990J9340q50j7588
$$ y = [408704, 385603, 377643, 395158, 382254, 398202, 416535, 461778, 424598, 395249, 461920, 463901, 484452, 496919, 483946, 534876, 523630, 530068, 594414, 608847, 591413, 603451, 625666, 625808, 613429, 600212, 663716, 667040, 667321, 663743, 644439, 670057, 650783, 682673, 675297, 729703, 723394, 686999, 713119, 727744, 729538, 698517, 738299, 741629, 730425, 726329, 746037, 747792, 762302, 808354, 829601, 817540, 788728, 812366, 820904, 821330, 788620, 811405, 852134, 850437, 841121, 835517, 869927, 922097, 910982, 878561, 881990, 895943, 931493, 934386, 932547, 964469, 968114, 925625, 899971, 931078, 975133, 975251, 955953, 971598, 953075, 907129, 890706, 926446, 931360, 918792, 923276, 941347, 942058, 987898, 966714, 984064, 1015603, 1035708, 1048192, 1041448, 1050438, 1069778, 1068928, 1051340]
16185A051340j0544J887N3289L7514j6562j8574k5486m5915M0716k0795k6549
16174A020321M0287L6283j5826K8460J560K3797k6499j7296k5446P7169N9203
16163A202013j6617o5150j3594r332J2211J4709K9287J4466p1456J7325N56k1957
16151A092461N322L074l220J3806K5066M0518J7464n1187k4843K8283J3308j1417
16139A148635N9265p152m9759k124K3779J7901l1190o480j829k7168J3250k1813
16127A115315j3733N1737J1196L0102l2959q947J1593k0552q175K5266N7683k0833
16115A197693L0198N029k5674J6416O892j7765Q789J2771j5630K6345L3187r005
16103A269246l324k2703l6474K6399K0138J6745k5527l048J1718o3298L076J1140
$$ y = [1051340, 1040796, 1042683, 1095972, 1133486, 1116924, 1098350, 1072864, 1026949, 1067665, 1046870, 1020321, 1060608, 1096891, 1081065, 1109525, 1111085, 1134882, 1108383, 1091087, 1065641, 1142810, 1202013, 1185396, 1120246, 1106652, 1097320, 1109531, 1124240, 1153527, 1167993, 1096537, 1113862, 1114418, 1092461, 1097783, 1100857, 1097637, 1111443, 1136509, 1177027, 1194491, 1143304, 1118461, 1146744, 1160052, 1148635, 1207900, 1200748, 1150989, 1148865, 1172644, 1190545, 1159355, 1152875, 1151046, 1123878, 1137128, 1115315, 1101582, 1153319, 1164515, 1194617, 1161658, 1152711, 1164304, 1143752, 1135577, 1160843, 1218526, 1197693, 1227891, 1232920, 1207246, 1223662, 1230554, 1212789, 1221578, 1234349, 1218719, 1245064, 1278251, 1269246, 1265922, 1243219, 1206745, 1233144, 1253282, 1270027, 1244500, 1241452, 1253170, 1189872, 1192948, 1204088]
16091A204088l3067K6937k8230N1456R604l4052o798L4755j394L0149J507M952
$$ y = [1204088, 1171021, 1197958, 1169728, 1221184, 1230788, 1196736, 1189938, 1224693, 1223299, 1253448, 1254955, 1259907]
$$ [...]
##END NTUPLES=NMR SPECTRUM
##END=
