##TITLE=1H_CA-8698-2-3
 CDCl3, 8 sc, 
 5.7.2020
##JCAMPDX= 6.0         $$ Bruker NMR JCAMP-DX V2.0
##DATA TYPE= NMR FID
##DATA CLASS= NTUPLES
##ORIGIN= UXNMR, Bruker Analytische Messtechnik GmbH
##OWNER= root
$$ XWIN-NMR		Version 3.5
$$ Wed Aug  5 11:20:54 2020 Russian Standard Time (UT+4h)  she@DPX200
##.OBSERVE FREQUENCY= 200.1314999998
##.OBSERVE NUCLEUS= ^1H
##.DELAY= (6, 6)
##.ACQUISITION MODE= SIMULTANEOUS
##.ACQUISITION SCHEME= undefined
##.AVERAGES= 8
##.DIGITISER RES= 18
##SPECTROMETER/DATA SYSTEM= spect
##.PULSE SEQUENCE= zg30
##.SOLVENT NAME= CDCl3
##.SHIFT REFERENCE= (INTERNAL, CDCl3, 0, 15.7039)
##AUDIT TRAIL= $$ (NUMBER, WHEN, WHO, WHERE, WHAT)
$$ ##TITLE= Audit trail, XWIN-NMR		Version 3.5
$$ ##JCAMPDX= 5.01
$$ ##ORIGIN= Bruker BioSpin GmbH
$$ ##OWNER= she
$$ F:/spectra/data/she/nmr/H-F/1/audita.txt
$$ ##AUDIT TRAIL=  $$ (NUMBER, WHEN, WHO, WHERE, WHAT)
(   1,<2020-08-05 11:19:52.67 +0400>,<she>,<DPX200>,
      <created by zg, POWCHK disabled, PULCHK disabled
       configuration hash MD5:
       00 E9 B6 7A A2 85 ED C7 34 08 36 98 17 FE 4E 26
       data hash MD5: 16K
       1C 35 67 6B 3A BF 88 D1 B3 D9 1F 3F 7B 64 A8 6E>)
$$ ##END=
$$ 
$$ hash MD5
$$ 3D 8F 3B 31 93 B9 34 1A 03 1A D8 EC 3D 8C 14 34
##$RELAX= 
##$RELAX= 
##$RELAX= 
##$RELAX= 
##$RELAX= 
##$RELAX= 
$$ Bruker specific parameters
$$ --------------------------
##$DU= <F:/spectra>
##$EXPNO= 1
##$NAME= <H-F>
##$PROCNO= 1
##$TYPE= <nmr>
##$USER= <she>
##$AMP= (0..31)
100 100 100 100 100 100 100 100 100 100 100 100 100 100 100 100 100 100 
100 100 100 100 100 100 100 100 100 100 100 100 100 100 
##$AQSEQ= 0
##$AQ_mod= 1
##$AUNM= <au_zg>
##$AUTOPOS= <>
##$BF1= 200.13
##$BF2= 200.13
##$BF3= 200.13
##$BF4= 200.13
##$BF5= 200.13
##$BF6= 200.13
##$BF7= 200.13
##$BF8= 200.13
##$BYTORDA= 1
##$CFDGTYP= 0
##$CFRGTYP= 5
##$CHEMSTR= <none>
##$CNST= (0..31)
1 1 145 1 1 1 1 1 1 1 1 1 1 1 1 1 1 1 1 1 1 1 1 1 1 1 1 1 1 1 1 1 
##$CPDPRG= <>
##$CPDPRG1= <>
##$CPDPRG2= <>
##$CPDPRG3= <>
##$CPDPRG4= <mlev>
##$CPDPRG5= <mlev>
##$CPDPRG6= <mlev>
##$CPDPRG7= <mlev>
##$CPDPRG8= <mlev>
##$CPDPRGB= <>
##$CPDPRGT= <>
##$D= (0..31)
0 1.2 0 0 0 0 0 0 0 0.06 0 0.03 0 0 0 0 0.0002 0 0 0 0 0 0 0 0 0 0 0 0 
0 0 0 
##$DATE= 1596611991
##$DBL= (0..7)
120 120 120 120 120 120 120 120 
##$DBP= (0..7)
150 150 150 150 150 150 150 150 
##$DBP07= 0
##$DBPNAM0= <>
##$DBPNAM1= <>
##$DBPNAM2= <>
##$DBPNAM3= <>
##$DBPNAM4= <>
##$DBPNAM5= <>
##$DBPNAM6= <>
##$DBPNAM7= <>
##$DBPOAL= (0..7)
0.5 0.5 0.5 0.5 0.5 0.5 0.5 0.5 
##$DBPOFFS= (0..7)
0 0 0 0 0 0 0 0 
##$DE= 6
##$DECBNUC= <off>
##$DECIM= 24
##$DECNUC= <off>
##$DECSTAT= 4
##$DIGMOD= 1
##$DIGTYP= 9
##$DL= (0..7)
0 120 120 120 120 120 120 120 
##$DP= (0..7)
150 150 150 150 150 150 150 150 
##$DP07= 0
##$DPNAME0= <>
##$DPNAME1= <>
##$DPNAME2= <>
##$DPNAME3= <>
##$DPNAME4= <>
##$DPNAME5= <>
##$DPNAME6= <>
##$DPNAME7= <>
##$DPOAL= (0..7)
0.5 0.5 0.5 0.5 0.5 0.5 0.5 0.5 
##$DPOFFS= (0..7)
0 0 0 0 0 0 0 0 
##$DQDMODE= 0
##$DR= 18
##$DS= 0
##$DSLIST= <SSSSSSSSSSSSSSS>
$$ [...]
##$SUBNAM2= <"">
##$SUBNAM3= <"">
##$SUBNAM4= <"">
##$SUBNAM5= <"">
##$SUBNAM6= <"">
##$SUBNAM7= <"">
##$SUBNAM8= <"">
##$SUBNAM9= <"">
##$SW= 24.9337058888022
##$SWIBOX= (0..15)
0 0 2 0 0 0 0 0 0 0 0 0 0 0 0 0 
##$SW_h= 4990.01996007984
##$TD= 16384
##$TD0= 1
##$TE= 0
##$TE2= 300
##$TE3= 300
##$TEG= 300
##$TL= (0..7)
0 120 120 120 120 120 120 120 
##$TP= (0..7)
150 150 150 150 150 150 150 150 
##$TP07= 0
##$TPNAME0= <>
##$TPNAME1= <>
##$TPNAME2= <>
##$TPNAME3= <>
##$TPNAME4= <>
##$TPNAME5= <>
##$TPNAME6= <>
##$TPNAME7= <>
##$TPOAL= (0..7)
0.5 0.5 0.5 0.5 0.5 0.5 0.5 0.5 
##$TPOFFS= (0..7)
0 0 0 0 0 0 0 0 
##$TUNHIN= 0
##$TUNHOUT= 0
##$TUNXOUT= 0
##$USERA1= <user>
##$USERA2= <user>
##$USERA3= <user>
##$USERA4= <user>
##$USERA5= <user>
##$V9= 5
##$VALIST= <valist>
##$VCLIST= <CCCCCCCCCCCCCCC>
##$VD= 0
##$VDLIST= <DDDDDDDDDDDDDDD>
##$VPLIST= <PPPPPPPPPPPPPPP>
##$VTLIST= <TTTTTTTTTTTTTTT>
##$WBST= 1024
##$WBSW= 4
##$XGAIN= (0..3)
0 0 0 0 
##$XL= 0
##$YL= 0
##$YMAX_a= 412017
##$YMIN_a= -349193
##$ZGOPTNS= <>
##$ZL1= 120
##$ZL2= 120
##$ZL3= 120
##$ZL4= 120
##$ABSF1= 10
##$ABSF2= 0
##$ABSG= 5
##$ABSL= 3
##$ALPHA= 0
##$AQORDER= 0
##$ASSFAC= 0
##$ASSFACI= 0
##$ASSFACX= 0
##$ASSWID= 0
##$AUNMP= <proc_1d>
##$AZFE= 0.1
##$AZFW= 0.1
##$BCFW= 1
##$BC_mod= 2
##$BYTORDP= 1
##$COROFFS= 0
##$CY= 11.3945322036743
##$DATMOD= 1
##$DC= 2
##$DFILT= <>
##$DTYPP= 0
##$F1P= 16.9975609425685
##$F2P= -3.02152046262296
##$FCOR= 0.5
##$FTSIZE= 0
##$FT_mod= 4
##$GAMMA= 1
##$GB= 0.15
##$INTBC= 1
##$INTSCL= 1
##$ISEN= 128
##$LB= 0.24
##$LEV0= 0
##$LPBIN= 0
##$MAXI= 10000
##$MC2= 0
##$MEAN= 0
##$ME_mod= 0
##$MI= 1.114404
##$NCOEF= 0
##$NC_proc= 0
##$NLEV= 6
##$NOISF1= 3.799351
##$NOISF2= 2.8
##$NSP= 1
##$NTH_PI= 0
##$NZP= 0
##$OFFSET= 15.70392
##$PC= 1
##$PHC0= -9796.693
##$PHC1= 16.40093
##$PH_mod= 1
##$PKNL= yes
##$PPARMOD= 0
##$PSCAL= 0
##$PSIGN= 0
##$REVERSE= no
##$SF= 200.130013532006
##$SI= 16384
##$SIGF1= 3
##$SIGF2= 2
##$SINO= 400
##$SIOLD= 16384
##$SREGLST= <1H.CDCl3>
##$SSB= 0
##$STSI= 0
##$STSR= 0
##$SW_p= 3612.71676300578
##$SYMM= 0
##$S_DEV= 0
##$TDeff= 0
##$TDoff= 0
##$TI= <>
##$TILT= no
##$TM1= 0
##$TM2= 0
##$TOPLEV= 0
##$USERP1= <user>
##$USERP2= <user>
##$USERP3= <user>
##$USERP4= <user>
##$USERP5= <user>
##$WDW= 1
##$XDIM= 8192
##$YMAX_p= 0
##$YMIN_p= 0
$$ End of Bruker specific parameters
$$ ---------------------------------
##NTUPLES= NMR FID
##VAR_NAME=  TIME,          FID/REAL,        FID/IMAG
##SYMBOL=    X,             R,               I
##VAR_TYPE=  INDEPENDENT,   DEPENDENT,       DEPENDENT
##VAR_FORM=  AFFN,          ASDF,            ASDF
##VAR_DIM=   8192,          8192,            8192
##UNITS=     SECONDS,       ARBITRARY UNITS, ARBITRARY UNITS
##FACTOR=    0.0002004,     1,               1
##FIRST=     0,             0,               0
##LAST=      1.6414764,     0,               0
##MIN=       0,             -349193,         0
##MAX=       1.6414764,     412017,          0
$$ Real data points
##PAGE= N=1
##DATA TABLE= (X++(R..R)), XYDATA
$$ [...]
$$ plain form
2585 2886 4089 31 -3937 -2396 963 2513 2218 203 -2592 -2378 854 2051 796 316 -1625 -2514
2601 -2514 210 2583 1205 -1017 -1741 -1664 -278 2535 2144 -1784 -2683 -617 1120 1914 1135 -2671 -3259
2618 -3259 558 2589 1016 -1190 -1843 -2058 793 2627 -11 -2744 -1871 511 1048 817 -312 -2054
2634 -2054 -812 1590 604 -1124 -158 293 -35 201 -305 -1623 -760 1934 1220 -1783 -1530 -117 929
2651 929 1669 687 -2093 -2610 1192 2498 967 -883 -2059 -1894 1741 3394 133 -2041 -1758 -122
2667 -122 1260 2721 684 -2511 -1592 828 1910 1650 699 -1694 -2503 565 2774 1617 -250 -1650
2683 -1650 -2447 32 3783 2642 -1137 -3144 -1640 1387 4008 3200 -2592 -4810 -900 3549 3917 1279
2699 1279 -3106 -4806 -76 4942 3941 -1141 -3582 -2943 738 4980 3160 -2348 -4056 -660 2014
$$ packed form
2585B886J203m058l968J541L359J550k95k015k795K14L232J197j255m80j941q89
2601b514K724K373j378k222p24P7J386K813l91l928q99K066J737P94p79l806n88
2618c259L817K031j573k206o53k15K851J834k638k733Q73K382N37k31j129j742
2634b054J242K402r86j728R66M51l28K36n06j318Q63K694p14l003K53J413J046
2651I29P40r82k780n17L802J306j531j850j176J65L635J653l261k174K83J636
2667a22J382J461k037l195R19K420J082k60r51k393q09L068K209j157j867j400
2683a650p97K479L751j141l779k007J504L027K621q08n792k218L910M449L68k638
2699A279m385j700M730N018j001n082k441O39L681M242j820n508j708L396K674
$$ plain form
2714 2014 3007 1630 -1686 -3433 -194 2551 1787 -153 -1028 -2026 -449 2106 1876 -241 -1064 -836 -863
2731 -863 1071 2210 -184 -2283 -1470 292 1244 1830 210 -2995 -2399 973 2209 1247 -889 -2942
2747 -2942 -2262 2111 3386 -498 -2101 -1725 -652 1114 2160 -366 -3055 -963 1369 757 -97 -456
2763 -456 -1151 -4 1032 -46 -1482 -70 618 -388 -270 206 -1089 -327 1411 544 -1650 -896 561
2780 561 225 201 -151 -942 -274 985 209 -1203 130 680 -303 420 520 -845 -558 1556 1140 -999
2798 -999 -818 1036 320 337 -71 -442 236 1419 168 -1403 20 1282 754 822 -391 -1921 -849 3281
2816 3281 2736 -1423 -3005 -1281 1078 3130 1819 -2159 -3402 -52 2709 2845 786 -2857 -3606 504
2832 504 4580 2167 -1954 -2455 -1387 655 2688 1885 -1210 -2856 -863 1148 2263 2104 -1275 -2928
$$ packed form
2714B014R93j377l316j747L239K745p64j940q75r98J577K555k30k117q23K28k7
2731h63J934J139k394k099Q13J762R52N86j620l205N96L372J236r62k136k053
2747b942O80M373J275l884j603L76J073J766J046k526k689K092K332o12q54l59
2763d56o95J147J036j078j436J412O88j006J18M76j295P62J738q67k194P54J457
2780E61l36k4l52p91O68J259p76j412J333N50r83P23J00j365K87K114m16k139
2798i99J81J854p16J7m08l71O78J183j251j571J423J262n28O8j213j530J072M130
2816C281n45m159j582J724K359K052j311l978j243L350K761J36k059l643p49M110
2832E04M076k413m121n01J068K042K033q03l095j646J993K011J115j59l379j653
$$ plain form
2848 -2928 -751 1432 1760 1645 -342 -3421 -2691 2491 4232 661 -2625 -3570 -1322 2468 4088 539
2864 539 -3797 -3556 62 3368 3563 -1084 -5333 -2262 2973 3623 240 -2549 -2958 -941 2247 3114
2880 3114 -757 -3157 -1038 1319 1749 704 -1871 -2448 790 2188 -392 -1285 -467 -686 33 1463
2896 1463 371 -1852 -1013 325 223 364 134 -890 -1005 -83 230 116 773 -392 -2122 -554 2296
2913 2296 1231 -1093 -1157 -1132 -76 2171 1606 -2043 -2846 -27 2210 2043 166 -2969 -2486 2033 4156
2930 4156 675 -2570 -2307 -398 2931 3412 -266 -4295 -2248 2501 3546 1218 -1986 -3459 -941
2945 -941 3426 2890 -742 -2018 -1386 553 2899 2184 -1198 -2273 -255 1306 1199 842 -93 -1718 -799
2962 -799 1556 1508 290 -411 -1547 -1266 1536 2543 230 -1640 -1351 -285 1289 2775 -15 -3462
$$ packed form
2848b928K177K183L28j15j987l079P30N182J741l571l286r45K248L790J620l549
2864E39m336K41L618L306J95m647m249L071N235O50l383k789m09K017L188Q67
2880C114l871k400K119K357M30j045k575n77L238J398k580q93Q18k19P19J430
2896A463j092k223Q39J338j02J41k30j024j15R22L13j14O57j165j730J568K850
2913B296j065k324o4K5J056K247n65l649q03K819K237j67j877l135M83M519K123
2930D156l481l245K63J909L329M81l678m029K047M749J045k328l204j473K518
2945i41M367n36l632j276O32J939K346p15l382j075K018J561j07l57r35j625R19
2962g99K355m8j218p01j136K81K802J007k313j870K89J066J574J486k790l447
$$ plain form
2978 -3462 -1884 1837 2522 1560 -1535 -3697 -1488 2711 3602 -628 -3162 -2137 417 3184 2248 -2076
2994 -2076 -3815 -261 2298 1745 -352 -1851 -2316 584 2802 586 -1978 -1509 -208 647 1079 142
3010 142 -1791 -1040 1153 191 -1079 -412 144 -528 -89 298 -1241 -770 720 294 -896 -249 -219 -443
3028 -443 344 543 -663 -396 244 -593 -555 1121 1042 -1074 -1081 -313 -327 982 1827 -1292 -3060 -825 2108
3047 2108 2294 1007 -2037 -3361 -59 3795 2458 -1488 -2973 -1692 1409 3637 2022 -2791 -3538
3062 -3538 680 3222 2280 -188 -2849 -2430 1295 3202 1256 -1301 -1416 -569 1451 2795 481 -1691
3078 -1691 -1246 446 958 961 818 -678 -1335 400 1292 837 694 42 -1365 -606 1291 1193 26 -703 -1391
3097 -1391 -1037 1596 1885 -948 -1685 -235 535 437 1020 -603 -1618 497 1540 40 -774 90 7 752
$$ packed form
2978c462J578L721O85r62l095k162K209M199Q91m230k534J025K554K767r36m324
2994b076j739L554K559n53k097j499m65K900K218k216k564M69J301Q55M32r37
3010A42j933P51K193r62j270O67N56o72M39L87j539M71J490m26j190O47L0k24
3028d43P87J99j206K67O40q37L8J676p9k116pP68j4J309Q45l119j768K235K933
3047B108J86j287l044j324L302L854j337l946j485J281L101K228j615m813p47
3062c538M218K542r42k468k661M19L725J907j946k557j15Q47K020J344k314k172
3078a691M45J692N12Lj43j496o57J735Q92m55j43o52j407P59J897r8j167p29o88
3097a391L54K633K89k833p37J450P70r8N83j623j015K115J043j500q14Q64q3P45
$$ plain form
3115 752 1252 -527 -1780 255 1753 464 -1042 -1129 -610 476 1686 85 -2263 -1163 846 1368
3131 1368 269 -1101 -1878 -567 2042 1308 -1570 -1868 -655 414 1395 863 -1455 -2258 235 1792
3147 1792 501 -477 -927 -1418 28 1634 466 -959 -855 -470 -287 718 1377 -509 -1266 -671 -6
3164 -6 267 1654 105 -1974 -1407 895 1364 953 -249 -2270 -1393 1679 2250 -131 -1575 -1452 -394
3181 -394 1880 2293 -326 -2553 -673 1150 1693 829 -523 -1836 -519 1507 1179 -18 -82 -241 -694
3198 -694 291 1060 197 -31 403 -353 -728 965 1434 266 -687 -768 -695 786 2225 601 -1712 -1257 417
3217 417 1219 1937 307 -2143 -1609 1485 1910 439 -695 -1423 -880 1598 2033 -192 -1418 -556 -171
3234 -171 262 1011 336 -1424 -999 682 298 501 754 -646 -1158 -44 788 207 429 -157 -1757 -564
$$ packed form
3115G52N00j779j253K035J498j289j506q7N19J086J210j601k348J100K009N22
3131A368j099j370p77J311K609p34k878k98J213J069R81n32k318q03K493J557
3147A792j291r78m50m91J446J606j168j425J04L85J83J005O59j886p57N95O65
3164fK73J387j549k079N67K302M69m11j202k021Q77L072N71k381j444J23J058
3181c94K274M13k619k227J880J823N43q64j352j313J317K026l28j197o4j59m53
3198f94R85P69q63k28M34p56l75J693M69j168r53q1P3J481J439j624k313M55J674
3217D17Q02P18j630k450N34L094M25j471j134p28N43K478M35k225j226Q62L85
3234a71M33P49o75j760M25J681l84K03K53j400n12J114Q32n81K22n86j600J193
$$ plain form
3252 -564 1201 981 -963 -944 -889 -266 1058 995 -1083 -1367 114 649 211 -25 -730 -1114 297 888 -262
3271 -262 -1304 81 536 113 86 -1051 -994 849 1497 -43 -1319 -610 -112 843 1637 -293 -2499 -881
3289 -881 1733 1311 -146 -1188 -1654 -246 2439 1536 -1308 -1812 -732 447 1927 1268 -955 -2564
3305 -2564 -135 1606 1411 486 -1158 -1891 -378 2278 1883 -321 -1743 -1732 -297 2488 2423 -694 -2815
3322 -2815 -1192 1046 2377 2118 -1192 -3283 -616 2514 3038 688 -1795 -2818 -318 3269 3062 -699
3338 -699 -2762 -1410 1226 3173 2172 -1612 -3441 -675 2719 2946 635 -1762 -2383 121 3326 2412
3354 2412 -755 -1881 -1088 612 2235 1501 -1323 -1867 -234 912 1402 732 -729 -1781 -207 1340
3370 1340 416 -200 -278 -568 -268 876 556 -695 -661 498 -5 -234 318 -877 -556 696 938 -714
$$ packed form
3252e64J765k20j944J9N5O23J324o3k078k84J481N35m38k36p05l84J411N91j150
3271b62j042J385M55m23k7j137N7J843O48j540j276P09M98R55P94j930k206J618
3289h81K614m22j457j042m66J408K685r03k844n04J080J179J480o59k223j609
3305b564K429J741j95r25j644p33J513K656l95k204j422J1J435K785o5l117k121
3322b815J623K238J331k59l310k091K667L130N24k350k483j023K500L587k07l761
3338f99k063J352K636J947j001l784j829K766L394K27k311k397o21K504L205r14
3354B412l167j126P93J700J623p34k824n44J633J146M90o70j461j052J574J547
3370A340r24o16p8k90L00J144l20j251L4J159n03k29N52j195L21J252K42j652
$$ plain form
3388 -714 -652 -341 3 689 825 -757 -2025 -483 1112 846 -120 -1468 -2062 40 2236 1046 -1135
3405 -1135 -1678 -781 659 2221 879 -2093 -2789 559 2316 1473 -196 -2165 -2209 928 2507 919
3421 919 -1702 -2141 -977 1293 2759 721 -2640 -2273 544 1833 1347 119 -1919 -1941 616 2415
3437 2415 995 -949 -1648 -1785 443 2325 905 -1555 -1696 -532 816 2273 857 -1725 -2250 478
3453 478 2111 1656 -41 -1798 -2152 857 2973 1314 -953 -1467 -921 819 2454 901 -1710 -1687 474
3470 474 1224 1350 853 -1227 -1418 810 1600 609 -594 -674 -694 207 1296 120 -598 -248 223 -59 158
3489 158 477 117 -248 83 340 -685 458 854 -327 -553 -331 -100 710 912 -48 -1122 -458 750
3507 750 577 524 75 -1352 -995 426 910 116 199 -851 -1766 -170 1011 1135 -352 -1035 -1285 -360 1368
$$ packed form
3388g14O2L11L44O86J36j582j268J542J595k66r66j348n94K102K196j190k181
3405a135n43Q97J440J562j342k972o96L348J757q43j669j969m4L137J579j588
3421I19k621m39J164K270J466k038l361L67K817J289m86j228k038k2K557J799
3437B415j420j944o99j37K228J882j420k460j41J164J348J457j416k582n25K728
3453D78J633m55j697j757l54L009K116j659k267n14N46J740J635j553k611K3K161
3470D74P50J26m97k080j91K228P90r91j203q0k0R01J089j176p18L50M71k82K17
3489A58L19l60l65L31K57j025J143L96j181k26K22K31Q10K02r60j074O64J208
3507G50j73n3m49j427L57J421M84p94Q3j050r15J596J181J24j487o83k50R25J728
$$ plain form
3526 1368 1454 -813 -2035 -1226 77 1801 1746 -831 -2815 -1224 1620 2055 624 -1453 -2649 -1071
3542 -1071 2080 2512 -314 -1621 -1987 -417 1928 2520 -714 -2090 -1158 263 958 1477 110 -2157
3558 -2157 -1753 981 1604 976 47 -1880 -1811 541 2203 1082 -431 -1893 -1828 501 2736 1805 -1099
3575 -1099 -2044 -1076 943 2466 1624 -1280 -2695 -480 1539 2109 776 -1109 -1868 -491 2094 1786
3591 1786 -221 -822 -1177 -793 1548 1634 129 -1138 -446 -420 947 1659 435 -1403 -1265 -279 946 1527
3609 1527 605 -1627 -1761 561 1804 1074 243 -1246 -2018 -87 2260 1327 -876 -1505 -1077 353 1590
3626 1590 1053 -1122 -992 -246 269 903 762 -578 -1555 -280 782 41 462 185 -972 -1485 -51 949
3644 949 1014 270 -1096 -1615 -315 1629 1359 -80 -1356 -1644 -402 1844 1890 -829 -2235 -1064 345
$$ packed form
3526A368Q6k267j222Q09J303J724n5k577j984J591K844M35j431k077j196J578
3542a071L151M32k826j307l66J570K345N92l234j376R32J421O95N19j367k267
3558b157M04K734O23o28r29j927O9K352J662j121j513j462O5K329K235r31k904
3575a099r45R68K019J523q42k904j415K215K019N70j333j885p59J377K585l08
3591A786k007o01l55L84K341Q6j505j267O92K6J367P12j224j838J38R86J225N81
3609A527r22k232j34K322J243p30q31j489p72J931K347r33k203o29M28J430J237
3626A590n37k175J30P46N15O34j41j340r77J275J062p41M21k77j157n13J434J000
3644I49O5p44j366n19J300J944k70j439j276k88J242K246M6k719j406J171J409
$$ plain form
3661 345 1478 1424 -600 -2537 -1486 683 1590 1396 -459 -2616 -2095 977 2186 906 -392 -1885
3677 -1885 -2449 314 3275 2008 -1287 -3067 -1830 1458 3368 1786 -2226 -3553 -805 2090 3558
3692 3558 1654 -2785 -4248 -163 3732 3305 -441 -3028 -3038 247 4085 2726 -1188 -3583 -1874 1384
3708 1384 3639 2349 -1983 -3295 -582 1854 2586 1339 -1333 -3332 -1254 2334 2825 556 -1419
3723 -1419 -2596 -1068 2241 2910 347 -2174 -2298 -555 2188 3085 258 -2646 -2101 967 2123 1894
3739 1894 -232 -2298 -1654 1120 2305 924 -702 -1334 -771 489 1244 49 -402 -238 -157 -561 465
3756 465 1022 303 -424 -326 -781 -60 1702 1197 -607 -1693 -805 592 1896 923 -1531 -2041 -244 1703
3774 1703 1632 319 -1280 -2210 -31 2075 1364 -453 -1745 -1332 -67 1717 1568 -656 -2086 -1162 25
$$ packed form
3661C45J133n4k024j937J051K169R07j94j855k157N21L072J209j280j298j493
3677a885n64K763K961j267l295j780J237L288J910j582m012j327K748K895J468
3692C558j904m439j463M085L895m27l746k587j0L285L838j359l914k395J709L258
3708A384K255j290m332j312K713K436P32j247k672j999K078L588M91k269j975
3723a419j177J528L309O69k563k521j24J743K743Q97k827k904N45L068J156k29
3739A894k126k066O44K774J185j381j626o32N63J260P55j195m51J64Q1m04J026
3756D65N57p19p27R8m55P21J762n05j804j086Q88J397J304r73k454n10J797J947
3774A703p1j313j599r30K179K106p11j817j292M13J265J784j49k224j430R24J187
$$ plain form
3791 25 1278 1431 -235 -2322 -1646 392 1457 1678 -168 -2655 -2074 988 2896 1461 -1150 -2610
3807 -2610 -2109 1607 3069 686 -2579 -2455 -488 1941 2780 387 -3166 -2241 874 2263 1056 -405
3823 -405 -2184 -1394 935 2252 340 -640 -1154 -1091 226 1454 1230 -1065 -767 -605 -83 1056 1774 -405
3841 -405 -1738 -1114 607 1558 1254 -264 -2586 -1534 1211 2515 1037 -855 -2376 -984 1856 2720
3857 2720 175 -1899 -1505 -214 1564 2037 -94 -1959 -951 323 1355 1218 360 -1104 -1508 168
3873 168 872 1047 315 -570 -1748 -58 1655 1414 -5 -1063 -1655 -201 1850 1796 -597 -2291 -1008
3890 -1008 682 2106 1456 -1145 -2381 -665 1981 1634 -90 -1690 -1587 233 2171 1249 -1203 -1355
3906 -1355 -510 400 927 649 -401 -1147 -104 98 -61 408 302 -757 -1063 40 -163 381 853 -325
$$ packed form
3791B5J253J53j666k087O76K038J065K21j846k487N81L062J908j435k611j460
3807b610N01L716J462k383l265J24J967K429Q39k393l553R25L115J389j207j461
3823d05j779P90K329J317j912r80n14O3J317J228k24k295K98J62N22J139P18k179
3841d05j333O24J721R51l04j518k322J052K745J304j478j892j521J392K840Q64
3857B720k545k074L94J291J778M73k131j865J008J274J032j37q58j464m04J676
3873A68P04J75p32q85j178J690J713k41j419j058n92J454K051n4k393j694J283
3890a008J690J424o50k601j236J716K646l47j724j600J03J820J938r22k452j52
3906a355Q45R10N27k78j050p46J043K02j59M69j06j059l06J103k03N44M72j178
$$ plain form
3924 -325 -1351 -530 653 907 234 -755 -1648 -472 1459 1056 -681 -1381 -316 -45 1078 783 -640
3941 -640 -1546 15 852 303 235 -121 -880 -267 591 475 -78 323 -280 -1229 -274 1075 1086 76 -972
3960 -972 -1402 -545 1960 1931 -711 -2005 -1311 452 2354 1482 -1572 -2432 -320 2151 1989 268 -1480
3977 -1480 -1769 453 2388 1288 -1070 -1306 -372 614 1562 478 -1129 -687 568 729 298 251 -238 -675
3995 -675 -142 265 266 341 339 -304 -809 74 1037 593 12 -576 -1100 198 1779 844 -863 -968 -483 738
4015 738 1504 162 -1321 -1246 260 953 290 -200 -610 -909 106 515 -73 -83 481 -369 -910 -289 504
4034 504 615 237 -651 -1468 -480 1772 1569 -685 -1610 -1156 502 2108 1036 -1503 -2317 -118 1844
4051 1844 1560 -36 -2199 -1792 716 2302 830 -1705 -1611 -795 1189 1785 277 -2014 -1453 532 868
$$ packed form
3924c25j026Q21J183K54o73r89q93J176J931m03j737p00J065K71J123k95j423
3941f40r06J561Q37n49o8l56p59O13Q58j16n53M01o03r49R55J349J1j010j048
3960i72m30Q57K505k9k642j294O94J763J902q72l054q60K112K471j62j721j748
3977a480k89K222J935j100k358k36R34R86R48j084j607M42J255J61m31m7m89m37
3995f75N33M07JP5ko43n05Q83R63m44n81n88n24J298J581r35j707j05M85J221
4015G38P66j342j483P5J506O93o63m90m10k99J015M09n88j0N64q50n41O21P93
4034E04J11l78q88q17R88K252k03k254r25M54J658J606j072k539q14K199J962
4051A844k84j596k163M07K508J586j472k535R4Q16J984N96j508k291N61J985L36
$$ plain form
4068 868 558 201 -719 -860 367 677 299 147 -167 -908 -609 556 654 280 27 -782 -946 886 1480
4087 1480 -44 -1245 -707 107 935 1096 -85 -1247 -100 1024 727 -231 -476 -571 372 1227 395 -873
4105 -873 -288 1080 609 -307 -802 -531 554 1358 58 -1681 -673 1111 1586 19 -1167 -1982 -203
4122 -203 2463 1667 -1190 -2491 -994 1476 2379 830 -2027 -2679 289 2229 1541 -241 -2058 -1735
4138 -1735 808 2444 1177 -1029 -1788 -468 674 1660 867 -1134 -1679 -368 560 810 792 -771 -1504
4155 -1504 -700 1304 1639 501 -1164 -1877 -890 1841 1958 -256 -2270 -1340 375 2022 1452 -1170 -2507
4172 -2507 -533 1946 1929 -133 -1620 -1761 355 2225 968 -1531 -1668 -337 977 1028 -198 -1523
4188 -1523 -838 1071 1009 -662 -848 -400 308 1093 232 -1418 -713 909 1041 91 -818 -691 -100 1206
$$ packed form
4068H68l10l57r20j41J227L10l78j52l14p41K99J165R8l74k53q09j64J832N94
4087A480j524j201N38Q14Q28J61j181j162J147J124k97r58k45r5R43Q55q32j268
4105h73N85J368m71r16m95K71J085Q04j300j739J008J784M75j567j186q15J779
4122b03K666p96k857j301J497K470R03j549k857o52K968J940o88j782j817L23
4138a735K543J636j267k206p59J320J142R86p93k001n45J311R28K50j8j563p33
4155a504Q04K004L35j138j665p13R87K731J17k214k014R30J715J647n70k622j337
4172b507J974K479j7k062j487j41K116J870j257k499j37J331J314N1j226j325
4188a523O85J909o2j671j86M48P08P85q61j650P05J622J32r50r09J27N91J306
$$ plain form
4206 1206 741 -814 -1488 245 555 664 -8 -710 -1127 182 1250 604 -220 -468 -562 -112 757 1285 -294
4225 -294 -1006 -456 -116 1384 1704 -151 -1766 -981 603 1906 1423 -384 -2550 -1315 1764 3146 834
4242 834 -1726 -2482 -403 2852 2858 -223 -2957 -1657 1420 2675 1873 -1148 -3120 -568 2216 2423 11
4259 11 -1564 -1884 522 1979 1472 -957 -1544 -828 340 1633 1363 -569 -1404 -598 397 584 542 190
4277 190 -1202 -1386 161 1614 906 -256 -1321 -1293 59 1657 925 -1036 -1540 -1351 358 1752 640
4294 640 -1309 -1670 338 1056 786 150 -1097 -1058 94 962 141 58 -94 -485 -513 129 185 137 325 -308
4314 -308 -1439 -524 1201 790 -92 -945 -1167 -185 1600 1343 -920 -2117 -855 707 1798 667 -1580
4331 -1580 -2169 58 1808 1295 -380 -1248 -1206 309 1729 840 -1275 -1439 -79 555 1048 359 -837
$$ packed form
4206A206m65j555o74J733L10J09o72p02m17J309J068o46q24k48r4M50Q69N28j579
4225b94p12N50L40J500L20j855j615P85J584J303m83j807k166J235L079J382k312
4242H34k560p56K079L255Ol081k734J300L077J255q02l021j972K552K784K07k412
4259A1j575l20K406J457n07k429n87P16J168J293k70j932q35Q06R95J87m2l52
4277A90j392j84J547J453p08j162j065K8J352J598p32j961n04J89J709J394j112
4294F40j949l61K008P18k70o36j247L9J152Q68q21q3j52l91k8O42N6m8J88o33
4314c08j131R15J725m11q82q53k22R82J785k57k263j197J262J562J091j131k247
4331a580n89K227J750n13j675q68M2J515J420q89k115j64J360O34M93o89j196
$$ plain form
4348 -837 -646 141 342 137 412 288 -978 -383 448 501 224 155 -491 -1099 365 1114 646 -147 -790 -653
4368 -653 637 1626 616 -986 -659 -69 355 745 517 -632 -845 341 629 381 323 -451 -759 -337 -52
4387 -52 393 916 423 -1165 -1378 -15 1302 1013 23 -1235 -1215 176 2436 1527 -1140 -2361 -1074 1282
4405 1282 2553 1015 -2049 -2724 -202 2099 2060 -29 -1833 -2262 159 2705 1214 -1310 -2007 -1182
4421 -1182 852 2181 920 -1484 -1978 -814 787 1406 659 -991 -2042 -442 1503 1326 507 -770
4437 -770 -1688 -845 1563 1315 -178 -1298 -1429 -102 1589 1384 -573 -2181 -871 564 1371 741 -868
4454 -868 -1766 -381 882 722 -581 -567 -527 -135 496 230 -583 -511 432 95 -146 -200 -225 242 820 -183
4474 -183 -831 -415 838 677 0 -410 -574 -241 1136 1103 -217 -907 -538 292 989 710 -473 -1271 -218
$$ packed form
4348h37J91P87K01k05K75j24j266N95Q31N3k77o9o46o08J464P49m68p93o43J37
4368f53J290R89j010j602L27N90M24L90k28j149k13J186K88k48n8p74l08M22K85
4387e2M45N23m93j588k13J363J317k89r90j258K0J391K260r09k667j221J287K356
4405A282J271j538l064o75K522K301l9k089j804m29K421K546j491k524o97Q25
4421a182K034J329j261k404m94J164J601O19p47j650j051J600J945j77q19j277
4437g70r18Q43K408k48j493j120j31J327J691k05j957j608J310J435Q07o30j609
4454h68q98J385J263j60j303J4M0L92O31k66q13P2R43l37k41n4k5M67N78j003
4474a83o48M16J253j61o77m10j64L33J377l3j320o90L69Q30O97k79j183p98J053
$$ plain form
4493 -218 663 707 261 -380 -1145 -324 1215 1180 -181 -559 -747 -468 863 1202 -151 -1177 -1440 80 965
4512 965 1562 -110 -1729 -1046 693 1541 697 -338 -1333 -864 1017 1538 519 -1155 -1136 -206 1090 1269
4530 1269 -232 -1571 -849 597 740 231 -199 -1089 -609 839 1043 -73 -228 -509 -119 462 774 28
4548 28 -546 -244 -47 16 450 302 -685 -413 527 -233 145 581 -264 -701 -46 545 -193 -143 -87 -505 -518 93
4570 93 -20 -226 22 -85 -428 -242 196 -221 -76 359 -469 -760 40 576 -64 -122 -424 -809 8 623 324
4591 324 -220 -417 -189 15 803 455 -151 -686 198 560 258 58 -193 -822 -126 590 396 -302 -482 -360
4611 -360 58 658 620 -431 -641 -117 245 403 492 -15 -1056 -341 722 468 189 25 -961 -360 640
4630 640 980 165 -482 -641 -398 202 1200 195 -509 -657 -386 347 564 168 -881 -658 167 862 473
$$ packed form
4493b18Q81M4m46o41p65Q21J539l5j361l78j88K79J331L39j353j026k63J520Q85
4512I65N97j672j619O83J739Q48q44j035r95M69J881N21j019j674J9R30J296J79
4530A269j501j339P22J446J43n09m30q90M80J448K04j116j55k81L90N81L12p46
4548B8n74L02J97O3M34j48r87K72R40p60L78M36q45m37O55N91p38N0N6m18j3O11
4570I3j13k06K48j07l43J86M38m17J45M35q28k91Q00N36o40n8l02l85Q17O15k99
4591C24n44j97K28K04P88l48o06n35Q84L62l02k00k51o29O96P16j94o98j80J22
4611c60M18O00l8j051k10N24L62J58Q9n07j041P15J063k54k79j64r86O01J000
4630F40L40q15o47j59K43O00R98j005p04j48K71P33K17l96j049K23Q25O95l89
$$ plain form
4649 473 -15 -745 -542 526 730 271 -496 -465 -260 -2 566 440 -804 -197 309 267 709 450 -791 -1043
4669 -1043 229 534 156 -401 -882 -297 243 616 444 -458 -224 -75 108 108 156 -702 -571 173 -16 29 -292
4690 -292 -403 -444 89 597 -566 -313 54 -92 123 425 -23 -1090 85 309 159 145 116 -285 -389 494
4710 494 175 -352 -319 -249 -160 355 532 -645 -463 176 430 260 356 -441 -774 367 674 111 -542 -304 46
4731 46 115 604 232 -754 -220 512 596 -203 -181 -825 -218 651 865 -226 -897 -510 -236 144 717 -366 -1142
4752 -1142 -393 245 697 287 -32 -857 -492 686 652 105 -492 -303 -337 701 1049 -113 -858 -500 225
4771 225 570 985 -4 -1142 -563 719 973 651 -637 -1245 -760 1079 1479 -220 -1165 -836 338 858
4789 858 997 -274 -1232 -474 750 963 199 -265 -1020 -375 826 862 -233 -609 -649 -180 473 568 -80 -796
$$ packed form
4649D73m88p30K03J068K04m59p67L1K05K58N68j26j244O07N06m2M42k59j241k52
4669a043J272L05l78n57m81N85N40L73j72r02K34J49J83%M8q58J31P44j89M5l21
4690b92j11m1N33N08j163K53L67j46K15L02m48j067J175K24j50j4k9m01j04Q83
4710D94l19n27L3P0Q9N15J77j177J82O39K54j70R6p97l33J141L07n63o53K38L50
4731D6O9M89l72r86N34P32Q4p99K2o44O07Q69K14j091o71L87K74L80N73j083p76
4752a142P49O38M52m10l19q25L65J178l4n47n97J89l4J038L48j162p45L58P25
4771B25L45M15r89j138N79J282K54l22j288o08M85J839M00j699r45L29J174N20
4789H58J39j271r58P58J224K13p64m64p55O45J201L6j095l76m0M69O53R5o48p16
$$ plain form
4809 -796 -522 -88 280 558 240 -843 -593 208 473 369 28 -635 -850 61 762 150 -636 -571 -277 324
4829 324 869 -117 -662 -741 83 347 274 180 -606 -105 526 513 64 -65 108 -119 168 108 -203 -259 119 296
4851 296 -297 -295 -157 215 -33 222 -783 -371 427 419 -143 -572 -312 -255 369 858 -94 -455 -80 43 141 123
4873 123 -43 -238 -114 28 231 154 60 -164 57 -2 471 316 153 134 -791 38 609 926 119 -927 -358
4894 -358 23 838 900 -152 -827 -35 770 784 543 -502 -1022 -266 1044 963 -443 -573 -456 -160 695 517
4914 517 -394 -585 -10 -102 295 137 -87 -473 3 148 -52 70 231 -412 -833 199 308 429 61 -515
4934 -515 -585 -93 553 558 -105 -322 -212 41 943 602 -951 -832 -177 566 229 -323 -512 -686 80 495 184
4955 184 -409 -82 -328 182 231 -212 -27 -167 192 -265 -375 297 213 -213 -252 90 -308 351 427 -181 -462
$$ packed form
4809g96K74M34L68K78l18j083K50Q01K65j04l41o63k15R11P01o12p86O5K94O01
4829C24N45r86n45p9Q24K64p3r4p86N01O31j3m49j29J73k27K87o0l11n6L78J77
4851B96n93KJ38L72k48K55j005M12P98qn62m29K60N7O24M89r52l61L75J23R8j8
4873A23j66j95J24J42K03p7r4k24K21n9M73j55j63j9r25Q29N71L17q07j046N69
4894c58L81Q15O2j052o75P92Q05J4k41j045n20P56J310q1j406j30J17K96Q55j78
4914E17r11j91N75r2L97j58k24l86M76J45k00J22J61o43m21J032J09J21l68n76
4934e15p0M92O46No63k17J10K53R02l41j553J19O55P43l37n52j89j74P66M15l11
4955A84n93L27k46N10M9m43J85j40L59m57j10O72q4m26l9L42l98O59P6o08k81
$$ plain form
4976 -462 -5 23 338 227 -356 -285 409 374 70 -868 -598 127 322 758 83 -542 -91 320 92 -167 -222
4997 -222 -362 -45 416 -122 -424 -230 284 -48 -216 234 173 73 468 -149 -387 -212 346 523 177 -404
5017 -404 -191 -4 609 494 -101 -303 223 189 498 207 -309 -440 195 391 236 19 79 62 -434 -37 -57
5038 -57 -90 309 -42 -469 251 472 187 -128 -479 -461 -2 773 452 -995 -1014 -58 665 758 54 -840 -1138
5059 -1138 228 1045 456 -488 -886 -276 331 977 -20 -871 -404 -94 785 494 -138 -632 -205 404 554
5078 554 -36 -323 -335 -163 177 225 -59 -253 -120 -250 45 482 22 -22 -216 162 -158 174 197 -368 -316 227
5100 227 185 307 -159 -436 -342 114 509 -235 -518 38 472 188 108 -304 -305 4 544 360 -699 -529 358
5121 358 601 885 -256 -865 -360 735 827 -52 -551 -532 -44 1087 905 -195 -705 -300 588 823 287
$$ packed form
4976d62M57K8L15j11n83P1O94l5l04r38K70P25J95M36o75o25M51M11k28k59n5
4997b22j40L17M61n38l02J94N14l32j68M50o1j00L95o17k38J75N58J77l46n81
5017d04K13J87O13j15n95k02N26l4L09k91n16j31O35J96j55k17O0j7m96L97k0
5038e7l3L99l51m27P20K21k85l15l51J8M59P75l21j447j9R56P23R3p04q94k98
5059a138J366Q17n89r44l98O10O07O46r97q51M67L10Q79k91o32m94M27O09J50
5078E54n90k87j2J72L40M8k84j94J33j30K95M37m60m4j94L78l20L32K3n65N2N43
5100B27m2J22m66k77R4M56L95p44k83N56M34k84q0m12jL09N40j84j059J70Q87
5121C58K43K84j141o09N05J095R2q79m99J9M88J131j82j100n10M05Q88K35n36
$$ plain form
5140 287 -548 -892 218 841 775 -397 -536 -278 303 818 440 -256 -677 -55 242 678 317 -216 -567 -38
5160 -38 735 494 68 -282 -847 -39 761 528 -3 -531 -850 -47 867 924 -483 -976 -176 599 993 183
5180 183 -533 -973 -175 804 488 -334 -1096 -260 228 689 130 -749 -484 331 506 437 -158 -864 -282 386
5200 386 427 -231 -416 -192 51 243 89 -123 -350 183 178 47 -93 -157 148 -151 423 -221 -368 -203 21
5221 21 22 332 39 -320 -109 93 108 -123 -13 -232 -481 -66 815 129 -244 -733 -293 373 573 267 -829
5242 -829 -591 215 726 447 -118 -639 -525 308 1062 548 -686 -403 -72 677 910 -268 -661 -247 386
5261 386 586 168 -121 -713 -101 313 581 -342 20 -33 -47 41 439 -395 -339 318 432 -138 139 108 87 176
5283 176 209 -334 -50 330 152 -71 -166 -154 -9 366 380 53 -56 -283 -234 414 317 107 -107 -438 356 143
$$ packed form
5140B87q35l44J110O23o6j172j39K58N81N15l78o96m21O22K97M36l61n33l51N29
5160c8P73k41m26l50n65Q08Q00k33n31n28l19Q03R14N7j407m93Q00P75L94q10
5180A83p16m40P98R79l16q22p62Q36M88M61n59q79K65Q15J75o9n95p06N82O68
5200C86M1o58j85K24K43J92j54k12k27N33nj31j40o4L05k99N74o44j47J65K24
5221B1JL10k93l59K11K02J5k31J10k19k49M15Q81o86l73m89M40O66K00l06j096
5242h29K38Q06N11k79n65n21J14Q33P54n14j234K83L31P49K33j178l93M14O33
5261C86K00m18k89n92O12M14K68r23L62n3j4Q8L98q34N6O57J14n70K77l1k1Q9
5283A76L3n43K84L80j78k23r5J2J45L75J4l27j09k27M9O48r7k10k14l31P94k13
$$ plain form
5305 143 267 455 -320 -576 27 545 150 -40 -474 -195 -87 835 263 -457 -848 -60 -2 443 375 -600 -442
5326 -442 136 819 330 -325 -770 -573 252 792 245 -455 -338 82 476 536 -323 -512 118 77 256 -188 -166
5347 -166 -333 -23 308 77 -293 -179 -69 -3 -233 -115 317 -167 393 136 -183 -14 6 -186 -13 363 207
5368 207 -149 15 -46 -141 134 -13 -407 -472 334 785 160 -320 -515 -299 510 720 -1 -922 -142 644 293
5389 293 569 -318 -983 -87 456 985 -275 -707 -357 -137 811 608 -332 -694 -154 525 472 78 -556 -699
5409 -699 -447 617 600 157 -305 -546 159 677 337 -317 -424 -57 -33 472 658 -32 -342 -239 310 -249
5429 -249 284 -44 -251 -312 328 73 -155 82 180 -250 214 260 -158 19 336 -171 -197 83 -368 -168 64
5450 64 315 -205 -178 50 416 12 333 -448 -267 357 214 -90 -308 -365 -168 213 573 -219 -657 -86 201
$$ packed form
5305A43J24J88p75k56O03N18l95j90m34K79J08R22n72p20l91P88N8M45o8r75J58
5326d42N78O83m89o55m45J97Q25N40n47p00J17M20L94O0q59j89O30m1J79m44K2
5347a66j67L10L31k31l70J14J10O6k30J18M32m84N60k57l19J69K0j92J73L76j56
5368B07l56J64o1r5K75j47l94o5Q06M51o25m80j95K16Q09K10p21r21P80P86l51
5389B93K76q87o65Q96N43N29j260m32L50K20R48k03r40l62N40O79n3l94o34j43
5409f99K52J064j7m43m62k41P05N18l40o54j07L67K4N05J86o90l10J03N49n59
5429b49N33l28k07o1O40k55k28K37R8m30M64M6m18J77L17n07k6K80m51K00K32
5450F4K51n20K7K28L66m04L21p81J81O24j43l04k18n7J97L81L60p92m38N71K87
$$ plain form
5471 201 615 82 -200 -566 -192 685 552 -334 -648 -61 50 376 572 127 -571 -50 222 297 255 -401 -354
5492 -354 -35 562 361 76 -246 -360 -136 369 190 -179 -63 -82 -331 -233 300 -430 -293 -126 -88 141 82
5513 82 -89 -337 -30 535 15 -285 -224 -50 47 218 64 -376 -434 351 145 -43 -45 235 118 397 345 -298
5535 -298 -357 80 315 192 200 -267 -272 77 627 373 -125 -45 -318 145 384 -6 -386 -447 263 734 299 209 -414
5558 -414 -325 156 381 219 -109 -290 -257 -95 343 562 52 -399 -175 216 140 216 -239 -512 -9 404 405 29
5580 29 -176 -208 -184 339 160 -249 -332 144 41 383 219 -34 -357 9 -118 -34 398 -114 -402 569 251 -111
5602 -111 58 24 89 -84 24 289 -102 69 9 34 -203 -165 154 128 -131 -108 -63 87 195 -127 -148 111 -208
5625 -208 143 93 -65 -243 -406 22 47 199 186 -14 -192 35 155 132 91 92 -585 -139 746 143 -124 -113 160
$$ packed form
5471B01M14n33k82l66L74Q77j33q86l14N87J11L26J96m45o98N21K72P5m2o56M7
5492c54L19N97k01k85l22j14K24N05j79l69J16j9k49R8N33p30J37J67L8K29n9
5513H2j71k48L07N65n20l00O1J74R7J71j54m40n8P85k06j88kK80j17K79n2o43
5535b98n9M37K35j23Qm67nL49N50k54m98Q0k73M63K39l90l80o1P10M71m35r0o23
5558d14Q9M81K25j62l28j81L3J62M38K19n10m51K24L91p6P6m55k73N03M13Jl76
5580B9k05l2K4N23j79m09q3M76j03L42j64k53l23L66j27Q4M32n12k88R71l18l62
5602a11J69l4O5j73J08K65l91J71o0K5k37L8L19k6k59K3M5J50J08l22k1K59l19
5625b08L51n0j58j78j63M28K5J52j3k00j78K27J20k3m1Jo77M46Q85o03k67J1K73
$$ plain form
5648 160 -84 109 126 56 -329 67 28 260 136 175 -345 -103 -50 72 50 80 5 -335 114 162 4 -188 -294
5671 -294 -56 219 265 203 -128 -211 199 -106 63 289 -112 76 317 -18 -173 47 274 -194 -152 -103 252 110
5693 110 216 -350 -200 114 -47 7 -120 74 -266 222 242 77 -293 -226 -211 -79 224 112 -223 -357 16
5714 16 -108 17 435 -263 -449 4 -31 -12 -89 60 -337 -298 150 -41 102 -280 -2 -152 -206 230 -53 -189
5736 -189 -344 -105 325 138 -186 -350 -131 167 357 -158 -53 -283 -437 114 392 -112 50 1 -293 95
5756 95 145 -79 -49 107 -174 -62 20 -113 -317 12 236 39 -71 -102 227 -108 -21 163 -87 13 -169 -8
5778 -8 -10 198 443 9 -76 -114 52 -52 3 -82 -388 299 461 167 -282 -221 -83 93 309 374 -40 -261 204
5801 204 -126 148 101 14 -201 -43 95 73 -53 -22 287 -267 277 -43 -235 -61 68 205 -213 -84 -101 36
$$ packed form
5648A60k44J93J7p0l85L96l9K32j24L9n20K42N3J22k2L0p5l40M49M8j58j92j06
5671b94K38K75M6o2l31q3M10l05J69K26m01J88K41l35j55K20K27m68M2M9L55j42
5693A10J06n66J50L14j61N4j27J94l40M88K0j65l70O7J5J32L03j12l35j34L73
5714A6j24J25M18o98j86M53l5J9p7J49l97L9M48j91J43l82K78j50n4M36k83j36
5736a89j55K39M30j87l24j64K19K98J90n15J05k30j54N51K78n04J62m9k94L88
5756I5N0k24L0J56k81J12Q2j33k04L29K24j97j10l1L29l35Q7J84k50J00j82J61
5778hkK08K45m34q5l8J66j04N5q5l06O87J62k94m49O1J38J76K16O5m14k21M65
5801B04l30K74m7q7k15J58J38k2j26L1L09n54N44l20j92J74J29J37m18J29j7J37
$$ plain form
5823 36 308 36 34 311 63 -123 -39 34 -98 28 143 77 -213 -104 -157 -136 101 68 -87 -183 4 -104 -351
5846 -351 34 13 59 3 -55 279 -191 -35 -339 -70 -60 72 -307 -5 70 -63 79 -64 34 -264 -143 226
5868 226 -31 115 46 -238 -60 107 -138 39 -145 -340 -288 272 305 -83 -238 -99 144 201 181 237 -72 -277
5890 -277 51 47 -121 160 -96 -269 303 271 -177 -57 -277 -154 37 -35 -71 -216 -193 280 170 118 296 -145
5912 -145 -374 198 424 -132 81 -72 -72 38 541 70 -235 9 -114 398 233 -21 -184 -296 302 411 -169
5933 -169 95 -44 -88 -181 192 -14 -194 10 -162 146 566 86 -123 17 -152 -119 185 56 86 -311 293
5954 293 -36 104 -122 28 -112 -20 -13 2 -292 212 -197 -118 283 -291 -370 -100 -55 -9 -8 -219 180 78 36 188
5978 188 -314 27 329 -2 -124 -85 -94 -349 407 147 86 -489 -68 65 171 495 -283 -173 50 230 34
$$ packed form
5823C6K72k72kK77k48j86Q4P3j32J26J15o6k90J09n3K1K37l3j55r6J87j08k47
5846c51L85k1M6n6n8L34m70J56l04K69J0J32l79L02P5j33J42j43R8k98J21L69
5868B26k57J46o9k84J78J67k45J77j84j95N2N60L3l88j55J39K43N7k0N6l09k05
5890b77L28mj68K81k56j73N72l2m48J20k20J23J91p2l6j45K3M73j10n2J78m41
5912a45k29N72K26n56K13j53%J10N03m71l05K44j23N12j65k54j63j12N98J09n80
5933a69K64j39m4r3L73k06j80K04j72L08M20m80k09J40j69L3L04j29L0l97O04
5954B93l29J40k26J50j40R2PJ5k94N04m09P9M01n74p9K70M5M6Jk11L99j02m2J52
5978A88n02L41L02l31j22L9rk55P56k60o1n75M21J33J06L24p78J10K23J80j96
$$ plain form
5999 34 42 -113 -183 133 215 106 -162 126 -28 -135 133 100 162 165 102 296 -237 228 400 -292 -27 -69 153 176
6023 176 -254 46 -219 379 176 -207 -373 -138 12 -203 313 157 -322 -340 531 341 -2 -84 -242 -207 406
6044 406 248 -359 -371 -374 -14 131 277 -336 -243 142 327 38 -27 -88 -324 -110 232 3 -19 272 -257 -165 242
6067 242 62 150 26 -40 -45 15 79 6 -348 -196 176 184 -302 -68 -106 -62 127 25 -355 -148 -327 -23 409 -40
6091 -40 -108 -247 149 -257 170 185 117 -164 237 54 -237 -380 27 103 165 255 -60 -168 65 317 251 -219 -33
6114 -33 309 -4 -134 -142 -297 -153 333 -10 18 28 41 -3 -14 -132 -68 -6 42 44 82 212 163 -252 -61 73 -273
6139 -273 28 -186 -73 -191 194 289 43 58 -223 -2 130 69 148 59 -50 -90 -52 304 225 -260 -411 65 135
6162 135 278 -49 -282 -122 349 377 24 -86 -60 105 8 109 143 -193 33 -27 -272 79 507 107 -224 -376
$$ packed form
5999C4Qj55p0L16Q2j09k68K88j54j07K68l3O2Lo3J94n33M65J72o92K65m2K22K3
6023A76m30L00k65N98k03l83j66K35J50k15N16j56m79j8Q71j90l43q2j58L5O13
6044D06j58o07j2lL60J45J46o13R3L85J85k89o5o1k36K14L42k29k2K91n29R2M07
6067B42j80Q8j24o6nO0O4p3l54J52L72Qm86K34l8M4J89j02l80K07j79L04M32m49
6091d0o8j39L96m06M27J5o8k81M01j83k91j43M07P6O2R0l15j08K33K52o6m70J86
6114c3L42l13j30qj55J44M86l43K8J0J3m4j1j18O4O2M8KL8J30m9m15J91J34l46
6139b73L01k14J13j18L85R5k46J5k81K21J32o1P9q9j09m0L8L56p9m85j51M76P0
6162A35J43l27k33J60M71K8l53j10K6J65r7J01L4l36K26o0k45L51M28m00l31j52
$$ plain form
6184 -376 -277 40 103 -17 -115 -390 43 170 357 218 -167 -358 -60 647 25 -260 -105 -168 178 482 -249
6205 -249 -471 -284 -55 50 318 87 -352 -205 -50 250 -78 280 98 -311 -64 418 243 -471 -129 -150
6225 -150 -78 154 328 -47 -506 -47 57 147 147 -312 -170 -285 -19 39 -132 -285 -201 -110 266 186 -335 -213 -129
6248 -129 272 209 226 -469 -199 336 257 26 -270 -56 173 73 308 -468 17 163 236 299 -275 -181 -197 70
6270 70 -37 -252 -184 -56 61 189 117 81 -57 -398 232 -48 -250 -547 -226 -349 541 -18 -157 -332 -291 35
6292 35 -204 216 -8 -282 -113 -2 248 132 -146 -643 -487 437 319 206 -326 -487 -70 455 346 -256
6312 -256 -532 -276 445 595 245 -474 -718 -67 773 461 -208 -557 -411 418 967 62 -102 -615 102 372
6332 372 549 258 -405 -96 4 518 520 -64 -169 -76 187 338 348 -180 -274 274 -126 432 233 -74 -295 2
$$ packed form
6184c76R9L17O3j20r8k75M33J27J87j39l85j91K98P07o22k85J55o3L46L04p31
6205b49k22J87K29J05K68k31m39J47J55L00l28L58j82m09K47M82j75p14L42k1
6225a50P2K32J74l75m59M59J04R0%m59J42j15K66N8j71j53Q4R1L76q0n21J22Q4
6248a29M01o3J7o95K70N35p9k31k96K14K29j00K35p76M85J46P3O3n74R4j6K67
6270G0j07k15O8J28J17J28p2l6j38l41O30k80k02k97L21j23Q90n59j39j75M1L26
6292C5k39M20k24k74J69J11K50j16k78m97J56R24j18j13n32j61M17N25j09o02
6312b56k76K56P21J50l50p19k44O51Q40l12o69l49J46Q29N49r05j64n13P17K70
6332C72J77k91o63L09J00N14Kn84j05R3K63J51J0n28r4N48m00N58j99l07k21K97
$$ plain form
6354 2 215 427 20 -237 -397 133 281 205 -3 -109 -333 -132 95 184 -354 -301 75 70 199 91 -111 -284
6376 -284 108 388 249 -171 -329 -57 18 16 -242 -413 -10 425 111 -90 126 -10 217 131 150 -431 -278 219
6398 219 36 49 154 -316 58 26 -120 -192 67 189 -163 -45 194 -1 -63 -183 149 183 378 -238 -196 -57
6420 -57 459 -3 -138 -138 15 206 -11 131 -3 -64 -23 111 156 -129 64 -73 81 -57 430 74 -261 -760
6442 -760 284 553 287 -107 -255 -141 247 175 -148 -69 -420 149 377 52 -56 45 -91 119 178 137 -135
6463 -135 -249 10 -84 -29 -24 -159 -301 -29 44 -55 113 -54 -259 -43 -251 50 37 186 -308 -309 147 94 167 -106
6487 -106 -76 -647 -129 424 300 242 -6 -112 -116 -29 93 -46 -182 -322 -199 137 341 -72 -430 -266 174 457
6509 457 114 207 -357 -353 8 295 174 -149 -277 -230 141 410 114 -229 -309 -220 26 518 213 -296 -282 -8
$$ packed form
6354BK13K12m07k57j60N30J48p6k08j06k24K01K27Q9n38N3L76nJ29j08k02j73
6376b84L92K80j39m20j58K72P5kk58j71M03M35l14k01K16j36K27q6J9n81J53M97
6398B19j83J3J05m70L74l2j46p2K59J22l52J18K39j95o2j20L32L4J95o16M2J39
6420e7N16m62j35%J53J91k17J42j34o1M1J34M5k85J93j37J54j38M87l56l35m99
6442g60J044K69k66l94j48J14L88p2l23P9l51N69K28l25j08J01j36K10N9m1k72
6463a35j14K59r4N5Nj35j42K72P3r9J68j67k05K16k08L01j3J49m94jM56n3P3k73
6487a06L0n71N18N53j24n8k48j06mQ7J22j39j36j40J23L36K04m13l58J64M40K83
6509D57l43R3n64ML61K87j21l23j28M7L71K69k96l43q0Q9K46M92l05n09J4K74
$$ plain form
6531 -8 292 191 202 -50 -177 13 378 76 193 -195 74 285 659 183 -66 -368 -157 58 173 151 50
6552 50 -189 84 275 -115 34 52 314 47 86 -16 -83 -232 -33 -342 133 86 -16 -179 267 144 -64 7
6574 7 -8 -94 149 344 -177 32 -73 20 -50 -168 -17 97 315 193 -82 -264 221 175 2 162 192 -463 -17
6597 -17 174 239 79 -234 -15 101 132 264 -146 5 -39 57 172 225 -156 -326 -102 226 92 -211 84 -372
6619 -372 -42 276 246 -189 26 16 -207 168 265 -203 3 2 -85 262 38 74 -357 106 95 159 -163 -197 -65
6642 -65 50 -119 219 160 -96 162 225 85 -42 -32 -219 204 -234 -38 159 -118 -276 -305 184 88 169 -64
6664 -64 -52 -3 187 89 -250 49 104 144 -449 94 148 385 149 -215 -177 -251 310 184 -197 -277 -3 36 102 11
6688 11 -67 -30 -47 -96 307 189 198 -188 -102 194 -245 44 -98 -246 -44 189 33 99 -305 -210 -177 -174 72 10 52
$$ packed form
6531hL00j01J1k52j27J90L65l02J17l88K69K11L74m76k49l02K11K15J15k2j01
6552E0k39K73J91l90J49J8K62k67L9j02o7j49J99l09M75m7j02j63M46j23k08P1
6574Gj5q6K43J95n21K09j05R3p0j18J51J14K18j22k75j82M85m6j73J60L0o55M46
6597a7J91O5j60l13K19J16L1J32m10J51m4R6J15N3l81j70K24L28j34l03K95m56
6619c72L30L18l0m35K15j0k23L75R7m68K06jq7L47k24L6m31M63j1O4l22l4J32
6642f5J15j69L38n9k56K58O3j40j27J0j87M23m38J96J97k77j58k9M89r6Q1k33
6664f4J2M9J90r8l39K99N5M0n93N43N4K37k36l64L8p4N61j26l81q0K74L9O6r1
6688A1p8L7j7m9M03j18Rl86Q6K96m39K89j42j48K02K33j56O6m04R5L3LK46o2M2
$$ plain form
6713 52 -148 -43 13 130 262 -45 -95 -8 517 345 126 -74 -348 33 95 203 -201 -76 -79 37 86 237 -270
6736 -270 -188 -10 -114 -1 -26 -74 -185 3 366 60 28 -247 10 141 130 196 -61 -75 123 13 -52 158 -48
6759 -48 -216 247 -127 -82 109 63 -293 166 -204 -354 -36 302 95 -165 -92 122 -209 152 -158 -198 158 -44
6781 -44 10 -46 -396 -62 -76 -144 125 81 17 247 -14 -39 144 183 -47 36 77 85 110 87 32 -412 -23 -196 -59
6806 -59 199 74 -204 -97 545 -120 78 134 -245 90 30 224 -179 -40 -393 -101 167 95 -155 -113 -100 209
6828 209 219 105 -211 -310 10 81 -68 215 23 -67 -217 -191 77 222 -115 -243 -64 25 201 176 -477 -487 -180
6851 -180 79 392 -208 -191 -167 215 175 153 -72 -326 63 116 117 -127 -209 -166 -26 -160 305 -132 24 245 286
6874 286 -37 30 3 160 -183 279 259 -149 -222 102 -167 -134 -235 196 298 -145 201 -222 -69 184 -56 -242
$$ packed form
6713E2k00J05N6J17J32l07n0Q7N25j72k19k00k74L81O2J08m04J25lJ16M9J51n07
6736b70Q2J78j04J13k5m8j11J88L63l06l2k75K57J31j1O6k57j4J98j10o5K10k06
6759d8j68M63l74M5J91m6l56M59l70j50L18L38k07k60P3K14l31L61l10m0L56k02
6781d4N4n6l50L34j4o8K69m4o4K30k61k5J83L9k30Q3M1QK5k3n5m44L89j73J37
6806e9K58j25k78J07O42o65J98N6l79L35o0J94m03J39l53K92K68p2k50M2J3L09
6828B09J0j14l16r9L20P1j49K83j92r0j50K6K68J45l37j28J79Q9J76k5o53j0L07
6851a80K59L13o00J7K4L82m0k2k25k54L89N3Jk44q2M3J40j34M65m37J56K21M1
6874B86l23O7k7J57l43M62k0m08p3L24k69L3j01M31J02m43L46m23J53K53k40j86
$$ plain form
6896 -242 137 370 351 -164 -86 -14 -333 132 171 80 -150 -235 -340 -44 86 -98 10 -104 65 -176 -120 443
6918 443 100 -276 -197 -115 -20 124 225 10 50 42 235 0 53 -315 -101 137 76 153 -224 -205 -297 239 416 -127
6942 -127 43 73 103 219 -357 -121 -47 -186 187 -158 210 156 -126 -139 -146 76 198 97 29 -68 -233 -43 -64
6965 -64 -7 66 4 271 -162 32 233 -111 -94 69 113 -14 96 -119 149 -210 53 -171 38 -52 -33 1 16
6988 16 -65 -165 -30 -5 -121 -36 -29 -203 76 88 -77 -73 186 38 -496 -165 140 123 326 4 -93 -287 -125 158
7012 158 197 135 -215 -8 396 45 87 -313 254 -192 63 177 74 -322 -403 166 254 68 42 -122 72 -212
7034 -212 219 -78 -55 -33 -182 -247 -315 36 12 -133 -84 -130 -245 206 85 -176 86 -229 -24 330 74 -114
7056 -114 -40 34 -143 -42 33 43 94 217 73 -257 102 2 162 67 -30 -34 157 -51 168 -42 -143 52 185
$$ packed form
6896b42L79K33j9n15P8P2l19M65L9r1k30q5j05K96J30j84J08j14J69k41N6N63
6918D43l43l76P9Q2R5J44J01k15M0qJ93k35N3l68K14K38o1P7l77J9r2N36J77n43
6942a27J70L0L0J16n76K36P4j39L73l45L68n4k82j3pK22J22j01o8r7j65J90k1
6965f4N7P3o2K67m33J94K01l44J7J63M4j27J10k15K68l59K63k24K09r0J9L4J5
6988A6q1j00J35K5j16Q5Pj74K79J2j65MK59j48n34L31L05j7K03l22r7j94J62K83
7012A58L9o2l50K07M04l51M2m00N67m46K55J14j03l96q1N69Q8j86k6j64J94k84
7034b12M31k97K3K2j49o5o8L51k4j45M9m6j15M51j21k61K62l15K05L54k56j88
7056a14P4P4j77J01P5J0N1J23j44l30L59j00J60r5r7mJ91k08K19k10j01J95J33
$$ plain form
7079 185 219 -34 -148 -189 70 137 80 -5 102 -71 58 199 24 -152 -140 193 335 -234 -77 164 221 73
7101 73 -13 -157 -208 268 38 -15 207 -242 18 -90 -101 27 67 144 -30 95 -47 -153 -378 223 -313 -267 99
7124 99 142 1 24 377 -25 -29 312 -402 155 155 -227 51 -291 2 -3 -54 -2 107 -186 148 394 7 -27 187
7148 187 -200 -29 181 314 -391 -98 258 267 -68 -125 -257 -154 259 36 -105 -149 273 107 172 141 -124 -256
7170 -256 201 245 -14 -226 -40 183 267 263 58 -370 -196 221 -174 166 -11 95 4 251 -175 137 -82 -23
7192 -23 -43 -15 275 68 18 -292 -231 -142 -18 120 -73 -84 137 90 217 12 405 -243 225 -185 130 116 -115
7215 -115 223 168 257 -67 -367 -50 174 -79 148 -136 -162 107 -78 230 -252 130 243 -113 -80 -222 -288 16
7237 16 -193 78 -209 -365 81 -251 154 -250 -244 85 88 46 51 71 126 -79 17 164 -103 -138 148 -71 -20 -202
$$ packed form
7079A85L4k53j14m1K59O7n7q5J07j73J29J41j75j76J2L33J42n69J57K41N7j48
7101G3q6j44n1M76k30n3K22m49K60j08j1J28M0P7j74J25j42j06k25O01n36M6L66
7124I9M3j41K3L53m02mL41p14N57%l82K78l42K93nn1N2J09k93L34K46l87l4K14
7148A87l87J71K10J33p05K93L56Rl35n7j32J03M13k23j41m4M22j66O5l1k65j32
7170b56M57M4k59k12J86K23Q4mk05m28J74M17l95L40j77J06r1K47m26L12k19N9
7192b3k0K8K90k07n0l10O1Q9J24J38j93j1K21m7J27k05L93o48M68m10L15j4k31
7215a15L38n5Q9l24l00L17K24k53K27k84k6K69j85L08m82L82J13l56L3j42o6L04
7237A6k09K71k87j56M46l32M05m04OL29Lm2NK0N5k05R6J47k67l5K86k19N1j82
$$ plain form
7261 -202 -186 117 63 204 -173 29 79 -193 5 -51 106 126 161 -233 -283 -81 149 -15 188 -32 -137 19
7283 19 -55 -253 -407 148 -137 43 -58 -248 -8 85 25 25 -32 63 149 -128 65 7 -52 -114 -126 208 -29 -203
7307 -203 -103 -24 -35 -82 109 -192 -40 224 -137 256 -141 -261 -115 157 -166 49 212 51 150 133 68 -233
7329 -233 113 74 273 -291 137 -83 209 17 64 -182 -17 -7 -20 317 40 -107 -110 -96 65 277 21 -145
7351 -145 59 -215 33 234 -168 171 -126 -93 86 -85 72 -92 204 -4 26 -113 -116 -58 -203 -84 97 -200
7373 -200 -105 122 -55 220 37 -25 -273 -171 -26 -67 -39 -21 58 -42 105 -194 -119 45 38 -99 65 65 11 197
7397 197 18 25 -206 298 149 -66 -267 168 -240 4 4 168 -135 -246 107 176 -45 -140 -272 79 120 88 55
7420 55 -277 -224 -96 -121 -17 -297 -322 -103 106 -107 214 74 18 11 62 129 208 135 33 -289 -155 -22 -13 -133
$$ packed form
7261b02J6L03n4J41l77K02N0k72J98n6J57K0L5l94n0K02K30j64K03k20j05J56
7283A9p4j98j54N55k85J80j01j90K40R3o0%n7R5Q6k77J93n8n9o2j2L34k37j74
7307b03J00P9j1m7J91l01J52K64l61L93l97j20J46K72l23K15J63j61R9j7o5l01
7329b33L46l9J99n64M28k20K92j92M7k46J65J0j3L37k77j47lJ4J61K12k56j66
7351a45K04k74K48K01m02L39k97L3J79j71J57j64K96k08L0j39lN8j45J19J81k97
7373b00R5K27j77K75j83o2k48J02J45m1K8J8P9j00J47k99P5J64pj37J64%n4J86
7397A97j79Pk31N04j49k15k01M35m08K44%J64l03j11L53O9k21r5j32L51M1l2l3
7420E5l32N3J28k5J04k80k5K19K09k13L21j40n6pN1O7P9p3j02l22J34J33Rj20
$$ plain form
7444 -133 97 -279 158 323 19 -221 81 210 135 145 324 -97 -260 104 -9 74 95 -121 -102 -64 156 53
7466 53 72 -284 -88 216 144 383 -263 6 104 -243 -85 -87 52 0 214 155 -174 -138 -63 391 62 190 -61
7489 -61 53 -183 -132 4 -114 78 -197 -3 129 -159 -134 141 45 -220 209 -182 13 9 -115 156 -45 -54 41
7512 41 14 28 325 329 211 92 -25 274 150 167 -292 108 123 130 1 352 174 -144 90 -108 248 89 60
7535 60 117 204 34 -36 -238 84 157 251 -100 186 26 -63 86 277 -49 38 -40 -124 6 155 -239 276 119
7558 119 -261 256 306 243 68 -139 76 92 -44 115 -196 -248 28 80 -47 -161 -148 79 121 -146 -6 -192
7580 -192 -112 165 -265 130 412 -57 40 320 -92 -14 13 -72 -23 -198 -446 191 -97 224 -46 -148 64 -147
7602 -147 -147 3 121 23 -280 25 -177 -173 161 -218 -198 80 135 -77 26 -32 -107 -455 264 -49 -197 -38 71
$$ packed form
7444a33K30l76M37J65l04k40L02J29p5J0J79m21j63L64j13Q3K1k16J9L8K20j03
7466E3J9l56J96L04p2K39o46K69R8l47J58kJ39n2K14n9l29L6P5M54l29J28k51
7489f1J14k36N1J36j18J92k75J94J32k88K5K75r6k65M29l91J95mj24K71k01rR5
7512D1k7J4K97Mj18j19j17K99j24J7m59M00J5Pj29L51j78l18K34j98L56j59k9
7535F0N7Q7j70p0k02L22P3R4l51K86j60q9J49J91l26Q7p8q4J30J49l94N15j57
7558A19l80N17N0o3j75k07K15J6j36J59l11n2K76N2j27j14J3K27M2k67J40j86
7580a92Q0K77m30L95K82m69R7K80m12P8K7q5M9j75k48O37k88L21k70j02K12k11
7602a47%J50J18r8l03L05k02ML34l79K0K78N5k12J03n8p5l48P19l13j48J59J09
$$ plain form
7625 71 -120 396 200 -29 -155 163 -273 -166 87 -102 -4 -128 172 -60 284 -79 80 79 -154 53 154
7646 154 46 280 246 171 92 -95 103 -142 -374 20 243 -211 126 -205 56 178 -163 -206 54 31 -128 -190
7668 -190 -163 -89 -103 -60 -265 -132 131 119 18 105 137 23 -188 44 -158 -43 90 -3 -143 -230 -494 114 258
7691 258 350 24 -169 118 27 163 82 99 -219 17 46 150 220 28 -222 152 31 204 -4 22 -273 99
7713 99 27 249 148 -226 218 -110 115 12 111 -207 -150 253 73 340 57 5 51 103 67 82 108 -118 16
7736 16 1 -143 -30 242 183 135 -3 89 -122 -74 347 105 -254 -343 -374 -44 267 91 15 126 -33 39 14 -260
7760 -260 125 254 13 -46 1 -75 181 44 -109 131 64 -148 -210 410 276 32 37 -152 102 43 286 71 53
7783 53 -38 -2 200 -23 -153 94 -400 -70 -24 -51 -113 -110 59 113 57 86 -71 13 1 -96 -54 92 -149 -223 -255 -436
$$ packed form
7625G1j91N16j96k29j26L18m36J07K53j89R8j24L00k32L44l63J59jk33K07J01
7646A54j08K34l4p5p9j87J98k45k32L94K23m54L37l31K61J22l41m3K60k3j59o2
7668a90K7P4j4M3k05J33K63j2j01Q7L2j14k11K32k02J15J33r3j40q7k64O08J44
7691B58R2l26j93K87r1J36q1J7l18K36K9J04P0j92k50L74j21J73k08K6k95L72
7713I9p2K22j01l74M44l28K25j03R9l18N7M03j80K67k83n2M6N2l6J5K6k26J34
7736A6j5j44J13K72n9m8j38R2k11M8M21k42l59q9l1L30L11j76p6J11j59P2k5k74
7760b60L85J29k41n9M7p6K56j37j53K40o7k12o2O20j34k44Nj89K54n9K43k15j8
7783E3r1L6K02k23j30K47m94L30M6k7o2LJ69N4n6K9j57Q4j2r7M2J46k41p4l2j81
$$ plain form
7809 -436 8 59 135 66 -71 -103 187 62 -4 -343 187 88 73 -205 70 143 53 132 206 166 -136 69 182 257
7833 257 184 -109 -300 -73 -38 -16 146 65 34 -132 123 39 -146 45 -44 56 -125 211 207 -144 56 -39 159
7856 159 140 54 -46 -336 -123 -73 -41 156 238 6 -152 215 -84 98 120 168 -278 199 94 36 118 -180 244
7879 244 -82 -63 250 -260 74 78 102 -26 -101 -312 -320 109 -328 -16 -80 -61 -109 41 73 60 173 118 -20 -38 52
7904 52 255 -46 -67 125 85 -209 181 -116 -174 128 159 146 -93 -35 193 -255 188 -104 -177 -62 -112 -217 -248
7927 -248 235 123 76 -204 -174 43 273 -117 -266 -229 -79 79 97 49 -292 77 -319 138 282 -346 27 -252
7949 -252 -215 97 92 -163 -192 175 -78 248 65 -162 -113 -11 69 196 296 -205 64 -167 262 65 -286 -96
7971 -96 85 -175 284 -43 -29 254 43 -335 250 -21 42 -58 -155 37 -67 4 0 104 -98 30 121 154 206
$$ packed form
7809d36M44N1P6o9j37l2K90j25o6l39N30r9j5k78K75P3r0P9P4m0l02K05J13P5
7833B57p3k93j91K27L5K2J62q1l1j66K55q4j85J91q9J00j81L36ml51K00r5J98
7856A59j9q6j00k90K13N0L2J97Q2k32j58L67k99J82K2M8m46M77j05n8Q2k98M24
7879B44l26J9L13n10L34MK4j28p5k11qM29m37L12o4J9m8J50L2j3J13n5j38j8R0
7904E2K03l01k1J92m0k94L90k97n8L02L1j3k39N8K28m48M43k92p3J15n0j05l1
7927b48M83j12m7k80L0K17K30l90j49L7J50J58J8m8l41L69l96M57J44o28L73k79
7949b52L7L12nk55k9L67k53L26j83k27M9J02Q0J27J00n01K69k31M29j97l51J90
7971i6J81k60M59l27J4K83k11l78N85k71O3j00r7J92j04P1mJ04k02J28R1L3N2
$$ plain form
7994 206 -15 221 137 58 51 -24 -22 19 -196 60 402 46 -77 -127 -14 -258 281 198 115 -137 -74 79 271 221
8018 221 -219 -96 -95 -84 274 162 -91 -135 -286 245 -14 -223 53 -226 268 73 54 76 -85 144 17 79
8040 79 32 330 -93 187 134 122 -24 58 -59 57 312 431 -32 -190 -191 -358 147 249 53 -338 -411 232 95
8063 95 182 -49 -103 -308 3 32 -161 -86 -187 -129 44 60 211 133 -130 -11 -92 120 -332 -162 -25 114 -151
8086 -151 61 166 37 -335 263 -26 153 164 -86 54 -55 -139 52 -72 -127 251 26 -135 146 137 -153 108
8108 108 -52 -45 175 38 9 214 266 -43 -25 33 -166 142 -203 -252 -92 152 107 95 40 -52 -53 324 -205 -167 -226
8133 -226 -66 1 -13 -29 -110 252 -6 83 132 -127 -146 77 147 -69 -51 213 15 24 154 -313 367 -51 -36 167
8157 167 348 -177 -286 -54 -27 -150 43 173 -44 -130 -239 219 80 -249 13 186 53 5 220 -140 -168
$$ packed form
7994B06k21K36q4p9pp5KM1k15K56L42l56j23n0J13k44N39q3q3k52O3J53J92n0
8018B21m40J23JJ1L58j12k53m4j51N31k59k09K76k79M94j95j9K2j61K29j27O2
8040G9m7K98m23K80n3j2j46Q2j17J16K55J19m63j58jj67N05J02j96l91p3O43j37
8063I5Q7k31n4k05L11K9j93P5j01N8J73J6J51p8k63J19q1K12m52J70J37J39k65
8086a51K12J05j29l72N98k89J79J1k50J40j09q4J91j24n5L78k25j61K81rk90K61
8108A08j60PK20j37k9K05N2l09J8N8j99L08l45m9J60K44m5j2n5r2jL77n29L8n9
8133b26J60O7j4j6q1L62k58Q9M9k59j9K23P0k16J8K64j98RJ30m67O80m18J5K03
8157A67J81n25j09K32K7j23J93J30k17q6j09M58j39l29K62J73j33m8K15l60k8
$$ plain form
8178 -168 -129 43 334 84 -234 -123 171 41 -245 244 -120 -381 -58
$$ packed form
8178a68L9J72K91k50l18J11K94j30k86M89l64k61L23
8191e8
$$ Imaginary data points
##PAGE= N=2
##DATA TABLE= (X++(I..I)), XYDATA
$$ plain form
0 0 0 0 0 0 8 0 8 -8 8 -16 19 -24 31 -40 42 -51 65 -74 89 -106 124 -140 165 -190 219 -251 287 -324 370
29 370 -415 468 -526 588 -657 735 -818 908 -1011 1121 -1241 1377 -1522 1684 -1866 2069
45 2069 -2294 2552 -2846 3178 -3571 4032 -4588 5273 -6143 7284 -8855 11175 -14944 22133
59 22133 -40803 191307 385874 -88415 -349193 -251926 119751 319281 201100 -138031 -288976
70 -288976 -129140 160280 250221 86538 -166062 -211933 -19208 171859 138162 -9204 -107633
81 -107633 -103503 -17980 99622 114435 7558 -93939 -89222 -12452 74967 95036 16247 -83625
93 -83625 -92325 -10378 88160 108633 1488 -128810 -98785 59984 130879 44175 -68515 -99395
105 -99395 -35344 68902 99648 11061 -81479 -66169 15624 62850 31401 -37980 -45353 23389
$$ packed form
0@%%%%QqQj6J6k4L5m3N5p1Q2r3J16j39J63j95K30k64L05l55M09m70N38o11O94
29C70p85Q83r94J114j245J392j553J726j919K132k362K618k899L206l550L935
45B069m363M846n398O024o749P603q620R861j1416J3427j6139K0030k6119L7077
59B2133o2936K32110J94567m74289k60778R7267L71677J99530j18181l39131j50945
70b88976J59836K89420Q9941j63683k52600m5871J92725J91067l3697j47366r8429
81a07633M130Q5523J17602J4813j06877j01497M717P6770Q7419K0069p8789r9872
93h3625q700Q1947R8538K0473j07145j30298L0025J58769P0895q6704j12690l0880
105i9395O4051J04246L0746q8587r2540J5310Q1793M7226l1449o9381p373O8742
$$ plain form
117 23389 45241 -26289 -60956 5760 65226 37319 -33178 -79208 -46467 58303 108903 16224
129 16224 -110598 -108674 20594 132867 94952 -70979 -166919 -57238 116326 138772 10101
140 10101 -116763 -125989 -2809 133129 112054 -45494 -137221 -67860 57058 107333 45993
151 45993 -62448 -97528 -26791 52419 66649 30299 -31896 -78766 -44721 43280 78064 34452
163 34452 -29997 -75295 -61782 29667 106131 61775 -54840 -111668 -52834 68739 126175 35208
175 35208 -103160 -113923 6843 108812 93698 -16244 -113887 -81817 55549 122350 39939
186 39939 -70734 -86704 -13327 68097 73863 -4321 -64479 -34969 22139 35762 18253 -4076
198 -4076 -19011 -7285 9725 -947 -5146 25052 28709 -19212 -46055 -13424 37669 57507 17547
$$ packed form
117B3389K1852p1530l4667O6716N9466k7907p0497m6030L2741J04770N0600r2679
129A6224j26822J924J29268J12273l7915j65931r5940J09681J73564K2446j28671
140A0101j26864r226J23180J35938k1075j57548r1727O9361J24918N0275o1340
151D5993j08441l5080P0737P9210J4230l6350o2195m6870L4045Q8001L4784m3612
163C4452o4449m5298J3513R1449P6464m4356j16615n6828N8834J21573N7436r0967
175C5208j38368j0763J20766J01969j5114j09942r7643L2070J37366O6801q2411
186C9939j10673j5970P3377Q1424N766p8184o0158K9510N7108J3623j7509k2329
198d076j4935J1726J7010j0672m199L0198L657m7921k6843L2631N1093J9838l9960
$$ plain form
211 17547 -59458 -75965 9284 89931 64757 -28172 -91564 -59864 47508 111669 40720 -76463
223 -76463 -93001 -9404 71638 79234 6684 -76324 -70361 14806 67634 41594 -11393 -47358
235 -47358 -42758 5092 44185 31694 -879 -23487 -39095 -23007 30356 54598 13545 -38413
247 -38413 -52066 -21404 38943 66691 9602 -68296 -62072 13012 65988 48069 -25451 -79268
259 -79268 -38077 52725 69870 887 -59112 -51815 6298 59355 41660 -34977 -64706 -10606
271 -10606 42629 33572 -8258 -36713 -24670 19171 34119 -4988 -32498 -8293 19259 15544
283 15544 -4559 -23477 -16720 21546 35429 -8339 -43763 -17640 25508 34433 9331 -29617
295 -29617 -39547 3908 45099 23972 -21378 -32672 -12354 17986 34162 9193 -29547 -23681
$$ packed form
211A7547p7005j6507Q5249Q0647k5174r2929o3392L1700J07372O4161p0949j17183
223g6463j6538Q3597Q1042P596p2550q3008N963Q5167N2828k6040n2987l5965
235d7358M600M7850L9093j2491l2573k2608j5608J6088N3363K4242m1053n1958
247c8413j3653L0662O0347K7748n7089p7898O224P5084N2976j7919p3520n3817
259g9268M1191R0802J7145o8983n9999P297N8113N3057j7695p6637k9729N4100
271a0606N3235r057m1830k8455J2043M3841J4948l9107k7510K4205K7552l715
283A5544k0103j8918O757L8266J3883m3768l5424K6123M3148Q925k5102l8948
295b9617r930M3455M1191k1127m5350j1294K0318L0340J6176k4969l8740N866
$$ plain form
307 -23681 10126 18266 6783 4 -9151 -12736 1943 10861 4988 5443 3621 -14384 -15712 12044
321 12044 26273 10940 -11167 -26773 -16643 27523 48999 4158 -47622 -37403 14279 52825
333 52825 40996 -21381 -66794 -26794 51062 64627 7151 -51138 -53561 5424 66945 48807
345 48807 -30203 -63555 -18617 37188 48672 11899 -40001 -44410 8847 45183 19933 -18701
357 -18701 -27770 -11534 15126 26826 2511 -22003 -10340 7990 5148 1156 1743 -4869 -5619 2017
371 2017 -1340 -5312 7286 9671 -9535 -14583 -541 7377 8705 4514 -12526 -18997 3891 17848
385 17848 2516 -11083 -7952 -4274 2204 7624 -3967 -11843 3493 10502 -7971 -16296 -1861
398 -1861 11121 14435 3631 -23278 -28459 9638 37978 14499 -25324 -36729 -13421 29309 45378
$$ packed form
307b3681L3807Q140j1483o779r155l585J4679Q918n873M55j822j8005j328K7756
321A2044J4229j5333k2107j5606J0130M4166K1476m4841n1780J0219N1682L8546
333E2825j1829o2377m5413M0000P7856J3565n7476n8289k423N8985O1521j8138
345D8807p9010l3352M4938N5805J1484l6773n1900m409N3257L6336k5250l8634
357a8701r069J6236K6660J1700k4315k4514J1663J8330k842l992N87o612p50P636
371B017l357l972J2598K385j9206n048J4042P918J328m191j7040o471K2888J3957
385A7848j5332j3599L131L678O478N420j1591p876J5336P009j8473q325J4435
398a861J2982L314j0804k6909n181L8097K8340k3479l9823j1405K3308M2730J6069
$$ plain form
411 45378 1542 -49546 -37383 16155 44840 27142 -18909 -50754 -22424 36803 47811 1984
423 1984 -36591 -34451 -1439 35830 34262 -11016 -40544 -18664 15328 26758 17383 -9841 -31743
436 -31743 -15603 18167 24894 9642 -6547 -21805 -18675 11867 31207 13110 -13077 -23737
448 -23737 -16389 12054 37151 17766 -24190 -32097 -4364 24048 33339 9823 -29897 -32473 9535
461 9535 36475 20885 -8650 -26581 -18649 15602 34802 8607 -22789 -18709 1465 15514 18278
474 18278 1775 -19926 -11935 11163 13347 2767 -1167 -6979 -8544 3761 9427 413 -1387 1767
488 1767 -6128 -8264 5283 9652 942 -3140 -6887 -10266 3680 17059 4973 -12111 -10535 -3058
502 -3058 3932 12262 5262 -13217 -12754 3352 6454 2363 1578 -5357 -10859 -688 5904 -559 -661
$$ packed form
411D5378m3836n1088J2163N3538K8685j7698m6051l1845K8330N9227J1008m5827
423A984l8575K140L3012L7269j568m5278k9528K1880L3992J1430r375k7224k1902
436c1743J6140L3770O727j5252j6189j5258L130L0542J9340j8097k6187j0660
448b3737P348K8443K5097j9385m1956p907K7733K8412R291k3516l9720k576M2008
461I535K6940j5590k9535j7931P932L4251J9200k6195l1396M080K0174J4049K764
474A8278j6503k1701P991K3098K184j0580l934n812j565J2305N666r014j800L154
488A767p895k136J3547M369q710m082l747l379J3946J3379j2086j7084J576P477
502c058O990Q330p000j8479M63J6106L102m091p85o935n502J0171O592o463j02
$$ plain form
517 -661 3236 -4892 -9908 -188 5144 2750 2845 -3923 -14874 -5575 12785 10612 -3281 -10276 -12680
532 -12680 -4677 14136 15796 -6971 -18937 -7445 5304 12551 11705 -6639 -21959 -7744 13215
545 13215 14011 4410 -7480 -18205 -9279 15082 18192 -434 -12277 -12622 -6484 11624 21415 2817
559 2817 -18204 -13907 1105 12583 17915 4659 -19343 -18594 5859 18337 13466 112 -17851
572 -17851 -19339 7654 26387 12289 -9462 -16933 -12085 7218 25643 13784 -15157 -20663 -3226
585 -3226 13276 20771 9260 -16770 -22962 2096 21082 15667 957 -15049 -19392 2578 25736
598 25736 16234 -9077 -17444 -9832 5287 20529 14914 -9957 -19035 -4451 8838 13229 9669
611 9669 -7433 -18092 -3631 13318 10423 2771 -3393 -12735 -9361 9392 15073 2690 -7234 -10551
$$ packed form
517f61L897q128n016R720N332k394R5o768j0951R299J8360k173j3893o995k404
532a2680Q003J8813J660k2767j1966J1492J2749P247q46j8344j5320J4215K0959
545A3215P96r601j1890j0725Q926K4361L110j8626j1843l45O138J8108R791j8598
559B817k1021M297J5012J1478N332j3256k4002P49K4453J2478m871j3354j7963
572a7851j488K6993J8733j4098k1751p471M848J9303J8425j1859k8941n506J7437
585c226J6502P495j1511k6030o192K5058J8986n415j4710j6006m343K1970K3158
598B5736r502k5311q367P612J5119J5242n615k4871r078J4584J3289M391l560
611I669j7102j0659J4461J6949k895p652o164r342L374J8753N681j2383r924l317
$$ plain form
625 -10551 -9015 5344 17172 5743 -11506 -12985 -5744 5388 16412 7953 -15150 -18049 1768
638 1768 12357 9490 1135 -12026 -16763 1377 17114 8160 -7235 -12444 -11033 690 14216
651 14216 7860 -9027 -11424 -4913 -1563 7153 11545 -2790 -14939 -7656 2368 6095 9433 1839
665 1839 -14833 -15070 3318 13815 9364 -2687 -17808 -16151 9037 22965 6721 -13077 -15729
678 -15729 -7835 8714 21392 7463 -17134 -16654 2856 12526 10082 274 -11550 -9013 6011
691 6011 9659 971 -1046 -1459 -5486 -729 6992 2633 -1172 3678 -581 -9275 -2381 10395 9057
706 9057 -865 -7887 -10533 -271 14994 11486 -6047 -11308 -4551 3246 12447 11035 -7434 -15066
720 -15066 1523 13592 6978 -567 -3968 -7228 -965 9438 7468 -45 -1799 -5084 -5719 5044
$$ packed form
625a0551J536J4359J1828j1429j7249j479P241J1132J1024q459k3103k899J9817
638A768J0589k867q355j3161m737J8140J5737q954j5395n209J411J1723J3526
651A4216o356j6887k397O511L350Q716M392j4335j2149P283J0024L727L338p594
665A839j6672k37J8388J0497m451j2051j5121J657K5188J3928j6244j9798k652
678a5729P894J6549J2678j3929k4597M80J9510R670k444r808j1824K537J5024
691F011L648q688k017m13m027M757P721m359l805M850m259q694O894J2776j338
706I057r922p022k646J0262J5265l508j7533n261O757P797R201j412j8469p632
720a5066J6589J2069o614p545l401l260O263J0403j970p513j754l285o35J0763
$$ plain form
734 5044 11758 4015 -2920 -5767 -9690 -547 18008 14174 -10372 -19718 -5849 11752 18385 7460
748 7460 -17259 -23684 1015 23371 18125 -4249 -24128 -21646 9900 32432 12577 -20023 -23880
761 -23880 -5549 13358 20940 6825 -18814 -22071 552 15950 12693 70 -13957 -15861 251
774 251 12940 8294 81 -6482 -15303 -10054 11803 18471 1604 -14644 -17217 -8721 11267 22790
788 22790 5226 -21040 -22415 -2159 18041 20890 -1540 -26689 -17943 12315 22158 7103 -10389
801 -10389 -19020 -10193 13162 21445 935 -16683 -11231 1679 9582 9635 -303 -8965 -3827 1669
815 1669 -35 2652 8014 842 -8002 -4049 552 3432 9512 5145 -11202 -14285 3833 16137
829 16137 9911 -4658 -16439 -11163 11128 21855 5217 -12618 -13586 -3367 11189 18361 3714
$$ packed form
734E044O714p743o935k847l923R143J8555l834k4546r346J3869J7601O633j0925
748G460k4719o425K4699K2356n246k2374j9879K482L1546K2532j9855l2600l857
761b3880J8331J8907P582j4115k5639l257K2623J5398l257j2623j4027j904J6112
774B51J2689m646q213o563q821N249K1857O668j6867j6248k573Q496J9988J1523
788B2790j7564k6266j375K0256K0200K849k2430k5149Q746L0258R843j5055j7492
801a0389q631Q827K3355Q283k0510j7618N452J2910P903N3r938q662N138N496
815A669j704K687N362p172q844L953M601K880O080m367j6347l083J8118J2304
829A6137o226j4569j1781N276K2291J0727j6638j7835r68J0219J4556P172j4647
$$ plain form
842 3714 -15812 -11079 5447 9426 5819 2332 -4050 -6947 -542 3986 4236 6884 3972 -8220 -9753
857 -9753 2871 11646 10938 2679 -13017 -18144 3724 24525 13888 -10163 -19685 -11055 10067 23618
871 23618 9406 -17275 -20431 -145 16130 15924 641 -17854 -15254 7369 16652 4633 -6531
884 -6531 -8103 -7201 1691 10437 5264 -4463 -5478 -4309 -4332 3545 9895 3205 -6201 -9258 -7366 3614
900 3614 15617 6202 -13985 -15837 291 11229 10744 684 -16098 -15868 5822 17928 5627
913 5627 -10413 -13610 -5212 9475 13446 -1942 -13883 -6542 3774 4840 3816 -266 -7868 -5572
927 -5572 3523 2615 -1904 1732 1875 -5629 -6428 386 5495 7523 1575 -12332 -13632 5165 17588
942 17588 8439 -7005 -15748 -11217 9251 23043 7202 -18233 -18442 1191 16629 16288 -264
$$ packed form
842C714j9526M733J6526L979l607l487o382k897O405M528K50K648k912j2192j533
857i753J2624Q775p08q259j5696n127K1868K0801j0637k4051r522Q630K1122J3551
871B3618j4212k6681l156K0286J6275k06j5283j8495K600K2623R283j2019j1164
884f531j572R02Q892Q746n173r727j015J169k3P877O350o690r406l057J892J0980
900C614J2003r415k0187j852J6128J0938m85j0060j6782K30K1690J2106j2301
913E627j6040l197Q398J4687L971j5388j1941P341J0316J066j024m082p602K296
927e572R095r08m519L636J43p504p99O814N109K028n948j3907j300J8797J2423
942A7588r149j5444q743M531K0468J3792j5841k5435k09J9633J5438l41j6552
$$ plain form
955 -264 -18324 -12979 8844 16536 6794 -5031 -11424 -7072 8533 14280 1618 -8061 -5102 -1555
969 -1555 1498 7997 6616 -3430 -6732 -2604 1897 8308 9436 -2705 -12249 -5189 7120 10543
983 10543 7429 -4346 -15518 -6032 14218 15096 -1969 -12045 -8765 2125 14112 10224 -7653
996 -7653 -13611 -278 9717 7931 339 -8398 -7977 5890 11805 -1152 -10330 -3453 4360 5071 2788
1011 2788 -4685 -8289 1497 9526 1947 -6682 -4852 307 4546 5773 -2461 -10033 -2005 8189 4069
1026 4069 -3809 -4908 -4176 -176 7257 4037 -6039 -6105 529 1773 1631 2954 -1751 -5343 -1547 1011
1042 1011 -118 3088 3336 -5826 -8440 -527 4721 3921 1878 -5770 -10326 -439 10356 4586 -5541
1057 -5541 -7564 -4426 3273 9185 1319 -10962 -7063 4917 6582 1105 -3668 -6723 -1778 8779
$$ packed form
955b64j8060N345K1823P692r742j1825o393M352J5605N747j2662r679K959L547
969a555L053O499j381j0046l302M128M501O411J128j2141r544P060J2309L423
983A0543l114j1775j1172R486K0250Q78j7065j0076L280J0890J1987l888j7877
996g653n958J3333R995j786p592q737M21J3867N915j2957r178O877P813P11k283
1011B788p473l604R786Q029p579q629J830N159M239J227q234p572Q028J0194m120
1026D069p878j099P32M000P433l220j0076o6O634J244j42J323m705l592L796K558
1042A011j129L206K48r162k614P913N248q00k043p648m556R887J0795n770j0127
1057e541k023L138P699N912p866j2281L899J1980J665n477m773l055M945J0557
$$ plain form
1071 8779 6297 -6421 -8234 1124 5971 5021 559 -7192 -5636 6559 9331 -1201 -6827 -3288
1085 -3288 1746 6169 6119 -3778 -8187 821 8363 3477 -1590 -3025 -3091 2645 7843 1946 -5578 -2164
1101 -2164 3043 2229 2498 1474 -2960 -2306 3442 2525 -757 1767 1216 -3093 -831 3412 1451 513
1117 513 1748 -1350 -2566 3318 4168 -1516 -2702 960 977 1414 2452 -2538 -5036 3061 5844 -1273
1133 -1273 -4585 -1987 410 5051 6146 -3920 -10361 -1140 9124 6487 -1268 -7993 -9078 2353
1147 2353 13497 5797 -9913 -11509 -1686 7494 10951 1633 -12878 -11685 5441 12791 4222 -5787
1161 -5787 -11202 -6987 7446 12837 -106 -12083 -8575 788 7480 8544 -1859 -13168 -7791 6099
1175 6099 9588 3624 -4821 -11513 -7235 7720 12192 574 -9918 -10284 -3044 8196 13065 -220
$$ packed form
1071H779k482j2718j813R358M847r50m462p751J556J2195K772j0532n626L539
1085c288N034M423n0r897m409R008P542m886n067j435o6N736N198n897p524L414
1101b164N207q14K69j024m434O54N748r17l282K524n51m309K262M243j961r38
1117E13J235l098j216N884Q50n684j186L662J7M37J038m990k498Q097K783p117
1133a273l312K598K397M641J095j0066o441R221J0264k637p755o725j085J1431
1147B353J1144p700j5710j596R823R180L457r318j4511J193J7126P350q569j0009
1161e787n415M215J4433N391j2943j1977L508R363O692J064j0403j1309N377J3890
1175F099L489n964q445o692M278J4955M472j1618j0492l66P240J1240M869j3285
$$ plain form
1189 -220 -14854 -10988 3403 11469 9299 -2828 -15424 -9525 9490 15197 2705 -9996 -12092
1202 -12092 -3147 12073 14110 -3002 -15079 -7006 5966 11190 6991 -6140 -13606 -2415 12595
1215 12595 10358 -2301 -8721 -6721 2223 11896 7098 -6791 -9432 -207 6402 7133 2558 -6828
1229 -6828 -8486 3417 10145 3814 -3531 -4306 -3067 3474 9038 2478 -7129 -5239 2332 5777 5629
1244 5629 163 -8468 -5666 6748 9430 1466 -5139 -6771 -2996 8539 12007 -1081 -11655 -6530
1258 -6530 4123 10271 7458 -4288 -13436 -5000 9787 11030 883 -8329 -11037 -1983 12312 11409
1272 11409 -4833 -12983 -5927 4214 9695 7075 -5906 -13344 -3713 8703 8563 1270 -7204 -10768
1286 -10768 -1977 9982 7830 -4018 -8338 -5563 -660 7386 8123 -3314 -10535 -4309 3541 5670
$$ packed form
1189b20j4634L866J4391Q066k170j2127j2596N899J9015N707j2492j2701k096
1202a2092Q945J5220K037j7112j2077Q073J2972N224m199j3131p466J1191J5010
1215A2595k237j2659o420K000Q944R673m798j3889k641R225O609P31m575r386
1229f828j658J1903O728o331p345p75J239O541N564o560r607J890P571L445j48
1244E629n466q631K802J2414K682p964o605j632L775J1535L468j3088j0574N125
1258f530J0653O148k813j1746r148Q436J4787J243j0147r212k708R054J4295r03
1272A1409j6242q150P056J0141N481k620j2981p438R631J2416j40p293q474l564
1286a0768Q791J1959k152j1848m320K775M903Q046P37j1437p221O226P850K129
$$ plain form
1300 5670 3909 -2983 -9015 -3964 5156 4758 169 -2858 -5573 -3239 4991 5669 -2725 -5280 -796
1315 -796 407 852 2664 -615 -3676 -344 2172 -513 -1267 76 -1132 190 2140 -1582 -4195 1411
1331 1411 4122 -492 -2026 -127 -1561 -912 3681 1798 -2909 -1647 1612 989 1532 928 -2783 -1667
1347 -1667 3096 2031 -1308 685 925 -1856 264 4100 912 -1845 495 707 -725 1777 2808
1362 2808 -878 -1238 713 210 1094 2846 -1285 -3693 1856 4715 604 -1186 -244 -1532 -212 4718
1378 4718 3141 -2414 -2451 407 782 2503 1968 -2413 -3079 1919 2034 -642 1261 584 -3123 -932 3681
1395 3681 1071 -1411 168 -739 -2909 766 3664 400 -2161 -2696 -3037 306 5703 1658 -5155 -4282
1411 -4282 255 1346 3014 2163 -4946 -6263 2030 5456 937 -2309 -4226 -3775 1944 5758 351
$$ packed form
1300E670j761o892o032N051R120l98m589l027k715K334Q230O78q394k555M484
1315g96J203M45J812l279l061L332K516k685p54J343j208J322J950l722k613N606
1331A411K711m614j534J899j434O49M593j883m707J262L259o23N43o04l711J116
1347a667M763j065l339J993K40k781K120L836l188k757K340K12j432K502J031
1362B808l686l60J951n03Q84J752m131k408N549K859m111j790R42j288J320M930
1378D718j577n555l7K858L75J721n35m381o66M998J15k676J903o77l707K191M613
1395C681k610k482J579r07k170L675K898l264k561n35l41L343N397m045o813Q73
1411d282M537J091J668q51p109j317Q293L426m519l246j917M51N719L814n407
$$ plain form
1426 351 -4925 -2698 -649 1195 3510 1325 -4487 -3065 2124 1650 -1134 407 -1206 -2652 865
1441 865 2424 -1166 -2598 -518 -1194 -589 2786 1071 -3579 -1882 644 192 1747 2355 -2669 -4019
1457 -4019 1155 2946 -71 -907 -1148 -2412 1455 4540 -96 -4192 -1166 1795 1955 2445 -543 -4392
1473 -4392 -408 5303 2088 -2519 -1487 -158 1319 4241 1730 -5295 -3754 3938 5459 1677 -1433
1488 -1433 -4409 -2791 4661 6898 -172 -4182 -2268 321 3750 5929 -100 -6516 -2336 4027 4234
1503 4234 2331 -232 -4706 -3759 3868 6256 1885 -1810 -3964 -3576 2926 7630 1876 -4849 -3764
1518 -3764 -781 2042 5890 2467 -6344 -6252 2375 5795 2632 -1368 -5624 -4595 3857 7294 866
1533 866 -5218 -4444 -937 4206 6233 -995 -8270 -3120 4980 3941 102 -2903 -5559 -2040 4993
$$ packed form
1426C51n276K227K049J844K315k185n812J422N189m74k784J541j613j446L517
1441H65J559l590j432K080o76O05L375j715m650J697K526m52J555O08n024j350
1457d019N174J791l017q36k41j264L867L085m636m096L026K961J60M90k988l849
1473d392L984N711l215m607J032J329J477K922k511p025J541P692J521l782l110
1488a433k976J618P452K237p070m010J914K589L429K179o029o416M180O363K07
1503D234j903k563m474R47P627K388m371l695k154L88O502M704n754o725J085
1518c764K983K823L848l423q811R2Q627L420l163m000m256J029Q452L437o428
1533H66o084P74L507N143K027p228p275N150Q100j039l839l005k656L519P033
$$ plain form
1548 4993 4771 -2951 -5427 -2502 1081 4210 3639 -3674 -6109 -662 2790 1129 781 -1039 -4430 -1989
1564 -1989 3736 2085 -2236 -2019 -1052 -810 1981 1804 -2712 -2634 673 816 779 1280 -2342 -4337 1265
1581 1265 5076 521 -3785 -2355 -941 2233 5204 303 -6966 -4783 2928 6227 4405 -2319 -8791
1596 -8791 -4846 7074 9292 585 -6478 -7025 -1641 7439 9783 -645 -10864 -6401 4356 9495
1610 9495 6171 -3457 -10822 -4727 7997 9792 2302 -5632 -9013 -3221 8788 11258 -217 -9411
1624 -9411 -6844 887 7701 9002 14 -10212 -6621 4295 9539 6522 -2222 -10317 -7025 6598
1638 6598 11601 3508 -5550 -9186 -4571 6271 12026 2618 -9209 -8534 305 8129 9198 259 -10009
1653 -10009 -7601 4093 9317 4517 -3080 -8342 -5740 5091 9573 927 -6459 -5597 -1366 3499
$$ packed form
1548D993k22p722k476K925L583L129n71p313k435N447L452j661l48j820l391K441
1564a989N725j651m321K17R67K42K791j77m516P8L307J43l7N01l622j995N602
1581A265L811m555m306J430J414L174K971m901p269K183P711L299j822o724o472
1596h791L945J1920K218q707p063n47N384R080K344j0428j0219M463J0757N139
1610I495l324r628p365O095J2724J795p490p934l381N792J2009K470j1475r194
1624i411K567P731O814J301q988j0226L591J0916N244l017q744q095L292J3623
1638F598N003q093r058l636M615J0842N755r408j1827O75Q839P824J069q939j0268
1653a0009K408J1694N224m800p597n262K602J0831M482q646p386Q62M231M865
$$ plain form
1667 3499 5682 461 -6591 -3770 1741 2455 1214 -473 -3401 -2401 2082 1719 -1824 -1109 616 -1107
1683 -1107 -1152 273 -1158 -1592 2151 1400 -2827 -2352 37 233 1772 1782 -2661 -3999 -144 2779 1635
1700 1635 868 -1674 -4950 -1755 4240 3881 -880 -3189 -3531 -1143 4626 5810 -1662 -6394 -3361 1775
1716 1775 5735 5093 -2610 -8550 -3238 6188 6775 1433 -5242 -8186 -1817 9116 8415 -2404 -9055
1731 -9055 -5581 2866 9835 6949 -4741 -11210 -2860 7644 8745 3150 -5522 -10248 -2126 9371
1745 9371 8514 -447 -5942 -6742 -1095 7916 8840 -706 -7439 -5020 736 6031 7577 514 -8245 -6105
1761 -6105 2301 6503 5697 233 -7361 -6994 3863 9521 4210 -3378 -7146 -4493 4545 10008 2647
1776 2647 -6852 -6220 -181 5727 6636 475 -7643 -5614 3448 6118 2392 -2063 -4428 -3528 2977 5391
$$ packed form
1667C499K183n221p052K821N511P14j241j687k928J000M483l63l543P15J725j723
1683a107m5J425j431m34L743p51m227M75K389J96J539J0m443j338L855K923j144
1700A635p67k542l276L195N995l59m761k309l42K388N769J184p472m732L033N136
1716A775L960o42p703n940N312R426N87n342o675k944O369J0933p01j0819o651
1731i055L474Q447O969k886j1690o469Q350J0504J101n595q672m726Q122J1497
1745I371q57q961n495q00N647R011R24r546o733K419N756N295J546p063q759K140
1761f105Q406M202q06n464p594L67J0857N658n311p588l768K653R038N463p361
1776B647r499O32O039N908R09o161q118K029R062K670l726m455k365R00O505K414
$$ plain form
1792 5391 304 -3467 -1764 -906 32 2578 817 -2479 -1736 -393 -1656 -514 2294 211 -2472 -1551
1808 -1551 -671 -268 2303 1883 -3171 -3374 420 1705 560 -127 -1768 -2742 496 2111 -764 -1730 861
1825 861 73 -1480 -547 -327 -348 1717 1729 -3351 -3945 1792 3915 1844 -1526 -4682 -3934 3045 6679
1842 6679 400 -5874 -4522 405 5115 5486 -1611 -7827 -3225 5057 5917 1420 -3715 -5623 -1193
1857 -1193 6059 5270 -2079 -4923 -2056 1629 3974 3501 -1631 -4428 -647 2877 2138 2213 798 -2648
1873 -2648 -2567 1297 3111 2222 1009 -2424 -4212 745 5733 3175 -1758 -3521 -2515 1833 6370 2580
1889 2580 -5168 -4729 1778 5261 3254 -1070 -5427 -2965 5147 6138 -1192 -5382 -2890 1976 5505
1904 5505 3420 -4173 -6716 624 6199 3205 -1757 -3869 -2643 2273 5194 -16 -4810 -2461 1933
$$ packed form
1792E391n087l771J703Q58R38K546j761l296P43J343j263J142K808k083k683R21
1808a551Q80M03K571m20n054k03L794J285j145o87j641r74L238J615k875r66K591
1825H61p88j553R33K20k1K065J2n080n94N737K123k071l370l156P48O979L634
1842F679o279o274J352M927M710L71p097o216M602Q282Q60m497n135j908M430
1857a193P252p89p349k844K867L685K345m73n132k797L781L524p39P5j415l446
1873b648Q1L864J814q89j213l433j788M957M988k558m933j763J006M348M537l790
1889B580p748M39O507L483k007m324m357K462Q112R91p330m190K492M866L529
1904E505k085p593k543P340N575k994m962k112J226M916K921n210m794K349M394
$$ plain form
1919 1933 2697 753 -1690 -3444 -51 4055 776 -3328 -2269 626 1119 1638 386 -2870 -1823 1636
1935 1636 870 -832 137 -311 -1902 -1109 767 266 1132 1042 -3080 -4202 769 4669 1298 -2209 -3925
1952 -3925 -2942 2653 6324 444 -6994 -5038 1941 5366 3999 -2670 -7904 -2750 6351 6000 -1829
1967 -1829 -6144 -4210 1793 6715 3815 -5552 -7056 66 5600 3665 -962 -4836 -3866 2357 5276
1982 5276 281 -3243 -1342 576 900 1214 95 -1409 963 1932 -1428 -2264 1602 2685 745 -680
1998 -680 -1940 -1057 2974 4183 -999 -4215 -403 2631 2584 1061 -2153 -2736 1601 4614 209 -3384
2014 -3384 -793 1518 2589 1822 -1692 -3756 1209 5004 1437 -3296 -2801 217 2952 3274 -1063 -4962
2030 -4962 -620 4423 2678 -1910 -2870 -1110 1922 4441 416 -5464 -3168 3488 3721 -343 -3127
$$ packed form
1919A933P64j944k443j754L393M106l279m104J059K895M93N19j252l256J047L459
1935A636p66j702R69m48j591P93J876n01Q66r0m122j122M971L900l371l507j716
1952c925R83N595L671n880p438J956O979L425j367o669n234N154R101l51p829
1967a829m315J934O003M922k900r367j504P122N534j935m627l874R70O223K919
1982E276m995l524J901J918L24L14j119j504K372R69l360q36L866J083j940j425
1998f80j260Q83M031J209n182l216L812L034m7j523l214n83M337L013m405l593
2014c384K591K311J071p67l514k064M965L795l567m733M95L018K735L22m337l899
2030d962M342N043j745m588r60J760L032K519m025n880K296O656K33m064k784
$$ plain form
2045 -3127 -3143 681 5059 2303 -3838 -3507 1162 2934 1444 -853 -3323 -1793 3496 3087 -2363 -3976
2061 -3976 445 2540 1196 -1303 -3387 -982 4188 2956 -3222 -4110 -1148 2559 3083 379 -4875
2076 -4875 -4742 2749 5747 -388 -5210 -3416 783 3797 2584 -3103 -5571 -853 4017 2792 -575
2091 -575 -3371 -3456 1010 4690 732 -4106 -1739 1753 620 -563 329 -462 -74 -37 -1077 -1061 2155
2108 2155 2359 -1092 -2748 -1561 927 4852 3768 -3751 -7904 23 7981 5291 -2642 -6945 -3835
2123 -3835 4148 8741 2552 -6949 -6793 1250 7996 6472 -2395 -9691 -3656 8067 8481 -446 -6785
2138 -6785 -5014 1218 7089 5356 -2975 -6791 -1376 4343 4481 731 -3231 -3537 1694 3638 47
2153 47 -1463 515 57 -1345 432 1662 480 -291 -446 -1575 -322 2656 2203 -1126 -2666 -1179
$$ packed form
2045c127j6L824M378k756o141L31M669J772j490k297k470J530N289m09n450j613
2061c976M421K095j344k499k084K405N170j232o178q88K962L707N24k704n254
2076d875J33P491K998o135m822J794M199L014j213n687k468M718M870j225l367
2091e75k796q5M466L680l958m838K367L492j133j183Q92p91L88L7j040J6L216
2108B155K04l451j656J187K488L925j084p519m153P927P958k690p933m303L110
2123c835P983M593o189r501J56Q043O746j524q867p296O035J1723M14q927o339
2138f785J771O232N871j733q331l816N415N719J38l750l962l06N231J944l591
2153D7j510J978m58j402J777J230j182p71j55j129J253K978m53l329j540J487
$$ plain form
2169 -1179 1594 4115 699 -5069 -3418 4146 5143 -398 -4523 -4036 372 5488 4958 -3394 -7732 -2072
2185 -2072 5710 6262 -449 -7149 -6184 3582 7868 944 -6273 -5135 564 4950 4407 -2206 -7846 -2846
2201 -2846 5766 5016 -1652 -5616 -3592 2662 5674 888 -5777 -4366 1773 4224 1857 -1231 -4577
2216 -4577 -3110 2712 4370 -534 -3146 -1313 -74 359 1170 840 -745 -812 -1226 -1605 1438 3302 -91
2233 -91 -2880 -1980 287 2554 3661 -993 -5906 -3126 4587 6318 210 -5237 -5243 787 7220 4989
2249 4989 -4078 -6863 -1440 4979 6387 1494 -6562 -6352 3023 8084 2516 -4211 -4563 -236 4487
2264 4487 4688 -742 -4286 -989 2962 2221 -236 -1253 -923 1736 3023 -1062 -3656 419 3937 1720
2280 1720 -1538 -2497 -558 2349 3822 -337 -4223 -1673 2800 3389 458 -2297 -3710 168 4267
$$ packed form
2169a179K773K521l416n768J651P564R97n541m125M87M408N116n30q352m338N660
2185b072P782N52o711o700R65R766M286o924p217J138N699M386n43o613n640N000
2201b846Q612p50o668l964K024O254L012m786o665J411O139K451k367l088l346
2216d577J467N822J658m904k612J833J239M33Q11l30j585o7m14l79L043J864l393
2233i1k789R00K267K267J107m654m913K780P713J731o108n447oO030O433k231
2249D989r067k785N423O419J408m893q056K10R375N061n568o727l52M327M723
2264D487K01n430l544L297L951p41k457j017L30K659J287m085k594M075L518k217
2280A720l258r59J939K907J473m159l886K550M473N89k931k755j413L878M099
$$ plain form
2295 4267 1795 -2723 -2573 584 1210 1236 142 -2174 -1460 1653 1377 -1423 -889 905 608 -532 -1055
2312 -1055 -991 1102 3356 -215 -4426 -2392 2564 3492 925 -2498 -5349 -1489 5112 4436 -2551 -5629
2328 -5629 -2369 2618 4688 1077 -5217 -4722 2093 4491 773 -2869 -3285 -966 3503 3656 -2540 -5023
2344 -5023 -562 3693 2353 -1110 -3332 -2252 2047 3864 -262 -3873 -1796 1540 2268 1143 -1340
2359 -1340 -3217 242 3226 971 -2631 -1098 806 1349 1124 -1044 -2326 -117 2550 840 -1345
2374 -1345 -1193 -3 110 1464 87 -1485 -57 1575 -334 -1680 402 2060 1153 -215 -1371 -1792
2390 -1792 1854 4357 664 -3920 -2539 1137 4315 3686 -1858 -5761 -1653 5542 5343 -809 -4393
2405 -4393 -3908 1554 6381 3874 -3673 -5638 -369 4728 4257 105 -4793 -4034 2169 5274 1309 -2586
$$ packed form
2295D267k472m518J50L157O26K6j094k316P14L113k76k800N34J794k97j140n23
2312a055O4K093K254l571m211K034M956R28k567l423k851L860O601o76o987l078
2328e629L260M987K070l611o294M95O815K398l718l642m16K319M469J53o196k483
2344e023M461M255j340l463k222J080M299J817m126l611K077L336P28j125k483
2359a340j877L459K984k255l602J533J904N43k25k168j282K209K667j710k185
2374a345J52J190J13J354j377j572J428J632j909j346K082J658r07j368j156m21
2390a792L646K503l693m584J381L676L178o29n544l903M108P195j99o152l584
2405d393M85N462M827k507p547j965N269N097m71m152m898P59O203L105l965l895
$$ plain form
2421 -2586 -2677 -1549 1291 3272 776 -2551 -1390 375 86 516 1155 155 -1662 -1167 -866 460 2728
2438 2728 1447 -2692 -3780 284 2680 2373 166 -3568 -3656 1399 4718 974 -3071 -3391 -661 2397
2454 2397 2940 -877 -4266 -1694 1946 2007 139 -1572 -2216 -639 2443 1000 -1675 -1148 254 -50
2470 -50 -373 23 -272 145 891 -882 -2589 -372 2278 967 -838 -2421 -1877 911 3911 1513 -3524
2487 -3524 -3409 365 2616 2468 -200 -3624 -2355 1972 3287 -416 -2067 -1640 -578 1979 1823 -1320
2503 -1320 -2285 600 1481 -45 -358 -38 -99 802 1058 -852 -1296 1553 1766 -713 -945 -380 468 2082
2521 2082 1858 -1524 -2211 881 2781 1282 -69 -1659 -1257 1653 3416 675 -2479 -1685 686 1833
2537 1833 2168 258 -2468 -1418 1361 1899 271 329 -597 -1817 -13 1504 747 556 323 -2024 -2131
$$ packed form
2421b586r1J128K840J981k496l327J161J765k89M30O39j000j817M95L01J326K268
2438B728j281m139j088M064K396l07k207l734q8N055L319l744m045l20K730L058
2454B397N43l817l389K572L640O1j868j711o44J577L082j443k675N27J402l04
2470e0l23L96k95M17P46j773j707K217K650j311j805j583N44K788L000k398n037
2487c524J15L774K251j48k668l424J269M327J315l703j651M27J062K557j56l143
2503a320r65K885Q81j526l13L20o1R01K56j910m44K849K13k479k32N65Q48J614
2521B082k24l382o87L092J900j499j351j590M02K910J763k741l154P94K371J147
2537A833L35j910k726J050K779N38j628N8r26j220J804J517p57j91k33k347j07
$$ plain form
2554 -2131 1601 3428 919 -2037 -2696 -1763 2090 4945 614 -4349 -3404 696 3756 3385 -750 -5766
2570 -5766 -3133 3131 4799 1236 -3166 -4775 -1545 4437 4839 -1154 -5068 -2646 1060 3020 2672
2585 2672 -1558 -4679 -1721 2508 2629 572 -1432 -3090 -1833 1813 2363 -61 -1373 -1974 -1544 1047
2601 1047 2899 111 -2405 -2366 -375 821 2388 961 -2719 -2670 350 2145 1360 -259 -2090 -2288
2617 -2288 1686 3271 359 -2320 -1778 -153 1733 2085 -110 -3237 -1090 2138 1727 176 -582 -1118
2633 -1118 -331 1711 1076 -1694 -781 625 557 349 -109 -595 -106 1861 830 -1713 -1173 1187 1623 1193
2651 1193 -208 -2398 -1596 2290 2991 165 -1614 -1578 -92 2368 2994 -319 -2671 -810 1575 1979
2667 1979 1767 10 -2545 -1503 2160 2492 534 -579 -1870 -1573 1264 3309 930 -1650 -1899 -1377
$$ packed form
2554b131L732J827k509k956o59R33L853K855m331m963R45M100L060l71m135n016
2570e766K633O264J668l563m402j609L230N982M02n993l914K422L706J960l48
2585B672m230l121K958M229J21k057k004j658J257L646N50k424j312o01M30K591
2601A047J852k788k516L9J991J196J567j427l680M9L020J795p85j619j831j98
2617b288L974J585k912k679N42J625J886L52k195l127K147L228m11j551p58n36
2633a118P87K042o35k770R13J406o8k08m58m86M89J967j031k543N40K360M36m30
2651A193j401k190Q02L886P01k826j779L6J486K460O26l313k352J861K385M04
2667A979k12j757k555J042L663L32j958j113j291K97K837K045k379k580k49N22
$$ plain form
2683 -1377 1295 3744 1760 -2884 -3309 -209 2606 3397 812 -3632 -4604 723 4530 2486 -1676 -4488
2699 -4488 -3664 1696 5423 2273 -3462 -4198 -1401 2272 4606 1201 -4257 -4377 793 3244 1990 -442
2715 -442 -2964 -3103 334 3287 1188 -1244 -2060 -1100 417 2182 1041 -1556 -1691 -815 -163 1074 1770
2732 1770 -888 -3044 -663 1226 1309 690 -822 -2811 -1445 2185 2489 187 -1845 -2432 -397 2818
2748 2818 2754 -1319 -2908 -979 924 1892 1579 -635 -2766 -709 2126 1143 -822 -762 -495 433 1541
2765 1541 296 -1417 117 1281 346 -151 67 -491 8 1371 437 -1476 -236 1420 792 -218 -185
2782 -185 -456 278 1210 140 -973 167 1268 -104 -245 184 -408 -215 1542 936 -1017 -260 1360
2799 1360 735 -96 130 42 369 1259 -10 -1375 179 1371 717 -294 -712 -1392 -83 2756 1872 -2091
$$ packed form
2683a377K672K449j984m644m25L100K815P91k585m444r72N327L807k044m162k812
2699d488Q24N360L727l150n735p36K797L673K334l405n458j20N170K451j254k432
2715d42k522j39L437K953k099k432q16R60J517J765j141k597j35Q76O52J237O96
2732A770k658k156K381J889Q3o19j512j989J366L630L04k302k032n87K035L215
2748B818o4m073j589J929J903R68l13k214k131K057K835r83j965O0K67R28J108
2765A541j245j713J534J164r35m97K18n58M99J363r34j913J240J656o28j010L3
2782a85k71P34R32j070j113J140J101j372j41M29n92J93J757o06j953P57J620
2799A360o25q31K26q8L27Q90j269j365J554J192o54j011m18o80J309K839q84l963
$$ plain form
2817 -2091 -3220 -96 2432 2486 171 -2883 -3076 982 3612 1568 -1416 -3523 -2335 1810 4514 865
2833 865 -3618 -2872 313 1632 2228 634 -2416 -2766 318 1985 1415 410 -2043 -2999 183 2432
2849 2432 1359 12 -1664 -3023 -1269 3280 3300 -1059 -3953 -2532 697 3006 3035 -1649 -4466 -2137
2865 -2137 2317 3555 1529 -2690 -4824 -616 4670 3246 -1544 -3297 -1860 493 3031 2272 -2301
2880 -2301 -3415 -141 1916 1802 52 -1758 -1619 1442 2241 -402 -1638 68 271 291 1484 20
2896 20 -1687 -896 1101 725 240 434 -396 -730 839 827 612 274 -447 -1475 484 2284 978 -1538
2914 -1538 -1053 -32 1111 2084 889 -1800 -2025 1388 2791 1188 -615 -2630 -1262 2747 3590 -650
2930 -650 -3721 -1457 1426 2676 2091 -1661 -4251 -727 3909 3131 -411 -3369 -2491 592 4053 2205
$$ packed form
2817b091j129L124K528N4k315l054j93M058K630k044k984k107J188M145K704l649
2833H65m483P46L185J319N96j594l050l50L084J667n70j005k453r56L182K249
2849B432j073j347j676j359J754M549K0m359k894J421L229K309K9m684k817K329
2865b137M454J238k026m219k134M208N286j424m790j753J437K353K538p59m573
2880b301j114L274K057j14j750j810J39L061P99k643j236J706K03K0J193j464
2896B0j707P91J997l76m85J94q30l34J569j2k15l38p21j028J959J800j306k516
2914a538M85J021J143R73j195k689k25L413J403j603j803k015J368M009Q43m240
2930f50l071K264K883J250n85l752k590L524M636p78l542k958Q78L083L461j848
$$ plain form
2946 2205 -2205 -2883 -504 1635 2197 1365 -2209 -2892 26 2158 543 -254 -899 -1339 -515 1814 1158
2963 1158 -964 -1112 -984 -330 1551 1955 -722 -2482 -1007 523 1312 1419 -1204 -3272 -1150 2770
2979 2770 2535 -587 -2679 -2594 273 3198 2410 -2414 -3264 -1231 1791 2810 1156 -2959 -3854 649
2995 649 3046 886 -1665 -2368 -1248 1483 2692 168 -2580 -1176 734 1258 581 -102 -1609 -554
3011 -554 1505 339 -1021 -33 275 -272 -26 446 -458 -245 1017 380 -649 110 464 -91 734 535
3029 535 -143 -226 271 -67 -300 919 649 -997 -834 255 942 1387 1145 -1192 -2522 525 3035 1802
3047 1802 -566 -2550 -2163 1362 3971 1742 -2786 -2980 -319 2118 3300 570 -3698 -2949 1780 3813
3063 3813 1344 -1417 -2491 -1266 2250 3039 210 -2476 -1484 123 1582 1972 -269 -2320 -834 1245
$$ packed form
2946B205m410o78K379K139N62q32l574o83K918K132j615p97o45m40Q24K329o56
2963A158k122j48J28O54J881M04k677j760J475J530P89J07k623k068K122L920
2979B770k35l122k092Q5K867K925p88m824q50K033L022J019j654m115q95M503
2995F49K397k160k551p03J120K731J209k524k748J404J910N24o77o83j507J055
3011e54K059j166j360R88L08n47K46M72r04K13J262o37j029P59L54n55Q25j99
3029E35o78q3M97l38k33J219k70j646J63J089O87M45k42k337j330L047K510j233
3047A802k368j984L87L525K609k229m528j94K661K437J182k730m268P49M729K033
3063C813k469k761j074J225L516P89k829k686R92J607J459L90k241k051J486K079
$$ plain form
3079 1245 938 73 302 -807 -1200 298 1362 194 -195 -350 -1305 -417 1353 943 -1042 -938 -539 -328
3097 -328 1176 1257 -1399 -1949 184 1203 248 240 -935 -1224 346 1172 -358 -1565 -587 8 530 380
3115 380 -584 -1935 37 1721 -62 -1510 -968 134 817 987 -448 -2325 -1008 1783 1072 -565
3131 -565 -1326 -1251 231 2168 1027 -1918 -1824 266 917 1334 285 -1688 -1600 995 2292 197 -1142
3148 -1142 -748 -743 659 1621 395 -1473 -536 236 372 1099 982 -817 -1265 47 545 708 1027 -270
3166 -270 -1747 -503 1867 1412 -11 -1028 -1566 -530 2296 2089 -794 -2175 -598 994 2004 1643
3182 1643 -1089 -2333 -202 2264 1378 201 -819 -1578 -60 1871 1144 -980 -994 126 -364 422 1020
3199 1020 -169 -456 107 -533 -637 1021 1251 -487 -1486 -559 -260 768 1652 -255 -2193 -941 1371
$$ packed form
3079A245l07q65K29j109l93J498J064j168l89j55r55Q88J770m10j985J04L99K11
3097c28J504Q1k656n50K133J019r55qj175k89J570Q26j530j207R78N95N22j50
3115C80r64j351J972J684j783j448N42J102O83J70j435j877J317K791p11j637
3131e65p61P5J482J937j141k945R4K090O51M17j049j973Q8K595J297k095j339
3148a142L94NJ402R62j226j868R37P72J36P27j17j799m48J312M98J63L19j297
3166b70j477J244K370m55j423j017n38J036K826k07k883j381J577J592J010l61
3182A643k732j244K131K466q86j177j020p59J518J931p27k124j4J120m90P86N98
3199A020j189k87N63o40j04J658K30j738r99R27K99J028Q84j907j938J252K312
$$ plain form
3216 1371 1479 867 -504 -2350 -953 1736 1755 -390 -1477 -1252 -91 1477 1654 -1019 -1984 -403 506
3233 506 565 372 -519 -1733 -597 582 397 -182 113 -941 -1391 221 1043 164 -596 -384 -888 -277 1232
3252 1232 694 -1061 -1141 33 -27 779 847 -1305 -1217 342 929 74 -357 -290 -459 864 833 -675 -1090 317
3272 317 487 376 -394 -765 -436 1003 1206 -340 -1462 -46 722 1246 583 -764 -2181 99 2429
3289 2429 1336 -607 -1459 -1159 696 2324 1299 -1819 -1853 629 1315 1488 209 -1455 -1731 451 2638
3306 2638 1079 -472 -957 -1416 413 2571 1515 -1432 -1875 -261 903 2187 1638 -1819 -2854 -366
3322 -366 2128 2134 793 -1804 -2972 383 3179 1987 -1027 -2495 -1642 721 3370 1937 -2434 -3195
3338 -3195 -379 2427 2792 605 -2512 -3368 575 3271 1619 -1264 -2364 -1831 584 3127 1469 -2623
$$ packed form
3216A371J08o12j371j846J397K689J9k145j087K25J161J568J77k673r65J581R09
3233E06N9j93q91j214J136J179j85n79K95j054m50J612Q22q79p60K12n04O11J509
3252A232n38j755q0J174o0Q06O8k152Q8J559N87q55m31O7j69J323l1j508m15J407
3272C17J70j11p70l71L29J439K03j546j122J416P68N24o63j347j417K280K330
3289B429j093j943q52L00J855J628j025l118l4K482O86J73j279j664k76K182K187
3306B638j559j551m85m59J829K158j056k947m43J614J164J284n49l457j035K488
3322c66K494Oj341k597j168L355K796j192l014j468Q53K363K649j433m371p61
3338c195K816K806L65k187l117q56L943K696j652k883j100N33K415K543j658m092
$$ plain form
3354 -2623 -2528 -282 1669 1770 549 -2009 -2179 540 1579 739 9 -941 -1821 141 1622 345 -1187
3371 -1187 -710 -186 -11 891 609 -776 -822 231 142 150 149 -691 -720 653 1176 -720 -952 249 -69 417
3391 417 682 -1022 -1815 110 1263 692 -957 -1254 -1118 645 2006 500 -1685 -1659 595 1381 1637
3408 1637 31 -2643 -2379 1499 2763 538 -1601 -2004 -1125 1846 2845 157 -2123 -1630 681 1974
3424 1974 2261 -314 -3027 -1521 1905 2411 737 -790 -2021 -1038 1660 2710 187 -1809 -1693 -530
3440 -530 1745 2286 264 -2138 -1445 937 1768 1673 440 -2322 -1885 1517 2452 777 -1209 -1856 -1060
3457 -1060 1276 2558 429 -1922 -1632 -215 1609 2146 370 -2463 -2033 1114 1662 733 -440 -1635
3473 -1635 -1603 1249 1525 -24 -987 -1121 -573 582 1066 28 -1230 -739 189 -211 -239 532 -333 -749 51
$$ packed form
3354b623R5K246J951J01j221k558j70K719J039q40p30r50q80J962J481j277j532
3371a187M77N24J75R02k82j385m6J053q9Qjq40k9J373N23j896k32J201l18M86
3391D17K65j704p93J925J153n71j649k97J36J763J361j506k185K6K254P86K56
3408A637j606k674K64L878J264k225k139m03Q79K971R99k688k280M93K311J293
3424A974K87k575k713J506L426N06j674j527j231R83K698J050k523j996J16J163
3440e30K275N41k022k402O93K382Q31r5j233k762M37L402R35j675j986o47P96
3457a060K336J282k129k351K90J417J824N37j776k833M30L147N48r29j173j195
3473a635L2K852K76j549r63j34N48J155M84j038j258M91R28m00k8P71q65m16Q00
$$ plain form
3492 51 -1 -310 -31 715 -702 -1046 -52 17 164 459 -502 -1265 -35 891 433 23 61 -1260 -926 866
3512 866 906 -360 -477 -926 -1232 334 1484 395 -917 -1039 -634 447 1636 1300 -1444 -1741 -216
3529 -216 1131 1034 960 -1658 -2907 -190 2451 1919 -345 -1927 -1610 256 2724 2000 -1204 -1928 -834
3546 -834 892 2398 1572 -1209 -2297 -203 1767 1790 732 -702 -2146 -907 1478 2161 525 -1025
3562 -1025 -1847 -1205 1324 2460 572 -1321 -1239 -732 1478 2655 845 -1902 -1831 318 1602 2262 694
3579 694 -1973 -2040 636 2353 1436 -276 -1975 -2037 496 2428 925 -1166 -1096 -777 245 1716 1404
3596 1404 -932 -1654 -624 581 885 929 -360 -1613 -1298 639 1155 920 -46 -1920 -1691 768 1744
3613 1744 386 -956 -1395 -1484 442 2211 491 -1785 -1734 -127 1158 1282 -106 -1396 -1334 425 1044
$$ packed form
3492E1n2l09K79P46j417l44R94O9J47K95r61p63J230R26m58m10L8j321L34J792
3512H66M0j266j17m49l06J566J150j089j312j22M05J081J189l36k744k97J525
3529b16J347r7p4k618j249K717K641n32k264j582L17J866K468p24l204p24J094
3546h34J726J506q26k781j088K094J970K3j058j434j444J239K385O83j636j550
3562a025q22O42K529J136j888j893Q2N07K210J177j810k747P1K149J284O60j568
3579F94k667o7K676J717r17j712j699o2K533J932j503k091P0L19J022J471l12
3596A404k336p22J030J205L04M4j289j253L15J937N16k35r66j874K29K459R76
3613A744j358j342m39q9J926J769j720k276N1J607J285J24j388j290O2J759O19
$$ plain form
3630 1044 686 54 -1050 -1513 -159 1196 618 -256 -51 -694 -1054 344 1067 596 -335 -1064 -1243 303
3648 303 2066 795 -1130 -1121 -1144 79 2060 1670 -1514 -2172 -344 1413 1518 567 -1506 -2175 -560 1789
3666 1789 1641 53 -1625 -2078 -843 2019 2512 -126 -1653 -2014 -739 1766 3211 775 -2495 -2904
3682 -2904 -360 2370 3301 292 -2968 -3071 624 3517 2462 -514 -3799 -2991 1730 4711 1910 -2430
3698 -2430 -3452 -1457 2095 3884 1130 -2829 -3397 -194 2799 3267 446 -2986 -2805 715 2842 1919
3714 1919 -115 -2215 -2533 267 3100 2393 -666 -2310 -1749 181 2757 2147 -866 -2911 -1447 878
3730 878 2612 2097 -878 -3224 -1278 1958 2250 836 -1493 -2243 -970 1671 1913 -113 -1598 -1327
3746 -1327 -446 928 1154 -271 -987 -200 162 -318 296 501 -359 -687 -685 -328 455 1467 412 -1383 -1533
$$ packed form
3630A044l58o32j104m63J354J355n78q74K05o43l60J398P23m71r31p29j79J546
3648C03J763j271j925Rk3J223J981l90l184o58J828J757J05r51k073o69J615K349
3666A789j48j588j678m53J235K862M93k638j527l61J275K505J445k436l270m09
3682b904K544K730R31l009l260j03L695K893j055k976l285Q08M721K981k801m340
3698b430j022J995L552J789k754l959n68L203K993M68k821l432J81L520K127r23
3714A919k034k100l18K800K833p07l059j644N61J930K576o10l013k045J464K325
3730H78J734n15k975k346J946L236K92j414k329p50J273K641K42k026j485K71
3746a327Q81J374K26j425p16P87L62m80O14K05q60l28KL57P83J012j055j795j50
$$ plain form
3765 -1533 113 1179 1318 139 -1904 -2039 594 2245 802 -711 -1661 -1609 757 2269 825 -1509
3781 -1509 -1894 -580 1149 1770 643 -995 -2135 -818 924 1432 557 -988 -2337 -641 1597 1803
3797 1803 273 -949 -2173 -849 2325 3137 172 -2006 -2219 -293 2436 2811 -214 -2895 -1555 1301
3813 1301 2498 2042 -844 -2928 -1151 2109 2638 246 -1511 -1732 -217 1971 2291 143 -1598 -1392
3829 -1392 155 1309 1715 262 -1158 -1309 228 714 1304 1034 -562 -2078 -572 1527 1601 646 -1060
3846 -1060 -2037 -266 2192 2272 -112 -1867 -1569 -55 2487 1967 -1013 -2650 -840 921 1625 1225 -917
3863 -917 -1921 -888 1470 1295 538 -944 -1300 -899 784 1300 202 -636 -1057 -1279 -58 1960 927
3880 927 -911 -1442 -1187 560 1787 1146 -1755 -2889 -533 2079 1924 70 -1914 -2371 595 2388
$$ packed form
3765a533J646J066J39j179k043j35K633J651j443j513r50N2K366J512j444k334
3781a509l85J314J729O21j127j638j140J317J742N08q75j545j349J696K238K06
3797A803j530j222j224J324L174Q12k965k178k13J926K729L75l025k681J340K856
3813A301J197m56k886k084J777L260N29k392j757k21J515K188L20k148j741K06
3829a392J547J154M06j453j420j51J537M86N90k70j596j516J506K099P4r55j706
3846a060r77J771K458Q0k384j755K98J514K542n20k980j637J810J761P04m00k142
3863i17j004J033K358j75p57j482l56M01J683N16j098q38m21k22J221K018j033
3880I27j838n31K55J747J227o41k901j134K356K612j55j854j984m57K966J793
$$ plain form
3896 2388 1380 -1346 -2016 -926 814 2255 764 -1959 -1506 156 959 817 262 -671 -1136 399 724
3913 724 84 -200 187 -714 -472 493 555 645 422 -190 -1108 -245 1214 676 -346 -1011 -914 243 1553 1039
3933 1039 -1193 -1238 163 806 1122 226 -782 -994 535 1066 454 -204 -309 -733 98 781 460 -40 144
3952 144 -467 -521 203 1531 747 -436 -1030 -916 563 2038 898 -1371 -1894 -195 1771 1968 291
3969 291 -2028 -2368 971 2646 1538 -1099 -1797 -904 1321 2367 400 -1681 -1496 406 1318 964 -98
3986 -98 -1706 -984 882 985 41 -447 -198 -588 -101 490 20 -476 -97 -564 -1008 262 883 169 -478
4005 -478 -861 -696 536 1669 160 -1430 -1184 116 736 609 -221 -1861 -1156 757 984 -260 -511
4022 -511 -759 -496 302 593 -275 -301 216 172 -622 -286 661 587 -28 -695 -880 378 1841 924 -1141 -1966
$$ packed form
3896B388j008k726o70J090J740J441j491k723M53J662Q03j42n55r33m65J535L25
3913G24o40k84L87r01K42R65O2R0k23o12r18Q63J459n38j022o65R7J157J310n14
3933A039k232m5J401O43L16q96j008k12J529N31o12o58j05m24Q31O83l21n00J84
3952A44o11n4P24J328p84j183n94J14J479J475j140k269n23J699J966J97j677
3969B91k319l40L339J675j108k637o98Q93K225J046j967k081J85J902R12l54j062
3986i8j608P22J866J03r44m88K49l90M87N91m70m96L79m67m44J270O21p14o47
4005d78l83J65J232J133j509j590K46J300O20j27q30j640P05J913K27j244k51
4022e11k48K63P98K91q68k6N17m4p94L36R47p4o15o67j85J258J463r17k065q25
$$ plain form
4042 -1966 -189 1198 2020 368 -2041 -2178 698 2669 1365 -1000 -2295 -1210 1444 2777 62
4057 62 -2125 -1684 390 1570 1307 -509 -1704 -924 1104 1274 70 -595 -887 -198 970 1316 47
4074 47 -161 -67 -511 -167 1108 912 -384 -684 -500 -402 708 1417 -409 -1410 -501 451 745 444 -642
4093 -642 -1099 231 1187 620 -467 -690 -282 353 1062 -4 -771 -102 941 351 -691 -501 283 435
4111 435 609 -83 -1385 -150 1457 1213 -585 -1470 -1127 723 2199 1103 -1912 -2264 555 2088 1452
4128 1452 -463 -2523 -1995 1224 2773 682 -1741 -2433 -414 1764 2124 32 -2106 -1778 143 990
4144 990 928 -6 -1499 -1337 328 1270 642 -281 -1153 -1424 -57 1635 1094 -589 -1551 -1134 523 2027
4162 2027 1513 -1326 -2681 -632 1388 2201 577 -1793 -2262 532 2386 845 -1138 -1985 -1136 1160
$$ packed form
4042a966J777J387Q22j652k409j37K876J971j304k365j295J085K654J333k715
4057F2k187M41K074J180k63j816j195P80K028J70j204o65k92O89J168L46j269
4074D7k08R4m44L44J275j96j296l00J84R8J110P09j826j001R09R52K94l01j086
4093f42m57J330R56n67j087k23M08O35P09j066p67O69J043n90j042J90P84J52
4111D35J74o92j302J235J607k44j798q85L43J850J476j096l015l52K819J533o36
4128A452j915k060N28L219J549k091k423o92K019K178L60k092k138L28J921Q47
4144I90o2r34j493J62J665R42o28r23q72k71J367J692n41j683r62M17J657J504
4162B027n14k839j355K049K020Q13j624k370m69K794J854j541j983q47Q49K296
$$ plain form
4178 1160 2281 615 -1942 -1355 764 1382 669 -535 -1688 -163 1272 714 -875 -845 197 734 754
4195 754 -371 -1229 -596 1687 1073 -195 -886 -335 418 990 632 -1001 -1122 382 1154 526 -487 -496 -993
4214 -993 661 1417 19 -333 -664 -46 108 798 652 -382 -1085 -130 161 946 1294 -606 -1748 -425
4232 -425 1563 1771 534 -1204 -2405 -554 2560 2536 -784 -2674 -2005 912 3067 1650 -2004 -3260
4248 -3260 -733 2234 2497 590 -2603 -2885 230 2787 1547 -1307 -1962 -1177 863 1959 614 -1786
4264 -1786 -1745 114 846 1160 413 -1107 -1395 -205 942 688 -62 -271 -1344 -562 857 1315 404 -911
4282 -911 -1217 -680 928 1751 168 -1345 -1214 -249 1076 1329 -47 -1796 -1143 857 1603 564 -427
4299 -427 -985 -603 609 910 66 -445 -251 -175 -167 602 283 -280 -140 -9 -1164 199 1474 714 -956
$$ packed form
4178A160J121j666k557N87K119O18p13j204j153J525J435n58j589L0J042N37K0
4195G54j125q58O33K283o14j268o91N51P53N72l58j633j21J504P72o28j013rm97
4214i93J654P56j398l52l31O18J54O90j46j034p03R55K91P85L48j900j142J323
4232d25J988K08j237j738j201J851L114k4l320j890O69K917K155j417l654j256
4248c260K527K967K63j907l193k82L115K557j240k854o55P85K040J096j345k400
4264a786M1J859P32L14p47j520k88J190J147k54p50k09j073P82J419M58r11j315
4282i11l06N37J608Q23j583j513J31R65J325K53j376j749O53K000P46j039r91
4299d27n58L82J212L01q44n11J94P6QP69l19n63J40J31j155J363J275p60j670
$$ plain form
4318 -956 -848 -715 747 1903 861 -1261 -1663 360 1388 1402 -119 -1902 -1835 815 2270 629 -1140
4335 -1140 -1276 -486 962 1826 331 -1330 -1044 549 1347 861 222 -988 -604 346 522 65 478 471 -818
4354 -818 -206 982 701 132 56 -709 -691 388 1291 271 -794 -898 -551 695 1420 77 -1425 -630
4372 -630 214 765 536 70 -722 -998 546 823 169 -212 -272 -616 -214 618 446 227 -68 -1212 -1084 677
4392 677 1214 258 -1112 -1435 -635 868 2165 531 -2202 -2187 75 1718 2142 -303 -2739 -1911 1093
4409 1093 2377 1012 -1450 -2391 -1217 1295 2612 408 -2117 -1906 101 1554 1648 26 -2073 -1696
4425 -1696 237 1653 1199 -362 -1518 -1735 257 2287 988 -604 -1160 -1099 215 1983 1398 -1067
4441 -1067 -1654 -640 879 1911 913 -1461 -1644 -144 1397 1449 57 -1104 -1418 404 1688 846 -899
$$ packed form
4318i56J08J33J462J156j042k122m02K023J028J4j521j783O7K650J455j641j769
4335a140j36P90J448Q64j495j661K86J593P98m86o39j210L84R50J76m57M13pj289
4354h18O12J188k81n69p6p65J8J079R03j020j065j04L47J246P25j343j502P95
4372f30Q44N51k29m66p92k76J544K77o54l81o0l44M02Q32j72k19k95j144J28J761
4392F77N37r56j370l23Q00J503J297j634k733J5K262J643M24k445k436Q28L004
4409A093J284j365k462r41J174K512J317k204k525K11K007J453R4j622k099L77
4425a696J933J416m54j561j156k17J992K030j299j592n56O1J314J768n85k465
4441a067n87J014J519J032r98k374j83J500J541N2j392j161l14J822J284q42j745
$$ plain form
4458 -899 -783 31 519 982 400 -622 -319 563 466 -165 -40 41 282 410 134 -900 -56 1115 376 24
4478 24 -405 -368 226 1052 733 -805 -1219 45 782 1175 115 -785 -1146 230 981 458 -516 -648 -807
4497 -807 -11 1302 663 -618 -950 -116 206 721 774 -789 -1270 -661 795 1055 1124 -609 -1706 -656
4515 -656 1166 1202 176 -897 -1175 -622 1363 1619 -24 -1569 -827 574 1201 870 -615 -1702 -616
4532 -616 1077 801 194 -726 -1038 -161 974 611 -388 -894 -308 299 523 456 -152 -806 -213 466 345 -41
4552 -41 37 -624 -307 289 6 -108 110 -298 -492 -124 337 -108 -214 250 -445 -108 161 369 -166 252 217
4573 217 -246 -6 260 203 -246 23 -9 -706 189 548 378 -610 -355 -248 225 732 247 -491 -264 202 373
$$ packed form
4458h99J16Q14M88M63n82j022L03Q82r7o31J25Q1K41J28k76j034Q44J171p39l52
4478B4m29L7N94Q26l19j538m14J264P37L93j060r00l61J376P51n23r74j32j59
4497h07P96J313o39j281l32Q34L22N15N3j563m81O09J456K60O9j733j097J050
4515f56J822L6j026j073k78N53J985K56j643j545P42J401O27l31j485j087J086
4532f16J693k76o07r20l12Q77J135l63r99n06N86O07K24o7o08o54N93O79j21l86
4552d1P8o61L17N96k83j14K18m08j94L68M61m45j06M64o95L37K69K08n35M18l5
4573B17m63K40K66n7m49K69l2o97Q95L59j70r88K55J07M73N07m85p38K27M66J71
$$ [...]
8191b3
##END NTUPLES=NMR FID
##END=
