##TITLE=1H_CA-8698-2-2
 CDCl3, 8 sc, 
 5.7.2020
##JCAMPDX= 6.0         $$ Bruker NMR JCAMP-DX V2.0
##DATA TYPE= NMR FID
##DATA CLASS= NTUPLES
##ORIGIN= UXNMR, Bruker Analytische Messtechnik GmbH
##OWNER= root
$$ XWIN-NMR		Version 3.5
$$ Wed Aug  5 11:31:20 2020 Russian Standard Time (UT+4h)  she@DPX200
##.OBSERVE FREQUENCY= 200.1314999998
##.OBSERVE NUCLEUS= ^1H
##.DELAY= (6, 6)
##.ACQUISITION MODE= SIMULTANEOUS
##.ACQUISITION SCHEME= undefined
##.AVERAGES= 8
##.DIGITISER RES= 18
##SPECTROMETER/DATA SYSTEM= spect
##.PULSE SEQUENCE= zg30
##.SOLVENT NAME= CDCl3
##.SHIFT REFERENCE= (INTERNAL, CDCl3, 0, 15.7039)
##AUDIT TRAIL= $$ (NUMBER, WHEN, WHO, WHERE, WHAT)
$$ ##TITLE= Audit trail, XWIN-NMR		Version 3.5
$$ ##JCAMPDX= 5.01
$$ ##ORIGIN= Bruker BioSpin GmbH
$$ ##OWNER= she
$$ F:/spectra/data/she/nmr/H-F/1/audita.txt
$$ ##AUDIT TRAIL=  $$ (NUMBER, WHEN, WHO, WHERE, WHAT)
(   1,<2020-08-05 11:30:20.75 +0400>,<she>,<DPX200>,
      <created by zg, POWCHK disabled, PULCHK disabled
       configuration hash MD5:
       00 E9 B6 7A A2 85 ED C7 34 08 36 98 17 FE 4E 26
       data hash MD5: 16K
       27 DD 31 59 63 11 4C 72 AF 56 7B 15 8B 55 04 7F>)
$$ ##END=
$$ 
$$ hash MD5
$$ 90 A6 E4 D8 07 E1 3C A5 94 1B C5 D9 C6 4B 86 64
##$RELAX= 
##$RELAX= 
##$RELAX= 
##$RELAX= 
##$RELAX= 
##$RELAX= 
$$ Bruker specific parameters
$$ --------------------------
##$DU= <F:/spectra>
##$EXPNO= 1
##$NAME= <H-F>
##$PROCNO= 1
##$TYPE= <nmr>
##$USER= <she>
##$AMP= (0..31)
100 100 100 100 100 100 100 100 100 100 100 100 100 100 100 100 100 100 
100 100 100 100 100 100 100 100 100 100 100 100 100 100 
##$AQSEQ= 0
##$AQ_mod= 1
##$AUNM= <au_zg>
##$AUTOPOS= <>
##$BF1= 200.13
##$BF2= 200.13
##$BF3= 200.13
##$BF4= 200.13
##$BF5= 200.13
##$BF6= 200.13
##$BF7= 200.13
##$BF8= 200.13
##$BYTORDA= 1
##$CFDGTYP= 0
##$CFRGTYP= 5
##$CHEMSTR= <none>
##$CNST= (0..31)
1 1 145 1 1 1 1 1 1 1 1 1 1 1 1 1 1 1 1 1 1 1 1 1 1 1 1 1 1 1 1 1 
##$CPDPRG= <>
##$CPDPRG1= <>
##$CPDPRG2= <>
##$CPDPRG3= <>
##$CPDPRG4= <mlev>
##$CPDPRG5= <mlev>
##$CPDPRG6= <mlev>
##$CPDPRG7= <mlev>
##$CPDPRG8= <mlev>
##$CPDPRGB= <>
##$CPDPRGT= <>
##$D= (0..31)
0 1.2 0 0 0 0 0 0 0 0.06 0 0.03 0 0 0 0 0.0002 0 0 0 0 0 0 0 0 0 0 0 0 
0 0 0 
##$DATE= 1596612620
##$DBL= (0..7)
120 120 120 120 120 120 120 120 
##$DBP= (0..7)
150 150 150 150 150 150 150 150 
##$DBP07= 0
##$DBPNAM0= <>
##$DBPNAM1= <>
##$DBPNAM2= <>
##$DBPNAM3= <>
##$DBPNAM4= <>
##$DBPNAM5= <>
##$DBPNAM6= <>
##$DBPNAM7= <>
##$DBPOAL= (0..7)
0.5 0.5 0.5 0.5 0.5 0.5 0.5 0.5 
##$DBPOFFS= (0..7)
0 0 0 0 0 0 0 0 
##$DE= 6
##$DECBNUC= <off>
##$DECIM= 24
##$DECNUC= <off>
##$DECSTAT= 4
##$DIGMOD= 1
##$DIGTYP= 9
##$DL= (0..7)
0 120 120 120 120 120 120 120 
##$DP= (0..7)
150 150 150 150 150 150 150 150 
##$DP07= 0
##$DPNAME0= <>
##$DPNAME1= <>
##$DPNAME2= <>
##$DPNAME3= <>
##$DPNAME4= <>
##$DPNAME5= <>
##$DPNAME6= <>
##$DPNAME7= <>
##$DPOAL= (0..7)
0.5 0.5 0.5 0.5 0.5 0.5 0.5 0.5 
##$DPOFFS= (0..7)
0 0 0 0 0 0 0 0 
##$DQDMODE= 0
##$DR= 18
##$DS= 0
##$DSLIST= <SSSSSSSSSSSSSSS>
$$ [...]
##$SUBNAM2= <"">
##$SUBNAM3= <"">
##$SUBNAM4= <"">
##$SUBNAM5= <"">
##$SUBNAM6= <"">
##$SUBNAM7= <"">
##$SUBNAM8= <"">
##$SUBNAM9= <"">
##$SW= 24.9337058888022
##$SWIBOX= (0..15)
0 0 2 0 0 0 0 0 0 0 0 0 0 0 0 0 
##$SW_h= 4990.01996007984
##$TD= 16384
##$TD0= 1
##$TE= 0
##$TE2= 300
##$TE3= 300
##$TEG= 300
##$TL= (0..7)
0 120 120 120 120 120 120 120 
##$TP= (0..7)
150 150 150 150 150 150 150 150 
##$TP07= 0
##$TPNAME0= <>
##$TPNAME1= <>
##$TPNAME2= <>
##$TPNAME3= <>
##$TPNAME4= <>
##$TPNAME5= <>
##$TPNAME6= <>
##$TPNAME7= <>
##$TPOAL= (0..7)
0.5 0.5 0.5 0.5 0.5 0.5 0.5 0.5 
##$TPOFFS= (0..7)
0 0 0 0 0 0 0 0 
##$TUNHIN= 0
##$TUNHOUT= 0
##$TUNXOUT= 0
##$USERA1= <user>
##$USERA2= <user>
##$USERA3= <user>
##$USERA4= <user>
##$USERA5= <user>
##$V9= 5
##$VALIST= <valist>
##$VCLIST= <CCCCCCCCCCCCCCC>
##$VD= 0
##$VDLIST= <DDDDDDDDDDDDDDD>
##$VPLIST= <PPPPPPPPPPPPPPP>
##$VTLIST= <TTTTTTTTTTTTTTT>
##$WBST= 1024
##$WBSW= 4
##$XGAIN= (0..3)
0 0 0 0 
##$XL= 0
##$YL= 0
##$YMAX_a= 667170
##$YMIN_a= -579357
##$ZGOPTNS= <>
##$ZL1= 120
##$ZL2= 120
##$ZL3= 120
##$ZL4= 120
##$ABSF1= 10
##$ABSF2= 0
##$ABSG= 5
##$ABSL= 3
##$ALPHA= 0
##$AQORDER= 0
##$ASSFAC= 0
##$ASSFACI= 0
##$ASSFACX= 0
##$ASSWID= 0
##$AUNMP= <proc_1d>
##$AZFE= 0.1
##$AZFW= 0.1
##$BCFW= 1
##$BC_mod= 2
##$BYTORDP= 1
##$COROFFS= 0
##$CY= 11.3945322036743
##$DATMOD= 1
##$DC= 2
##$DFILT= <>
##$DTYPP= 0
##$F1P= 16.9975609425685
##$F2P= -3.02152046262296
##$FCOR= 0.5
##$FTSIZE= 0
##$FT_mod= 4
##$GAMMA= 1
##$GB= 0.15
##$INTBC= 1
##$INTSCL= 1
##$ISEN= 128
##$LB= 0.24
##$LEV0= 0
##$LPBIN= 0
##$MAXI= 10000
##$MC2= 0
##$MEAN= 0
##$ME_mod= 0
##$MI= 1.114404
##$NCOEF= 0
##$NC_proc= 0
##$NLEV= 6
##$NOISF1= 3.799351
##$NOISF2= 2.8
##$NSP= 1
##$NTH_PI= 0
##$NZP= 0
##$OFFSET= 15.70392
##$PC= 1
##$PHC0= -9801.701
##$PHC1= 24.20093
##$PH_mod= 1
##$PKNL= yes
##$PPARMOD= 0
##$PSCAL= 0
##$PSIGN= 0
##$REVERSE= no
##$SF= 200.130013532006
##$SI= 16384
##$SIGF1= 3
##$SIGF2= 2
##$SINO= 400
##$SIOLD= 16384
##$SREGLST= <1H.CDCl3>
##$SSB= 0
##$STSI= 0
##$STSR= 0
##$SW_p= 3612.71676300578
##$SYMM= 0
##$S_DEV= 0
##$TDeff= 0
##$TDoff= 0
##$TI= <>
##$TILT= no
##$TM1= 0
##$TM2= 0
##$TOPLEV= 0
##$USERP1= <user>
##$USERP2= <user>
##$USERP3= <user>
##$USERP4= <user>
##$USERP5= <user>
##$WDW= 1
##$XDIM= 8192
##$YMAX_p= 0
##$YMIN_p= 0
$$ End of Bruker specific parameters
$$ ---------------------------------
##NTUPLES= NMR FID
##VAR_NAME=  TIME,          FID/REAL,        FID/IMAG
##SYMBOL=    X,             R,               I
##VAR_TYPE=  INDEPENDENT,   DEPENDENT,       DEPENDENT
##VAR_FORM=  AFFN,          ASDF,            ASDF
##VAR_DIM=   8192,          8192,            8192
##UNITS=     SECONDS,       ARBITRARY UNITS, ARBITRARY UNITS
##FACTOR=    0.0002004,     1,               1
##FIRST=     0,             0,               0
##LAST=      1.6414764,     0,               0
##MIN=       0,             -579357,         0
##MAX=       1.6414764,     667170,          0
$$ Real data points
##PAGE= N=1
##DATA TABLE= (X++(R..R)), XYDATA
$$ plain form
0 0 0 0 0 0 -1 8 0 8 -8 8 -16 17 -17 28 -33 40 -49 61 -67 81 -98 110 -129 151 -174 200 -230 259 -295 334
30 334 -375 424 -476 532 -594 662 -737 820 -912 1009 -1118 1239 -1371 1516 -1682 1861
46 1861 -2067 2300 -2565 2872 -3233 3659 -4176 4819 -5641 6739 -8281 10620 -14606 23048
60 23048 -76921 346252 667170 160550 -432473 -554029 -62054 449498 464707 -38176 -447882
71 -447882 -355776 109190 413250 263770 -166902 -367523 -150781 184726 266738 98146
81 98146 -128021 -221423 -104677 121604 210094 86197 -101648 -178082 -92776 89374 191177
92 191177 96968 -100233 -196388 -93016 128025 232218 65006 -192745 -209584 24493 207557
103 207557 151221 -48860 -185583 -117048 85861 182759 63144 -105037 -124842 -2229 105134
$$ packed form
0@%%%%jRqQj6J6k4L3l4M5o1P3q9J10j28J48j79K08k39K80l25L74m30M89n54O29
30C34p09P99r00J008j126J256j399J557j732J921k127K357k610K887l198L543
46A861l928M367m865N437o105O892p835Q995j0460J2380j5020J8901k5226L7654
60B3048r9969M23173L20918n06620n93023j21556M91975N11552J5209n02883m09706
71d47882R2106M64966L04060j49480m30672k00621K16742L35507Q2012j68592
81I8146k26167r3402J16746K26281Q8490j23897j87845p6434Q5306J82150J01803
92A91177r4209j97201r6155J03372K21041J04193j67212k57751j6839K34077J83064
103B07557n6336k00081j36723O8535K02909R6898j19615j68181j9805J22613J07363
$$ plain form
114 105134 69919 -49180 -69711 32237 69856 -23699 -84283 -11797 88979 91168 -21427
125 -21427 -139301 -99961 91549 195202 53882 -168335 -199924 7110 227213 187496 -91785
136 -91785 -271166 -123918 157841 245031 65275 -181736 -235214 -21484 220733 195279 -52510
147 -52510 -215527 -130918 75159 182962 90916 -88639 -153114 -58348 65655 113626 67531
158 67531 -45787 -126175 -77378 46280 114634 82091 -25202 -133990 -120468 38422 170361
169 170361 113850 -72137 -191485 -109064 106838 212532 64344 -163307 -197023 -14412
179 -14412 174307 171270 -26174 -200861 -137472 84745 185675 67148 -103366 -143645 -31984
190 -31984 101988 106852 -8609 -86722 -51883 14737 40228 26354 -2460 -13952 -4079 -13615
$$ packed form
114A05134l5215j19099k0531J01948L7619r3555o0584P2486J00776K189j12595
125b1427j17874L9340J91510J03653j41320k22217l1589K07034K20103l9717k79281
136i1785j79381J47248K81759Q7190j79756k47011n3478K13730K42217k5454k47789
147e2510j63017Q4609K06077J07803r2046j79555o4475R4766J24003M7971m6095
158F7531j13318q0388M8797J23658O8354l2543j07293j08788J3522J58890J31939
169A70361n6511j85987j19348Q2421K15902J05694j48188k27651l3716J82611
179a4412J88719l037j97444j74687O3389K22217J00930j18527j70514m0279J11661
190c1984J33972M864j15461p8113L4839O6620K5491j3874k8814j1492R873r536
$$ plain form
202 -13615 -33925 4672 71488 52122 -47447 -100378 -39094 80172 130173 26353 -132655
213 -132655 -141324 26705 168175 120408 -61613 -183551 -99771 111711 196227 48338 -142414
224 -142414 -158643 -7400 143958 141865 -15140 -148004 -101959 47883 122203 69974 -35319
235 -35319 -97236 -59636 34991 81270 49452 -8994 -58927 -68534 -4708 79229 81177 -1216
247 -1216 -80007 -84193 1806 106685 98744 -34112 -129418 -72094 65351 131567 53273 -94026
259 -94026 -134785 -8054 126415 102025 -34971 -121471 -70966 61191 123794 31541 -97076
270 -97076 -93326 20014 88920 48003 -41252 -77421 -16599 61542 46813 -31027 -54251 -4786
282 -4786 40028 30520 -21170 -53345 -10096 57083 42392 -38281 -67242 -11577 52117 55640 -8095
$$ packed form
202a3615k0310L8597O6816j9366r9569n2931O1284J19266N0001j03820j59008
213a32655q669J68029J41470m7767j82021j21938Q3780K11482Q4516j47889j90752
224a42414j6229J51243J51358k093j57005j32864M6045J49842P4320n2229j05293
235c5319o1917L7600R4627M6279l1818n8446m9933r607O3826Q3937J948q2393
247a216p8791m186Q5999J04879p941j32856r5306N7324J37445O6216p8294j47299
259i4026m0759J26731J34469k4390j36996q6500N0505J32157O2603r2253j28617
270i7076L750J13340O8906m0917q9255l6169O0822P8141j4729p7840k3224M9465
282d786M4814r508n1690l2175M3249O7179j4691q0673k8961N5665O3694L523o3735
$$ plain form
295 -8095 -73276 -49693 38736 72066 13913 -52109 -57575 -5477 53344 49287 -18491 -57512 -22651
308 -22651 22820 30105 13073 -12885 -30750 -16641 10372 16937 13357 6569 -20233 -37810 -7058
321 -7058 37600 40730 1942 -47757 -57136 7683 81730 57613 -44088 -94560 -36539 64711
333 64711 103326 23215 -97018 -103896 20191 118753 77988 -46190 -117614 -55702 78658
344 78658 122362 16813 -100674 -88636 18698 95713 67273 -36604 -94964 -34216 62133
355 62133 71301 2910 -52872 -46715 7074 51341 32070 -21764 -33492 -4191 14772 15257 9632
368 9632 -4445 -11764 -2279 1779 -743 11606 17549 -6338 -23478 -7979 14397 22101 12720 -15870
382 -15870 -30502 -207 33455 19629 -13920 -22536 -8012 13719 22257 -1092 -24991 -6573
$$ packed form
295h095o5181K3583Q8429L3330n8153o6022n466N2098N8821m057o7778l9021L4861
308b2651M5471P285j7032k5958j7865J4109K7013O565l580o788k6802j7577L0752
321g058M4658L130l8788m9699r379O4819P4047k4117j01701n0472N8021J01250
333F4711L8615q0111j20233o878J24087R8562m0765j24178p1424O1912J34360
344G8658M3704j05549j17487J2038J07334P7015k8440j03877n8360O0748R6349
355F2133R168o8391n5782O157N3789M4267j9271n3834j1728K9301J8963M85n625
368I632j4077p319R485M058k522J2349N943k3887j7140J5499K2376P704r381k8590
382a5870j4632L0295L3662j3826l3549q616J4524K1731Q538k3349k3899J8418
$$ plain form
394 -6573 22580 11718 -16506 -19898 635 24856 25051 -15964 -48369 -13235 45533 44669 -10518
407 -10518 -54349 -42666 22158 71360 31691 -53855 -72696 -5938 60608 59219 -7266 -72902
419 -72902 -55192 31526 75692 26613 -44271 -62915 -19435 43888 58315 712 -55099 -42541
431 -42541 7324 37955 32016 -5702 -42972 -33638 9802 32700 22689 -1646 -30593 -37295 -108
444 -108 39258 33226 -5476 -38844 -41190 2562 54413 43378 -22147 -60002 -32118 26297 61491
457 61491 31771 -40563 -66655 -10544 53445 53114 1076 -49015 -49036 10090 59061 34791 -24629
470 -24629 -45397 -19144 21064 42138 17911 -27189 -34890 -2397 22086 23466 10370 -13984
482 -13984 -26783 -6762 19097 21044 9988 -6568 -25557 -17772 17643 33419 11741 -17232
$$ packed form
394f573K9153j0862k8224l392K0533K4221J95m1015l2405L5134N8768q64n5187
407a0518m3831J1683O4824M9202l9669q5546j8841O6758O6546j389o6485o5636
419g2902J7710Q6718M4166m9079p0884j8644M3480O3323J4427n7603n5811J2558
431d2541M9865L0631n939l7718l7270R334M3440K2898j0011k4335k8947o702L7187
444a08L9366o032l8702l3368k346M3752N1851j1035o5525l7855K7884N8415L5194
457F1491k9720p2334k6092N6111O3989l31n2038n0091k1N9126M8971k4270n9420
470b4629k0768K6253M0208K1074k4227m5100p701L2493K4483J380j3096k4354
482a3984j2799K0021K5859J947j1056j6556j8989P785L5415J5776k1678k8973
$$ plain form
494 -17232 -29476 -15648 23228 42783 9357 -33573 -32481 1165 31244 34346 -1093 -39126
506 -39126 -27170 17766 34758 14745 -13356 -28724 -14637 19953 28598 1179 -18742 -12280
518 -12280 -175 10226 14197 760 -12474 -5505 3794 773 2244 6353 -919 -7027 -2166 -1959
532 -1959 -1231 8711 7422 -9476 -12011 419 6683 7190 5501 -8170 -16569 -2067 12333 8428
546 8428 98 -7549 -15588 -6341 13516 13649 -3364 -11885 -12574 -7697 11077 20604 811 -20151
560 -20151 -17029 -1468 13968 21086 2309 -25827 -23206 5548 22672 17540 -3878 -29565 -26088
573 -26088 11944 34324 14161 -16845 -29647 -17894 15322 37027 13141 -27599 -33267 -4789
585 -4789 24825 32267 5051 -33894 -33719 7202 34915 23990 -6838 -33150 -27579 14276 42635
$$ packed form
494a7232j2244J3828L8876J9555l3426m2930J092L3646L0079L102l5439l8033
506c9126J1956M4936J6992k0013k8101j5368J4087L4590Q645k7419j9921O462
518a2280J2105J0401L971j3437j3234O969R299l021J471M109p272o108M861K07
532a959P28R942j289j6898k535J2430O264N07j689j3671q399J4502J4400l905
546H428q330p647q039R247J9857J33j7013q521o89M877J8774R527j9793k0962
560b0151L122J5561J5436P118j8777k8136K621K8754J7124n132k1418k5687L477
573b6088L8032K2380k0163l1006j2802J1753L3216K1705k3886m0740n668K8478
585d789K9614P442k7216l8945J75M0921K7713j0925l0828k6312N571M1855K8359
$$ plain form
598 42635 18398 -22455 -32870 -12409 19894 36559 13315 -26228 -31405 -2040 23323 26526
610 26526 6463 -23429 -27627 3222 26333 18924 427 -15669 -21781 -2647 25183 24096 -1126
623 -1126 -19095 -19082 -2464 23889 27757 -1743 -26604 -20196 3553 25905 27640 -4328 -34776
636 -34776 -20673 18200 31926 14861 -13361 -31248 -15327 23634 34839 5214 -24233 -27107
648 -27107 -5358 23369 29060 -170 -27025 -20151 1544 16126 21144 5564 -22593 -25242 684
661 684 19547 19125 4953 -19031 -29686 -5065 26772 26780 -680 -28819 -32675 788 39415 30822
675 30822 -15637 -40802 -22975 14556 39775 24256 -24786 -46329 -11254 31557 33533 1882
687 1882 -30334 -31647 2663 31814 19155 -12176 -23354 -13752 5079 20458 12114 -12076 -17114
$$ packed form
598D2635k4237m0853j0415K0461L2303J6665k3244l9543n177K9365K5363L203
610B6526k0063k9892m198L0849K3111p409j8497j6096o112J9134K7830j087k5222
623a126j7969J3J6618K6353L868k9500k4861O408K3749K2352J735l1968l0448
636c4776J4103L8873J3726j7065k8222j7887J5921L8961J1205k9625k9447k874
648b7107K1749K8727N691k9230k6855O874K1695J4582N018j5580k8157k649K5926
661F84J8863m22j4172k3984j0655K4621L1837Qk7460k8139l856L3463L8627q593
675C0822m6459k5165J7827L7531K5219j5519m9042k1543L5075M2811J976l1651
687A882l2216j313L4310K9151j2659l1331j1178R602J8831J5379q344k4190n038
$$ plain form
700 -17114 -2634 3764 4332 8311 3009 -9719 -11922 -3464 5282 13002 8836 -11799 -19279 -1984
714 -1984 13936 13375 2529 -14089 -19299 2561 24877 12260 -14049 -17633 -4052 10437 15701
727 15701 3994 -13903 -11277 4760 7903 3035 829 -2558 -2764 2440 -573 -6480 5078 16286
741 16286 1772 -17547 -11465 7663 19451 14123 -10028 -27042 -8863 25542 30154 964 -27603
754 -27603 -28463 5771 40529 28401 -18973 -38486 -11124 22810 33176 12993 -22100 -32847
766 -32847 -3324 27556 23970 -601 -19109 -20224 -972 19482 17179 209 -11128 -17058 -11492
779 -11492 12864 28802 10233 -20461 -29110 -11912 18422 37303 13981 -32196 -42740 -4690
791 -4690 36861 39328 -1570 -46301 -39504 15958 50613 24124 -24513 -44500 -20328 26976 45898
$$ packed form
700a7114J4480O398N68L979n302j2728k203Q458Q746P720m166k0635p480J7295
714a984J5920n61j0846j6618n210K1860K2316j2617k6309l584J3581J4489N264
727A5701j1707j7897K626J6037L143m868k206l387k06N204l013n907J1558J1208
741A6286j4514j9319O082J9128J1788n328k4151j7014J8179L4405M612k9190k8567
754b7603q60L4234L4758j2128m7374j9513K7362L3934J0366k0183l5093j0747
766c2847K9523L0880l586k4571j8508j115J9252K0454k303j6970j1337n930N566
779a1492K4356J5938j8569l0694q649J7198L0334J8881k3322m6177j0544L8050
791d690M1551K467m0898m4731O797N5462L4655k6489m8637j9987K4172M7304J8922
$$ plain form
804 45898 8405 -38025 -36315 1922 29522 25534 -2818 -28561 -22383 5222 18541 13114 1544
817 1544 -12762 -20115 -5570 13793 16043 5746 -9177 -24102 -16739 16174 32180 8707 -24460
830 -24460 -32868 -8505 28884 37157 -567 -39444 -30742 9074 36161 26740 -12164 -41279 -20718
843 -20718 23477 33814 6586 -19189 -22801 -6394 16264 19653 913 -12219 -9235 -4114 2102
856 2102 11115 11056 -151 -9825 -13641 -7616 14909 27555 4356 -26534 -25323 3570 28847 27224
870 27224 -5324 -36860 -23980 20481 38901 14199 -22460 -34068 -7395 31279 33121 -4420
882 -4420 -30334 -17473 9294 23809 16897 -7728 -22570 -7691 12321 12144 3885 -828 -5791
895 -5791 -6743 -152 4612 7297 8904 -1309 -16863 -10574 12147 19169 5978 -11831 -21079 -8312
$$ packed form
804D5898l7493m6430J710L8237K7600l988k8352k5743O178K7605J3319n427j1570
817A544j4306p353J4545J9363K250j0297j4923j4925P363L2913J6006k3473l3167
830b4460q408K4363L7389Q273l7724l8877Q702L9816K7087r421l8904k9115K0561
843b0718M4195J0337k7228k5775l612J6407K2658L389j8740j3132K984N121O216
856B102R013n9j1207r674l816O025K2525J2646k3199l0890J211K8893K5277j623
870B7224l2548l1536J2880M4461J8420k4702l6659j1608K6673L8674J842l7541
882d420k5914J2861K6767J4515o912k4625j4842J4879K0012j77q259m713m963
895e791r52O591M764K685J607j0213j5554O289K2721P022j3191j7809r248J2767
$$ plain form
909 -8312 19628 25386 -2738 -26521 -16644 9058 23774 13691 -13973 -25561 -4351 17974 14652
922 14652 -1687 -12420 -12565 558 12650 5422 -7687 -4432 2161 -3390 -5120 2143 7630 5844
936 5844 -3765 -15854 -11699 12258 23610 3674 -21476 -24099 -2927 25518 28543 -7231 -39460
949 -39460 -22882 19532 34987 12774 -23039 -36045 -8279 29902 30112 -4802 -29666 -22863 4996
962 4996 27470 19388 -12702 -27290 -9995 10603 16068 10427 -4850 -18564 -11778 7187 15557
975 15557 11001 -1439 -17211 -17252 4999 22937 15170 -6149 -22238 -17683 10476 32209 14430
988 14430 -21602 -28290 -3470 22680 26679 1800 -27746 -23095 11000 28527 12461 -13090 -22271
1001 -22271 -6746 18384 20576 -3885 -18433 -6315 8246 9760 3212 -5921 -7760 4374 10118
$$ packed form
909h312K7940N758k8124k3783R877K5702J4716j0083k7664j1588K1210K2325l322
922A4652j6339j0733j45J3123J2092p228j3109L255O593n551j730P263N487j786
936E844r609j2089M155K3957J1352j9936k5150k623K1172K8445L025l5774l2229
949c9460J6578M2414J5455k2213l5813j3006K7766L8181K10l4914k4864O803K7859
962D996K2474q082l2090j4588J7295K0598N465n641j5277j3714O786J8965Q370
975A5557m556j2440j5772m1K2251J7938p767k1319j6089M555K8159K1733j7779
988A4430l6032o688K4820K6150L999k4879k9546M651L4095J7527j6066k5551r181
1001b2271J5525K5130K192k4461j4548J2118J4561J514o548r133j839J2134N744
$$ plain form
1014 10118 -1443 -8383 644 8334 5190 -2257 -8783 -4577 10982 14198 -3658 -15828 -6177 8348
1028 8348 13661 6858 -9583 -16297 -597 16568 10826 -4898 -11218 -6944 3978 12796 5416 -8266
1042 -8266 -8139 504 2214 3277 4004 -1916 -6117 -1648 1053 808 4923 3393 -7359 -8858 2428
1057 2428 8621 5161 -2574 -10682 -8296 8133 14693 -567 -15176 -10195 3730 13201 8950 -10368
1071 -10368 -20521 -2909 18111 13215 -7467 -18862 -10954 10041 21674 3651 -22288 -19066
1083 -19066 5969 19740 10966 -10315 -23724 -9207 18590 20795 -3712 -21087 -14330 4940
1095 4940 20068 12630 -12076 -22161 -3798 15401 14546 1298 -12831 -15552 799 17519 11584
1108 11584 -4944 -12230 -8892 1620 14278 12247 -5341 -14891 -6636 5430 13497 10390 -6674
$$ packed form
1014A0118j1561o940R027P690l144p447o526M206J5559L216j7856j2170R651J4525
1028H348N313o803j6441o714J5700J7165n742j5724o320M274J0922Q818p380j3682
1042h266J27Q643J710J063P27n920m201M469K701k45M115j530j0752j499J1286
1057B428O193l460p735q108K386J6429O560j5260j4609M981J3925R471m251j9318
1071a0368j0153J7612K1020m896k0682j1395P908K0995J1633j8023k5939L222
1083a9066K5035J3771q774k1281j3409J4517K7797K205k4507j7375O757J9270
1095D940J5128p438k4706j0085J8363J9199q55j3248j4129k721J6351J6720n935
1108A1584j6528p286L338J0512J2658k031j7588r550Q255J2066Q067l107j7064
$$ plain form
1121 -6674 -18455 -5964 13610 15486 2797 -11742 -15692 -168 19753 14395 -8760 -18248 -5926
1134 -5926 11915 18553 4973 -17330 -17548 7566 21381 9174 -10800 -18312 -5647 17154 21128
1147 21128 -2766 -22087 -12086 10150 19335 9852 -11313 -20719 -2956 19740 16043 -3799 -16033
1160 -16033 -11741 4625 17911 9932 -11059 -16172 -2070 10331 11835 3549 -11287 -14051 1942
1173 1942 14542 8676 -3325 -10648 -10038 3120 15535 8639 -9459 -14594 -4872 8118 15193 5745
1187 5745 -14484 -18213 481 16396 12942 -1911 -17648 -16460 6172 22374 9319 -13984 -19349
1200 -19349 -6418 12415 19448 2461 -19745 -17077 3805 15821 10504 -4744 -17468 -11299 9129
1213 9129 16608 2471 -10055 -10448 -3991 6536 11643 1046 -10707 -7790 521 4651 6254 2276
$$ packed form
1121f674j1781J2491J9574J876j2689j4539l950J5524J9921n358k3155r488J2322
1134e926J7841O638j3580k2303k18K5114J3815j2207j9974p512J2665K2801L974
1147B1128k3894j9321J0001K2236R185r483k1165r406J7763K2696l697j9842j2234
1160a6033M292J6366J3286p979k0991n113J4102J2401J504q286j4836k764J5993
1173A942J2600n866j2001p323O10J3158J2415o896j8098n135R722J2990P075r448
1187E745k0229l729J8694J5915l454j4853j5737J188K2632J6202j3055k3303n365
1200a9349J2931J8833P033j6987k2206K668K0882J2016n317j5248j2724O169K0428
1213I129P479j4137j2526l93O457J0527N107j0597j1753K917Q311M130J603l978
$$ plain form
1227 2276 -7300 -7758 1121 5458 4200 2855 -3677 -9422 -1965 8260 6484 -673 -5029 -7045 -1611
1242 -1611 8446 8336 -2499 -7188 -3900 426 6465 7804 -1775 -8148 -1892 4648 3493 3456 909
1257 909 -5403 -4541 3976 5636 1977 -76 -3563 -4817 2334 7749 3053 -2472 -3439 -3276 1244 8764
1273 8764 4934 -5983 -6138 1409 5021 4824 1855 -5241 -6013 3613 7955 1850 -3325 -4247 -1625 5264
1289 5264 6583 -2297 -6754 539 5395 1936 -704 -2574 -3696 1427 6789 742 -7206 -4434 2276
1304 2276 5217 4400 -2877 -9603 -3403 7350 6600 -896 -5031 -7404 -3424 8234 9985 -3388 -11831
1319 -11831 -6548 2754 9085 8192 -4306 -14520 -7375 6945 12114 5878 -6741 -16427 -7026 13153
1333 13153 15161 -1491 -13363 -11798 -709 13309 13754 -5116 -19179 -9727 8957 15747 6315
$$ packed form
1227B276r576m58Q879M337j258j345o532n745P457J0225j776p157m356k016N434
1242a611J0057j10j0835m689L288M326O039J339r579o373O256O540j155l7k547
1257I09o312Q62Q517J660l659k053l487j254P151N415m696n525r67J63M520P520
1273H764l830j0917j55P547L612j97k969p096p72R626M342o105n175r22K622O889
1289E264J319q880m457P293M856l459k640j870j122N123N362o047p948K772O710
1304B276K941q17p277o726O200J0753p50p496m135k373L980J1658J751j3373q443
1319a1831N283R302O331q93j2498j0214P145J4320N169o236j2619r686R401K0179
1333A3153K008j6652j1872J565J1089J4018M45j8870j4063R452J8684O790r432
$$ plain form
1346 6315 -11402 -18138 -2254 16241 12888 -3755 -13455 -10660 2346 16041 10261 -9925 -15791
1359 -15791 -2548 10391 10936 1712 -10853 -11818 1689 12519 7665 -2764 -9385 -8816 3104 13555
1373 13555 6328 -8087 -9853 -1556 5204 8753 4465 -7540 -10746 655 9619 6786 -1222 -8674
1387 -8674 -7698 5363 12220 3235 -7493 -7082 -915 6335 10362 1756 -10702 -6643 6868 9694
1401 9694 1847 -5550 -6672 261 9956 6963 -5008 -8448 -694 6621 8613 2656 -8667 -9190 4686
1416 4686 11812 3110 -5947 -6885 -2700 5930 9333 110 -10044 -6566 3227 7901 5955 -2106 -10376
1431 -10376 -5895 5744 8313 2275 -3392 -7012 -5901 4003 10232 1983 -7739 -7159 -1385 5241 8114
1446 8114 1065 -9946 -8028 3210 8897 5797 -3239 -12437 -7523 8124 12419 39 -10393 -9287
$$ packed form
1346F315j7717o736J5884J8495l353j6643r700K795J3006J3695n780k0186n866
1359a5791J3243J2939N45r224j2565r65J3507J0830m854j0429o621N69J1920J0451
1373A3555p227j4415j766Q297O760L549m288j2005l206J1401Q964k833q008p452
1387h674R76J3061O857q985j0728M11O167P250M027q606j2458M059J3511K826
1401I694p847p397j122O933R695k993j1971l440P754P315J992n957j1323n23J3876
1416D686P126q702r057r38M185Q630L403r223j0154L478R793M674j946q061q270
1431a0376M481J1639K569o038n667l620J111R904O229q249r722N80N774O626K873
1446H114p049j1011J918J1238N687l100r036r198M914J5647M295j2380j0432J106
$$ plain form
1460 -9287 -1284 9032 10247 -3558 -13831 -6332 7464 10290 3027 -8017 -12070 -803 11389
1473 11389 7802 -4214 -8652 -5682 1035 9002 6104 -5925 -8825 -548 5022 3911 1022 -3146
1487 -3146 -5486 407 4660 2068 -1295 -1986 -3154 32 5423 2698 -3960 -3998 -211 900 3562 3836
1503 3836 -3245 -7054 11 6241 4175 -1015 -5512 -5470 3560 9982 2793 -7300 -7151 -860 6833
1518 6833 10122 1189 -11811 -8703 6307 11746 4232 -4861 -9242 -3933 8889 11674 -79 -9630
1532 -9630 -6624 2394 10004 8295 -4400 -11979 -2910 8025 7929 1989 -3950 -7817 -3190 7906 8248
1547 8248 -472 -6020 -4972 -529 6542 7541 -1688 -8071 -4015 1839 6607 6945 -1848 -11667 -6492
1562 -6492 7490 10527 2667 -6518 -10904 -4819 9517 13204 100 -12026 -10529 777 11919
$$ packed form
1460i287Q003J0316J215j3805j0273P499J3796K826p263j1044m053J1267J2192
1473A1389l587j2016m438K970O717P967k898j2029k900Q277N570j111k889m168
1487c146k340N893M253k592l363o91j168L186N391k725o658l8L787J111K662K74
1503C836p081l809P065O230k066n190m497M2R030O422p189j0093J49O291P693
1518F833L289q933j3000L108J5010N439p514r093m381N309J2822K785j1753r551
1532i630L006R018P610j709j2695p579R069J0935r6n940n939l867M627J1096L42
1547H248q720n548J048M443P071R99r229o383M056N854M768L38q793r819N175
1562f492J3982L037p860r185m386O085J4336L687j3104j2126J497J1306J1142
$$ plain form
1575 11919 11002 -4922 -16076 -6689 8610 11569 4009 -7532 -13467 -4206 10675 11604 -1654 -10321
1589 -10321 -7765 238 8543 7302 -3403 -9111 -3198 2164 4225 3902 -2021 -7416 -2942 3672 3065
1604 3065 -279 -1179 -2882 -3453 1895 3929 468 -2522 -2157 -1762 763 3343 -106 -3952 -591 1834
1620 1834 -98 426 -57 -2548 -385 4383 1645 -3933 -2288 2381 3739 2783 -1456 -6176 -2319 6991
1636 6991 6882 -1665 -6042 -5122 1233 9665 7577 -6207 -11925 -1925 9529 10825 2601 -9564
1650 -9564 -11906 1499 14052 9808 -4655 -12106 -8806 4896 15800 8470 -9562 -14194 -3497
1663 -3497 9323 13802 5702 -10239 -15562 -1399 13359 13095 1580 -11372 -14447 -792 15480
1676 15480 13973 -2070 -14719 -12916 1165 17234 14980 -5549 -19706 -11197 7163 18520 12343
$$ packed form
1575A1919r17j5924j1154R387J5299K959p560j1541n935R261J4881R29j3258q667
1589a0321K556Q003Q305j241j0705n708N913N362K061l23n923n395M474O614o07
1604C065l344r00j703n71N348K034l461k990L65L95K525K580l449l846L361K425
1620A834j932N24m83k491K163M768k738n578J645M669J358r56m239m720L857R310
1636F991j09q547m377R20O355Q432k088j3784n718J0000J1454J296q224j2165
1650i564k342J3405J2553m244j4463p451L300J3702J0904p330j8032m632J0697
1663c497J2820M479q100j5941n323J4163J4758k64j1515j2952l075J3655J6272
1676A5480j507j6043j2649J803J4081J6069k254k0529j4157Q509J8360J1357o177
$$ plain form
1689 12343 -9594 -22584 -8971 14917 20285 4813 -14912 -20602 -3344 19137 19130 -3335 -19834
1702 -19834 -14476 3981 19230 14057 -8146 -20661 -8482 10847 15829 5743 -10307 -16889 -4305
1715 -4305 12781 12876 -792 -11462 -11268 -1410 11246 10991 -2739 -11892 -8128 975 8753 8974 -2070
1730 -2070 -12631 -7965 4260 9035 5954 -3213 -11206 -7367 5912 10608 2527 -6344 -8714 -3242
1744 -3242 6623 9479 -281 -8665 -4550 2354 4856 3522 -1751 -5111 -595 4577 1419 -3436 -1112
1759 -1112 2115 2319 473 -3194 -4214 2733 8596 2098 -6989 -7057 637 7790 9422 -1304 -12251
1774 -12251 -7846 7367 12121 4700 -6727 -12376 -4277 10769 13558 292 -10965 -9093 736
1787 736 10589 11000 -1457 -12487 -7854 4210 10069 8388 -1279 -11855 -9319 4034 12369 7766
$$ packed form
1689A2343k1937j2990J3613K3888N368j5472j9725n690J7258K2481pk2465j6499
1702a9834N358J8457J5249n173k2203j2515J2179J9329M982j0086j6050o582J2584
1715d305J7086R5j3668j0670J94R858J2656k55j3730r153L764R103P778K21j1044
1730b070j0561M666J2225M775l081r167p993L839J3279M696q081q871k370N472
1744c242R865K856r760q384M115O904K502j334n273l360M516N172l158m855K324
1759a112L227K04j846l667j020O947N863o498r087o8P694P153J632j0726j0947
1774a2251M405J5213M754p421j1427n649Q099J5046K789j3266j1257J872R829
1787G36R853M11j2457j1030M633J2064N859j681r667j0576K536J3353Q335m603
$$ plain form
1801 7766 -3050 -12039 -10416 4917 16519 8696 -8396 -15562 -7659 9234 18482 6645 -14781
1814 -14781 -18474 -1224 15426 15593 -617 -17357 -15116 5994 19352 9113 -8799 -15742 -7096
1827 -7096 9617 15698 2413 -12727 -11055 1259 8759 7609 -824 -9274 -6567 2833 6025 1913
1841 1913 -946 -3631 -4927 -906 3784 2775 519 -2048 -5557 -3955 4154 7246 747 -6287 -7101
1856 -7101 -1689 6110 7909 -1945 -10296 -5797 4037 6948 3199 -4008 -8512 -2025 7315 5134 -3021
1871 -3021 -5123 -1575 2089 3216 176 -4536 -1713 4560 2033 -3536 -3468 699 3807 3504 -1821 -6876
1887 -6876 -2196 6987 6083 -2190 -6283 -3744 2722 7444 3147 -6558 -6762 2213 6425 3017 -2284
1902 -2284 -4698 -1971 4591 4901 -2109 -4355 634 3104 1255 -312 -1376 -166 3536 1951 -3961
$$ packed form
1801G766j0816q989J623J5333J1602p823j7092p166P903J6893R248j1837k1426
1814a4781l693J7250J6650J67j6210j6740K241K1110J3358j0239j7912o943Q646
1827g096J6713O081j3285j5140J672J2314P500j150q433q450K707R400L192m112
1841A913k859k685j296M021M690j009k256k567l509J602Q109L092o499p034q14
1856g101N412P799J799r854q351M499R834K911l749p207m504O487R340k181q155
1871c021k102L548L664J127l040m712K823O273k527n569O8M167L108l03n325n055
1887f876M680R183r04q273m093K539O466M722m297r705k04Q975M212l408n301
1902b284k414K727O562L10p010k246M989K470j849j567j064J210L702j585n912
$$ plain form
1917 -3961 -3217 3652 5720 500 -4480 -5149 855 8916 6006 -6555 -10183 -422 9365 8862 -877
1932 -877 -11033 -8413 6540 13925 3473 -9476 -10153 -222 9950 9639 -2752 -11623 -5042 6660
1946 6660 7872 1628 -4878 -6465 -452 5479 3523 -2647 -3083 -119 -212 -33 1240 157 88 -142 -2545
1963 -2545 -2835 3205 5327 -688 -5965 -4176 1492 6229 4249 -5005 -9932 -1042 8494 6177 -3143
1978 -3143 -8888 -5427 5065 10533 854 -10615 -7336 4929 9436 2677 -7482 -9757 487 10839
1992 10839 6046 -7913 -10877 -913 8925 8829 -2693 -13122 -7221 9117 12575 -82 -11125 -9099
2006 -9099 2499 11526 6957 -6611 -11815 -1675 8250 7926 163 -7174 -7194 2367 7751 2662 -3508
2021 -3508 -3205 -1204 -1 2546 3255 -332 -1906 -2448 -2142 1996 6623 2290 -5675 -6287 -91 7107
$$ packed form
1917c961P44O869K068n220m980o69O004Q061k910j2561l628R761R787n03r739
1932h77j0156K620J4953P385j0452j2949o77R931J0172l11j2391q871O581J1702
1946F660J212o244o506j587O013N931j956o170m36K964r3J79J273j083o9k30k403
1963b545k90O040K122o015n277J789N668M737j980r254m927Q890R536k317r320
1978c143n745L461J0492N468r679j1469L279J2265M507o759j0159k275J0244J0352
1992A0839m793j3959k964R964R838r6j1522j0429N901J6338L458j2657j1043K026
2006i099J1598R027m569j3568n204J0140R925l24p763p337k0R561N384n089o170
2021c508L03K001J203K547P09l587j574n42L06M138M627m333p965o12O196P198
$$ plain form
2037 7107 8602 -552 -11886 -8348 7903 14723 3535 -10140 -12227 44 14841 12864 -5684
2050 -5684 -16659 -6600 10896 16020 3480 -14113 -14921 3893 17407 8623 -9164 -13096 -2734
2063 -2734 9850 11889 -204 -12062 -7269 5501 9548 2445 -5963 -7020 499 7315 3221 -4846
2077 -4846 -3898 1763 1821 6 -417 -760 201 1442 -385 -3552 -364 4099 2115 -2771 -4730 -1545
2093 -1545 4663 5711 -2738 -9302 -2154 7089 5919 -2589 -7049 -4182 3089 8315 2057 -8741 -8123
2108 -8123 2502 8618 3851 -6685 -9899 -125 10255 5661 -7140 -9318 -113 7063 6475 -1698
2122 -1698 -9308 -5389 7010 9892 -945 -9738 -6310 4150 9621 2414 -8826 -7648 3953 8739
2136 8739 1838 -5183 -6071 -1160 6147 5850 -3130 -7731 -856 6236 3634 -2982 -4864 94 5211
$$ packed form
2037G107J495r154j1334L538J6251O820j1188j3675k087J2271J4797j977j8548
2050e684j0975J0059J7496N124j2540j7593q08J8814J3514q784j7787l932J0362
2063b734J2584K039j2093j1858M793J2770M047p103q408j057P519O816m094q067
2077d846R48N661N8j815m23l43R61J241j827l167L188M463j984m886j959L185
2093a545O208J048q449o564P148R243j170q508m460K867P271N226o258j0798O18
2108h123J0625O116m767j0536l214R774J0380m594j2801k178R205P176n88q173
2122a698p610L919J2399K882j0837q793L428J0460N471p207j1240J178J1601M786
2136H739o901p021q88M911P307k97q980m601O875P092k602o616j882M958N117
$$ plain form
2151 5211 3364 -4981 -5767 2154 6204 2002 -3389 -5293 -1510 6405 7485 -3250 -10186 -2317 8694
2166 8694 8324 -1268 -9183 -6063 5601 10436 1833 -7172 -5831 1076 6674 5827 -2005 -7306 -1409
2181 -1409 7242 4700 -2986 -3767 472 3310 2225 -1359 -2632 1515 4148 -317 -3938 -1688 2908
2196 2908 4466 1582 -5201 -6738 2637 10310 3340 -8393 -8765 1436 10207 6773 -5420 -12804
2210 -12804 -3880 10835 11196 -2035 -13111 -10162 5421 15965 5990 -12692 -14635 1088 12922
2223 12922 9524 -3702 -12937 -7320 7176 11322 1493 -8770 -8246 459 7564 5650 -3628 -7054
2237 -7054 -1684 3261 1747 374 19 -1775 -2439 -690 651 1191 2442 -331 -5302 -4141 2690 5484
2253 5484 2625 -4870 -8116 -794 8902 7222 -5031 -10348 -3299 6680 9254 1390 -9357 -9224 3995
$$ packed form
2151E211j847q345p86P921M050m202n391j904L783P915J080j0735o936P869J1011
2166H694l70r592p915L120J1664M835q603r005J341O907N598q47p832n301N897
2181a409Q651k542p686p81M239K838j085l584j273M147K633m465l621K250M596
2196B908J558k884o783j537R375P673o970j1733l72J0201Q771l434j2193p384
2210a2804Q924J4715L61j3231j1076K949J5583J0544r975j8682j943J5723J1834
2223A2922l398j3226r235N617J4496M146r829j0263N24Q705P105j914r278l426
2237g054N370M945j514j373l55j794o64J749J341N40J251k773m971J161O831K794
2253E484k859p495l246P322R696j680j2253n317P049R979K574p864j0747J33J3219
$$ plain form
2268 3995 11503 3970 -7829 -9191 -60 9933 7669 -5072 -10738 -1319 9083 7312 -2006 -8677
2282 -8677 -5212 5698 10483 1170 -9919 -6400 4800 9228 2908 -6534 -8124 843 8959 5568
2296 5568 -4654 -7144 -1699 5096 6716 347 -6356 -3731 4419 5205 382 -2759 -1295 117 1879
2311 1879 1286 -756 361 2068 -195 -2423 -276 3121 2659 -125 -4148 -4617 2459 8192 2509 -7183
2327 -7183 -7548 916 7879 6472 -2834 -9958 -4329 7639 9168 -165 -8119 -6968 2070 9819 4562
2342 4562 -6848 -8405 1096 7295 3872 -3006 -6405 -2336 5013 5321 -2614 -6126 -1301 4303 3702
2357 3702 -1514 -5651 -2535 4968 5445 -2577 -6706 -1479 3850 4351 -452 -6089 -5136 3297 7444 712
2373 712 -6768 -5796 1131 6491 4450 -4413 -7810 -1070 6188 4212 -1699 -4460 -3576 1472 4889 1436
$$ packed form
2268C995P508p533j1799j362R131R993k264j2741n666R419J0402j771r318o671
2282h677L465J0910M785r313j1089L519J1200M428o320r442j590Q967Q116l391
2296E568j0222k490N445O795J620o369o703K625Q150P86m823l141J464J412J762
2311A879n93k042J117J707k263k228K147L397m62k784m023m69P076N733n683r692
2327g183l65Q464O963j407r306p124N629J1968J529r333p954J151R038P749n257
2342D562j1410j557R501O199l423o878l399M069P349L08p935l512M825N604o01
2357C702n216m137L116P503M77q022m129N227N329N01m803n637R53Q433M147o732
2373G12p480R72O927N360k041q863l397O740P258j976n911k761Q84N048L417l453
$$ plain form
2389 1436 -3700 -2671 841 899 488 380 -104 -255 -487 -1998 -1207 3564 4121 -1825 -5217 -2367 3091
2406 3091 6317 2986 -5544 -8348 107 9123 6705 -3248 -9028 -4858 5710 10902 1753 -8686
2420 -8686 -7603 2162 9040 5875 -3364 -9350 -3409 7447 7803 -1035 -6037 -3766 2345 5386 2420
2435 2420 -3716 -3992 2048 3877 229 -1818 -1336 729 2736 913 -3283 -2183 3064 3573 -686 -3196
2451 -3196 -2071 879 3937 2184 -3610 -4286 1314 3831 2043 -1162 -3109 -1628 2026 2980 -732
2466 -732 -2576 -8 1079 133 -89 -100 -142 925 -12 -2273 -1203 3196 3555 -1378 -3817 -2932 1689
2483 1689 5847 3173 -5371 -7319 12 6794 5448 -2035 -8321 -6124 4367 9269 2036 -7231 -7996
2498 -7996 -701 6882 6991 -1929 -8891 -4630 4305 6300 1700 -3570 -5711 -1834 4326 4235 -570 -2905
$$ packed form
2389A436n136J029L512N8m11j08m84j51k32j511P91M771N57n946l392K850N458
2406C091L226l331q530k804Q455R016k418r953n780M170J0568N192r149j0439
2420h686J083R765O878l165r239n986N941J0856L56q838n002K271O111L041k966
2435B420o136k76O040J829l648k047M82K065K007j823m196J100N247N09m259k510
2451c196J125K950L058j753n794o76N600K517j788l205j947J481L654R54l712
2466g32j844K568J087r46k22j1m2J067r37k261J070M399L59m933k439Q85M621
2483A689M158k674q544j948P331O782j346p483o286K197J0491M902p233r267p65
2498g996P295P583J09q920o962M261Q935J995m600n270k141L877O160r1m805k335
$$ plain form
2514 -2905 -2197 -1022 1257 2650 814 -1547 -1726 -1684 -520 3308 3808 -1137 -4789 -3212 1386 4934
2530 4934 4157 -2722 -7613 -2825 5550 6499 1117 -5350 -6716 -30 7933 5927 -2810 -6752 -3426
2545 -3426 2881 6305 3574 -4132 -6524 -590 4280 3956 1026 -1974 -3682 -893 2983 3302 980
2560 980 -653 -2772 -2576 1663 4642 2371 -1441 -3675 -3378 1807 6741 3641 -4434 -6298 -1120 5064
2576 5064 7099 1547 -6813 -7286 1671 7773 4775 -2312 -7033 -4366 3657 8147 1939 -5603 -5390
2591 -5390 -331 4352 4905 300 -5283 -3347 1749 3261 1230 56 -2076 -2334 233 1845 370
2606 370 198 269 -1828 -2423 807 2342 1227 -391 -2181 -3118 830 4135 1584 -2469 -3351 -1534 1661
2623 1661 3944 810 -3727 -3549 230 2514 2125 332 -2355 -3100 716 2660 1289 -81 -1712 -2938
$$ packed form
2514b905P08J175K279J393j836k361j79M2J164L828N00m945l652J577M598L548
2530D934p77o879m891M788Q375R49n382o467j366O686P963k006q737l942L326
2545c426O307L424k731p706k392N934M870l24k930l000j708K789L876L19k322
2560I80j633k119J96M239K979k271l812k234K97N185M934l100q075j864N178O184
2576E064K035n552q360m73Q957O102k998p087m721K667Q023M490o208p542K13
2591e390N059M683N53m605n583J936N096J512k031j174k132k58K567J612j475
2606C70j72P1k097n95L230J535j115j618j790r37L948L305k551m053q82J817L195
2623A661K283l134m537J78L779K284l89j793k687p45L816J944j371j370j631j226
$$ plain form
2639 -2938 -1186 2422 2838 -123 -1988 -3641 -2017 3097 5321 725 -5091 -5048 31 5193 6456 -650
2655 -650 -8346 -5981 3306 8484 4470 -3608 -9127 -4200 7017 10129 1026 -8306 -8237 -273 8816
2670 8816 8678 -1859 -10218 -5907 4419 8956 4987 -4412 -9612 -3384 6459 8791 1757 -5540 -6983
2685 -6983 -1830 6157 7666 554 -6381 -5490 25 5735 7196 383 -6950 -6038 1956 6856 5775
2700 5775 -305 -7167 -6019 2567 8158 4726 -3038 -7145 -4311 4261 8413 2576 -5976 -6483 -93
2715 -93 5248 5806 38 -6766 -4658 2815 5370 1831 -2894 -4028 -1139 2893 3704 -712 -2524 -980
2731 -980 867 1079 609 -912 -1386 741 894 -1377 -1667 1224 1521 -29 -1395 -1968 -739 2421 2146
2748 2146 -1793 -3422 -1379 1047 2443 1936 -2343 -4544 -923 3279 2341 167 -1556 -2930 -1589
$$ packed form
2639b938J752L608M16k961j865j653J624N114K224m596n816M3N079N162J263p106
2655f50p696K365R287N178m014q078n519M927J1217L112r103r332O9P964R089
2670H816j38j0537q359M311J0326M537l969r399n200O228R843K332p034p297j443
2685f983N153P987J509p112o935Q91N515N710J461o813p333R12P994M900j081
2700E775o080o862J148Q586N591l432p764m107K834Q572M152n837q552n07O390
2715i3N341N58n768o804K108P473K555l539m725j134K889M032Q11m416j812J544
2731i80J847K12m70j521m74K127J53k271k90K891K97j550j366n73J229L160k75
2748B146l939j629K043K426J396n07m279k201L621M202r38k174j723j374J341
$$ plain form
2763 -1589 1806 2918 327 -1521 -2757 -2153 1336 3952 1920 -2716 -3555 -1945 1952 5466 3028
2778 3028 -4536 -6894 -839 5614 5954 924 -6468 -6679 1582 8231 5076 -3306 -7676 -4770 4519
2793 4519 9232 2565 -7132 -7585 625 6919 6390 -205 -7262 -6213 2857 7463 3758 -2570 -6498
2808 -6498 -4209 3169 7096 2517 -3147 -4662 -2717 1820 6557 4183 -3051 -6554 -2633 3006 6715
2823 6715 4101 -3799 -7878 -2392 5781 7886 2229 -6247 -8724 -464 9240 8016 -2425 -8549 -5850
2838 -5850 2959 9401 5228 -5157 -9318 -2329 6153 7202 1266 -6328 -6703 788 6330 4451 -1403
2853 -1403 -4320 -4027 226 4680 3771 -1432 -3586 -1790 -251 2143 3509 374 -3256 -3429 -555 2301
2869 2301 3370 852 -4063 -4026 953 3460 1794 -985 -3359 -3021 1971 4177 453 -3765 -2514 1158
$$ packed form
2763a589L395J112k591j848j236O04L489K616k032m636q39J610L897L514k438
2778C028p564k358O055O453L40n030p392k11Q261O649l155q382m370K906R289
2793D519M713o667r697m53Q210O294n29o595p057J049R070M606l705o328l928
2808f498K289P378L927m579n664j515J945M537M737k374p234l503L921N639L709
2823F715k614p900m079N486Q173K105n657q476k477Q260R704j224j0441o124K699
2838e850Q809O442m173j0385m161O989Q482J049n936p594l75P491N542j879n854
2853a403k917K93M253M454r09n203k154J796J539K394J366l135l630j73K874K856
2869B301J069k518m915L7M979K507j666k779k374L38M992K206l724m218J251L672
$$ plain form
2885 1158 2250 1147 -2366 -2822 922 3309 501 -3197 -2659 248 2863 2985 -2007 -5385 -1062 4115
2901 4115 3688 -1158 -3834 -3083 1816 5034 1968 -4173 -4266 777 3679 3464 -457 -4454 -3414 2665
2917 2665 4705 1147 -2383 -2860 -1696 1704 3789 1143 -2555 -2544 -925 1047 3628 2399 -2330 -4079
2933 -4079 -1358 2480 4468 3007 -3416 -6839 -1336 6003 6541 72 -6257 -6341 678 8644 6440 -3957
2949 -3957 -8820 -3224 5497 8768 2479 -7169 -8357 1506 8652 5898 -2530 -7524 -4897 3792 8723
2964 8723 2448 -5894 -5897 -428 4768 5361 487 -4824 -4253 1230 4289 3187 -427 -3642 -3746 862
2980 862 4165 2060 -806 -3070 -3170 212 4737 3587 -2225 -4793 -2299 2074 5029 2391 -3982
2995 -3982 -5703 85 4930 4113 -1007 -5193 -4038 2491 6459 1165 -5178 -4746 273 4270 3697 -1997
$$ packed form
2885A158J092j103l513m56L744K387k808l698N38K907K615J22m992l378M323N177
2901D115m27m846k676P51M899L218l066o141r3N043K902k15l921l997J040O079
2917B665K040l558l530m77J164L400K085k646l698J1J619J972K581j229m729j749
2933d079K721L838J988j461o423l423N503P339N38o469o329q4P019P966k204j0397
2949c957m863N596Q721L271o289r648j188R863P146k754q428m994K627Q689M931
2964H723o275q342lN469N196N93m874n311N71N483L059j102l614l215j04M608
2980H62L303k105k866k264j00L382M525j150n812k568K494M373K955k638o373
2995c982j721N788M845q17n120m186J155O529L968n294o343M32N019L997n73n694
$$ plain form
3011 -1997 -5643 -1553 4097 4084 -914 -4091 -2901 1701 4569 943 -4698 -3952 1708 4211 1290 -2073
3027 -2073 -4176 -1605 4004 4272 -908 -4902 -2770 1191 3847 2543 -2306 -4598 -1126 2692 2878
3042 2878 1200 -1596 -3624 -2025 2969 4286 1119 -2163 -3920 -2170 2725 5653 1568 -4099 -5428
3057 -5428 -1039 4599 6370 5 -7074 -5379 2715 7238 3825 -2763 -7465 -3259 5729 8029 461
3072 461 -6359 -5521 1264 7040 4748 -3161 -7002 -1893 4851 5495 952 -4103 -4531 463 5355 3174
3088 3174 -1941 -3289 -1286 949 2706 1538 -1302 -1905 237 579 175 656 65 -1190 -406 512 154
3105 154 804 929 -811 -1850 -81 1575 660 -428 -863 -893 602 1672 -239 -1796 -291 1306 380
3122 380 -316 -875 -924 1127 2083 -311 -2648 -828 1532 1780 -96 -2282 -2575 991 4128 1162 -3528
$$ packed form
3011a997l646M090N650j3m998l177J190M602K868l626n641P46N660K503k921l363
3027b073k103K571N609K68n180l994K132L961K656j304m849k292L472L818J86
3042B878j678k796k028J599M994J317l167l282j757J750M895K928m085n667j329
3057e428M389N638J771o365p079J695Q094M523l413o588m702M206Q988K300p568
3072D61o820Q38O785N776k292p909l841N109O744O44m543n055m28M994M892k181
3088C174n115j348K003K235J757j168k840o03K142L42m04M81n91j255P84R18l58
3105A54O50J25j740j039J769J656r15j088m35l0J495J070j911j557J505J597r26
3122C80o96n59m9K051R56k394k337J820K360K48j876k186k93L566L137k966m690
$$ plain form
3139 -3528 -3977 -378 3274 3281 -1192 -5190 -3177 3092 4556 596 -3930 -4575 -542 4514 4320 -1820
3155 -1820 -4806 -2333 2019 3749 2065 -2365 -4268 -787 2596 2068 223 -1194 -2606 -1169 1720
3170 1720 2112 -79 -1224 -1623 -1821 867 3136 1083 -1992 -2469 -1033 1566 3327 1025 -3341 -3556
3186 -3556 792 3340 2692 -335 -3316 -3015 1871 4510 1196 -2085 -2627 -827 2263 3427 580 -2167
3202 -2167 -1420 589 1212 1306 1023 -973 -1336 -254 342 850 2087 1013 -1885 -2258 -71 2023 2668
3219 2668 685 -2714 -3794 625 3998 2841 -1421 -3696 -2490 1740 4523 1455 -3458 -3552 108
3234 108 3080 3068 -294 -3431 -2583 1672 3030 674 -1330 -1900 -933 1414 2088 99 -1518 -716 -21
3251 -21 -66 1017 864 -1134 -689 -120 -331 429 1358 -573 -1802 -781 494 798 629 -104 -1674 -894
$$ packed form
3139c528m49L599L652Pm473l998K013O269J464l960m526o45M033N056j94o140
3155a820k986K473M352J730j684m430j903L481L383n28j845j417j412J437K889
3170A720L92k191j145l99j98K688K269k053l075m77J436K599J761k302m366k15
3186c556M348K548o48l027k981L01M886K639l314l281n42J800L090J164k847k747
3202b167P47K009O23R4k83j996l63J082N96N08J237j074k898l73K187K094O45
3219B668j983l399j080M419L373j157m262k275J206M230K783l068m913r4L660
3234A08K972j2l362l137Q48M255J358k356k004n70R67K347O74j989j617Q02O95
3251b1m5J083j53j998M45N69k11P60R29j931j229J021J275L04j69p33j570P80
$$ plain form
3269 -894 1212 876 -410 -512 -327 -548 206 276 -666 -512 808 227 -1528 -1074 788 954 916 -914 -2863
3288 -2863 -1076 2997 2720 -883 -3243 -2645 535 4018 3005 -2877 -4895 -643 3710 3880 276 -4480
3304 -4480 -4827 1046 5967 3434 -2489 -4984 -2340 2669 5795 1743 -4661 -5078 -155 4248 4886 466
3320 466 -4874 -4714 1264 5017 3688 -1186 -4476 -4008 1441 5569 3222 -2747 -4659 -2287 2194 5337
3336 5337 2486 -3606 -5279 -583 4387 4781 755 -4219 -4673 1096 5761 3499 -2055 -4682 -2598
3351 -2598 2502 5779 1858 -4533 -4587 308 3998 3386 -594 -4555 -3244 1834 4395 1336 -1951 -3182
3367 -3182 -1155 2162 3233 -162 -2962 -1312 753 1492 1070 -329 -1855 -740 1279 218 -1135
3382 -1135 -163 215 597 606 -384 -1721 -780 1078 775 -440 -969 -980 -560 1524 1958 -753 -2371 -1156
$$ packed form
3269h94K106l36j286j02J85k21P54P0r42J54J320n81j755M54J862J66l8j830j949
3288b863J787M073k77l603k360N98L180L483j013n882k018M252M353J70l604m756
3304d480l47N873M921k533n923k495K644N009L126m052o404m17M923M403O38m420
3320D66n340J60N978L753j329m874l290M68N449M128k347n969j912K372M481L143
3336E337k851o092j673M696M970L94m026m974m54N769M665k262n554k627K084
3351b598N100L277l921o391n4M895L690o12l980l961J311N078K561l059l287j231
3367c182K027L317J071l395k800J650K065P39m22j399j526J115K019j061j353
3382a135R72L78L82Rr90j337R41J858l03j215n29j1M20K084M34k711j618J215
$$ plain form
3400 -1156 146 1942 1782 -1165 -3229 -1663 1453 2343 1326 -1514 -3810 -1631 3154 3541 -387 -3517
3416 -3517 -3101 302 3883 3456 -1599 -4801 -1917 2651 4152 1720 -3050 -4968 -417 4809 3741
3431 3741 -1071 -3960 -3239 919 4518 2881 -2614 -4770 -1533 2222 3643 1759 -2581 -3738 -84
3446 -84 3058 2501 429 -2124 -2843 -215 3283 2524 -605 -2319 -1746 286 2532 2222 -736 -2467 -1258
3463 -1258 1292 2133 1689 -993 -3010 -961 2610 2316 0 -1479 -2276 -272 2392 2383 -826 -2432 -1059
3480 -1059 760 1706 1651 -994 -2080 -534 986 821 508 114 -1158 -515 622 663 86 834 186 -1338
3498 -1338 -920 603 1092 663 46 -1820 -1519 711 2285 1071 -1181 -2066 -1346 1273 2903 611 -2558
3515 -2558 -2064 -106 1321 1884 278 -2120 -2175 477 1719 804 5 -1664 -1877 401 1741 779 -801
$$ packed form
3400a156J302J796j60k947k064J566L116Q90j017k840k296K179M785L87l928l130
3416c517M16L403L581m27n055l202K884M568J501k432m770j918M551N226j068
3431C741m812k889P21M158L599j637n495k156L237L755J421j884m340j157L654
3446h4L142n57k072k553p19K628L498p59l129j714N73K032K246l10k958j731J209
3463a258K550Q41m44k682k017K049L571k94k316j479p97K004K664rl209j606J373
3480a059J819R46n5k645j086J546J520j65l13l94j272O43J137M1n77P48o48j524
3498a338M18J523M89m29o17j866L01K230J574j214k252q85P20K619J630k292l169
3515b558M94J958J427N63j606k398n5K652J242r15p99j669k13K278J340r62j580
$$ plain form
3532 -801 -1654 -2005 -174 2129 2124 -958 -2708 -1294 352 2290 2024 -681 -3247 -1322 1354 2822 1454
3549 1454 -1785 -3412 -976 2475 2337 19 -1940 -2594 -833 2769 2763 -550 -2715 -1267 287 1922
3565 1922 1989 -163 -2024 -1156 516 1201 1575 615 -1676 -2254 256 2024 1389 495 -1180 -2451 -496
3582 -496 2744 2841 -678 -2341 -2391 573 3545 2750 -1062 -3361 -1265 1600 3158 1884 -1790 -3796
3598 -3796 -840 3032 2680 618 -1446 -2430 -587 2432 2790 -26 -1781 -2043 -541 1988 2397 78
3614 78 -1958 -1569 -336 1279 2580 954 -2614 -2937 454 2602 1868 -24 -2328 -1911 968 3137
3630 3137 1222 -1450 -2270 -1130 1127 3150 492 -2647 -1715 346 1614 1315 136 -1529 -1586 149
3646 149 1069 483 138 -312 -893 -603 70 463 660 687 -1220 -2082 -489 1963 1440 -121 -1612 -2457 -544
$$ packed form
3532h01q53l51J831K303nl082j750J414J646J938k66k705k566J925K676J468j368
3549A454l239j627K436L451j38k318j959o54J761L602ol313k165J448J554J635
3565A922O7k152j861Q68J672O85L74r60k291n78K510J768o35q94j675j271J955
3582d96L240R7l519j663n0K964K972p95l812k299K096K865J558j274l674k006
3598c796K956L872l52k062k064r84J843L019L58k816j755k62J502K529M09k319
3614G8k036L89J233J615J301j626l568l23L391K148p34j892k304M17K879K169
3630C137j915k672q20J140K257K023k658l139R32K061J268k99j179j665n7J735
3646A49R20n86l45m50n81K90O73L93J97K7j907q62J593K452n23j561j491q45J913
$$ plain form
3665 -544 2818 2464 -1141 -3241 -2156 751 3428 2614 -1661 -3884 -1721 1359 2819 2054 -1137 -3999
3681 -3999 -1852 2007 3447 1626 -1584 -3651 -1798 2293 4314 1594 -2627 -4525 -1960 3040 5508
3696 5508 1130 -4603 -4793 -427 4758 5146 272 -6090 -5068 1820 5864 3770 -2149 -5946 -3044
3711 -3044 3761 6130 2142 -3971 -5069 -1341 3904 5376 616 -4342 -4062 871 4071 3362 365
3726 365 -3421 -3548 848 3803 2723 -179 -2796 -3115 294 3918 2923 -841 -3355 -2464 466 3862
3742 3862 2981 -1453 -3925 -1761 1729 3400 2041 -2055 -3805 -831 2854 2760 15 -2120 -2317 -475
3758 -475 2116 1839 -492 -1206 -982 -359 690 1129 530 -571 -934 -975 -533 1606 2086 -108 -2326 -2186
3776 -2186 -255 2390 3011 -792 -3954 -2350 1555 3436 1558 -1673 -4057 -1923 2827 3708 317
$$ packed form
3665e44L362l54l605k100J085K907K677q14m275k223K163L080J460p65l191k862
3681c999K147L859J440j821l210k067J853M091K021k720m221j898K565N000K468
3696E508m378n733j90M366N185L88m874o362J022O888M044k094n919l797K902
3711c044O805K369l988o113j098L728N245J472m760m958K80M933L200p09k997
3726C65l786j27M396K955j080k902k617l19L409L624r95l764k514Q91K930L396
3742C862q81m434k472K164L490J671j359m096j750K974L685r4k745k135j97J842
3758d75K591k77k331p14K24O23J049M39n99j101l63m1M42K139M80k194k218J40
3776b186J931K645O21l803l162J604L905J881j878l231k384K134M750Q81l391
$$ plain form
3791 317 -2880 -3094 -824 2559 3077 77 -2659 -2406 221 1848 2506 596 -2438 -2799 -289 2040
3807 2040 2699 963 -2539 -3623 -677 3077 3381 -182 -3314 -4343 22 4501 3759 -1414 -4224 -2697
3823 -2697 1650 4840 2877 -2868 -5108 -1674 3302 4058 1302 -3233 -3790 -617 3526 3518 136 -2402
3839 -2402 -2679 -475 2927 3275 212 -2241 -2585 -705 2166 4239 964 -3053 -3774 -669 3308 4419
3855 4419 647 -4051 -4702 626 4995 3923 -1201 -5039 -3816 2183 5988 2866 -3397 -4673 -1494
3870 -1494 3255 4733 842 -4021 -3986 402 3287 2828 -45 -3198 -2724 869 2940 1779 -344 -1881
3886 -1881 -2406 -666 2435 2137 -203 -2180 -2330 -275 2525 3222 -796 -3480 -2133 918 2977 2368
3902 2368 -1168 -4047 -1652 2298 3137 701 -2382 -2738 -588 2573 2483 -654 -2407 -1389 61 1172
$$ packed form
3791C17l197k14K270L383N18l000k736K53K627J627O58j910l034l61K510K329
3807B040O59j736l502j084K946L754L04l563l132j029M365M479p42n173k810J527
3823b697M347L190j963n745k240L434M976P56k756m535n57L173M143ql382k538
3839b402k77K204L402L48l063k453l44J880K871K073l275m017p21L105L977J111
3855D419l772m698o51N328M369j072n124l838J223N999L805l122o263j276L179
3870a494M749J478l891m863L5M388K885m59k873l153M74L593K071j161k123j537
3886a881n25J740L101k98k340j977j50K055K800O97m018k684J347L051K059o09
3902B368l536k879K395L950Q39k436l083l56K150L161r0l137j753J018J450J111
$$ plain form
3918 1172 1119 -617 -1034 -292 -8 -542 65 1275 -171 -1173 -1389 -539 1309 2248 343 -2839 -2422 1077
3936 1077 2742 1913 -1276 -3786 -1903 2491 3774 258 -3199 -2896 322 3182 2842 -1191 -3590 -1442
3952 -1442 1805 2770 1030 -1522 -2881 -947 1954 2037 503 -984 -1761 -1506 1389 2355 1190 -900
3968 -900 -2075 -1665 830 3254 1585 -1970 -3077 -1041 2022 3619 1232 -2913 -3703 803 3644 2682
3984 2682 -912 -3590 -2159 1970 3922 897 -2676 -2547 319 2282 2094 -165 -2285 -980 1738
3999 1738 1207 -51 -550 283 34 286 -294 -682 623 1597 219 -1758 -1013 915 2016 883 -1710
4016 -1710 -2960 -495 3024 2215 -472 -2384 -2487 810 3305 1639 -2180 -3279 -735 1722 2490 759
4032 759 -1927 -2717 -340 1750 1528 343 -1225 -1992 -828 1547 1898 554 -1285 -2442 -1399 1485
$$ packed form
3918A172n3j736m17P42K84n34O07J210j446j002k16Q50J848R39j905l182M17L499
3936A077J665q29l189k510J883M394J283l516l457L03L218K860l40m033k399K148
3952a442L247R65j740k552j359J934K901Q3j534j487p77K55K895R66j165k090
3968i00j175M10K495K424j669l555j107K036L063J597k387m145p90M506K841r62
3984B682l594k678J431M129J952l025l573J29K866J963j88k259k120J305K718
3999A738n31j258m99Q33k49K52n80l88J305R74j378j977P45J928J101j133k593
4016a710j250K465L519q09k687j912j03L297K495j666l819j099K544K457P68j731
4032G59k686p90K377K090k22j185j568p67J164K375L51j344j839j157J043K884
$$ plain form
4048 1485 3452 582 -2987 -3260 -293 3022 3277 -772 -4605 -3132 2423 4399 1447 -2661 -4715
4063 -4715 -1129 4532 4533 -880 -4561 -2919 1766 4182 2301 -2566 -4157 -308 3429 2559 -272 -2506
4079 -2506 -2019 1049 2598 794 -1754 -1478 90 555 558 -98 -491 66 734 -293 -705 141 899 317
4097 317 -496 -771 -246 1076 1287 14 -1346 -672 613 644 512 -91 -540 -178 382 75 -373 510 570
4116 570 -825 -995 79 909 1516 322 -2011 -2124 1278 3242 1463 -1784 -3207 -928 2992 4250
4132 4250 -350 -4741 -2930 1892 4652 2513 -2570 -5208 -1471 4260 4405 -369 -4470 -3589 1130
4147 1130 4930 2862 -2587 -4477 -656 2815 3174 543 -2586 -2910 432 2827 1775 -320 -1513
4162 -1513 -1434 -283 1564 1235 -374 -1272 -1117 -715 989 2016 472 -2063 -1828 -390 1657 2116 -100
$$ packed form
4048A485J967k870l569k73K967L315K55m049l833J473N555J976k952m108k054
4063d715L586N661Jn413l681J642M685K416j881m867j591L849L737q70k831k234
4079b506M87L068J549j804k548K76J568M65Lo56l93N57O68j027m12Q46P58n82
4097C17q13k75N25J322K11j273j360O74J285L1j32o03m49L62N60l07m48Q83O0
4116E70j395j70J074Q30O07j194k333j13L402J964j779l247j423K279L920J258
4132D250m600m391J811M822K760k139n083k638L737N731J45m774m101Q81M719
4147A130L800k068n449j890L821L471L59k631l129l24L342K395j052k095j193
4162a513P9J151J847l29j609q98J55M02J704J027j544k535K35J438K047M59k216
$$ plain form
4179 -100 -2905 -2249 1479 2059 600 -1749 -2404 -515 1738 1910 -963 -2370 -387 1149 1057 290 -1369
4196 -1369 -1102 942 1576 -588 -1614 -198 1261 1044 -704 -2041 -668 1701 2614 -342 -2848 -1800
4212 -1800 1196 2959 1724 -2009 -3652 -27 3220 2383 -860 -2851 -1765 1739 3623 1085 -2443
4227 -2443 -2575 -163 2467 2235 13 -2619 -1618 937 2394 609 -514 -963 -1010 277 1634 1334
4243 1334 -83 -952 -1612 -262 1732 1828 155 -1856 -1721 46 2329 2380 -969 -3317 -1267 2054 2863
4260 2863 812 -1831 -2683 -173 2819 2539 -1135 -2388 -1328 930 2285 642 -1615 -1366 737 1221
4276 1221 58 22 -105 -222 204 -153 -671 21 1385 449 -1825 -1763 94 2070 1903 -553 -3681 -1574
4294 -1574 2348 3319 861 -2810 -3002 -289 3503 3426 -1282 -4309 -2668 1746 4002 1890 -2227 -4352
$$ packed form
4179a00k805O56L728N80j459k349o55J889K253J72k873j407J983J536r2p67j659
4196a369K67K044O34k164j026J416J459k17j748j337J373K369R13k956k506J048
4212a800K996J763j235l733j643L625L247q37l243j991J086L504J884k538l528
4227b443j32K412K630k32k222k632J001K555J457j785j123m49m7J287J357l00
4243A334j417q69o60J350J994R6j673k011J35J767K283N1l349k348K050L321Q09
4260B863k051k643q52K510K992k80l674j253J060K258J355j643k257K49K103M84
4276A221j163l6j27j17M26l57n18O92J364r36k274O2J857J976j67k456l128K107
4294a574L922R71k458l671j92K713L792p7m708l027J641M414K256k112m117k125
$$ plain form
4310 -4352 -1219 2836 3191 597 -2270 -3098 -953 2984 3300 -275 -2727 -2645 -56 2392 3183 39
4326 39 -3289 -3087 338 3347 3117 -701 -4582 -3208 2233 4870 2059 -2386 -4899 -1905 3798 5371
4342 5371 257 -4727 -4174 865 4834 3302 -1974 -5128 -2135 3406 4462 920 -3041 -3686 -242
4357 -242 4018 3037 -1024 -3096 -1118 1131 2259 1143 -1177 -1904 21 1292 948 123 13 -544 -328
4374 -328 566 61 261 796 74 -1113 -200 647 770 413 -13 -927 -891 532 1034 135 -288 -490 -685 -4
4394 -4 1114 673 134 -450 -1621 -1204 1355 2563 609 -1867 -2455 -718 2163 3068 626 -3409 -3209
4411 -3209 713 4142 2916 -1654 -4823 -2546 3305 5267 909 -3798 -4565 -510 4254 4576 -873
4426 -873 -5011 -3622 1505 4683 3138 -2308 -5057 -2236 2810 4287 1378 -2811 -3963 -1553 2789
$$ packed form
4310d352L133M055L55k594k867q28K145L937L16l575k452Q2K589K448P91l144
4326C9l328K02L425L009k30l818l881J374N441K637k811m445k513K994N703J573
4342E371n114m984N53N039L969j532n276l154K993N541J056l542l961o45L444
4357b42M260r81m061k072J978K249J128j116k320p27J925J271l44q25j10n57K16
4374c28Q94n05K00N35p22j187R13Q47J23l57m26r14L6J423N02q99m23k02j95O81
4394dJ118m41n39n84j171M17K559J208j954k476n88J737K881R05k442m035K00
4411c209L922L429j226m570l169K277N851J962m358m707p67M055M764L22n449
4426h73m138J389N127L178j545n446k749K821N046J477k909m189j152K410M342
$$ plain form
4441 2789 4192 404 -2796 -3520 -1128 2746 3724 683 -3441 -3731 -299 3112 3556 154 -3980 -3906
4457 -3906 628 4105 3080 -839 -4196 -3078 1321 4858 2102 -2538 -3530 -1488 2090 3632 1020
4472 1020 -2835 -2791 -16 2296 2431 333 -2100 -2230 127 1704 1325 222 -518 -1585 -1028 1073 1604
4489 1604 939 -580 -1341 -897 1063 2660 857 -1226 -2003 -828 1533 2461 799 -2334 -2129 70
4505 70 1894 1855 163 -1886 -1930 611 2155 1255 -150 -1592 -1231 275 2016 1153 -576 -1008 -1282 -233
4523 -233 1291 1537 64 -1262 -1539 -443 1060 1674 710 -1989 -1751 361 1788 1719 -89 -2361 -1911
4540 -1911 639 2105 989 -801 -1913 -1652 618 2157 748 -1190 -1952 -908 598 1851 946 -1385
4556 -1385 -1987 -765 683 1125 1133 -660 -2162 -811 1410 1900 750 -1108 -2540 -1281 1703 2382 452
$$ packed form
4441B789J403l788l200p24K392L874R78l041m124k90L432L411M44l402m134P4
4457c906M534L477j025l919l357J118M399L537k756m640r92K042L578J542k612
4472A020l855M4K775K312J35k098k433j30K357J577l79j103p40j067N57K101N31
4489A604o65j519p61M44J960J597j803k083p77J175K361R28j662l133K05K199
4505G0J824l9j692k049m4K541J544r00j405j442L61J506J741q63j729m32k74J049
4523b33J524K46j473j326k77J096J503O14r64k699K38K112J427o9j808k272M50
4540a911K550J466j116j790j112K61K270J539j409j938p62J044J506J253r05k331
4556a385o02J222J448M42Qj793j502J351K221M90j150j858j432J259K984O79j930
$$ plain form
4573 452 -1937 -2512 -257 2457 2697 -299 -2874 -2080 800 2384 2151 -1010 -3053 -1471 1497 2500
4589 2500 966 -1248 -2223 -1090 1654 2420 388 -1945 -1547 -323 1440 2015 168 -1756 -1206 441
4605 441 1358 1238 -117 -1384 -1121 879 1414 747 -264 -930 -1015 533 1448 306 -829 -476 1 309
4623 309 982 538 -718 -653 331 390 117 198 336 -601 147 144 -85 397 452 141 -340 -167 -234 398 1056 289
4645 289 -946 -898 61 838 933 -58 -1156 -1301 501 1853 789 -712 -1358 -875 632 1905 947 -1478
4663 -1478 -1541 -171 859 1814 804 -1816 -1777 83 1751 1398 -159 -1934 -1706 803 2398 1189 -1069
4680 -1069 -1889 -1241 999 2240 993 -1774 -1875 -343 1241 1356 358 -1497 -1999 166 1705 1195 14
4697 14 -1671 -1738 72 1727 1261 -775 -1402 -658 652 1531 503 -1281 -1881 66 1251 1047 305 -1267
$$ packed form
4573D52k389n75K255K714K40k996k575P94K880J584k33l161k043J582K968J003
4589B500j534k214r75J133K744P66k032k333L98J224J763N75j847j924N50J647
4605D41R17j20j355j267K63K000N35o67j011o66q5J548R15j142j135L53M77L08
4623C09O73m44j256O5R84N9k73Q1J38r37P48lk29M82N5l11m81J73o7O32O58p67
4645B89j235M8R59P77R5r91j098j45J802J352j064j501o46M83J507J273r58k425
4663a478o3J370J030R55j010k620L9J860J668l53j557j775K28K509J595j209k258
4680a069q20O48K240J241j247k767j01J532J584J15r98j855n02K165J539n10j181
4697A4j685o7J810J655m66k036o27P44J310Q79j028j784o00J947J185k04p42j572
$$ plain form
4715 -1267 -1418 150 1724 787 -654 -1462 -859 346 1332 387 -911 -1070 86 685 997 551 -1064
4732 -1064 -960 271 1146 -122 -418 -675 -493 448 633 206 -458 -158 291 281 423 305 -632 -596 366 176
4752 176 -184 599 -127 -423 596 878 137 -552 -219 39 64 700 -45 -708 -59 578 645 -18 -653 -746 -53
4773 -53 956 675 -414 -673 -162 631 862 468 -871 -1345 573 1356 651 -362 -986 -830 774 1795
4791 1795 141 -1335 -558 578 917 1006 -320 -1591 -881 709 897 611 -334 -1049 -819 486 1222 382
4809 382 -644 -1039 -382 735 1348 432 -1089 -1425 -256 729 1088 312 -1346 -1475 -17 1475 1043 -617
4827 -617 -1743 -1363 1035 2344 370 -1911 -1977 -298 1549 1804 -248 -2396 -1790 990 1887 767 -891
4844 -891 -2028 -868 1292 1897 180 -1331 -1177 -226 957 1265 -255 -1284 -1042 554 888 1097 -54
$$ packed form
4715a267j51J568J574r37j441q08O03J205R86r45j298j59J156N99L12m46j615
4732a064J04J231Q75j268k96k57J82R41J85m27o64L00M49j0J42j18r37L6R62j90
4752A76l60P83p26k96J019K82p41o89L33K58K5O36p45o63O49O37O7o63o35r3O93
4773e3J009k81j089k59N11P93K31l94j339m74J918P83p05j013o24J56J604J021
4791A795j654j476P77J136L39Q9j326j271P10J590J88k86r45p15K30J305P36q40
4809C82j026l95O57J117O13r16j521l36J169R85L59p76j658j29J458J492m32j660
4827f17j126L80K398J309j974k281o6J679J847K55k052k148O06K780Q97j120j658
4844h91j137J160K160O05j717j511J54R51J183L08j520j029K42J596L34K09j151
$$ plain form
4861 -54 -572 -1375 363 1123 737 91 -1169 -1432 342 1836 839 -668 -1313 -636 693 1676 393 -1105
4879 -1105 -1613 400 1854 1217 -398 -1695 -743 1084 1942 245 -1400 -1042 28 1187 1266 -530 -1361
4896 -1361 -262 893 911 -65 -635 -745 265 637 335 -710 -263 -270 -191 494 2 -530 -94 445 -3 -397
4916 -397 168 168 -95 71 214 -31 -45 -285 -275 105 595 325 -599 -459 -172 416 967 512 -930 -918 294
4937 294 1310 428 -954 -1291 -489 887 1831 -365 -1918 -1238 427 1298 880 -965 -1917 -1030 1733
4954 1733 1514 -921 -1429 -1144 234 1705 797 -1044 -1686 -130 995 1113 233 -1079 -1313 118 988
4971 988 748 -360 -340 -834 -345 735 552 -250 -713 -450 -158 915 1176 -392 -1065 -700 661 1260 911
4990 911 -744 -1462 -276 1481 1412 -142 -1298 -1118 299 1860 873 -894 -1748 -148 1413 1561 -45
$$ packed form
4861e4n18q03J738P60l86o46j260k63J774J494r97j507o45O77J329R83j283j498
4879a105n08K013J454o37j615j297R52J827Q58j697j645L58J070J159P9j796q31
4896a361J099J155J8r76n70j10J010L72l02j045M47pP9O85m92n32M36N39m48l94
4916c97N65%k63J66J43k45j4k40J0L80M90k70r24J40K87N88N51m55j442J2J212
4937B94J016q82j382l37Q02J376R44k196j553O80J665Q71m18j845r52Q87K763
4954A733k19k435n08K85J378J471r08j841o42J556J125J18q80j312k34J431Q70
4971I88k40j108K0m94M89J080j83q02m63K63K92J073K61j568o73L65J361N99l49
4990I11j655p18J186J757o9j554j156J80J417J561r87j767q54J600J561J48j606
$$ plain form
5007 -45 -1436 -1100 903 2133 10 -1181 -770 -202 1237 774 -638 -1219 -99 1274 687 -310 -625
5024 -625 -45 470 856 200 -520 -199 384 311 223 -144 -490 75 889 174 -374 -173 263 -96 -63 223 254
5045 254 -210 -54 -169 89 351 763 -334 -590 -68 357 731 356 -907 -896 428 1340 412 -800 -909
5064 -909 171 977 1366 -313 -1572 -711 838 1275 350 -1268 -1541 128 1760 907 -948 -1525 -745
5081 -745 845 1102 334 -1177 -1045 338 1233 300 -846 -845 -415 395 732 -471 -864 126 317 183 145
5100 145 -206 -467 -28 228 530 -154 412 291 -322 -159 45 64 433 234 -748 -280 470 323 -239 -238 -92
5121 -92 -191 509 420 -562 -592 45 847 -135 -110 -330 30 449 203 -339 -259 488 953 89 -151 -620 142 688
5143 688 1231 -277 -868 180 1066 556 94 -1157 -717 857 1387 367 -1333 -1064 126 1409 790
$$ packed form
5007d5j391L36K003J230k123j191M11N68J439m63j412n81J120J373n87r97l15
5024f25N80N15L86o56p20L21N83p3q8l67l46N65Q14p15n48K01M36l59L3K86L1
5045B54m64J56j15K58K62M12j097k56N22M25L74l75j263J1J324R12r28j212j09
5064i09J080Q06L89j679j259Q61J549M37r25j618k73J669J632q53j855n77P80
5081g45J590K57p68j511J32J383Q95r33j146JM30Q10L37j203l93R90J91j34l8
5100A45l51k61M39K56L02o84N66j21o13J63K04J9L69j99r82M68P50j47n62JJ46
5121i2r9P00q9r82l0O37Q02r82K5k20L60M19k46n42Q0P47M65q64k40m69P62N46
5143F88N43j508n91J048Q86n10m62j251M40J574N30j020j700K69J190J283o19
$$ plain form
5160 790 -416 -1503 -455 1020 1397 -129 -814 -1084 261 943 753 -419 -902 -50 618 588 155 -774
5178 -774 -690 226 445 273 -317 -378 -188 -114 314 287 -330 206 -106 -203 145 179 -106 -432 -152 -150 58 126 -420
5201 -420 -605 168 865 513 -722 -655 -206 530 925 -187 -1129 -632 796 1210 360 -1144 -1188 -15 1703
5220 1703 1358 -1090 -1626 -524 1320 1492 206 -1791 -1438 721 2053 1068 -1212 -1952 -403 1931
5236 1931 1906 -387 -1805 -1006 289 1789 1267 -624 -2047 -677 1046 1547 570 -1149 -1307 -228 1448
5253 1448 1356 -206 -962 -1031 -383 1069 1064 -300 -1563 -905 769 1325 1059 -302 -1796 -852 998 1428
5271 1428 326 -1304 -1330 -59 2018 1100 -610 -1806 -581 1182 1258 164 -1165 -1443 354 1771
5287 1771 681 -925 -1343 -318 1100 1386 204 -1705 -800 897 1309 400 -875 -722 23 1290 890
$$ packed form
5160G90j206j087J048J475L77j526o85k70J345O82j90j172m83Q52O68l0m33r29
5178g74Q4R16K19j72n90o1J90P4M28k7o17N36l12r7L48L4k85l26K80KK08O8n46
5201d20j85P73O97l52j235O7M49P36L95j112r42M97J428M14q50j504m4J173J718
5220A703l45k448n36J102J844J72j286j997L53K159J332r85k280p40J549K334
5236A931k5k293j418P99J295J500n22j891j423J370J723N01r77j719j58J079J676
5253A448r2j562p56o9O48J452nj364j263O58J674N56k66j361j494R44J850M30
5271A428j102j630k6J271K077r18j710j196J225J763P6j094j329k78J797J417
5287A771j090j606m18J025J418K86j182j909R05J697M12r09j275J53P45J267m00
$$ plain form
5304 890 -1015 -1095 -326 487 873 -4 -917 -1000 521 1025 472 -475 -782 -740 395 707 444 -564 -655 -387
5324 -387 314 676 245 -893 -1032 -191 600 358 -73 -711 -955 221 1322 488 -669 -877 -331 608 1144
5343 1144 47 -1262 -854 332 983 632 -307 -1419 -330 851 894 -304 -873 -599 391 842 562 -681
5361 -681 -1143 192 731 525 -482 -322 -431 761 861 -399 -1100 -291 847 550 163 -586 -986 19
5379 19 963 437 -649 -864 -306 753 1049 368 -861 -860 478 595 529 -134 -911 -638 432 1169 333 -639
5399 -639 -953 -916 846 1385 248 -773 -1031 -172 683 1159 36 -1078 -1505 383 1349 884 -423 -1289
5417 -1289 -667 493 1666 219 -1110 -1301 -126 969 854 -413 -1182 -624 870 1103 215 -714 -895
5434 -895 -117 944 560 -551 -858 -23 461 729 82 -821 -312 479 917 -195 -676 -331 22 787 394
$$ packed form
5304H90j905q0P69Q13L86q77r13q3J521N04n53r47l07M2J135L12k63j008r1K68
5324c87P01L62m31j138j39Q41P91k42m31o38k44J176J101q34j157k08N46R39N36
5343A144j097j309M08J186O51l51r39j112J089J181M3j198n69K74R90M51k80j243
5361f81m62J335N39k06j007J60j09J192J00j260p01Q09J138k97l87p49m00J005
5379A9R44n26j086k15N58J059K96o81j229JJ338J17o6o63p77K73J070P37q36r72
5399f39l14L7J762N39j137j021k58Q59Q55M76j123j114m27J888R66m65j307q66
5417a289O22J160J173j447j329j91J175J095j15j267p69N58J494K33q88r29j81
5434h95P78J061l84j111l07Q35M84K68o47r03N09P91M38j112m81L45L53P65l93
$$ plain form
5453 394 -458 -571 -22 556 624 -288 -779 -897 -24 978 609 -480 -737 -363 190 694 719 -600 -1071 -152
5473 -152 485 921 -166 -1085 -1089 -191 1680 997 -279 -1430 -966 282 1400 728 -1091 -1456 -323 1194
5491 1194 1501 462 -944 -1385 176 1436 585 -393 -1265 -585 346 1469 563 -853 -932 -391 658 855
5509 855 376 -926 -906 51 828 527 -159 -510 -549 -92 228 136 86 -272 -198 34 425 473 -97 -302 -241 -189
5531 -189 378 637 -78 -481 -264 97 546 680 650 -337 -773 103 178 292 303 -45 -432 57 251 386 6
5552 6 -231 -588 -232 758 558 -193 -311 -540 -152 429 815 29 -685 -737 -218 253 660 -80 -1230 -825 327
5573 327 462 592 -421 -921 -521 601 697 229 -996 -633 42 294 507 -96 -550 -191 375 249 -24
5592 -24 -91 -209 -376 352 -85 -232 49 111 34 -304 -70 -136 -74 -133 -388 -284 -55 165 -221 -153 -101 -483 -112
$$ packed form
5453C94q52j13N49N78O8r12m91j18Q73J002l69j089k57L74N53N04K5j319m71R19
5473a52O37M36j087r19mQ98J871o83j276j151M64J248J118o72j819l65J133J517
5491A194L07j039j406m41J561J260q51r78q72O80R31J123r06j416p9N41J049J97
5509H55m79j302K0R57P77l01o86l51l9M57L20r2n0l58P4K32L91M8n70k05O1N2
5531a89N67K59p15m03K17L61M49J34l0r87m36Q76P5J14J1l48l87M89J94J35l80
5552Fk37l57L56R90k00p51j18k29L88N81L86p86p14n2N19M71M07p40j150M05J152
5573C27J35J30j013n00M00J122R6m68j225L63O75K52K13o03m54L59N66j26k73
5592b4o7j18j67P28m37j47K81O2p7l38K34o6O2n9k55J04K29K20l86O8N2l82L71
$$ plain form
5615 -112 582 398 -155 -505 -98 -176 69 336 181 -440 -275 -325 155 554 -86 -806 -528 154 509 291 -73
5636 -73 -329 -217 81 613 104 -524 -765 -289 534 635 279 -398 -426 70 389 301 144 -598 -435 216 774
5657 774 465 -256 -742 34 548 650 -116 -410 -169 287 307 379 -137 -272 50 125 -142 -19 88 0 -70 52
5679 52 387 95 1 170 -206 -380 13 -60 87 419 -210 -93 299 260 158 -196 49 -84 -118 -186 392 -13
5701 -13 -360 26 -156 -107 -1 -133 192 -222 -211 2 465 407 -170 -512 24 211 152 -275 -365 -704 -8 432
5723 432 246 -401 -377 -311 167 572 -105 -528 -571 242 433 2 157 -629 -411 191 614 -60 -405 -104 -214
5744 -214 148 558 36 -274 178 -7 -211 311 -71 -243 -227 -17 -67 126 149 280 -402 -324 28 35 11 75 -407
5767 -407 -278 210 94 -123 -103 -83 -163 369 365 -179 -568 70 125 123 69 21 -12 117 383 116 -221 65 186 -112
$$ packed form
5615a12O94j84n53l50M07p8K45K67j55o21J65n0M80L99o40p20K78O82L55k18l64
5636g3k56J12K98N32n09o28k41M76Q23J01l56o77k8M96L19q8j57p42J63O51N58
5657G74l09p21m86P76N14J02p66k94K41M56K0P2n16j35L22P5k67J23J07q8p0J22
5679E2L35k92r4J69l76j74L93p3J47L32o29J17L92l9j02l54K45j33l4o8N78m05
5701a3l47L86j82M9J06j32L25m14J1K13M63n8n77l42N36J87n9m27r0l39O96M40
5723D32j86o47K4O6M78M05o77m23m3Q13J91m31J55p86K18O02M23o74l45L01j10
5744b14L62M10n22l10M52j85k04N22l82j72J6K10n0J93K3J31o82P8L52Pk4O4m82
5767d07J29M88j16k17K0K0q0N32mn44l89O38N5kn4m8l3J29K66k67l37K86J21k98
$$ plain form
5791 -112 28 123 113 212 32 -176 -582 98 174 159 184 22 -329 -49 491 285 -202 -353 -85 338 255 -265
5813 -265 -354 5 141 131 -270 -147 -18 -169 104 264 -220 38 27 -116 -505 92 372 243 -210 -61 -518
5834 -518 169 494 270 -321 -719 -269 342 687 -82 -607 -290 189 693 424 -566 -791 -413 476 519 -13
5854 -13 -590 -614 -128 435 611 152 -626 -293 242 247 97 -141 -387 -206 275 109 -58 -172 -348 -303 225 426
5876 426 -82 -411 -244 17 137 508 246 -778 -719 127 627 236 -202 -751 -356 563 683 -176 -542 -452
5896 -452 116 942 704 -611 -959 -288 772 504 175 -341 -407 300 666 211 -464 -274 -24 143 492 327
5916 327 -408 -251 171 116 -154 -137 49 -235 155 224 221 -267 452 -294 5 379 298 136 -229 100 180 283
5938 283 524 -205 -402 75 334 471 -139 -441 -342 285 900 300 -439 -359 -146 392 544 -257 -725 -434 485
$$ packed form
5791a12J40R5j0R9j80k08m06O80P6j5K5j62l51K80N40k06m87j51K68M23q3n20
5813b65q9L59J36j0m01J23J29j51K73J60m84K58j1j43l89N97K80j29m53J49m57
5834e18O87L25k24n91l98M50O11L45p69n25L17M79N04k69r90k25L78Q89M3n32
5854a3n77k4M86N63J76m59p78L33N35Nj50k38k46J81M81j66j67j14j76M5N28K01
5876D26n08l29J67K61J20L71k62j024N9Q46N00l91m38n49L95R19J20q59l66R0
5896d52N68Q26k38j315l48O71J060k68l29n16o6P07L66m55o75J90K50J67L49j65
5916C27p35J57M22n5k70J7J86k84L90O9lm88P19p46K99L74q1j62l65L29Q0J03
5938B83K41p29j97M77K59J37o10l02R9O27O15o00p39Q0K13N38J52q01m68K91R19
$$ plain form
5959 485 255 67 -318 -171 -140 302 577 -97 -451 398 375 340 287 -283 -303 203 482 -84 -246 -292 -314 -75
5981 -75 4 -296 -385 -378 -13 -459 -11 326 99 -106 -282 -89 -254 430 161 -553 -512 233 86 -97 -189 -360
6003 -360 -256 383 373 -386 -662 -141 301 419 157 -382 -392 83 695 190 -231 -217 -45 312 273 -64 -766
6024 -766 -418 249 353 -33 -221 -650 -71 609 633 -25 -227 69 169 404 123 -275 109 110 329 -225 218
6045 218 -43 127 -265 242 123 342 13 58 -427 262 519 479 -350 -580 -408 475 555 107 -586 -580 430
6066 430 342 307 -148 -563 11 636 254 -235 -704 -393 163 542 209 -233 -483 436 435 157 -303 -200 -139 392
6088 392 511 -177 -405 -318 -60 144 -105 -99 37 -58 47 -138 -480 240 240 -88 -82 92 -159 -56 -32 -432 -368
6111 -368 -250 533 -153 -301 -277 49 143 42 -230 -377 173 146 -103 -39 -80 -356 197 266 -223 -253 313 304 309 41
$$ packed form
5959D85k30j88l85J47L1M42K75o74l54Q49k3l5n3n70k0N06K79n66j62m6k2K39
5981g5P9l00q9PL65m46M48L37k27k05j76J93j65O84k69p14M1P45j47j83r2j71
6003c60J04O39j0p59k76N21M42J18k62n39j0M75O12n05m21J4J72L57l9l37p02
6024g66L48O67J04l86j88m29N79O80K4o58k02K96J00K35k81l98L84JK19n54M43
6045B18k61J70l92N07j19K19l29M5m85O89K57m0q29k30J72Q83Q0m48o93OJ010
6066D30q8l5m55m15N74O25l82m89m69L11N56L79l33m42k50R19jk78m60J03O1N31
6088C92J19o88k28Q7K58K04k49OJ36r5J05j85l42P20%l28OJ74k51J03K4m00O4
6111c68J18P83o86j48K4L26R4j01k72j47N50k7k49O4m1k76N53O9m89l0N66rNk68
$$ plain form
6135 41 -552 -178 256 677 -55 -694 -355 202 570 637 -142 -576 229 496 211 -381 -482 -265 12 531 252
6156 252 -141 99 115 170 158 -65 -13 -168 185 197 -109 154 192 2 -144 213 54 356 320 -496 -222 -335
6178 -335 382 354 11 -377 -58 493 679 428 -498 -660 125 231 118 -33 -379 -356 227 229 -34 82 -4 -58
6200 -58 -151 325 -97 85 -16 -148 -377 -101 113 147 -222 -331 -326 -137 690 81 -737 -623 -4 268 740 -10
6222 -10 -714 -586 170 738 453 -221 -404 -263 388 735 -95 -715 -315 254 189 530 260 -238 -140 180 190
6243 190 59 -198 -11 -37 -134 -109 -144 169 -432 -425 -201 34 238 -56 -155 -141 -319 -45 88 304 188 -23 80
6266 80 34 336 273 -152 -356 -1 -143 203 582 117 -365 28 -114 222 687 337 -701 -896 -66 631 847
6287 847 173 -534 -705 413 1010 585 -504 -824 -428 794 1331 458 -920 -1240 216 1005 778 99
$$ packed form
6135D1n93L74M34M21p32o39L39N57L68O7p79m34Q05K67k85n92j01K17K77N19k79
6156B52l93K40J6N5j2k23N2j55L53J2l06K63L8j90j46L57j59L02l6q16K74j13
6178c35P17k8l43l88L19N51J86k51r26j62P85J06j13j51l46K3N83Kk63J16q6n4
6200e8r3M76m22J82j01j32k29K76K14L4l69j09NJ89Q27o09q18J14O19K72M72p50
6222a0p04J28P56N68k85o74j83J41O51L47q30o20M00N69o5L41k70m98R8L20J0
6243A90j31k57J87k6r7K5l5L13o01PK24K35K04k94r9J4j78K74J33K16j16k11J03
6266H0m6L02o3m25k04L55j42L46L79m65m82L93j42L36M65l50j038j95Q30O97K16
6287H47o74p07j71J118N97m25j089l20L96J222N37q73j378l20J456P89k27o79
$$ plain form
6305 99 -1202 -889 857 1231 768 -308 -904 -306 521 1267 543 -906 -1202 -183 911 1159 97 -826
6323 -826 -977 116 807 704 -8 -833 -711 254 1274 572 -355 -714 -572 212 1264 138 -758 -985 -45
6342 -45 1020 650 -29 -1052 -590 348 810 289 -529 -914 -560 839 676 -214 -712 -273 350 187 179 -331
6362 -331 -341 8 159 151 -114 -54 51 -219 212 -118 -156 123 442 256 -465 107 -113 50 647 191 -240 -400
6384 -400 87 -5 70 -76 -634 -551 -165 414 266 -67 -239 -780 267 695 566 -376 -864 -326 520 776 559
6405 559 -629 -858 -29 730 886 131 -833 -809 103 1044 434 -623 -1192 -526 391 986 204 -855 -932 -98
6425 -98 530 875 26 -759 -683 318 487 447 -188 -687 -558 343 644 89 -421 -307 126 428 820 152 -521
6446 -521 -530 -101 359 613 259 -400 -626 -271 509 520 -89 -436 -582 -248 543 715 -180 -445 -357 287 622
$$ packed form
6305I9j301L13J746L74m63j076n96N98Q27P46p24j449k96J019J094K48j062r23
6323h26j51J093O91j03p12q25J22R65J020p02r27l59J42P84J052j126q96k27R40
6342d5J065l70o79j023M62R38M62n21q18l85L54J399j63q90m98M39O23j63qn10
6362c31j0L49J51qk65O0J05k70M31l30l8K79L19j86p21N72k20J63N97m56m31j60
6384d00M87r2P5j46n58Q3L86N79j48l33j72n41J047M28j29r42m88N38Q46K56k17
6405E59j188k29Q29P59J56p55r64K4R12R41o10j057n69O66R17N95p82j059p7Q34
6425i8O28L45q49p85P6J001J69m0o35m99J29R01L01n55n10J14M33L02L92o68o73
6446e21rM29M60K54l54o59k26L55P80J1o09l47j46L34P91J72q95k65Q8O44L35
$$ plain form
6467 622 575 -389 -606 -225 124 409 172 -69 -529 -181 302 327 54 -398 -176 -409 -40 464 144 -493 -359
6488 -359 -124 266 675 177 -72 -708 -383 426 397 -19 -607 -970 184 639 354 58 -515 -650 -13 746
6508 746 185 -413 -684 -367 450 449 194 -239 -337 -96 625 419 26 -429 -790 -153 618 -46 -274 -103 -285
6529 -285 210 357 194 -170 -302 -161 48 300 177 -4 -456 -224 422 139 117 30 -143 5 329 178 177
6550 177 164 -102 -44 102 255 19 226 215 185 -242 308 116 -204 28 -149 -239 -174 464 328 0 -166 -179
6572 -179 243 544 370 -506 -569 127 668 410 -205 -348 -460 208 778 276 -237 -499 -319 81 847 347
6592 347 -386 -648 35 330 637 307 -457 -501 239 604 409 -78 -594 -752 310 621 463 -298 -562 -195
6612 -195 72 822 442 -621 -796 -125 522 766 -63 -634 -810 -151 764 468 -184 -537 -248 133 504 169
$$ packed form
6467F22m7r64k17L81L49K85k37k41m60L48M83K5k73m52K22k33L69N04l20o37J34
6488c59K35L90M09m98k49o36L25Q09k9m16n88l63J154M55k85k96n73j35O37P59
6508G46n61n98k71L17Q17jk55m33r8K41P21k06l93m55l61O37P71o64k28J71j82
6529b85M95J47j63l64j32J41K09K52j23j81m52K32O46k83k2q7j73J48L24j51j
6550A77j3k66N8J46J53k36K07j1l0m27N50j92l20K32j77r0O5O38j36l28j66j3
6572a79M22L01j74q76o3O96N41k58o15j43j12O68N70n02n13k62J80M00P66n00
6592C47p33k62O83K95L07l30p64m4P40L65j95m87n16j58J062L11j58p61k64L67
6612a95K67P50l80j063j75O71O47K44q29n71j76O59R15k96o52l53K89L81L71l35
$$ plain form
6632 169 -228 -418 -145 364 748 312 -369 -570 139 408 412 -202 -261 -724 -194 494 138 14 -459 -286 -250
6653 -250 495 191 -27 -171 125 -6 23 111 -175 -173 -192 -105 -153 209 278 -17 -205 261 98 138 -2 -56 -257
6676 -257 -25 73 243 213 3 106 -231 364 54 38 -161 -353 -101 212 140 182 -100 -101 -58 101 408 150 -108
6699 -108 -152 -111 228 205 580 -88 -396 -54 376 340 -90 -371 -370 -12 530 411 -28 -576 -178 188 515 451
6721 451 -453 -429 -184 501 382 60 -278 -358 -256 385 294 10 -266 -413 -173 248 245 127 -272 -204 -17 298
6743 298 169 137 -232 -23 288 125 53 -120 -431 -547 110 187 26 -214 -98 -44 381 392 43 -336 -293 -220
6765 -220 119 191 -54 -287 -163 323 164 74 -123 -196 -200 395 -25 -367 -457 65 -274 4 98 -127 223 141 159
6788 159 -46 -1 275 332 31 -280 -161 -13 -71 131 -13 -422 -32 155 161 25 -303 -444 -108 122 389 38
$$ packed form
6632A69l97j90K73N09L84m36o81k01P09K69Mo14n9m63N30O88l56j24m73J73L6
6653b50P45l04k18j44K96j31K9Q8k86Kj9Q7m8L62O9k95j88M66j63M0j40n4k01
6676b57K32R8J70l0k10J03l37N95l10j6j99j92K52L13p2M2k82jM3J59L07k58k58
6699a08m4M1L39k3L75o68l08L42M30l6m30k81JL58N42j19m39n48L98L66L27o4
6721D51r04K4K45O85j19l22l38q0J02O41r1k84k76j47K40M21lj18l99O8J87L15
6743B98j29l2l69K09L11j63p2j73l11j16O57P7j61k40J16N4M25J1l49l79M3P3
6765b20L39P2k45k33J24M86j59r0j97p3mN95m20l42r0N22l39K78R4k25L50q2J8
6788A59k05M5K76N7l01l11J19J48n8K02j44m09L90J87Oj36l28j41L36K30K67l51
$$ plain form
6810 38 -232 -188 18 -102 393 216 -366 -124 161 278 469 387 -394 -440 32 189 432 32 61 -322 328 235
6832 235 118 -75 -416 -280 404 664 -117 -474 -298 -218 286 223 -9 -190 -20 345 51 37 12 -372 -221
6853 -221 172 483 -117 -399 -278 -457 -50 86 -3 210 -164 -569 -141 148 1 160 -185 105 27 101 276
6874 276 1 -389 -122 2 96 243 -259 -392 -188 117 107 -68 97 -304 -160 227 307 183 -75 34 22
6895 22 -20 121 -63 141 -129 -207 175 309 142 52 96 -136 102 330 -93 -126 -584 182 420 530 -46 -466
6917 -466 -510 -6 247 70 -53 -204 -64 274 226 47 -477 -184 -90 193 348 -293 -115 -240 391 -174 -312
6938 -312 -386 34 127 -35 52 493 95 -353 -26 -146 89 350 53 -51 -275 -174 366 295 -76 -224 -66
6959 -66 -7 6 271 -78 -129 20 394 261 422 -247 296 -164 66 -144 184 83 -139 195 181 4 226 171
$$ packed form
6810C8k70M4K06j20M95j77n82K42K85J17J91q2p81m6M72J57K43m00K9l83O50r3
6832B35j17j93l41J36O84K60p81l57J76Q0N04o3k32j81J70L65k94j4k5l84J51
6853b21L93L11o00k82J21j79M07J36q9K13l74m05M28K89j47J59l45K90p8P4J75
6874B76k75l90K67J24R4J47n02j33K04L05j0j75J65m01J44L87Q0j24k58J09j2
6895B2m2J41j84K04k70p8L82J34j67r0M4k32K38K28m23l3m58P66K38J10n76m20
6917d66m4N04K53j77j23j51J40L38m8j79n24K93R4K83J55o41J78j25O31n65j38
6938c12p4M20R3j62Q7M41l98m48L27j20K35K61k97j04k24J01N40p1l71j48J58
6959f6N9J3K65l49n1J49L74j33J61o69N43m60K30k10L28j01k22L34j4j77K22n5
$$ plain form
6981 171 -222 -549 240 53 47 104 -201 -257 108 579 -66 -274 -302 -20 120 307 144 -373 -556 68 465 202
7003 202 29 -606 -59 401 429 195 -145 -88 -61 -38 55 306 -173 -152 71 172 160 76 239 -83 -507 3 287
7026 287 140 -31 -363 -294 61 123 221 -66 -227 204 436 535 -67 -454 -138 79 387 236 -204 -138 8 135
7048 135 220 96 -289 -177 93 233 96 -20 180 -42 -123 -71 115 379 -37 282 -211 97 208 181 121 108
7070 108 270 79 565 231 8 -444 327 409 175 5 -164 -168 -263 325 34 -54 127 -10 40 397 213 -192
7092 -192 -74 130 203 229 253 90 -111 -264 176 54 -36 -74 -111 109 -426 393 -168 164 -213 -191 -102 169 231
7115 231 -235 -50 -80 133 248 -293 -4 -377 417 -38 135 0 372 8 191 -175 6 187 263 313 -72
7136 -72 91 -252 242 34 -168 -287 -75 270 244 -52 -22 -253 57 249 -117 -139 -325 -137 215 54 297
$$ packed form
6981A71l93l27P89j87oN7l05n6L65M71o45k08k8K82J40J87j63n17j83O24L97k63
7003B02j73o35N47M60K8k34l40N7K7K3R3K51m79K1K23J01j2q4J63l22m24N10K84
7026B87j47j71l32O9L55O2R8k87j61M31K32R9o02l87L16K17L08j51m40O6J46J27
7048A35Q5j24l85J12K70J40j37j16K00k22q1N2J86K64m16L19m93L08J11k7o0j3
7070A08J62j91M86l34k23m52P71Q2k34j70j69mr5N88k91q8J81j37N0L57j84m05
7092a92J18K04P3K6K4j63k01j53M40j22r0l8l7K20n35Q19n61L32l77K2Q9K71O2
7115B31m66J85l0K13J15n41K89l73P94m55J73j35L72l64J83l66J81J81P6N0l85
7136g2J63l43M94k08k02j19K12L45k6k96L0k31L10J92l66k2j86J88L52j61K43
$$ plain form
7157 297 25 -379 52 327 -65 5 -127 43 191 1 211 -67 -72 66 134 229 104 -103 -123 -170 -200 21 61
7180 61 105 -488 -233 408 166 49 -38 -243 -28 431 446 51 -401 59 -8 -10 -4 -241 -296 -54 215 178 -77 -241
7204 -241 76 82 97 150 -47 -253 2 208 170 5 -160 -117 207 78 -210 -18 -54 152 80 37 -91 53 -9
7227 -9 64 39 -129 55 -23 196 -165 194 95 -34 -159 47 122 207 -50 84 271 8 196 199 138 118 -156 -149 337
7252 337 211 328 -137 -167 257 -89 -142 61 -187 -142 337 -227 -89 332 96 -69 -83 315 70 -216 -157 -202
7274 -202 -129 152 191 -183 174 -101 -30 -57 -45 194 -249 -163 -9 48 -37 66 6 43 85 -139 24 -128 -51 -71
7298 -71 -45 33 -2 -173 327 196 -151 -77 -186 -200 43 13 39 -258 -58 111 -38 190 8 -48 175 235 -57
7321 -57 -74 235 102 -30 -251 -289 -125 -6 301 68 124 35 13 -118 -58 187 -44 25 7 81 -35 -63 74 145
$$ packed form
7157B97k72m04M31K75l92P0j32J70J48j90K10k78nJ38O8R5j25k07k0m7l0K21M0
7180F1M4n93K55O41k42j17q7k05K15M59J5l95m52M60o7kOk37n5K42K69l7k55j64
7204b41L17OJ5N3j97k06K55K06l8j65j65M3L24j29k88J92l6K06p2m3j28J44o2
7227iP3k5j68J84p8K19l61L59r9j29j25K06P5Q5k57J34J87k63J88Lo1k0k74PM86
7252C37j26J17m65l0M24l46n3K03k48M5M79n64J38M21k36j65j4L98k45k86N9m5
7274b02P3K81L9l74L57k75P1k7J2K39m43Q6J54N7q5J03o0L7M2k24J63j52P7k0
7298g1K6P8l5j71N00j31l47P4j09j4K43l0K6k97K00J69j49K28j82n6K23O0k92
7321e7j7L09j33j32k21l8J64J19L07k33N6q9k2j31O0K45k31O9j8P4j16k8J37P1
$$ plain form
7345 145 -196 -76 -26 315 217 -66 -292 69 147 23 -80 -138 -154 -69 302 -133 -94 -86 55 85 -121 135 235
7368 235 14 134 85 41 32 -158 -223 -69 245 141 -163 -18 -82 -114 116 251 154 136 75 -126 -250 115 -117
7391 -117 117 200 12 18 81 -40 28 194 -53 -47 5 -143 -81 -21 -126 -187 192 -77 5 -26 -105 144 97 125 42 -80
7417 -80 36 -121 309 341 141 -173 -157 -395 240 174 -90 -341 -318 46 -38 -93 -101 46 -117 281 -178 139 -118
7440 -118 155 -18 140 17 -92 -356 106 279 -115 41 -274 -274 100 191 86 140 -299 -200 -27 158 -28 13
7462 13 -465 -218 15 365 455 -113 -232 -83 420 395 -98 -339 -17 32 35 -69 -164 3 15 174 226 -40 -111
7485 -111 -43 72 219 65 -17 -366 -133 69 28 -100 -234 273 -42 268 103 -12 -243 216 99 28 -145
7506 -145 -190 69 -89 132 -103 -179 -153 -219 67 263 37 -49 -33 -86 -137 107 138 -38 -211 -161 64 -47 -24 -293
$$ packed form
7345A45l41J20N0L41r8k83k26L61P8j24j03n8j6Q5L71m35L9QJ41L0k06K56J00
7368B35k21J20m9m4rj90o5J54L14j04l04J45o4l2K30J35r7j8o1k01j24L65k32
7391a17K34Q3j88OO3j21O8J66k47ON2j48O2O0j05o1L79k69Q2l1p9K49m7K8q3j22
7417h0J16j57M30L2k00l14J6k38O35o6k64k51K3L64q4n5qJ47j63L98m59L17k57
7440a18K73j73J58j23j09k64M62J73l94J56l15%L74R1j05N4m39R9J73J85j86M1
7462A3m78K47K33L50R0n68j19J49N03k5m93k41L22M9Lj04r5J67J2J59N2k66p1
7485a11O8J15J47j54q2l49K33K02m1j28j34N07l15L10j65j15k31M59j17p1j73
7506a45m5K59j58K21k35p6K6o6K86J96k26q6J6n3n1K44L1j76j73N0K25j11K3k69
$$ plain form
7530 -293 -171 -192 37 6 48 61 -132 -79 89 -109 -176 -339 140 444 21 -224 -21 -226 36 72 -217 -17
7552 -17 -75 -50 -257 140 151 -57 0 165 74 -2 280 -238 72 -81 -179 74 41 -142 302 -8 -9 -256 -60 53
7576 53 -27 0 41 227 46 -337 -350 241 214 -525 -33 -320 -78 125 12 -108 68 -158 240 552 -199 12
7598 12 -79 -11 -27 79 -297 -348 -177 -195 114 237 266 -68 -205 181 78 118 -193 77 181 133 -85 -44 -425
7621 -425 176 -319 334 334 -146 -150 -75 422 635 -227 -214 -331 -108 194 170 -257 -166 -129 421 250 -87 2 -100
7644 -100 114 173 61 -133 -161 -138 -111 479 199 -67 89 -220 171 85 -66 -311 -21 43 111 -32 27 28 98 -103
7668 -103 223 245 -26 -220 -3 191 228 84 -113 -7 118 209 -77 -84 -246 34 50 367 -148 -31 -239 -316
7690 -316 268 -81 150 -345 41 48 236 -2 119 -272 -34 320 -18 -1 -223 64 12 429 396 -143 -171 -153
$$ packed form
7530b93J22k1K29l1M2J3j93N3J68j98o7j63M79L04m23k45K03k05K62L6k89K00
7552a7n8K5k07L97J1k08N7J65r1p6K82n18L10j53r8K53l3j83M44l10jk47J96J13
7576E3q0K7M1J86j81l83j3N91k7p39M92k87K42K03j13j20J76k26L98L12p51K11
7598A2r1O8j6J06l76n1J71j8L09J23K9l34j37L86j03M0l11K70J04m8k18M1l81
7621d25O01m95O53%m80mP5M97K13q62J3j17K23L02k4m27R1L7N50j71l37Q9j02
7644a00K14N9j12j94k8K3K7N90k80k66J56l09L91q6j51k45K90O4O8j43N9JP0k01
7668a03L26K2k71j94K17J94L7j44j97J06J25R1k86pj62K80J6L17n15J17k08p7
7690c16N84l49K31m95L86PJ88k38J21l91K38L54l38J7k22K87n2M17l3n39k8J8
$$ plain form
7712 -153 265 -8 -126 100 243 -171 -49 -31 -55 -87 127 1 316 75 38 -125 360 -88 -55 310 -42 144
7734 144 -241 36 145 -61 72 -41 -25 -56 192 -131 0 81 -90 331 -54 50 -218 71 -239 -230 -162 70
7756 70 21 -48 410 71 -172 25 -84 -203 94 -6 -126 303 -82 134 -15 -407 247 -127 -47 -11 -14 -128
7778 -128 17 138 297 19 24 -175 -181 -397 -172 -31 -397 109 -308 354 59 59 38 -24 118 399 212 259 103
7801 103 -347 76 201 208 -19 149 -50 82 -129 -59 2 -82 -247 -92 -93 -140 69 88 -146 -110 218 -253 -151
7824 -151 -140 -246 278 -207 252 -318 -249 183 191 195 -110 -187 -58 180 -59 281 -67 -60 -40 78 346 -65 -503
7847 -503 2 120 26 183 -88 -41 43 -133 148 157 43 263 239 16 -88 166 -60 -20 -208 81 -61 78
7869 78 58 33 -147 63 20 171 184 -243 -73 -29 155 20 344 -187 74 185 -33 58 127 -139 -236 40 -35
$$ packed form
7712a53M18k73j18K26J43m14J22J8k4l2K14j26L15k41l7j63M85m48L3L65l52J86
7734A44l85K77J09k06J33j13J6l1K48l23J31Q1j71M21l85J04k68K89l10RO8K32
7756G0m9o9M58l39k43J97j09j19K97j00j20M29l85K16j49l92O54l74Q0L6lj14
7778a28J45J21J59k78Nj99ok16K25J41l66N06m17O62k95%k1o2J42K81j87M7j56
7801A03m50M23J25Pk27J68j99J32k11P0O1q4j65J55jm7K09J9k34L6L28m71J02
7824a51J1j06N24m85M59n70O9M32QMl05p7J29K38k39L40l48PK0J18K68m11m38
7847e03N05J18r4J57k71M7Q4j76K81Rj14K20k4k23j04K54k26M0j88K89j42J39
7869G8k0k5j80K10m3J51J3m27J70M4J84j35L24n31K61J11k18R1O9k66r7K76p5
$$ plain form
7892 -35 257 -113 131 103 -317 152 -91 83 -77 -247 -321 -62 39 147 -10 -148 78 14 355 -44 -328
7913 -328 -205 192 544 71 -206 -301 -280 -169 100 51 -109 -381 21 261 166 70 18 -43 194 209 466 -82 -154
7936 -154 -358 36 254 363 -74 -7 29 168 214 33 -36 -25 -106 -91 174 100 -309 -175 -120 197 -8 134 -71
7959 -71 155 288 -245 -190 -238 -255 -21 316 33 146 380 -136 15 177 -91 193 -78 -194 343 -113 1
7980 1 -109 127 -159 -100 51 276 -173 -131 -12 58 454 -72 45 72 102 -69 -196 -23 24 -84 -152 104 -74
8003 -74 158 -96 157 179 -113 -65 54 -76 33 60 -96 -68 58 28 -117 -98 -119 -171 250 225 -245 -89 26
8026 26 127 162 221 -171 -194 238 12 -138 251 -200 -274 -102 67 -48 -401 -213 -293 -340 168 -64 107 -162
8048 -162 -101 -204 -10 112 -229 88 -10 215 39 129 -190 -97 -47 -163 404 -395 -337 -277 -133 74 480 35
$$ packed form
7892c5K92l70K44k8m20M69k43J74j60j70p4K59J01J08j57j38K26o4L41l99k84
7913c28J23L97L52m73k77r5K1J11K69m9j60k72M02K40r5r6n2o1K37J5K57n48p2
7936a54k04L94K18J09m37O7L6J39M6j81o9J1q1J5K65p4m09J34N5L17k05J42k05
7959g1K26J33n33N5m8j7K34L37k83J13K34n16J51J62k68K84k71j16N37m56J14
7980Aj10K36k86N9J51K25m49M2J19P0L96n26J17K7L0j71j27J73M7j08o8K56j78
8003g4K32k54K53K2k92M8J19j30J09K7j56K8J26l0j45J9k1n2M21k5m70J56J15
8026B6J01L5N9l92k3M32k26j50L89m51p4J72J69j15l53J88q0m7N08k32J71k69
8048a62O1j03J94J22l41L17r8K25j76R0l19R3N0j16N67p99N8O0J44K07M06m45
$$ plain form
8070 35 -432 -324 -49 316 -74 198 -425 -30 129 181 220 -70 -99 -192 83 95 232 -60 -325 144 15 430
8092 430 25 -58 136 203 -133 205 84 -224 -133 -115 198 209 -137 -237 -350 215 32 246 -66 19 -98 -90 281
8115 281 230 270 -165 -221 124 348 79 63 -188 -281 37 174 110 17 -150 11 308 41 -170 130 -63 54
8137 54 -67 550 -297 83 -24 211 191 476 82 -279 -215 48 156 119 62 -132 -170 -62 222 345 -347 -300
8159 -300 -83 396 234 50 -93 88 76 -292 121 -298 -79 44 -84 143 -265 232 -122 -14 -216 -182 201
8180 201 -28 72 -244 -150 -56 17 237 -144 -202 -280 -94
$$ packed form
8070C5m67J08K75L65l90K72o23L95J59N2L9k90k9r3K75J2J37k92k65M69j29M15
8092D30m05q3J94O7l36L38j21l08R1J8L13J1l46j00j13N65j83K14l12Q5j17QL71
8115B81n1M0m35n6L45K24k69j6k51r3L18J37o4r3j67J61K97k67k11L00j93J17
8137E4j21O17q47L80j07K35k0K85l94l61O4K63J08l7n7j94l8J08K84J23o92M7
8159c00K17M79j62j84j43J81j2l68M13m19K19J23j28K27m08M97l54J08k02L4L83
8180B01k29J00l16R4R4P3K20l81n8p8J86
8191i4
$$ Imaginary data points
##PAGE= N=2
##DATA TABLE= (X++(I..I)), XYDATA
$$ plain form
0 0 0 0 0 -8 8 -2 8 -16 16 -24 32 -33 44 -58 66 -81 100 -115 137 -165 190 -219 256 -294 339 -390 441
27 441 -501 570 -641 723 -814 910 -1016 1138 -1266 1408 -1565 1734 -1921 2130 -2357 2608
43 2608 -2892 3203 -3552 3950 -4403 4920 -5527 6243 -7100 8164 -9509 11275 -13711 17303
57 17303 -23148 34297 -63275 295723 611259 -137952 -579357 -422350 215824 551223 315779
68 315779 -270154 -500757 -190803 311805 429115 102892 -319575 -351462 -4645 308712
78 308712 241996 -33946 -224056 -185792 7910 198639 183241 -14638 -179763 -153630 2218
89 2218 155586 162987 4032 -168049 -165040 7063 184721 179839 -36638 -235229 -151523 118721
101 118721 231511 74020 -139292 -189406 -41548 149035 168670 -7744 -156667 -108150
$$ packed form
0@%%%qJ6j0J0k4L2m0N6o5P7j02J24j47J81k15K52l02L55m09M75n50O33p29Q31
27D41r42J071j211J364j537J724j926K154k404K674k973L299l655M051m487M965
43B608n500O095o755P502q353R323j0447J1770j3343J5264j7673K0784k4986L1014
57A7303m0451N7445r7572L58998L15536p49211m41405J57007O38174L35399k35444
68C15779n85933k30603L09954N02608J17310l26223m22467l1887L46817L13357
78C08712o6716k75942j90110L8264J93702J90729j5398j97879j65125K6133J55848
89B218J53368P401j58955j72081L009J72103J77658m882k16477j98591Q3706K70244
101A18721J12790j57491k13312n0114J47858J90583J9635j76414j48923M8517
$$ plain form
111 -108150 48883 122946 43934 -76632 -75558 35048 66541 -30306 -76190 11148 91292
122 91292 48345 -66773 -125706 -37189 128506 156214 -28248 -202376 -136733 98676 232232
133 232232 93013 -179780 -253521 -18127 235982 204085 -51709 -239028 -169541 86843
143 86843 251833 121069 -150528 -230341 -49635 157463 176182 12608 -152458 -142673 10322
154 10322 122662 101573 2758 -94288 -114188 -18873 99736 111730 19054 -84850 -125679
165 -125679 -50865 101208 163329 38575 -138758 -170688 -18121 168105 178156 -24368 -208219
176 -208219 -144124 83490 207596 105450 -109053 -204663 -62038 157524 181288 -3898
186 -3898 -156558 -118371 36066 136861 82808 -54462 -106036 -28307 53327 54929 14293 -18745
$$ packed form
111a08150J57033P4063p9012j20566J074J10606L1493r6847m5884Q7338Q0144
122I1292m2947j15118n8933Q8517J65695K7708j84462j74128O5643K35409J33556
133B32232j39219k72793p3741K35394K54109l1897k55794j87319O9487K56384
143H6843J64990j30764k71597p9813J80706K07098J8719j63574j65066R785J52995
154A0322J12340k1089r8815r7046j9900R5315J18609J1994r2676j03904m0829
165a25679P4814J52073O2121j24754j77333l1930J52567J86226J0051k02524j83851
176b08219O4095K27614J24106j02146k14503r5610J42625K19562K3764j85186
186c898j52660L8187J54437J00795n4053j37270n1574P7729Q1634J602m0636l3038
$$ plain form
198 -18745 -23693 -5341 -239 -9724 17838 58647 21781 -67825 -80056 10712 103220 91177 -33458
211 -33458 -145208 -88315 92022 172316 50762 -127738 -167065 -18549 165200 164684 -33944
222 -33944 -186751 -115950 73813 169814 86099 -87086 -162221 -51661 106826 127537 16644
233 16644 -87651 -97693 -17342 74128 83318 11099 -53068 -66027 -35224 33264 85053 47123
245 47123 -48497 -93296 -46800 47514 106261 50360 -81406 -127561 -21035 107154 111113 -8567
257 -8567 -125806 -104579 45737 142177 60021 -89130 -124592 -22540 98116 105591 -16272
268 -16272 -121322 -70991 59844 97519 16702 -69500 -69879 9407 72455 34600 -47726 -54116
280 -54116 11841 48045 17991 -31937 -43703 6009 57712 25594 -52500 -58260 15252 64518
$$ packed form
198a8745m948J8352N102r485K7562M0809l6866q9606j2231R0768R2508j2043j24635
211c3458j11750N6893J80337Q0294j21554j78500l9327J48516J83749n16j98628
222c3944j52807P0801J89763R6001q3715j73185p5135J10560J58487K0711j10893
233A6644j04295j0042Q0351R1470R190p2219o4167j2959L0803O8488N1789l7930
245D7123r5620m4799M6496R4314N8747n5901j31766m6155J06526J28189L959j19680
257h567j17239K1227J50316R6440q2156j49151l5462J02052J20656P475j21863
268a6272j05050N0331J30835L7675q0817q6202l79P9286O3048l7855q2326o390
280e4116O5957L6204l0054m9928j1766M9712N1703l2118p8094n760P3512M9266
$$ plain form
292 64518 35850 -33636 -70332 -22330 60987 66565 -13369 -67911 -39946 25195 61253 31277
304 31277 -38464 -59346 -4450 43271 30972 -3155 -24152 -25936 -2350 24291 21650 3331
316 3331 -6948 -20047 -22953 10904 43892 26361 -20879 -48479 -28740 34340 77200 26005
328 26005 -69672 -81629 7607 90388 77461 -23934 -109394 -67474 66981 124140 32648 -89939
340 -89939 -106303 -3914 109012 99282 -32242 -121252 -58451 65034 102760 29113 -70800
351 -70800 -88822 -10 85572 60032 -29772 -67367 -28806 31736 54996 16228 -38056 -36712
363 -36712 7047 25832 12598 -1352 -11325 -13835 -180 7598 2424 5653 7920 -11724 -23394
376 -23394 -1296 20220 15283 -2632 -22817 -24535 7839 33265 9340 -27441 -24775 631 17514
$$ packed form
292F4518k8668o9486l6696M8002Q3317N578p9934n4542K7965O5141L6058k9976
304C1277o9741k0882N4896M7721j2299l4127k0997j784K3586K6641k641j8319
316C331j0279j3099k906L3857L2988j7531m7240k7600J9739O3080M2860n1195
328B6005r5677j1957Q9236Q2781j2927j01395q5460M1920J34455N7159r1492j22587
340h9939j6364J02389J12926r730j31524q9010O2801J23485L7726p3647r9913
351g0800j8022Q8812Q5582k5540q9804l7595L8561O0542K3260l8768n4284J344
363c6712M3759J8785j3234j3950r973k510J3655P778n174L229K267j9644j1670
376b3394K2098K1516m937j7915k0185j718L2374K5426k3925l6781K666K5406J6883
$$ plain form
389 17514 15095 -8664 -26380 -4958 22820 7693 -21373 -16563 8994 22451 10727 -23844
401 -23844 -38976 2697 49981 29239 -32473 -54736 -16436 42724 61374 3536 -69560 -57328
413 -57328 26706 73074 35619 -37891 -73108 -26067 57475 72585 -2314 -66466 -50514 12605
425 12605 58932 43917 -23193 -63038 -25741 33809 46135 15101 -24451 -42665 -16215 30632
437 30632 39011 9205 -19187 -30803 -19512 18801 44587 19374 -25720 -40515 -18754 25511
449 25511 54667 23100 -42200 -57163 -4282 49726 53418 3690 -55749 -53613 17841 67950
461 67950 36982 -27940 -56402 -27724 33674 60746 15393 -44757 -44196 2737 37559 36136 206
474 206 -37400 -29274 14031 33270 16948 -4936 -21251 -20807 4769 26980 17193 -4253 -16353
$$ packed form
389A7514k419k3759j7716K1422K7778j5127k9066M810K5557J3457j1724l4571
401b3844j5132M1673M7284k0742o1712k2263L8300N9160J8650n7838p3096J2232
413e7328Q4034M6368l7455p3510l5217M7041Q3542J5110p4899o4152J5952O3119
425A2605M6327j5015o7110l9845L7297N9550J2326l1034l9552j8214K6450M6847
437C0632Q379k9806k8392j1616J1291L8313K5786k5213m5094j4795K1761M4265
449B5511K9156l1567o5300j4963N2881N4008L692m9728n9439K136P1454N0109
461F7950l0968o4922k8462K8678O1398K7072m5353o0150N61M6933L4822j423l5930
474B06l7606Q126M3305J9239j6322k1884j6315M44K5576K2211r787k1446j2100
$$ plain form
487 -16353 -20121 -4931 25578 28947 -3549 -28454 -23248 1525 30295 32289 -8839 -42871 -23853
500 -23853 18622 35591 18151 -19276 -41588 -15519 30207 33702 -1890 -27895 -26127 -2587
512 -2587 25645 23596 -10341 -27104 -9377 8326 11688 7826 -6010 -16293 -5376 7261 2450
525 2450 -920 2304 -3385 -9200 -2391 1913 613 5213 3184 -11025 -11351 5088 10039 3482 -1703
540 -1703 -9777 -12726 3056 15737 5296 -7440 -10111 -9507 779 16472 11080 -9627 -15158 -5603
554 -5603 2907 14081 15536 -6230 -22772 -9313 10878 18216 12896 -6890 -26350 -13662 18501
567 18501 26522 7410 -14981 -25887 -11222 24094 34673 2029 -27917 -23940 805 26852
579 26852 31628 -764 -35578 -25138 14097 33805 21739 -10476 -36635 -20521 23961 39524
$$ packed form
487a6353l768J5190L0509L369l2496k4905N206K4773K8770J994m1128l4032J9018
500b3853M2475J6969j7440l7427k2312K6069M5726L495l5592k6005J768K3540
512b587K8232k049l3937j6763J7727J7703L362l862j3836j0283J0917J2637m811
525B450l370L224n689n815O809M304j300M600k029j4209l26J6439M951o557n185
540a703q074k949J5782J2681j0441j2736k671O04J0286J5693n392k0707n531R555
554e603Q510J1174J455k1766j6542J3459K0191P338n320j9786j9460J2688L2163
567A8501Q021j9112k2391j0906J4665L5316J0579l2644k9946L977K4745K6047
579B6852M776l2392l4814J0440L9235J9708j2066l2215k6159J6114M4482J5563
$$ plain form
591 39524 10585 -22466 -31546 -10151 27693 40023 2833 -35380 -28384 5737 30563 28571 -2940
604 -2940 -35020 -25025 13453 31063 16719 -9228 -28170 -19144 15171 30786 9989 -14415 -20116
617 -20116 -12631 8214 26996 14850 -15006 -24799 -10469 9682 24343 16779 -15110 -30775 -10579
630 -10579 17247 26348 12716 -17603 -35134 -9428 28956 29299 -1758 -26261 -26710 -1733 30115
643 30115 27309 -11282 -34130 -19304 9511 27750 19052 -13975 -32543 -12887 14414 20576 11110
656 11110 -7392 -26161 -18282 12129 25350 10007 -9711 -23212 -20202 7664 30620 16706
668 16706 -16774 -32112 -18036 16874 39886 15632 -31553 -40550 -4186 31008 34835 4985
680 4985 -36537 -39732 6577 42973 25222 -15921 -35617 -19634 17619 35672 10264 -23891
$$ packed form
591C9524k8939l3051r080K1395L7844J2330l7190l8213O996L4121K4826j992l1511
604b940l2080R995L8478J7610j4344k5947j8942R026L4315J5615k0797k4404n701
617b0116P485K0845J8782j2146k9856r793J4330K0151J4661p564l1889j5665K0196
630a0579K7826R101j3632l0319j7531K5706L8384L43l1057k4503m49K4977L1848
643C0115k806l8591k2848J4826K8815J8239q698l3027j8568J9656K7301O162r466
656A1110j8502j8769P879L0411J3221j5343j9718j3501L010K7866K2956j3914
668A6706l3480j5338J4076L4910K3012k4254m7185q997L6364L5194L827k9850
680D985m1522l195M6309L6396j7751m1143j9696J5983L7253J8053k5408l4155
$$ plain form
692 -23891 -23881 -1504 16301 20239 4829 -17338 -16234 4599 12545 6225 3929 -635 -10027 -7705
706 -7705 5111 11316 10815 2479 -12769 -14355 6630 19809 9845 -5732 -14495 -10924 10324 25154
720 25154 5911 -20635 -16315 5614 16099 11987 -2791 -15819 -8493 9989 11259 399 -3359
733 -3359 -3175 -2107 2323 1492 -3214 4048 11771 -2706 -18465 -6454 14209 16770 2760 -16358
747 -16358 -22083 1769 29323 20726 -13927 -32056 -15213 19519 38247 12667 -33584 -37141 3775
760 3775 34070 25045 -5728 -31536 -26757 9697 32968 15205 -15668 -25148 -12508 9231 22430
773 22430 10686 -11814 -17522 -11166 116 17271 21965 -2908 -29159 -22649 4670 27063 26521
786 26521 -4406 -39927 -31760 15501 43902 23393 -22343 -48647 -21614 34076 49496 3996
$$ packed form
692b3891J0K2377J7805L938j5410k2167J104K0833P946o320k296m564r392K322
706g705J2816O205n01q336j5248j586K0985J3179r964j5577q763L571K1248J4830
720B5154j9243k6546M320K1929J0485m112j4778j3028P326J8482J270j0860l758
733c359J84J068M430q31m706P262P723j4477j5759J2011K0663K561j4010j9118
747a6358n725K3852K7554q597l4653j8129J6843L4732J8728k5580m6251l557M0916
760C775L0295r025l0773k5808M779L6454K3271j7763l0873r480J2640K1739J3199
773B2430j1744k2500n708O356J1282J7155M694k4873k6251O510K7319K2393n42
786B6521l0927l5521Q167M7261K8401k0509m5736k6304K7033N5690J5420m5500
$$ plain form
798 3996 -42445 -38951 1740 39012 36091 -10659 -46935 -26344 20687 36600 13795 -17997 -31474
811 -31474 -12436 18077 23717 6001 -9126 -15944 -13171 4454 19974 13013 -4726 -15376 -16727
824 -16727 -2703 23687 27201 -4316 -31649 -22580 10341 35242 25994 -16186 -41725 -15822 27832
837 27832 38529 11126 -26638 -37138 -4422 36125 31491 -7953 -28568 -16917 6754 23008
849 23008 16458 -6785 -17709 -6435 4987 7602 10522 5719 -6753 -11892 -6419 2973 17390
862 17390 19039 -6177 -29906 -16103 17918 30804 13340 -19074 -35258 -9616 32033 34958
874 34958 -3077 -33762 -26695 8332 36209 22841 -19581 -35486 -8300 21555 23381 4763
886 4763 -17937 -22644 -1013 18955 12134 -3533 -7833 -6825 -4851 3044 7352 4070 1296 -6391
$$ packed form
798C996m6441L494M0691L7272k921m6750l6276K0591M7031J5913k2805l1792j3477
811c1474J9038L0513N640j7716j5127o818K773J7625J5520o961j7739j0650j351
824a6727J4024K6390L514l1517k7333R069L2921K4901r248m2180k5539K5903M3654
837B7832J0697k7403l7764j0500L2716M0547m634l9444k0615J1651K3671J6254
849B3008o550k3243j0924J1274J1422K615K920m803j2472n139N473R392J4417
862A7390J649k5216k3729J3803L4021J2886j7464l2414j6184K5642M1649K925
874C4958l8035l0685P067L5027K7877j3368m2422j5905K7186K9855J826j8618
886D763k2700m707K1631J9968o821j5667m300J008J974P895M308l282k774p687
$$ plain form
900 -6391 -15072 -5113 15536 15911 -4361 -18051 -15363 1542 22195 17857 -13578 -29345 -7965
913 -7965 18947 22087 1784 -21641 -22258 4288 23413 10112 -11279 -15897 -7115 5938 13252
926 13252 3026 -10924 -6482 3543 411 -3249 3670 6694 854 -7232 -11608 -3808 15597 18685
940 18685 -6127 -25324 -15226 10963 27695 16551 -18959 -37315 -8032 32660 32118 -3489
952 -3489 -31913 -27106 8408 36947 22126 -18301 -33362 -10230 19595 29052 8865 -22067 -25983
965 -25983 1082 21672 16431 1307 -11729 -16517 -3540 15371 16680 2736 -9292 -15405 -7955
978 -7955 13281 22961 6052 -16322 -20978 -5344 19319 28360 2414 -29367 -22942 10394 28916
991 28916 17653 -10932 -29615 -13311 21486 29128 1567 -22465 -18900 3288 22199 15808 -11319
$$ packed form
900f391q681R959K0649L75k0272j3690K688J6905K0653m338l1435j5767K1380
913g965K6912L140k0303k3425o17K6546J9125j3301k1391m618Q782J3053P314
926A3252j0226j3950M442J0025l132l660O919L024n840q086m376P800J9405L088
940A8685k4812j9197J0098K6189J6732j1144l5510j8356K9283M0692n42l5607
952c489k8424M807L5514K8539j4821m0427j5061K3132K9825R457k0187l0932l916
965b5983K7065K0590n241j5124j3036m788J2977J8911J309j3944j2028o113P450
978g955K1236R680j6909k2374m656J5634K4663R041k5946l1781O425L3336J8522
991B8916j1263k8585j8683J6304L4797P642k7561k4032L565K2188J8911o391k7127
$$ plain form
1004 -11319 -21105 -1839 14279 9418 -1852 -8081 -5702 4967 9404 -2843 -9266 1069 8546
1017 8546 2029 -6058 -7698 -1120 10069 9304 -8867 -16827 -1895 12995 10493 -1616 -13769 -13610
1031 -13610 4182 17659 5678 -12586 -13038 -2220 7541 10366 562 -12262 -8633 3207 5015
1044 5015 1708 438 -3500 -6728 -764 3811 1663 1746 589 -6866 -6650 5185 9412 951 -6826
1059 -6826 -8833 -3195 10052 12294 -5193 -16520 -5151 10139 12501 2425 -12974 -15709 4234
1072 4234 21079 8655 -14106 -17014 -1812 15543 17669 -3511 -23820 -12162 15555 21291 2738
1085 2738 -16466 -18661 1333 23480 16819 -11844 -22862 -5363 15174 19455 4434 -16916 -18732
1098 -18732 4921 20550 10706 -7194 -15037 -9123 8350 18968 6891 -11874 -13485 -2190 8361
$$ packed form
1004a1319r786J9266J6118m861j1270o229K379J0669M437j2247o423J0335P477
1017H546o517q087j640O578J1189p65j8171p960J4932J4890k502j2109j2153J59
1031a3610J7792J3477j1981j8264m52J0818R761K825r804j2824L629J1840J808
1044E015l307j270l938l228N964M575k148Q3j157p455K16J1835M227q461p777
1059f826k007N638J3247K242j7487j1327J1369J5290K362j0076j5399k735J9943
1072D234J6845j2424k2761k908J5202J7355K126k1180k0309J1658K7717N736j8553
1085B738j9204k195J9994K2147o661k8663j1018J7499K0537M281j5021k1350j816
1098a8732K3653J5629r844j7900p843N914J7473J0618j2077j8765j611J1295J0551
$$ plain form
1111 8361 13861 6466 -10696 -14614 -334 11889 11818 3024 -10996 -15727 1007 18032 12549 -5487
1125 -5487 -14604 -9802 7147 19960 8442 -15563 -17538 2049 16474 13571 -3499 -19489 -12009
1138 -12009 13549 21253 1115 -17619 -15087 2609 19439 14452 -11140 -24038 -5430 16958
1150 16958 16925 -689 -17105 -17392 4128 21653 9969 -13352 -18334 -5050 10809 15801 2379
1163 2379 -16722 -15386 4171 14258 7511 -4548 -13356 -10228 6825 15450 3384 -10354 -11481
1176 -11481 -4226 7639 13907 2383 -14510 -13266 2091 12199 11006 -1737 -16849 -13816 8257
$$ packed form
1111H361N500p395j7162l918J4280J2223p1q794j4020m731J6734J7025n483j8036
1125e487r117M802J6949J2813j1518k4005j975J9587J4425k903j7070j5990P480
1138a2009K5558P704k0138j8734K532J7696J6830m987k5592j2898J8608K2388
1150A6958l3j7614j6416k87K1520J7525j1684k3321m982J3284J5859M992j3422
1163B379j9101J336J9557J0087o747j2059q808L128J7053Q625j2066j3738j127
1176a1481P255J1865O268j1524j6893J244J5357J0108j193j2743j5112L033K2073
$$ [...]
8191B6
##END NTUPLES=NMR FID
##END=
