##TITLE=1H_CA-8698-2-1
 CDCl3, 8 sc, 
 5.7.2020
##JCAMPDX= 6.0         $$ Bruker NMR JCAMP-DX V2.0
##DATA TYPE= NMR FID
##DATA CLASS= NTUPLES
##ORIGIN= UXNMR, Bruker Analytische Messtechnik GmbH
##OWNER= root
$$ XWIN-NMR		Version 3.5
$$ Wed Aug  5 11:26:59 2020 Russian Standard Time (UT+4h)  she@DPX200
##.OBSERVE FREQUENCY= 200.1314999998
##.OBSERVE NUCLEUS= ^1H
##.DELAY= (6, 6)
##.ACQUISITION MODE= SIMULTANEOUS
##.ACQUISITION SCHEME= undefined
##.AVERAGES= 8
##.DIGITISER RES= 18
##SPECTROMETER/DATA SYSTEM= spect
##.PULSE SEQUENCE= zg30
##.SOLVENT NAME= CDCl3
##.SHIFT REFERENCE= (INTERNAL, CDCl3, 0, 15.7039)
##AUDIT TRAIL= $$ (NUMBER, WHEN, WHO, WHERE, WHAT)
$$ ##TITLE= Audit trail, XWIN-NMR		Version 3.5
$$ ##JCAMPDX= 5.01
$$ ##ORIGIN= Bruker BioSpin GmbH
$$ ##OWNER= she
$$ F:/spectra/data/she/nmr/H-F/1/audita.txt
$$ ##AUDIT TRAIL=  $$ (NUMBER, WHEN, WHO, WHERE, WHAT)
(   1,<2020-08-05 11:25:49.56 +0400>,<she>,<DPX200>,
      <created by zg, POWCHK disabled, PULCHK disabled
       configuration hash MD5:
       00 E9 B6 7A A2 85 ED C7 34 08 36 98 17 FE 4E 26
       data hash MD5: 16K
       DC 91 A5 37 84 9D F0 71 5F 20 50 27 4A 90 6A A5>)
$$ ##END=
$$ 
$$ hash MD5
$$ 70 98 F1 1E 37 33 8E B5 90 2E 11 29 5C 8A E1 AB
##$RELAX= 
##$RELAX= 
##$RELAX= 
##$RELAX= 
##$RELAX= 
##$RELAX= 
$$ Bruker specific parameters
$$ --------------------------
##$DU= <F:/spectra>
##$EXPNO= 1
##$NAME= <H-F>
##$PROCNO= 1
##$TYPE= <nmr>
##$USER= <she>
##$AMP= (0..31)
100 100 100 100 100 100 100 100 100 100 100 100 100 100 100 100 100 100 
100 100 100 100 100 100 100 100 100 100 100 100 100 100 
##$AQSEQ= 0
##$AQ_mod= 1
##$AUNM= <au_zg>
##$AUTOPOS= <>
##$BF1= 200.13
##$BF2= 200.13
##$BF3= 200.13
##$BF4= 200.13
##$BF5= 200.13
##$BF6= 200.13
##$BF7= 200.13
##$BF8= 200.13
##$BYTORDA= 1
##$CFDGTYP= 0
##$CFRGTYP= 5
##$CHEMSTR= <none>
##$CNST= (0..31)
1 1 145 1 1 1 1 1 1 1 1 1 1 1 1 1 1 1 1 1 1 1 1 1 1 1 1 1 1 1 1 1 
##$CPDPRG= <>
##$CPDPRG1= <>
##$CPDPRG2= <>
##$CPDPRG3= <>
##$CPDPRG4= <mlev>
##$CPDPRG5= <mlev>
##$CPDPRG6= <mlev>
##$CPDPRG7= <mlev>
##$CPDPRG8= <mlev>
##$CPDPRGB= <>
##$CPDPRGT= <>
##$D= (0..31)
0 1.2 0 0 0 0 0 0 0 0.06 0 0.03 0 0 0 0 0.0002 0 0 0 0 0 0 0 0 0 0 0 0 
0 0 0 
##$DATE= 1596612348
##$DBL= (0..7)
120 120 120 120 120 120 120 120 
##$DBP= (0..7)
150 150 150 150 150 150 150 150 
##$DBP07= 0
##$DBPNAM0= <>
##$DBPNAM1= <>
##$DBPNAM2= <>
##$DBPNAM3= <>
##$DBPNAM4= <>
##$DBPNAM5= <>
##$DBPNAM6= <>
##$DBPNAM7= <>
##$DBPOAL= (0..7)
0.5 0.5 0.5 0.5 0.5 0.5 0.5 0.5 
##$DBPOFFS= (0..7)
0 0 0 0 0 0 0 0 
##$DE= 6
##$DECBNUC= <off>
##$DECIM= 24
##$DECNUC= <off>
##$DECSTAT= 4
##$DIGMOD= 1
##$DIGTYP= 9
##$DL= (0..7)
0 120 120 120 120 120 120 120 
##$DP= (0..7)
150 150 150 150 150 150 150 150 
##$DP07= 0
##$DPNAME0= <>
##$DPNAME1= <>
##$DPNAME2= <>
##$DPNAME3= <>
##$DPNAME4= <>
##$DPNAME5= <>
##$DPNAME6= <>
##$DPNAME7= <>
##$DPOAL= (0..7)
0.5 0.5 0.5 0.5 0.5 0.5 0.5 0.5 
##$DPOFFS= (0..7)
0 0 0 0 0 0 0 0 
##$DQDMODE= 0
##$DR= 18
##$DS= 0
##$DSLIST= <SSSSSSSSSSSSSSS>
$$ [...]
##$SUBNAM2= <"">
##$SUBNAM3= <"">
##$SUBNAM4= <"">
##$SUBNAM5= <"">
##$SUBNAM6= <"">
##$SUBNAM7= <"">
##$SUBNAM8= <"">
##$SUBNAM9= <"">
##$SW= 24.9337058888022
##$SWIBOX= (0..15)
0 0 2 0 0 0 0 0 0 0 0 0 0 0 0 0 
##$SW_h= 4990.01996007984
##$TD= 16384
##$TD0= 1
##$TE= 0
##$TE2= 300
##$TE3= 300
##$TEG= 300
##$TL= (0..7)
0 120 120 120 120 120 120 120 
##$TP= (0..7)
150 150 150 150 150 150 150 150 
##$TP07= 0
##$TPNAME0= <>
##$TPNAME1= <>
##$TPNAME2= <>
##$TPNAME3= <>
##$TPNAME4= <>
##$TPNAME5= <>
##$TPNAME6= <>
##$TPNAME7= <>
##$TPOAL= (0..7)
0.5 0.5 0.5 0.5 0.5 0.5 0.5 0.5 
##$TPOFFS= (0..7)
0 0 0 0 0 0 0 0 
##$TUNHIN= 0
##$TUNHOUT= 0
##$TUNXOUT= 0
##$USERA1= <user>
##$USERA2= <user>
##$USERA3= <user>
##$USERA4= <user>
##$USERA5= <user>
##$V9= 5
##$VALIST= <valist>
##$VCLIST= <CCCCCCCCCCCCCCC>
##$VD= 0
##$VDLIST= <DDDDDDDDDDDDDDD>
##$VPLIST= <PPPPPPPPPPPPPPP>
##$VTLIST= <TTTTTTTTTTTTTTT>
##$WBST= 1024
##$WBSW= 4
##$XGAIN= (0..3)
0 0 0 0 
##$XL= 0
##$YL= 0
##$YMAX_a= 811642
##$YMIN_a= -709019
##$ZGOPTNS= <>
##$ZL1= 120
##$ZL2= 120
##$ZL3= 120
##$ZL4= 120
##$ABSF1= 10
##$ABSF2= 0
##$ABSG= 5
##$ABSL= 3
##$ALPHA= 0
##$AQORDER= 0
##$ASSFAC= 0
##$ASSFACI= 0
##$ASSFACX= 0
##$ASSWID= 0
##$AUNMP= <proc_1d>
##$AZFE= 0.1
##$AZFW= 0.1
##$BCFW= 1
##$BC_mod= 2
##$BYTORDP= 1
##$COROFFS= 0
##$CY= 11.3945322036743
##$DATMOD= 1
##$DC= 2
##$DFILT= <>
##$DTYPP= 0
##$F1P= 16.9975609425685
##$F2P= -3.02152046262296
##$FCOR= 0.5
##$FTSIZE= 0
##$FT_mod= 4
##$GAMMA= 1
##$GB= 0.15
##$INTBC= 1
##$INTSCL= 1
##$ISEN= 128
##$LB= 0.24
##$LEV0= 0
##$LPBIN= 0
##$MAXI= 10000
##$MC2= 0
##$MEAN= 0
##$ME_mod= 0
##$MI= 1.114404
##$NCOEF= 0
##$NC_proc= 0
##$NLEV= 6
##$NOISF1= 3.799351
##$NOISF2= 2.8
##$NSP= 1
##$NTH_PI= 0
##$NZP= 0
##$OFFSET= 15.70392
##$PC= 1
##$PHC0= -9796.656
##$PHC1= 16.40093
##$PH_mod= 1
##$PKNL= yes
##$PPARMOD= 0
##$PSCAL= 0
##$PSIGN= 0
##$REVERSE= no
##$SF= 200.130013532006
##$SI= 16384
##$SIGF1= 3
##$SIGF2= 2
##$SINO= 400
##$SIOLD= 16384
##$SREGLST= <1H.CDCl3>
##$SSB= 0
##$STSI= 0
##$STSR= 0
##$SW_p= 3612.71676300578
##$SYMM= 0
##$S_DEV= 0
##$TDeff= 0
##$TDoff= 0
##$TI= <>
##$TILT= no
##$TM1= 0
##$TM2= 0
##$TOPLEV= 0
##$USERP1= <user>
##$USERP2= <user>
##$USERP3= <user>
##$USERP4= <user>
##$USERP5= <user>
##$WDW= 1
##$XDIM= 8192
##$YMAX_p= 0
##$YMIN_p= 0
$$ End of Bruker specific parameters
$$ ---------------------------------
##NTUPLES= NMR FID
##VAR_NAME=  TIME,          FID/REAL,        FID/IMAG
##SYMBOL=    X,             R,               I
##VAR_TYPE=  INDEPENDENT,   DEPENDENT,       DEPENDENT
##VAR_FORM=  AFFN,          ASDF,            ASDF
##VAR_DIM=   8192,          8192,            8192
##UNITS=     SECONDS,       ARBITRARY UNITS, ARBITRARY UNITS
##FACTOR=    0.0002004,     1,               1
##FIRST=     0,             0,               0
##LAST=      1.6414764,     0,               0
##MIN=       0,             -709019,         0
##MAX=       1.6414764,     811642,          0
$$ Real data points
##PAGE= N=1
##DATA TABLE= (X++(R..R)), XYDATA
0 0 0 0 0 0 -8 8 0 8 -10 8 -17 24 -24 33 -41 46 -57 71 -79 96 -118 133 -155 181 -206 238 -274 310 -351
29 -351 398 -448 505 -569 633 -710 792 -880 980 -1088 1204 -1335 1482 -1637 1813 -2010
45 -2010 2226 -2471 2750 -3066 3431 -3861 4371 -4987 5755 -6736 8042 -9877 12654 -17368
59 -17368 27275 -88338 428539 811642 185759 -535028 -663368 -54129 553137 550427 -63858
70 -63858 -552206 -424243 155852 516158 301395 -232765 -449206 -159165 246220 323062
80 323062 99904 -174636 -268777 -110364 163520 258466 94495 -139045 -217781 -95533 120608
91 120608 222514 101902 -127535 -233921 -98887 171276 278208 53997 -247832 -235429
101 -235429 59746 259060 158843 -91346 -229531 -116074 128793 223733 61363 -147074
111 -147074 -161542 7931 145918 89233 -66529 -88624 32921 74307 -26279 -81501 3373
122 3373 100897 80044 -50973 -153507 -73960 135245 205532 11531 -220430 -196207 76053
133 76053 285431 159605 -178381 -311703 -71016 240872 268176 6587 -258770 -247031
143 -247031 46494 291225 188616 -125995 -269457 -105965 145465 214137 51377 -144232
153 -144232 -162008 -24073 100001 119397 43023 -79983 -137723 -54829 79582 127411 62079
164 62079 -64458 -156301 -98551 86477 193461 84190 -127854 -214882 -69611 168590 222325
175 222325 7636 -219762 -190280 47446 224253 150544 -99629 -241284 -94041 158307
185 158307 201460 11671 -163280 -142836 21653 142591 91903 -49373 -103780 -39879 32801
196 32801 49222 24509 -8134 -17676 -11684 -26480 -29479 35180 92529 30852 -92534 -119102
208 -119102 -3315 138328 140979 -34275 -196288 -127142 106913 222997 85212 -152144
218 -152144 -224915 -37885 204930 209712 -28338 -214987 -150684 67070 203752 122610 -90150
229 -90150 -190768 -68240 113816 150378 36277 -92869 -117013 -21775 85241 93132 20994
240 20994 -49889 -79938 -46849 45751 106818 54642 -55923 -109989 -55371 68567 139296 51572
252 51572 -110645 -145455 -8185 138122 131632 -24190 -160377 -108432 79017 168483 55310
263 55310 -112015 -144339 -15588 132476 125133 -38428 -149996 -67914 83940 115128 11861
274 11861 -91627 -79451 26706 87151 24449 -60060 -50719 18512 50067 14369 -43205 -48117
286 -48117 20540 67109 11158 -68612 -55402 26560 72201 32183 -52470 -83181 -8596 78647
298 78647 61007 -31074 -79985 -41135 38131 73710 19755 -59625 -58696 7493 43283 26632
310 26632 -4495 -29419 -31946 -3969 22200 23174 12210 -10751 -39794 -30208 23580 53874 24154
323 24154 -34496 -67922 -30642 60913 94642 5380 -100838 -87215 30074 119707 78034 -64301
335 -64301 -143114 -46220 113669 136352 1395 -129836 -113542 36210 150175 85204 -81845
346 -81845 -140953 -32482 101078 116000 6070 -106620 -90261 34472 108426 49848 -50071
357 -50071 -78441 -22346 52307 64414 3091 -47121 -27868 12716 23260 15777 3459 -11409
369 -11409 -12784 -1921 3429 11392 21408 5215 -25545 -21436 11462 29084 18441 -10715 -35218
382 -35218 -17276 31253 39912 -3402 -34858 -21368 12064 32056 14328 -26724 -30321 13212
394 13212 33548 1795 -27026 -16943 14080 32404 7183 -40024 -37001 23552 54498 11672
406 11672 -45234 -50615 1056 60780 51623 -29982 -80043 -30078 52000 69887 10193 -64104
418 -64104 -70065 10103 79637 47736 -39250 -72433 -28762 37896 62389 14096 -50976 -52082
430 -52082 3170 40172 31271 -2127 -35445 -36375 1604 31760 23901 -108 -21842 -33359 -12479
443 -12479 28749 38614 4651 -33044 -43626 -12989 41725 57474 440 -60503 -50903 12664
455 12664 62841 48736 -24480 -76356 -36106 47326 70144 16797 -47796 -61740 -9594 57035
467 57035 56314 -9777 -54825 -35926 14034 47966 34997 -16299 -47161 -20109 22717 34509
479 34509 19366 -9500 -33334 -21074 16924 34715 19956 -7639 -33255 -29746 14740 50029
491 50029 27301 -23414 -45449 -22212 29166 58285 20891 -44347 -54371 -2384 48346 50005
503 50005 1540 -53465 -47844 17815 59058 30717 -24434 -49122 -24411 28987 51578 11677
515 11677 -36233 -34435 211 26308 27259 1039 -28215 -22586 7276 20254 12504 -974 -15205
528 -15205 -16510 2939 15878 6229 -5127 -6481 -9416 -3701 11241 10790 -4443 -10029 -6872 -3708
542 -3708 5877 10635 -2182 -12040 -4736 296 849 5564 2608 -9324 -8260 539 -453 772 8507
557 8507 1769 -12941 -10805 1429 7729 9421 1090 -16285 -16997 4171 16713 10909 -2175 -19608
571 -19608 -22160 6063 30743 13604 -18842 -26660 -10719 14764 29714 11848 -24647 -31857 -3272
584 -3272 24922 28500 3370 -31903 -32241 9430 37652 20721 -12762 -30681 -21921 14867 41800
597 41800 18003 -27633 -36998 -5003 27970 34337 5610 -31162 -30288 4448 29178 25009 1177
610 1177 -26898 -29382 7108 35910 20120 -10629 -22284 -15273 3658 25985 23272 -4890 -25345
623 -25345 -19322 5372 30494 26748 -10220 -34487 -16892 15640 30995 22473 -9975 -39948 -21869
636 -21869 27683 42891 9629 -27729 -34368 -5805 32418 35926 -1737 -33626 -27958 3197 32780
649 32780 30964 -8885 -39692 -20171 17511 27631 13852 -6735 -26691 -23255 8126 31254
661 31254 21130 -8480 -31644 -25955 10541 37532 20726 -17124 -36146 -24934 13436 47016
673 47016 26593 -33531 -55058 -11977 38488 45451 5073 -44400 -48101 2935 49035 36979
685 36979 -13950 -49338 -34467 18740 49572 17527 -32000 -37076 -5982 19818 26102 8744
697 8744 -21276 -28116 -3167 18753 17381 2948 -13261 -18719 -5682 11285 14833 9243 -4884
710 -4884 -23775 -18295 15297 31393 7354 -21276 -24592 -5302 21638 29406 755 -31066 -23603
723 -23603 10642 30489 17541 -15273 -31902 -7414 26124 23429 -4673 -17961 -12332 1547
735 1547 15995 13126 -6281 -11636 1429 5928 -527 -394 5596 6687 998 -10221 -13461 7771
749 7771 26031 10359 -18600 -22258 -1716 21791 28045 2159 -31883 -26420 15192 37531 17170
762 17170 -17331 -32557 -12661 23872 32296 3599 -22032 -19793 -2730 14734 20025 3522 -14350
775 -14350 -11977 -2186 2641 11286 16450 -121 -21862 -19409 3927 25837 25046 -6919 -39294 -26714
789 -26714 19785 43796 19837 -27277 -50867 -18288 41389 53037 -1199 -51212 -41374 9064
801 9064 46867 34900 -18772 -52011 -24004 26411 40115 10999 -26625 -37055 -8659 25481
813 25481 25203 948 -16623 -21150 -13442 9689 26415 13244 -13151 -26133 -19219 5906 32965
826 32965 26032 -15521 -43211 -24755 20313 47435 22825 -34742 -55218 -8780 45008 44516 -1765
839 -1765 -44903 -43181 8135 52723 33744 -22930 -46651 -19307 22937 38634 13589 -23649
851 -23649 -29329 -4940 14963 18842 11420 -5520 -19452 -11155 6462 14596 15634 5979 -17437
864 -17437 -26915 -1503 30702 29589 -2758 -35350 -30657 14077 46879 24243 -24677 -41260 -13695
877 -13695 28738 44322 10364 -38285 -38477 9668 41019 24185 -13385 -32610 -15487 19240
889 19240 29568 5844 -16650 -15959 -2634 11709 16249 3145 -10259 -7016 -696 -919 6353 15055
903 15055 4038 -14853 -16593 -564 18136 21237 -980 -26657 -19527 11596 27635 14097 -13648
916 -13648 -29803 -12808 23228 29723 -2622 -27330 -17118 6953 19608 11528 -9663 -18495 -3965
929 -3965 9085 5361 -1460 -1951 -1834 -1024 -2720 -7469 -1549 13994 11075 -13902 -23529 -3336 19889
944 19889 21777 -1559 -29680 -26376 11325 35719 15912 -22426 -36341 -11780 28007 36950 -1398
957 -1398 -38895 -27258 12068 32036 18250 -13549 -32070 -15008 18368 25634 4701 -14986
969 -14986 -19095 -7153 12020 18293 4234 -9879 -13053 -9399 3670 19666 15290 -9491 -23026
982 -23026 -12378 10146 26286 16700 -17009 -33651 -8743 25841 30861 3506 -27398 -29541 5408
995 5408 36222 22090 -15622 -29232 -9974 17145 26627 6365 -20788 -18514 6874 17899 7787
1008 7787 -5122 -8549 -1293 7978 4557 -5841 -1941 10130 6625 -6934 -10464 -1203 11470 15595
1022 15595 -544 -20793 -14351 12904 23426 7263 -14422 -21275 -3539 22401 21517 -6249 -23672
1035 -23672 -11517 9643 19490 10211 -11979 -20641 -3172 15034 11882 -92 -9331 -11374 -1911
1048 -1911 10810 9482 -1325 -7042 -8217 -5416 6683 13431 1796 -12722 -12465 -1254 11371
1061 11371 14842 -1694 -21710 -14526 10262 20258 6511 -14809 -23381 -5217 22500 21646 -9229
1074 -9229 -27897 -13360 13886 24994 7410 -23461 -27721 3769 28449 15345 -14185 -26621
1086 -26621 -11142 18150 27010 280 -27298 -19230 8492 23046 12519 -11803 -25224 -8326
1098 -8326 18295 19585 -1855 -16846 -14487 293 16381 14257 -5166 -16251 -8198 3994 11647
1111 11647 11379 -2305 -15977 -10176 6363 14272 9954 -3185 -16607 -11861 10567 20465 6642
1124 6642 -11835 -16389 -4650 15892 20711 -854 -20082 -11913 9072 18744 9837 -9413 -18727
1137 -18727 -2332 18768 14638 -5682 -14593 -6521 8375 15818 4567 -13328 -11500 6281 13469
1150 13469 5342 -5155 -9787 -3049 10282 10553 -3369 -9425 -1812 4344 5594 3161 -3856 -5875
1164 -5875 1862 5917 -103 -2434 363 109 270 1935 -374 -2483 1619 2238 -2933 -2205 1819 432
1180 432 -1384 392 -974 -1784 1904 1400 -4298 -2263 3409 1511 -1810 -2063 -2839 -924 4621 2223
1196 2223 -5983 -5646 1294 2785 1678 -572 -5454 -4918 3398 5432 -2263 -4173 -1033 -583 328 1721
1212 1721 -1175 -2782 1385 473 -4655 -1986 3543 2796 -564 -3484 -6546 -1414 9133 7292 -6650
1227 -6650 -11722 -3229 7243 11994 4026 -12223 -15241 2518 16630 10372 -5682 -16263 -10850
1240 -10850 9076 20851 5819 -15691 -16635 -810 14566 17425 1087 -19027 -15881 7094 20302
1253 20302 11900 -5910 -19251 -12297 11420 23062 8108 -13233 -18604 -6740 14438 23907 5316
1266 5316 -20392 -20285 2360 21269 19207 -1923 -23633 -18165 10685 26279 12135 -12434 -23439
1279 -23439 -9320 17565 26007 2551 -21805 -18149 4245 20357 16274 -6154 -22483 -10222
1291 -10222 14720 19629 2754 -14277 -15659 -93 17820 13931 -7648 -17052 -6314 8104 13545
1304 13545 5595 -10780 -14942 583 14094 8687 -4612 -11347 -8327 5090 14133 4240 -11818
1317 -11818 -11995 209 10223 10844 -1722 -16181 -11106 8314 15537 4041 -10593 -15611 -4873
1330 -4873 14013 16729 -3321 -20140 -12588 6625 17799 10477 -11963 -23216 -6592 17016 18363
1343 18363 -718 -17654 -18068 1624 21361 14032 -10804 -20455 -7149 10557 16625 4817 -14480
1356 -14480 -17523 1304 15721 10755 -4240 -14180 -10325 5812 16327 6056 -9804 -12297 -3161
1369 -3161 7477 13047 4296 -11237 -12812 1947 11808 9221 -705 -11243 -10088 5012 14684 6863
1383 6863 -5971 -11313 -5801 8068 15750 4126 -12586 -11002 2935 11020 9144 -722 -11294
1396 -11294 -7610 7219 12098 2057 -7158 -7242 103 9008 7824 -4110 -8138 -431 5628 4286
1410 4286 1612 -2796 -5433 907 7195 2074 -4294 -1906 1560 2062 1942 -711 -3326 576 3503
1425 3503 495 -1086 490 -1293 -2277 2722 3440 -1603 -1999 190 -1154 -523 3240 2317 -3111 -3618
1441 -3618 -699 2142 4539 861 -7022 -5137 4192 5751 698 -3153 -5466 -4547 4765 8989 -517
1456 -517 -9490 -5568 2703 6138 3202 -4797 -8221 -171 6302 3024 -2478 -4755 -4705 712 7804 3048
1472 3048 -7467 -6685 1438 3875 1990 495 -3282 -4384 -85 2158 1552 1538 -1212 -4995 -2261 3608
1488 3608 2370 525 -393 -4097 -5382 2970 9023 2058 -7158 -6618 124 6759 8030 -918 -8969
1503 -8969 -4996 4120 7097 4542 -2715 -9057 -3241 9404 8100 -3691 -7215 -1172 4180 6043
1517 6043 2655 -5000 -6488 1806 6995 3886 -1192 -5339 -4133 4222 7612 206 -5335 -1442 1538
1532 1538 2069 3586 1762 -3593 -3844 2025 4001 2862 357 -3985 -4825 1676 5792 3340 -15 -4085
1548 -4085 -6776 756 10153 5391 -6204 -8008 -1012 5575 7874 1726 -8566 -8570 3457 10289 4981
1563 4981 -5352 -11325 -5177 9975 13124 -1665 -13438 -8281 3398 10657 8202 -5632 -15200
1576 -15200 -6173 10445 12501 736 -11352 -12922 -533 13461 10548 -4972 -13195 -8594 2127
1589 2127 12437 9980 -6286 -16488 -6967 7619 12266 6266 -6734 -15284 -7156 9455 14186
1602 14186 3015 -10408 -15306 -4201 13491 15759 -1666 -16324 -12657 2260 15134 13552 -5312
1615 -5312 -20023 -10285 10679 17403 5774 -11167 -16983 -3757 15017 15127 -2085 -14597 -11116
1628 -11116 2606 15003 11228 -7301 -15771 -4197 9732 11245 3498 -7374 -10954 -1667 10471
1641 10471 8600 -1185 -6383 -5530 928 7716 5460 -2986 -5391 -757 1898 4003 4205 -1447 -5378
1656 -5378 -293 4474 2677 2 -1189 -1571 573 4260 1740 -3093 -1724 1808 2371 2201 -938 -5262
1672 -5262 -1273 7036 5944 -3317 -7014 -3533 3848 9554 5153 -7819 -11843 52 11991 10820
1686 10820 -1629 -14119 -12180 6776 18765 7647 -11673 -17470 -5695 12770 19570 2842
1698 2842 -19502 -18497 3455 19321 14505 -5567 -21314 -14216 9625 21266 8010 -12289 -19857
1711 -19857 -8384 12769 20854 3678 -17510 -18219 -1235 15162 17349 930 -18807 -17731 2838
1724 2838 18894 14716 -4055 -20857 -16280 7650 23237 11862 -11772 -22340 -11297 12804
1736 12804 24832 7759 -19635 -23552 -2218 19968 21032 -592 -23131 -19825 6520 23173
1748 23173 13676 -8938 -21357 -11427 11676 21039 5690 -13893 -15440 -2252 10966 13683 1995
1761 1995 -11643 -10731 1369 8828 7736 1620 -6960 -8239 -160 7136 6799 1910 -3905 -8254 -3329
1776 -3329 7785 9752 1108 -6430 -7615 -1490 8549 10004 -975 -9798 -5421 3088 8146 6130
1790 6130 -2690 -8593 -2851 5987 5293 727 -1778 -2263 -1025 2097 1822 -661 1785 2426 -2599 -5055
1806 -5055 -577 4978 6587 1517 -7154 -9715 1702 12405 7635 -5731 -11487 -6178 6440 13999
1820 13999 4035 -11399 -12299 789 10390 8776 -1468 -11299 -8470 4042 9889 3007 -4665 -6945
1834 -6945 -4211 2367 6535 2660 -3091 -4191 -3969 -1408 4959 7208 -427 -7813 -7614 -511 8635
1849 8635 10176 -2178 -15027 -10198 6076 14636 7309 -9083 -17971 -6346 14465 17113 -1102
1862 -1102 -16725 -14119 3140 17044 11637 -9090 -18416 -5421 10946 13097 2066 -10727 -12080
1875 -12080 976 11227 7056 -4110 -7232 -3924 1591 6165 3788 -2207 -3931 -1693 -466 2214
1889 2214 5459 1703 -4643 -5536 -728 5114 7400 1721 -8159 -8487 3373 10865 5452 -4813 -9847
1904 -9847 -3777 9108 11812 -1099 -11101 -6143 5828 10469 4206 -7242 -9455 1850 11472
1917 11472 5200 -6551 -7713 728 7968 7105 -3609 -9874 -1122 9890 7490 -3953 -9419 -3629
1931 -3629 7177 10634 442 -11249 -7173 6105 10614 3230 -6683 -9103 -655 9937 7515 -4123
1945 -4123 -8364 -2335 4226 5817 1937 -4406 -4699 578 2929 707 752 985 -2221 -3508 -1114 1916
1961 1916 4133 3125 -4588 -9227 -1807 9097 7781 -2702 -11047 -8207 4617 13976 4944 -11543
1975 -11543 -13711 -283 12306 10909 -3460 -15915 -8873 9762 14364 363 -11957 -9547 2374
1988 2374 10627 5790 -7548 -10766 144 8330 4619 -4023 -7538 -2261 6063 5988 -4019 -7701 202
2003 202 6505 2845 -3626 -5526 -1500 5422 5589 -2912 -7590 -1746 5353 5184 -579 -5679 -3862 4644
2019 4644 6482 -1735 -6325 -548 4743 3312 -1152 -4112 -2301 4096 6022 -968 -6759 -2112 5299
2034 5299 6328 -11 -7464 -5288 6223 10265 -625 -9473 -5242 4884 8754 3550 -5855 -8640
2048 -8640 536 10351 6244 -5575 -9013 -1528 8489 8450 -3005 -9890 -2295 7509 5834 -1500 -5035
2063 -5035 -2916 2679 5575 973 -5590 -2738 5432 5372 -2285 -7140 -2349 6751 7753 -3098 -10687
2078 -10687 -2506 8683 7779 -1774 -9340 -7134 4167 12850 4936 -11180 -13120 2159 14104 8544
2092 8544 -7601 -15200 -3966 11341 10701 -2444 -10491 -6676 2956 10030 4852 -7625 -10399 828
2106 828 8640 3722 -3916 -5439 -1647 2285 2221 -856 -675 655 -2038 -3704 160 3639 2480 -344
2122 -344 -4275 -6401 247 9523 5975 -7508 -12698 -1436 11803 11184 -3594 -15990 -8418 10142
2136 10142 16481 3110 -13134 -15610 83 17554 14566 -8221 -19987 -5690 14266 15505 -986
2149 -986 -14870 -11150 6424 15345 5152 -10038 -12155 -460 11572 9990 -4192 -12456 -3423
2162 -3423 9058 7300 -2231 -6072 -2437 2735 5180 1505 -3304 -2889 1243 2588 1261 78 -783
2177 -783 151 498 -1222 -1010 4221 4601 -3462 -7347 -824 7238 6260 -908 -8065 -6142 5071 11085
2193 11085 3269 -9107 -10417 962 12893 10063 -7411 -15845 -3337 13444 12079 -2956 -13746
2206 -13746 -8830 6816 15098 4265 -13032 -12834 3197 14902 8136 -8844 -15342 -2549 13023
2219 13023 11413 -4592 -12616 -6256 5861 11049 3079 -9190 -9998 1763 9267 3426 -4646 -6021
2233 -6021 -1577 3959 3337 -1590 -2818 -123 137 -1282 -11 1462 1274 -184 -2819 -4486 193 7120
2249 7120 4258 -5745 -8694 -1005 7839 7729 -2258 -11071 -5802 6849 10562 1117 -9390 -9370 1236
2264 1236 11804 7382 -7558 -12504 -1013 10409 7505 -2838 -9170 -4635 5752 8326 -165
2277 -165 -7324 -4177 3908 6187 1336 -5824 -4984 4035 7386 -1076 -7112 -2118 5280 5472 -404 -6286
2293 -6286 -4883 4446 8952 1856 -7856 -7429 2085 9863 6537 -5884 -10653 -471 9639 6692
2307 6692 -2964 -7434 -3764 4200 8144 2000 -6414 -5367 2504 5855 2139 -2761 -3826 983 3959
2322 3959 344 -3074 -267 3265 928 -2445 -1752 483 2803 3453 -1686 -5903 -1761 5448 5193 -1943
2338 -1943 -6756 -3321 4824 7646 -443 -8398 -4727 4381 6621 1575 -5141 -6903 -97 8207 5113
2353 5113 -5793 -8191 -300 7134 5071 -3365 -8708 -2593 6950 6207 -2540 -7501 -3316 3761 6766
2368 6766 1193 -7704 -6420 3781 7920 995 -6643 -5980 1409 6998 3519 -4918 -6914 -306 5348
2383 5348 3969 -1795 -5476 -3446 3459 5459 -808 -5153 -1686 2180 1897 223 -1384 -959 912
2398 912 651 -1990 -960 2632 2637 -982 -3165 -2150 1492 5689 2608 -5528 -6874 1801 7725 4696
2414 4696 -3438 -7895 -2977 6756 8902 -21 -8375 -6110 3103 8348 4854 -4600 -8524 -132 7997
2429 7997 5548 -2142 -5403 -2140 2932 5170 1011 -3883 -1910 2369 1846 -275 -882 0 1909 2023
2445 2023 -1887 -3517 1439 5511 2213 -3985 -4504 -32 5654 5799 -1550 -7757 -3731 4986 7369
2460 7369 1846 -5644 -7111 192 8069 5320 -3597 -6510 -2126 3064 5475 1872 -4202 -4802 692
2475 692 3674 2095 -161 -1477 -2250 -771 1249 1045 1128 391 -2761 -4182 141 4306 3062 -1518
2491 -1518 -5131 -4280 2325 7412 2774 -6154 -7699 -333 6230 6327 -1171 -8763 -5553 4246 8119 1781
2507 1781 -5698 -7043 -1058 6451 5840 -2241 -6939 -2645 2742 4127 1122 -3113 -4014 408 3070
2522 3070 563 -1826 -642 864 324 -220 -1272 -521 2178 2217 -1878 -3579 -140 3362 3000 -380
2538 -380 -4057 -3581 2194 5869 2179 -3716 -4207 -877 3616 4673 95 -4794 -3108 1497 3518 2261
2554 2261 -202 -2798 -2410 1126 2729 2118 468 -1565 -3546 -931 3519 4335 947 -3543 -5295 -1139
2570 -1139 5828 7051 -971 -7527 -5251 2498 8529 6100 -4288 -10535 -3351 7299 9028 1633
2584 1633 -7899 -9316 729 10212 7839 -3439 -9592 -4956 3949 9063 4146 -5838 -8266 -1143
2598 -1143 6246 6041 393 -5152 -6374 -451 5076 4112 -489 -3788 -4222 -1062 3544 4670 -428 -4012
2614 -4012 -3927 -1150 3367 5331 394 -5950 -5332 492 5148 4785 -790 -7032 -5006 2495 6627 2906
2630 2906 -3323 -6414 -3739 3991 6760 706 -5156 -4818 -406 3337 3844 -180 -3955 -3447 746 2722
2646 2722 2162 332 -2458 -3165 -171 2053 1750 1078 -1048 -3593 -2362 3256 4483 687 -3069 -4853
2662 -4853 -1727 4249 5894 203 -5356 -4747 586 5813 5701 -1631 -7401 -3730 4161 6596 2438
2677 2438 -3202 -5605 -1619 5206 5978 415 -4537 -4061 34 4378 4424 -185 -3478 -2432 -78 2071
2693 2071 3821 2132 -2682 -4169 -518 2659 3850 2422 -2173 -5223 -2059 4473 5946 1994 -4368
2708 -4368 -6623 -997 6682 6543 -1055 -6154 -4879 866 6603 5961 -2374 -7810 -3887 3515 6366
2723 6366 3282 -3316 -6538 -2073 3965 5368 2155 -3075 -6036 -3219 4067 6694 1634 -4343 -5810
2738 -5810 -2614 3734 7558 2584 -6050 -8360 -2011 6704 8351 619 -9617 -8985 2117 9813 6770
2753 6770 -3488 -11323 -7378 5794 12792 4252 -8940 -11548 -1720 9075 10107 -96 -10683
2766 -10683 -8834 2221 9334 6768 -2797 -9908 -6042 5091 9320 2561 -4892 -6845 -2704 4017
2780 4017 7266 2385 -5164 -6429 -1688 4387 6511 1618 -5461 -6475 -479 5345 5299 870 -5592
2795 -5592 -6503 745 7479 4613 -3226 -6653 -3146 4065 7115 1750 -6162 -5650 873 5936 4394
2810 4394 -1480 -5981 -2703 4711 5065 -238 -3777 -1989 1376 3424 1708 -2628 -3154 1912 4144
2825 4144 814 -3137 -2663 788 4463 2776 -3295 -4214 654 4845 3325 -892 -4408 -3394 2930
2840 2930 6770 1753 -4533 -4727 -445 4060 4855 995 -4638 -4803 44 3980 4709 1030 -4618 -5813
2856 -5813 213 5832 5180 -106 -5951 -6804 86 8503 7396 -3405 -10574 -6030 4652 11287 5552
2871 5552 -7622 -12727 -3081 9196 11480 1422 -11245 -12053 1983 13594 7987 -5894 -12477
2884 -12477 -5926 6395 11540 3741 -8927 -10634 -1078 8211 8548 -630 -9061 -7220 2215 7753
2898 7753 4356 -1721 -5957 -4869 1236 6443 3924 -3035 -5989 -3369 2445 6380 3767 -3395 -6693
2913 -6693 -2679 3830 6986 3165 -5655 -8447 -567 8088 6453 -1758 -6633 -4843 2170 8056 4019
2928 4019 -4644 -7050 -811 5721 5699 -725 -6500 -3786 3589 5616 131 -3679 -2803 467 3230 2981
2944 2981 -1842 -3499 306 3597 1535 -1450 -2691 -308 2800 2116 -1188 -2454 426 2039 1134
2959 1134 499 -815 -1483 436 2576 636 -1198 -166 534 552 34 -148 342 400 -396 -1283 574 2848
2977 2848 1237 -2129 -2308 -277 1809 3145 957 -3720 -4415 1171 5472 2767 -3138 -5979 -1925
2992 -1925 4906 5810 -996 -5827 -4102 1703 5749 3665 -3009 -6909 -1747 5226 5097 -605 -4418
3007 -4418 -3664 228 3665 2569 -1195 -2993 -1488 -103 1879 1971 -586 -2413 -1687 -483 388 2885
3023 2885 2044 -2712 -4736 -1287 3743 4147 904 -4832 -5544 357 6176 4216 -1798 -6531 -4383 2734
3039 2734 7472 2390 -5498 -6370 137 5160 4490 -482 -5245 -4152 1975 4869 1868 -1933 -3662
3054 -3662 -1377 1946 3301 632 -1595 -1498 -477 164 1865 1788 -424 -1947 -999 220 2248 2704 -567
3071 -567 -3617 -1916 1939 3299 1511 -1976 -3670 -418 4346 3062 -1645 -3393 -944 1969 3348
3086 3348 737 -2949 -2582 1957 3754 485 -2381 -2437 815 3682 2158 -2623 -3556 535 3896 2283
3102 2283 -1526 -3980 -1862 3181 4598 -406 -4768 -2628 2016 4246 1919 -2668 -4692 -265 3969
3117 3969 3039 -575 -3439 -2771 821 3800 2162 -2375 -3339 -898 1590 2636 1784 -1398 -3849 -1513
3133 -1513 1767 2961 1550 -2281 -4892 -1882 3985 5194 392 -4628 -5422 -522 5794 5762 -1954 -7673
3149 -7673 -4023 3537 7326 3260 -5150 -8451 -1160 6750 6682 -995 -7178 -5655 2164 7563 3678
3164 3678 -4972 -7082 -1278 4468 5427 -2 -5159 -4535 1759 5142 2136 -2186 -3678 -2009 2395
3179 2395 3796 732 -2505 -2081 16 1127 1844 574 -1428 -1697 477 1319 880 926 -1161 -1659 424
3196 424 2147 1061 -227 -994 -679 1007 1683 14 -1811 -538 1526 1610 70 -1246 -1564 925 3536
3213 3536 1419 -2966 -2642 779 3460 3092 -940 -4940 -2582 3842 5754 629 -4219 -4474 44 6141
3229 6141 4928 -2453 -6366 -2795 3807 5778 2268 -4394 -6086 -454 5675 4709 -986 -4706 -3806
3244 -3806 827 5119 3628 -2299 -4750 -2095 2106 4593 2583 -2173 -4999 -1847 2152 4290 1888
3259 1888 -2665 -4983 -1654 3893 4311 234 -3435 -4245 -877 4156 4152 -1098 -5088 -3390 1639 4358
3275 4358 2800 -2418 -5245 -1401 3377 3634 91 -2984 -3240 132 3605 1965 -1613 -2722 -1005
3290 -1005 849 1400 1056 -1086 -1511 -46 663 64 383 429 -859 -645 54 515 868 1475 -838 -2140
3308 -2140 -751 1525 1642 525 -1188 -2113 -521 2230 2144 -626 -2015 -1216 295 2158 1767 -913
3324 -913 -2033 -356 1414 1312 614 -426 -1504 -358 1058 862 665 242 -495 -1005 431 1242 890
3341 890 79 -943 -1384 -19 2107 1736 -707 -1293 -1173 265 1932 1373 -956 -1892 -311 1071 1089
3358 1089 591 -695 -1788 -175 1551 456 -238 -125 -691 -772 406 999 491 110 -687 -1521 -713 1948
3376 1948 1552 -215 -1710 -1942 -319 2965 2684 -1591 -3948 -1734 1730 3442 1853 -2722 -4394 -1120
3392 -1120 3664 3725 -201 -3646 -3747 186 4026 3202 -1546 -4238 -2364 1184 3816 2209 -2525 -3988
3408 -3988 -1681 2439 3519 1323 -2794 -4341 -1105 3384 3339 -48 -3403 -3552 -296 3790 3574 -819
3424 -819 -4276 -2641 1373 3819 2639 -2135 -4685 -1849 3021 3781 734 -2874 -3957 -313 3958
3439 3958 3303 -1254 -3599 -2082 1322 3437 1887 -1955 -3082 -135 2482 2033 413 -1927 -1912 1078
3455 1078 2856 754 -1386 -1131 -324 1222 1281 203 -1185 -653 959 801 363 -22 -824 -567 609
3472 609 727 -332 77 403 38 -364 354 125 -443 104 523 30 -262 11 -200 697 782 -650 -1386 -18
3492 -18 551 761 681 -478 -1834 -1001 1914 2572 -81 -2027 -2096 92 2829 2373 -958 -3123 -1724 1202
3510 1202 3087 2123 -1922 -4223 -821 3195 3268 -436 -2823 -3266 -39 3230 2509 -1513 -3682 -1944
3526 -1944 1498 3563 1357 -2730 -3600 -151 2439 1952 -125 -2143 -2682 -591 2498 2143 -1009 -2730
3542 -2730 -1735 121 2815 1446 -1417 -2501 -1489 584 2438 1642 -1188 -3552 -1138 2235 2122 391
3558 391 -1732 -2043 -469 2221 2278 -360 -1829 -1438 497 2022 1413 -1108 -1605 421 1118 457 353
3575 353 -449 -1003 -64 678 424 -409 85 53 -427 -289 -166 555 1172 540 -1514 -1451 1201 1746 780 -282
3595 -282 -1331 -1197 973 2306 959 -1419 -1716 -192 1269 1620 186 -1417 -1095 201 1136 1339 932
3612 932 -1170 -1823 192 2008 1143 165 -806 -1486 -408 1689 1652 -94 -1822 -1760 -85 2328 1978 -1185
3630 -1185 -2646 -1297 1210 2652 1363 -1821 -3457 -450 3111 2572 -80 -2441 -2451 -46 2818 2047
3646 2047 -718 -2367 -1749 636 2518 1383 -827 -2681 -1026 605 1425 1104 -204 -2103 -1916 750
3662 750 2139 1222 -203 -2310 -2511 470 2796 1694 -943 -2595 -1947 604 3553 1600 -2244 -3082
3678 -3082 -576 1763 2695 375 -2461 -2618 146 2497 1590 -194 -2244 -2342 499 2678 1563 -948
3694 -948 -1590 -1651 -85 2192 2123 -372 -2045 -1436 141 1497 2336 382 -2452 -1986 676 2253 2102
3711 2102 -632 -2923 -1497 1731 2925 750 -1683 -2140 -958 2169 2619 370 -1766 -1278 368 1349
3727 1349 1266 -76 -1194 -393 432 456 425 680 100 -660 -241 -52 397 1119 575 -1377 -1685 447 1843
3746 1843 1461 -309 -1958 -2088 927 2815 1395 -1099 -1916 -1306 1221 2920 1087 -1889 -2330 -281
3762 -281 1810 2179 456 -1524 -2449 -807 1742 2218 1134 -1868 -3394 -1052 2837 2867 142 -2781
3778 -2781 -3674 -678 3880 3930 -1064 -4949 -3136 1039 4720 2876 -2512 -5341 -2279 3391 4553 1488
3794 1488 -3525 -4861 -800 4319 4033 -1128 -4388 -2971 754 3994 2887 -1484 -3689 -2168 1406
3809 1406 2993 2365 -1339 -3342 -1797 1537 2745 1555 -844 -3255 -2208 1468 3547 1646 -1746
3824 -1746 -3108 -1774 1973 3924 1093 -2732 -3519 -602 2787 3384 405 -3402 -3289 1243 2830 1891
3840 1891 -640 -2426 -1615 943 2772 888 -1073 -1776 -966 63 1781 1199 -295 -1357 -1066 -497
3856 -497 1271 2415 205 -2281 -1945 196 2442 2836 45 -3496 -2475 1376 3362 1896 -1366 -3302
3872 -3302 -1534 2630 3444 542 -2436 -2398 -105 2275 2435 102 -2148 -1627 608 1479 1161 253 -1459
3889 -1459 -1441 109 869 1170 659 -477 -2143 -1050 1268 1788 578 -1482 -2247 -976 1974 2728 -319
3906 -319 -2674 -2017 502 2639 2013 -1158 -2944 -1005 1664 1991 610 -1028 -2162 -620 1705 1304
3922 1304 -396 -908 -735 -226 593 921 738 -185 -1318 -1154 -483 1843 2232 -568 -2637 -1810 854 2939
3940 2939 2304 -1857 -3989 -1336 3244 3728 253 -3331 -3520 341 4316 2692 -2015 -3934 -1699 1629
3956 1629 3478 1340 -2400 -3284 -84 2660 2354 -111 -1908 -1913 82 2107 1466 -379 -1263 -1185 -249
3973 -249 1743 1767 -46 -1440 -1569 -216 1646 2589 73 -2441 -2039 847 2402 1966 -719 -2929 -1321
3990 -1321 2277 3100 164 -2273 -2466 377 2724 2243 -840 -2052 -793 1169 1563 704 -1069 -830
4006 -830 325 894 373 -252 194 188 -170 -788 -361 589 1739 861 -1921 -1940 414 2154 1758 -816 -3141
4025 -3141 -1789 2097 3442 533 -2952 -2611 -86 2576 2756 -828 -3156 -1879 1423 2439 940
4040 940 -1451 -2415 -1019 1526 1788 -271 -1109 -1445 -447 776 1279 710 -1065 -1454 -1029 624 2057
4057 2057 912 -1645 -2711 -238 1745 2286 383 -2592 -2484 864 3039 1626 -1564 -2729 -1087
4072 -1087 1958 2822 46 -3090 -2097 1097 2566 1373 -1636 -2585 174 2313 1630 -1060 -1612 -88
4088 -88 1401 1500 -78 -1386 -287 1599 1000 -759 -1248 -337 1263 1349 -422 -2092 -769 1880 2246
4105 2246 -19 -1799 -1470 296 2302 1726 -1157 -2239 -668 1165 1584 961 -1102 -1851 125 1534
4121 1534 1016 321 -245 -1558 -978 1238 1729 458 -868 -1980 -968 1529 2941 469 -2298 -2875
4137 -2875 23 2746 3028 -693 -4068 -2259 2274 3863 1186 -2840 -4166 -487 3936 3432 -763
4152 -763 -3989 -2579 1783 3926 1542 -2600 -3620 -326 2805 2212 -357 -1927 -1582 591 2211 841
4168 841 -1377 -1489 252 927 571 -380 -649 -48 291 -362 -691 498 386 -410 -679 -60 -197 236 462
4187 462 -299 -1193 -393 696 -69 -538 -424 -119 3 99 -310 -272 322 354 -932 -1193 302 1163 1168 -183
4207 -183 -1751 -1444 923 2665 837 -2146 -2806 -490 2755 2848 -1125 -3700 -2088 2054 3440 1207
4223 1207 -2485 -3707 -225 4061 3030 -1173 -3892 -2040 1746 3711 1411 -2751 -3206 -189 2730
4238 2730 2781 26 -2459 -1975 572 2164 923 -514 -1391 -870 405 1465 1230 -525 -1296 -1027 158
4255 158 1643 1632 -319 -1958 -1105 609 2329 1759 -1066 -2662 -617 2161 2484 -50 -2131 -2315 243
4272 243 2416 1341 -1016 -2202 -616 1356 1701 -21 -1507 -1455 701 1317 -352 -363 -305 -222 337 -318
4290 -318 -402 11 713 494 -1156 -1051 173 1603 1008 -970 -2096 -971 2089 2784 -508 -2299 -1512
4307 -1512 454 2401 2017 -1501 -3131 -914 2429 2689 -366 -2425 -2474 564 2436 1017 -699 -2110
4323 -2110 -1105 265 1635 779 -1150 -1754 -356 375 660 674 -404 -1458 -1043 525 1452 1011 -767
4340 -767 -2081 -1260 1245 2171 346 -1426 -1811 -580 1583 2263 -141 -2315 -1311 1568 1990 596
4356 596 -1459 -2014 -116 1740 1097 -611 -1464 -531 687 1166 174 -1474 -324 988 642 -709 -496
4373 -496 394 1333 655 -736 -1520 -20 1829 1472 -348 -2087 -1217 1663 3084 1090 -2417 -2639 373
4390 373 2382 2119 -526 -2554 -1900 1154 2985 1050 -1626 -2899 -1149 1731 2990 701 -1960 -2731
4406 -2731 -853 1533 2592 1005 -2265 -3460 -483 2723 3147 221 -3262 -3388 119 3645 2781 -861
4422 -861 -4087 -3451 1681 5181 2411 -3121 -5101 -1235 3687 4451 706 -4273 -4256 460 4625 3377
4438 3377 -1786 -4585 -2685 2145 4349 1494 -2684 -3585 -934 1903 3225 801 -2550 -2893 62
4453 62 2361 1770 133 -2094 -2083 -333 1849 1797 -144 -1656 -2023 -29 2151 1620 -438 -1876 -1218
4470 -1218 434 1760 1621 -540 -2275 -1433 867 1807 589 -590 -1432 -492 913 1079 332 -376 -545
4487 -545 -682 195 602 535 318 -115 -759 -857 276 1503 752 -898 -1568 -683 1161 2213 582 -1909
4505 -1909 -1465 -399 2080 2203 -117 -2680 -1792 799 2523 1685 -1035 -2442 -1378 1435 2220 686
4521 686 -1292 -2168 -640 1324 2344 524 -1491 -1887 -534 1139 1827 924 -1711 -2306 -432 1663
4537 1663 2111 786 -1873 -2579 -207 2451 2073 27 -2271 -2219 142 2861 2004 -1198 -2891 -1264
4553 -1264 1100 2503 1225 -1758 -2807 -485 1953 2342 586 -1469 -2375 -469 1939 2120 226 -1397
4569 -1397 -1824 -418 1525 2147 154 -1659 -1417 -80 1305 1538 -128 -2016 -1583 274 1751 1451
4585 1451 -273 -2200 -1269 1039 1978 997 -930 -1841 -848 1042 2079 678 -1326 -1648 -170 1077
4601 1077 1329 270 -1538 -1012 188 879 732 124 -708 -1007 -78 1073 316 -144 -188 -543 -252 311 453
4620 453 -52 -152 -168 -307 106 802 294 -513 -489 -316 104 835 789 -535 -772 -406 676 774 525 -149 -1188
4641 -1188 -265 891 983 592 -438 -1185 -619 862 1627 353 -600 -1216 -856 823 1841 420 -1320
4658 -1320 -1174 -277 996 1681 144 -1685 -1464 388 1417 1268 -246 -1902 -1394 558 1912 846
4674 846 -1000 -1464 -773 1117 1907 251 -1435 -1532 -134 1137 1545 4 -1657 -1292 555 1357 721
4691 721 -371 -1358 -907 627 1533 335 -1087 -991 -545 1105 1000 30 -1071 -624 165 732 1031 -63
4709 -63 -998 -779 262 751 497 -598 -493 -588 304 850 64 -623 -509 -164 386 497 -35 -793 -398 407
4729 407 377 91 -16 -657 -197 605 434 -94 -859 165 414 287 55 -505 -323 481 1099 150 -600 -442
4749 -442 160 490 536 -445 -749 -70 791 738 330 -336 -873 -73 914 751 -399 -753 -208 26 721 529
4769 529 -516 -628 -297 391 732 726 -424 -1198 -366 590 839 639 -437 -574 -546 942 1199 -111 -1003
4788 -1003 -1078 224 1295 1347 -507 -1705 -864 859 1459 747 -915 -1463 -385 1506 1328 160 -1205
4805 -1205 -981 454 1144 690 -694 -1424 -474 608 987 627 -520 -1342 -149 841 624 -12 -780 -629
4823 -629 -447 704 975 -273 -821 -568 -317 577 1036 -450 -1008 -621 97 703 583 -278 -1222 -606 1019
4842 1019 1443 -108 -1157 -1376 208 1319 1115 -828 -1258 -359 636 1167 -14 -1038 -1287 214 1199
4859 1199 629 -500 -998 -485 344 987 23 -1096 -571 197 313 521 94 -307 -52 174 451 -76 331
4878 331 176 -584 -132 585 129 125 138 -136 -245 627 275 -134 -542 19 435 870 4 -538 -692 517 1106
4899 1106 56 -668 -663 -220 663 1045 -233 -1251 -603 708 811 377 -731 -805 233 892 477 -537
4917 -537 -755 -364 549 948 -127 -930 -671 340 723 289 -414 -418 -384 399 457 83 -222 -430 -205 -114 477
4938 477 543 -212 -638 -185 120 569 736 -418 -936 -539 666 1077 368 -1172 -1208 354 1448 410 -887
4957 -887 -1480 -594 757 1390 370 -1427 -1475 528 1491 1049 -851 -1164 -427 1010 1401 -46 -1185 -1058
4975 -1058 181 841 623 -651 -1109 -200 787 497 -125 -372 -624 -118 508 351 -297 -833 -216 -16 374
4994 374 118 -31 -315 -237 69 376 813 36 -830 -744 737 912 413 -941 -773 -60 840 886 -441 -956
5014 -956 -325 677 1110 346 -1017 -923 291 1049 925 -673 -1239 -208 1052 1034 -67 -1389 -690 492
5032 492 1131 292 -1079 -847 208 1338 825 -689 -934 -303 296 825 308 -563 -523 -15 766 147 -261
5051 -261 -551 -116 404 234 100 130 -296 -366 114 428 291 -275 -241 360 38 299 497 -48 -749 -150 711
5072 711 606 113 -545 -510 539 1148 -108 -790 -648 319 545 464 -185 -1147 -337 801 715 -314 -1147 -627
5092 -627 348 1370 477 -952 -1213 -56 715 329 -220 -715 -671 441 744 67 -846 -246 164 526 406
5111 406 -512 -297 68 466 -137 -35 45 -353 99 236 -78 -145 -38 283 -65 -255 157 105 69 13 -370 101
5133 101 183 596 -437 -409 43 92 397 68 -314 -604 601 574 184 -288 74 186 294 295 -234 -244 188 98
5155 98 -34 -645 -242 495 193 557 -713 -632 432 791 180 -844 -567 -358 574 840 -17 -800 -217 549
5175 549 924 356 -867 -599 -52 1016 324 -182 -529 -152 457 579 224 -803 -445 659 554 59 -300
5194 -300 -634 -169 624 563 -278 -470 -40 129 20 178 -193 -701 -190 398 7 224 -94 -213 -443 156
5214 156 418 -67 -226 -303 63 555 424 -419 -974 -70 456 541 106 -835 -852 105 1134 623 -604 -1433
5234 -1433 -233 768 1512 43 -1365 -1436 565 1548 881 -590 -1657 -626 1380 1703 -291 -1145 -1229
5251 -1229 420 1319 751 -1079 -1729 -346 1181 1206 10 -808 -975 198 1257 902 -701 -1286 -546
5268 -546 444 1002 850 -653 -841 -399 500 909 489 -435 -821 76 902 725 -218 -1095 -683 272 1137 871
5288 871 -930 -1007 -167 525 932 -93 -979 -722 381 1181 424 -622 -946 -166 1367 1033 -616 -1267
5306 -1267 -309 516 911 144 -756 -878 143 1067 633 -626 -1085 -468 309 788 -177 -1306 -617 418
5324 418 653 297 -414 -662 -204 596 528 -97 -832 -625 163 422 484 -440 -600 -25 506 481 214 -387 -728
5345 -728 -321 690 593 -161 -388 -429 337 630 484 -58 -554 -286 281 351 169 -587 -612 122 1040 260 -289
5366 -289 -515 -263 511 878 39 -494 -573 294 531 89 -251 -554 -6 793 368 -551 -698 312 476 524
5386 524 131 -547 -440 546 806 -208 -683 -601 36 761 664 -406 -677 -426 901 638 218 -281 -855 180
5406 180 886 744 -431 -678 -534 188 400 318 -450 -754 -125 343 433 556 -235 -788 -216 808 659 14
5426 14 -431 -365 -5 831 128 -290 -652 -263 383 868 369 -605 -431 351 631 435 -546 -837 -227 553 612
5447 612 -67 -638 -424 535 748 149 -710 -871 -54 861 486 -575 -905 -155 404 771 99 -1190 -668
5466 -668 36 629 279 -188 -661 -454 682 786 48 -568 -387 -180 670 512 -345 -709 -484 408 490 337
5486 337 -355 -766 -591 441 794 414 -281 -546 -267 672 889 -5 -1037 -712 117 559 534 -90 -414 -664
5506 -664 508 787 237 -373 -726 -213 422 543 -48 -331 -431 210 363 382 -235 -437 -55 485 230 104
5526 104 -158 -87 -127 278 252 -66 -10 0 83 -379 -17 -46 24 -114 -361 -545 288 256 41 -99 -409 -138 108
5549 108 749 398 -501 -517 30 464 521 227 -348 -760 383 283 409 150 -380 -339 291 183 19 -107 -437
5570 -437 -451 31 409 -1 -477 -410 -194 237 282 12 -519 -672 -9 349 432 -233 -474 -397 300 480 -29 -226
5592 -226 -386 69 379 336 -232 -167 -225 102 204 -41 -362 -348 -202 -215 -168 -265 -24 71 76 -137 -176 0 14 281
5616 281 163 -238 -530 184 86 128 62 -439 -423 10 559 4 -181 -244 -118 485 422 217 -546 -314 49 275
5638 275 259 -180 -494 -537 205 516 455 -86 -325 -397 216 352 -88 -440 -275 -6 212 445 289 -639 -311
5659 -311 -50 557 415 -274 -422 -224 284 639 405 -349 -505 -259 322 282 53 -139 -184 -25 405 239 46
5680 46 -190 -51 124 28 77 -317 -267 234 191 35 -207 -22 -8 -48 4 219 146 -75 11 151 -333 -349 182 -24
5704 -24 70 189 -179 -187 435 119 195 -407 -19 38 -261 21 173 -125 143 100 100 359 101 64 -76 -276 -22
5727 -22 -169 30 -288 -209 133 126 114 -21 -232 -148 -90 173 -18 -207 -399 133 291 253 -118 -296 -246 144 611
5750 611 28 -270 -177 -87 55 500 121 -319 -217 141 58 -281 359 -380 -240 81 -125 -261 243 198 -97
5771 -97 -63 73 331 133 -192 2 -125 75 399 24 -223 -424 8 9 247 131 -205 70 153 85 -107 -403
5793 -403 -394 235 -155 99 -125 -124 195 201 117 -108 -72 128 186 299 28 -125 127 274 -108 -133 -278 105 226
5816 226 -83 106 151 -302 -303 -197 42 106 -208 1 277 -111 148 304 91 76 -73 -388 43 406 186 -273
5838 -273 189 -146 105 346 -150 -293 -186 172 436 -178 -294 -346 52 556 322 -464 -371 -71 524 343 -154
5859 -154 -507 -254 254 533 220 -413 -482 128 310 47 -12 -327 -271 366 67 128 -14 -371 -395 193 199 70
5881 70 -41 -144 -117 174 403 165 -366 -143 -123 194 741 -11 -592 -310 246 283 169 19 -663 -151 672
5902 672 349 67 -349 -672 -50 590 325 -72 -554 -291 55 459 21 -392 -349 189 466 -61 -436 -401 -233
5923 -233 145 272 246 -387 -323 144 264 65 -68 -108 -216 164 209 -240 -49 -100 -401 -259 425 153 60 -16
5945 -16 118 10 -101 105 -205 -417 -179 278 352 -38 -123 -273 345 681 283 -266 -174 123 317 353 -137 -684
5967 -684 -110 353 390 -179 -619 -97 -70 202 92 -291 -203 -42 151 331 212 -122 -531 77 516 75 -300
5988 -300 153 101 291 -391 182 -293 -233 -266 -281 25 127 83 -54 84 43 14 509 106 -303 -527 64 -72
6010 -72 76 -149 -259 8 243 193 -84 -27 -62 358 34 92 -415 -174 71 274 -173 -17 -141 159 303 289
6032 289 -132 -466 1 193 268 -72 -28 -211 231 187 -267 -34 -116 115 -41 68 -166 -167 0 -75 75 94 155
6055 155 167 -93 11 179 -263 241 176 -116 -148 -128 75 183 -213 -280 -71 469 473 13 -534 -144 178 535
6077 535 339 -278 -76 186 444 276 -153 -299 261 119 251 223 -488 -420 331 326 82 -40 -384 76 80 -41
6099 -41 -81 -336 105 -57 -104 170 -217 -158 271 -6 -181 86 295 -155 -55 -74 -294 311 227 -37 -393 -282
6121 -282 55 -28 348 -136 -373 151 -238 319 -245 -249 154 -321 60 31 -224 -72 73 33 163 162 -152 -46
6143 -46 85 -398 -191 -11 -13 129 -313 -116 16 237 -3 -45 -150 10 274 378 -150 -242 -379 5 369 68
6165 68 -15 -447 -139 268 147 49 -263 -123 422 401 -41 -168 142 155 200 53 82 -96 86 161 -120 -28 150
6188 150 67 1 75 48 -120 216 191 148 70 -325 1 180 548 37 -266 -159 91 103 200 -31 -354 -105 218
6211 218 83 -236 -279 96 -53 -197 -144 41 -317 -170 -100 -124 200 181 -220 -181 155 -247 328 23 -184 -334
6233 -334 -244 439 152 -404 -693 -373 238 483 367 -554 -458 208 264 152 -99 -483 -330 470 231 314 -30
6254 -30 -219 140 41 -147 -327 -397 241 61 -12 -353 -113 21 -111 138 -170 -25 -10 334 36 254 185 -25
6276 -25 -133 171 -9 22 85 -266 -74 314 14 256 56 -228 -244 -12 122 104 -513 -57 62 446 187 -476
6298 -476 -534 -136 601 309 -133 -624 -309 245 782 294 -394 -695 -186 559 466 18 -711 -668 176 743 296
6319 296 -147 -654 -240 263 489 123 -507 -410 146 486 512 -45 -327 -561 222 444 475 -145 -552 -426 318
6340 318 386 466 118 -157 -61 116 710 -12 -406 -32 -235 323 209 -203 -437 -717 46 460 235 200 -272
6361 -272 -186 136 64 16 -322 -194 42 -76 5 90 -341 -140 -22 73 -539 -102 51 -54 -286 -271 64 -76
6383 -76 223 32 -155 -158 -113 215 97 197 -335 -74 49 136 89 -102 -215 -9 372 466 510 -73 -210 -187 71
6406 71 464 114 -291 -487 63 198 155 33 -365 -118 -209 250 557 61 -335 -172 274 437 294 -373 -524
6427 -524 60 217 151 350 -351 -87 253 153 276 90 -292 25 131 287 129 -28 -96 -141 -89 453 -210
6448 -210 73 -299 -268 42 232 157 -8 -183 -4 306 231 -10 -214 -221 -432 -30 365 261 -194 -149 -12 128
6470 128 365 -39 -227 -472 -172 238 298 208 -369 -467 122 182 -83 138 -565 -379 -33 296 323 67 -329 27
6492 27 122 315 193 -338 -260 32 148 496 174 -269 -488 -317 435 243 215 -321 -370 147 146 282 -398 -411 -182
6515 -182 232 256 102 -197 -171 9 466 180 274 -405 -63 -149 86 67 78 -216 -358 44 130 -175 -70 -276
6537 -276 -314 350 24 -202 -327 147 -135 76 125 14 94 -400 85 -168 50 -228 151 86 52 -120 -151 291
6559 291 175 138 76 -116 48 35 108 220 -65 -103 -148 590 -172 245 -330 109 82 133 232 -59 -2 -114 122
6582 122 247 -244 -123 -84 -186 344 136 -53 -108 -350 154 353 223 -363 -521 -296 373 68 -200 -219 -210 114
6604 114 415 252 -59 -267 -24 145 243 113 -55 -154 -150 103 329 30 -584 -233 146 264 181 -289 -408 -234
6626 -234 -52 -32 26 -36 -443 -344 178 304 295 -409 -154 173 321 334 -123 -588 -298 139 359 168 47 -264
6648 -264 -174 59 240 0 -131 -173 -305 -16 286 65 328 -46 -105 145 70 5 -139 2 99 -88 16 -1
6670 -1 -186 -134 77 75 -207 288 145 -188 -147 -22 -161 -118 -64 -304 111 167 354 178 208 -307 -76 164 93 33
6694 33 -26 -67 295 -236 202 88 -327 -134 153 260 174 65 200 122 124 -1 -6 187 -39 -121 -271 199 106 322
6718 322 354 -235 -121 163 354 -86 -433 198 -3 -116 385 -171 37 -4 -233 221 47 -221 -184 -78 83
6739 83 149 -108 -256 -253 -26 -42 110 -193 -197 -10 185 170 -87 -247 -206 100 -164 83 126 -16 -30 -223 38 -8
6763 -8 199 -163 -118 10 331 58 73 -88 -28 -82 530 -25 -79 -18 -292 41 50 -21 178 72 -20 79 184 -185
6787 -185 -20 44 314 109 -67 4 -2 92 82 -220 45 -70 -162 -116 -153 -83 -15 -137 55 -75 -455 11 43 -43
6811 -43 -127 4 23 152 45 240 -179 23 -246 209 27 -189 -12 -269 146 -75 -126 12 65 -51 -151 129
6833 129 -31 -86 -93 -78 20 -120 217 25 4 -42 -69 162 52 164 20 -140 -48 250 141 -69 -55 64 165
6856 165 -215 -179 -71 -22 -102 25 154 -37 -286 -207 132 -375 10 272 -14 -89 -150 48 -174 68 166 -24
6878 -24 -215 290 -139 209 128 -59 -220 194 282 175 -18 -84 -193 154 -190 -87 -6 -317 -376 -185 12 -109
6900 -109 -64 112 -154 17 -2 66 78 -5 28 38 -55 32 -68 84 0 -136 88 -356 -148 -152 284 95 -249 -67
6924 -67 -257 85 309 206 98 132 -157 65 48 -196 -317 -76 -22 105 291 147 -164 -220 33 29 172 -245
6946 -245 -119 158 -160 -31 214 -29 -149 -112 123 -140 -125 49 -5 81 231 -8 390 14 -19 20 -115 20
6968 20 152 62 231 -119 130 -251 -125 -357 74 -375 -124 -153 120 122 -43 305 15 9 -144 74 124 -105 -160
6991 -160 53 -120 -8 -96 -269 -273 -202 266 139 -278 -439 -102 367 21 -10 -117 46 306 237 -13 -50 -252
7013 -252 -138 64 311 63 -21 -342 181 -26 -37 77 -281 76 30 -3 43 -236 -40 -118 79 100 -38 41 -274
7036 -274 196 -239 109 48 116 -183 -406 29 60 3 131 -194 52 250 242 183 -335 -19 275 -147 387 147
7058 147 -104 -36 -125 244 50 -41 -322 -26 45 251 -24 -66 -15 -37 -106 -50 249 67 -130 -75 -131 216 298 -158
7082 -158 4 -178 -78 119 334 -83 -2 -24 390 101 319 -240 -64 35 120 -88 152 -104 81 -62 182
7103 182 180 107 -146 24 262 130 10 -205 221 -33 -8 28 54 -283 -202 -82 185 -7 -256 -164 -460 281 68
7126 68 166 29 -283 -120 6 69 214 -93 -33 33 114 95 43 -86 -6 28 -61 27 232 99 100 82 -227 -154 248
7151 248 170 73 -72 -15 -196 116 207 181 -151 36 49 -58 384 -15 311 -237 -147 88 70 -279 -261 -221 114
7174 114 -86 223 -27 -200 -39 -109 421 -182 95 93 16 273 120 81 195 -237 -351 174 157 88 223 -65
7196 -65 156 -19 119 212 -110 -76 -59 -53 -235 -391 99 44 -163 228 215 59 -105 -48 -30 303 80 217 -74
7219 -74 47 -99 -43 19 -41 74 18 -306 -33 53 -15 337 19 -1 79 349 98 -17 264 -8 88 -169 -69
7242 -69 47 -114 264 39 35 258 158 53 -148 19 -167 115 -124 140 4 -47 -37 252 -35 -285 -10 -177
7264 -177 -167 -102 104 172 43 2 -154 -17 -21 -210 109 -145 -96 44 -58 -68 -189 86 137 161 98 -96 -234 55
7288 55 88 -89 -56 -242 -163 97 183 -134 -135 -331 -27 -23 18 -8 139 72 44 38 -155 -158 181 -33 -99 121 -9 -128
7314 -128 -174 -79 122 22 216 -153 -154 331 -49 -4 95 184 151 185 -137 -151 44 2 -224 171 37 153 -91 295
7338 295 47 -119 -205 -97 -243 -43 64 -56 248 -246 -45 -101 -28 2 35 -80 102 267 -52 243 156 53
7360 53 -65 250 -167 82 -233 -163 -57 30 -254 -323 -167 43 -117 66 162 -92 -1 254 -19 28 134 209 -334
7383 -334 26 -64 -271 -499 -172 11 -103 -56 -205 -36 -179 -241 127 149 42 50 -46 57 -49 -9 -297 153 -65
7406 -65 -60 -97 86 -234 -39 -127 126 165 -171 44 -104 133 -87 -27 -377 -198 -163 -1 239 120 -267 -81 47
7429 47 -87 38 83 -159 80 5 30 -54 -225 -77 184 -209 337 187 -30 132 64 88 100 -123 76 -62 266
7452 266 -261 -192 137 78 -32 -89 -37 -73 263 124 -112 266 -26 -17 376 52 -451 30 -248 7 100 28 -154
7475 -154 -24 -196 202 -43 -290 -209 4 200 -46 -224 -288 50 63 7 23 233 -346 -165 -389 168 60 -43
7497 -43 -96 -326 -125 187 -6 147 42 225 -3 -26 53 87 75 15 -168 -39 -32 -75 -176 -66 86 -222 -341
7520 -341 -86 1 -44 7 74 -47 -197 153 -22 57 102 -89 -303 103 -331 21 -41 101 106 119 60 239 -88 189
7544 189 250 -43 309 75 187 -18 -208 131 -105 -57 -266 -73 -91 39 -199 180 80 116 39 -131 -128 -121 331
7567 331 -7 175 -104 -57 81 -223 96 108 32 175 -17 118 -40 229 -4 -60 -44 -42 -46 115 -22 -297 48
7590 48 53 132 -107 -95 117 83 185 -88 -98 110 -109 -199 118 263 -84 219 -136 166 176 -22 71 -264 94
7613 94 190 -37 62 -255 27 369 92 -233 -100 -54 77 -7 72 -57 -345 -96 -14 197 -124 -240 342 438 6
7636 6 113 -18 -56 11 127 89 277 -199 -300 -92 30 -245 -225 1 -171 -88 44 15 -184 -493 -97 75 272
7659 272 21 -242 -16 -83 112 145 0 -203 -116 162 100 -339 288 53 26 -47 253 -212 -115 -259 48 -123
7681 -123 -19 15 -131 81 -82 -158 -188 125 -49 184 -101 217 60 -372 150 -26 58 29 30 -60 -72 50 203
7704 203 123 -81 92 -49 120 158 125 -267 -47 -31 83 75 185 19 382 299 87 115 -152 208 -221 107 -104
7727 -104 55 -275 -195 -36 34 130 -34 97 -23 134 149 -4 35 -125 -3 -427 -138 414 -248 315 122 69
7749 69 -10 -344 85 -188 -143 -6 -24 107 171 -42 -48 106 167 220 267 -105 -66 274 150 -347 13 -148 -219 37
7773 37 81 -71 -88 105 -30 -78 -211 -443 255 250 -283 122 133 -52 -209 -122 1 23 258 -34 -139 -223 -53
7796 -53 -222 -209 60 115 -241 -211 -105 -59 141 274 -259 -64 -57 56 -146 74 -147 170 -383 155 260 -158
7818 -158 -116 -191 60 54 72 -72 -28 126 94 229 -137 52 -46 90 -79 -34 -144 133 -346 -185 28 153 -2
7841 -2 -372 179 -307 150 345 143 -192 -175 -136 -81 1 -41 -6 314 1 53 -10 -69 205 112 -15 73 -260 272
7865 272 -86 190 -229 -112 96 -134 -43 159 -36 -94 -28 -33 247 -225 -139 -200 78 -7 123 167 -27 -171 -80
7888 -80 -318 -69 -199 -143 37 344 -73 -107 136 -24 377 36 42 65 -204 103 -146 191 54 206 -119 200
7910 200 8 -151 0 -72 -182 8 206 180 1 -54 -21 182 126 136 133 -72 109 22 63 -251 -132 -102 -39 -21
7934 -21 160 204 -233 -283 41 37 -180 152 123 -132 19 187 -16 106 -41 -134 146 -73 281 0 -55 254 26
7957 26 297 -9 53 47 -13 -35 -74 -51 -146 -48 212 156 -42 -106 273 361 42 196 -70 273 72 -24 196 189 -259
7982 -259 -103 221 127 -195 -26 -199 -66 59 -112 -144 -2 -110 145 -90 -88 -41 -136 -96 191 -222 122 -139
8004 -139 236 -2 111 -68 17 -259 -62 11 -9 193 -164 162 187 174 -73 58 148 262 125 -99 -255 -191
8026 -191 -220 62 -184 19 65 124 -51 269 -96 106 195 -328 25 -83 -117 -177 -171 -72 -320 160 18 -82 -293
8049 -293 97 152 134 20 206 -88 27 -165 277 -205 -226 -54 93 94 3 325 -168 -84 127 42 11 -33 -180
8072 -180 -113 75 -53 179 101 -234 170 -71 -94 9 36 -31 -318 117 -10 -373 -176 -99 -102 301 -65 113 112
8095 112 -64 69 -176 -188 -80 71 -59 109 191 -46 -77 57 -148 -84 -78 21 39 -155 265 31 81 -199 127
8118 127 50 -170 64 28 95 131 12 58 3 46 -161 -87 112 19 -61 -283 -176 -57 -100 195 -33 40 153 -22
8142 -22 27 252 -73 -107 -328 43 40 -113 -54 43 77 186 -185 40 -44 244 -120 7 1 -65 154 -22 36 183
8166 183 133 -13 277 -137 417 -190 -235 27 -49 320 258 7 87 345 37 154 -189 -140 -13 -193 -217 122
8188 122 -96 -274 65
8191F5
$$ Imaginary data points
##PAGE= N=2
##DATA TABLE= (X++(I..I)), XYDATA
0 0 0 0 0 -8 8 -8 16 -18 16 -26 40 -41 56 -73 81 -98 123 -140 166 -199 231 -267 313 -360 411 -472 538
27 538 -611 694 -783 881 -991 1109 -1239 1386 -1542 1715 -1906 2111 -2339 2594 -2872 3176
43 3176 -3518 3898 -4325 4810 -5358 5989 -6728 7600 -8647 9942 -11578 13728 -16697
56 -16697 21073 -28191 41772 -77061 359664 740532 -176369 -709019 -502704 278389 666461
67 666461 362376 -343119 -605351 -216488 396866 524367 101606 -411531 -417516 25032
77 25032 389915 281100 -64117 -282459 -214091 31211 252057 215949 -31633 -228059 -181540
88 -181540 20999 196748 183702 -9539 -201046 -187684 20855 231079 208179 -65998 -289590
99 -289590 -159398 167495 273012 57688 -192557 -218259 -17213 198347 191439 -33111 -204189
110 -204189 -128784 76844 165968 51210 -107424 -99099 41475 78004 -30570 -75693 19897
121 19897 93173 30932 -89347 -125608 -6036 158986 144927 -76496 -234634 -109286 164264
132 164264 259276 37773 -259418 -259918 58580 303874 186727 -131882 -295767 -143726 167645
143 167645 297516 79125 -230742 -257617 3380 225708 180958 -47294 -201839 -128288
153 -128288 59871 148570 86709 -31995 -118558 -106824 14449 125989 105703 -12513 -114922
164 -114922 -125566 -14657 141304 163125 -6276 -183265 -166171 35733 215248 160996 -89925
175 -89925 -244137 -108507 149199 230896 58734 -177187 -215683 2592 220481 166567 -74856
186 -74856 -198846 -88436 99398 161456 47010 -100587 -110189 -331 74989 56663 4309
197 4309 -28464 -27362 -6614 -2126 -213 41327 65631 -8302 -103066 -76313 57016 144343 76540
210 76540 -98601 -183815 -45278 171446 193185 -13520 -207493 -169322 66055 239801 138662
221 138662 -127353 -235178 -69617 156106 199835 34312 -162022 -176364 8014 168449
231 168449 126050 -38487 -136240 -90751 36054 114801 69272 -34601 -84764 -61841 2123
242 2123 74342 87217 1847 -95265 -93875 1393 100987 106285 -14195 -141479 -109156 56895
254 56895 155774 74596 -92403 -162462 -47907 129806 150606 -14222 -155095 -112715 49853
265 49853 149785 76201 -93974 -152013 -20136 123707 99289 -37171 -112457 -54038 59201
276 59201 88864 671 -77854 -42177 38159 51159 -2212 -48712 -33063 32867 58467 -7318
288 -7318 -72588 -34591 51262 67860 1740 -68250 -62093 24160 87667 37798 -59899 -77468
300 -77468 -5821 65003 63939 -8925 -72382 -44143 35461 57627 14118 -24612 -32221 -16122
312 -16122 15903 33835 18463 -5297 -20780 -28577 -7454 38515 47813 -625 -49408 -48053 6866
325 6866 73806 68295 -31899 -105830 -46756 75565 114509 25331 -101123 -118836 13326 142942
337 142942 100825 -60815 -145221 -61949 92676 146193 28287 -125982 -123538 26781 134307
348 134307 84523 -49588 -121373 -54267 76388 110506 11512 -85293 -71803 12807 71930
359 71930 50456 -23627 -60861 -19825 30520 29455 4452 -10201 -17065 -11463 5282 10616 8379
372 8379 8897 -5886 -27395 -15062 19750 26573 1810 -23760 -30316 -4202 35132 29719 -20161
385 -20161 -41965 -11880 23248 27449 156 -32757 -25251 18922 31995 -6748 -32470 -10918
397 -10918 20267 23479 -6413 -39458 -23607 33862 47143 -8836 -55297 -34109 25641 59844
409 59844 25144 -51912 -72492 259 72170 53886 -23911 -74361 -44670 40583 82013 20100
421 20100 -65527 -67143 3959 60479 51156 -11717 -62446 -37737 29134 52271 17930 -23107
433 -23107 -37754 -19880 21413 39939 14341 -17445 -26538 -18639 7036 36890 29029 -13925 -40060
446 -40060 -25726 14067 49681 39397 -23419 -64529 -27047 42298 64367 20336 -48381 -68489
458 -68489 -5238 69468 60439 -15499 -64542 -43421 21993 67418 38247 -35429 -61141 -14617
470 -14617 39116 48514 13638 -34899 -45643 -2272 39864 32423 -17 -24795 -29729 -6057 29906
483 29906 32862 2015 -24640 -30366 -10861 28510 44836 6263 -41268 -40629 1322 42296 44343
496 44343 -5674 -57536 -42364 23106 57150 28925 -26645 -58860 -28201 38968 58592 6981
508 6981 -47120 -46090 -1566 42543 41640 -9534 -49578 -28003 17894 33001 14960 -14701 -32375
521 -32375 -15254 17984 23047 2867 -12625 -17344 -10760 8486 17391 1205 -12232 -8532 -3932
534 -3932 1420 10743 7050 -9921 -13017 -2875 2532 6820 7146 -4944 -13076 -2117 6057 3520
548 3520 3196 -104 -9000 -6589 4958 5039 1174 4873 -124 -11808 -6551 8254 10897 4429 -3837
563 -3837 -13986 -8928 12635 19725 4557 -10754 -16564 -9326 15890 30138 4784 -26688 -21494
576 -21494 5749 24830 23772 -1171 -29748 -23237 13319 33334 19027 -11404 -32953 -18121
588 -18121 24272 39792 7799 -26853 -27882 -3656 26879 36259 2553 -37757 -29468 13539 37289
601 37289 23480 -11811 -36232 -19984 20473 34851 12776 -15512 -29175 -16547 19620 37256
613 37256 8575 -25722 -24873 -3216 15478 24202 11045 -17502 -28216 -8125 17919 28156 11212
626 11212 -23542 -34847 -4170 27880 26817 3321 -24428 -35607 -6387 37147 34720 -10717
638 -10717 -40273 -25987 11164 36518 22555 -19810 -40265 -16070 19823 33490 14779 -24245
650 -24245 -40826 -7952 30820 26863 -1763 -20797 -24706 -10291 19737 30758 6131 -24507
662 -24507 -31127 -10155 23669 34777 4667 -32053 -33076 -4555 28663 39310 5517 -46288
674 -46288 -45452 11554 51541 31792 -19200 -50477 -30121 26224 54272 18828 -35373 -48823
686 -48823 -11886 37805 47153 708 -44440 -31295 13500 32588 19766 -5366 -26409 -20737
698 -20737 9951 27372 13137 -8133 -17290 -12546 4929 18469 13013 -1025 -11665 -17929 -5654
711 -5654 23292 28569 -3908 -27839 -16699 10022 27211 20253 -11179 -32814 -12453 24029 30852
724 30852 5028 -23773 -26811 4447 32646 18150 -15224 -22220 -4312 11241 17052 7985 -10804
737 -10804 -13393 3511 9327 -295 -1597 4180 2832 -3414 -9380 -6811 10180 20671 525 -25271
751 -25271 -17558 9773 24270 15515 -12058 -33885 -16087 25855 34624 620 -31486 -29151 1510
764 1510 30524 24747 -11330 -31350 -15006 9419 19123 12735 -6860 -20710 -10673 5441 8608
777 8608 7998 6734 -9041 -23137 -10729 14749 24661 9820 -20195 -36422 -10747 32993 38112
790 38112 -1959 -40786 -39070 5257 50462 38431 -24475 -58282 -23152 32598 49079 14262
802 14262 -36962 -49002 -4069 42994 35738 -8022 -37456 -27843 8976 34977 20907 -12537
814 -12537 -24383 -13754 2015 18777 23764 1962 -22758 -22516 -2870 19607 30756 10323 -27938
827 -27938 -38093 -3569 36739 40731 1124 -45198 -41750 15508 56351 30763 -25084 -49282
839 -49282 -22297 30896 54314 15554 -40709 -44725 1596 39513 34426 -3131 -33731 -24443 9817
852 9817 26029 16058 77 -13384 -17423 -2652 16115 16605 6292 -5425 -18748 -17303 10595
865 10595 33174 17298 -18632 -35875 -13894 28542 43321 5752 -39492 -36096 6276 39385
877 39385 32158 -10394 -45742 -26790 25719 43307 8412 -29652 -31970 -2323 28117 25675 -6608
890 -6608 -25917 -13952 6272 14755 10766 -4664 -15728 -7407 3847 3714 4538 7690 -3388 -18007
904 -18007 -11957 8241 18926 10825 -11716 -27690 -10843 20749 25691 -21 -24318 -25065 -341
917 -341 28497 22519 -14759 -32155 -9596 17886 19856 2698 -16359 -18069 1393 14276 5289
930 5289 -5370 -4349 -1942 -981 -1142 -2902 1121 11342 5247 -16152 -18132 6658 23891 13255
944 13255 -12654 -28205 -13311 23159 34622 1986 -32293 -28341 6568 36061 27144 -15856
956 -15856 -41282 -13851 28228 34116 4965 -24620 -28014 -834 28626 23965 -6258 -22350 -13679
969 -13679 4679 18846 15589 -3242 -15667 -9914 1064 11431 17732 6362 -16493 -20742 -575
982 -575 19956 22737 3652 -24098 -27006 5848 33963 22443 -11819 -31948 -18019 18500 37037
995 37037 9974 -27975 -28056 2829 25802 21224 -5052 -25706 -14281 14660 20309 2069 -11523
1008 -11523 -9118 1253 8246 3801 -6650 -3384 7719 3362 -9657 -8896 3372 11504 8535 -7275
1022 -7275 -20270 -7593 18438 20279 -3492 -21442 -16255 5608 23368 13271 -16333 -25416 -3522
1035 -3522 17656 16914 -276 -18406 -18372 4286 19083 8348 -8626 -12943 -7633 3137 12020 6177
1049 6177 -7665 -10839 -5446 604 8337 9586 -3825 -15364 -8452 6152 12925 8218 -8101 -20211
1063 -20211 -6983 17490 19103 -2589 -19765 -16135 5324 24917 14062 -17420 -26793 -2086
1075 -2086 23008 20782 -3344 -26328 -18678 15434 30892 6929 -22624 -22791 2495 24887 21473
1088 21473 -9193 -29332 -10418 19900 24176 2868 -18408 -20427 2359 24679 16499 -9995
1100 -9995 -19383 -6751 10020 18169 8993 -11165 -16710 -1292 12256 12687 4900 -7649 -14808 -3624
1114 -3624 13284 14310 2689 -9573 -14575 -3670 16043 18594 -1746 -17420 -12368 4368 18296
1127 18296 13889 -9072 -21916 -5890 16467 17008 664 -15316 -15672 3816 20355 9297 -12782
1140 -12782 -15926 -892 12346 11979 -1779 -16337 -9125 10397 13641 -439 -10057 -8842 932
1153 932 10430 7080 -7826 -11239 212 6870 3885 -848 -5615 -5692 2276 5729 -1253 -4628 -454
1168 -454 665 -714 381 -1041 -3042 203 1639 -3088 -3140 1680 415 -2262 -568 -459 -1840 1258
1184 1258 798 -3565 -2201 3411 1196 -3323 -2583 -722 420 3383 879 -6429 -4612 3757 4659 -52
1200 -52 -2128 -4026 -2645 4891 5465 -2923 -4994 316 2160 1086 1360 -702 -2523 1426 1821 -2813
1216 -2813 -839 4813 2658 -1954 -3095 -2476 2061 9078 5100 -8185 -9557 2803 11382 8582 -1569
1231 -1569 -12930 -9954 9188 18148 5009 -12008 -14420 -2229 14923 18119 -1482 -19696 -11948
1244 -11948 9124 18235 10541 -7317 -19972 -8870 15104 20223 3283 -14446 -17424 -2999 17623
1257 17623 20350 -1405 -20092 -14761 4375 19285 17107 -4957 -24319 -14238 12793 23232
1269 23232 9357 -12955 -24065 -8921 18981 24667 949 -21671 -19831 1071 22264 19194
1281 19194 -8464 -26643 -11979 14056 21092 6522 -14856 -21914 -2842 19829 16090 -6871
1293 -6871 -19403 -11184 6908 17951 7075 -14225 -17572 -111 13246 10577 -1788 -13949 -11854
1306 -11854 5374 15520 3944 -10269 -11749 -2696 8843 11558 -867 -14645 -9174 5970 12057
1319 12057 5189 -7451 -14864 -5276 13398 14139 -2734 -14729 -10617 3390 16095 11881 -9716
1332 -9716 -20339 -4936 14801 16747 2070 -16295 -18256 2909 22756 13922 -9332 -19942 -9335
1345 -9335 11276 21877 7025 -16838 -18616 2079 17700 13686 -2665 -16870 -12308 8780 19084
1358 19084 5911 -10466 -13400 -3096 11628 15314 550 -13885 -9905 3859 11627 9875 -1038
1371 -1038 -13165 -8972 8056 14269 4760 -6712 -10902 -5073 9237 14210 1881 -11211 -10108
1384 -10108 414 11216 12330 -2021 -15349 -8158 8545 12429 4008 -6317 -11538 -4072 10045
1397 10045 11340 -2600 -10196 -5424 3235 8540 4067 -7064 -9042 1784 7512 2421 -2398 -3989
1411 -3989 -4102 1537 6080 490 -6121 -2902 2458 1698 -93 -1813 -3077 54 3038 -361 -3172
1426 -3172 -729 -546 -1518 1743 2462 -2920 -3557 198 -19 -1118 1737 772 -4069 -3495 745 2747 2326
1443 2326 -1237 -6651 -3236 5617 5774 -2146 -5383 -3851 -588 5676 6927 -3200 -10171 -2846 6623
1458 6623 6340 181 -6227 -6552 2184 8187 2273 -4683 -4245 -1135 3522 6919 1319 -7960 -4876 4852
1474 4852 6100 756 -1867 -2904 -2428 2140 3973 1578 -89 -1209 -3337 -96 5255 3497 -1180
1489 -1180 -1288 -1944 -2567 4261 8105 -432 -8444 -4129 4568 7853 4718 -4076 -8976 -1979 7593 7363
1505 7363 732 -5076 -7128 110 10121 6378 -6707 -7892 1596 6229 4078 -556 -5829 -4563
1519 -4563 3729 7228 1186 -4052 -5010 -1400 5363 6349 -2111 -7084 -1165 3581 1680 1406 -210 -4185
1535 -4185 -3082 2960 4011 450 -2283 -4016 -3283 2522 5358 723 -3759 -4849 -3725 2681 8758
1550 8758 2040 -9266 -7934 2444 7356 4492 -2574 -9641 -6082 6026 10065 333 -9349 -9306 13
1565 13 11566 9645 -6752 -14879 -4155 8959 10420 2386 -9708 -13330 -591 13942 9770 -5551
1579 -5551 -13443 -7780 5865 14299 6089 -10253 -13587 -2236 8822 12194 3979 -10731 -14594 -468
1593 -468 13565 11007 -871 -10885 -11917 2 14325 12238 -3709 -13537 -9807 4002 16247
1606 16247 11353 -8440 -17708 -5713 10851 16202 6193 -11017 -18065 -2227 17196 15833 -2182
1619 -2182 -15436 -12393 4556 18363 11273 -8763 -16269 -4974 10131 14960 4786 -11989 -14214
1632 -14214 2114 14209 9230 -2851 -10321 -7820 3459 12169 5714 -5727 -8414 -2408 4697
1645 4697 7705 2930 -5519 -6026 1125 4089 2912 1155 -3005 -4849 440 5240 1495 -2728 -2151
1660 -2151 -1239 586 3156 480 -3781 -2194 2245 2156 -3 -2070 -4228 -194 6359 3277 -6282 -7271
1676 -7271 -269 5668 6535 18 -10061 -9358 4733 12809 5299 -8197 -14320 -5537 11338 16564
1690 16564 124 -17662 -14250 3007 16615 13504 -6429 -21839 -12141 12525 20689 5627 -14483
1703 -14483 -20438 -5201 17295 19572 -721 -19171 -16266 1914 18361 16052 -5673 -21603 -12543
1716 -12543 8591 18615 10270 -7893 -20510 -10743 12349 20546 6651 -13128 -19787 -6749 15944
1729 15944 22119 2250 -19605 -19095 503 20269 20244 -2550 -24669 -17242 10098 24761 13365
1742 13365 -11274 -24273 -10426 16586 24775 4691 -17749 -19137 -1179 18478 18785 -2135 -18767
1755 -18767 -11937 6887 15608 9831 -4361 -13681 -7393 7546 11561 4386 -3481 -7867 -5459 3732
1769 3732 9261 4170 -2438 -6103 -6046 859 9042 7390 -3509 -9106 -5022 2792 9336 6510 -5219
1784 -5219 -11061 -3169 7203 8067 1631 -6193 -8288 -593 7722 4606 -2563 -4316 -1854 -115 2090
1799 2090 1621 -1178 -105 792 -3086 -4518 1212 5503 3199 -2827 -7878 -6041 4737 11380 2597
1814 2597 -10004 -10983 -671 10258 10846 -1972 -14415 -9508 6455 12306 4430 -7183 -11662 -4468
1828 -4468 7977 9865 -796 -8200 -6218 -339 5058 6192 -82 -5711 -4192 -751 2051 5259
1842 5259 4398 -3428 -8585 -4164 4386 9019 5816 -6521 -13800 -4105 11844 13863 402 -13441
1856 -13441 -13601 1730 17865 13053 -8359 -18995 -6908 11013 17320 4900 -14011 -16426 2069
1869 2069 16712 10958 -4204 -12706 -7619 6394 13463 4239 -7896 -7816 -259 5441 6061 1777 -3833
1884 -3833 -4423 -14 2243 3134 3862 17 -5190 -3594 2783 6328 4526 -1617 -8206 -5065 6991
1899 6991 10782 1287 -8408 -7863 798 10476 8190 -5535 -12030 -2867 8940 9066 -824 -9164 -7423
1914 -7423 4630 11358 1640 -9439 -6914 3808 8310 3530 -6541 -9169 1052 10607 4328 -7737
1928 -7737 -9050 263 8556 7301 -3764 -12216 -4231 9197 9478 -1830 -9688 -7315 2814 10213
1942 10213 4230 -7846 -9303 290 6351 4222 -1339 -5971 -4493 1821 3776 14 -1510 -908 -2440
1957 -2440 -2758 904 3085 2273 -38 -5108 -6741 1672 9870 4992 -7018 -10727 -3042 9100 11924
1972 11924 -208 -13888 -10155 6332 14034 6071 -8603 -14241 -2923 13807 12373 -5052 -14203
1985 -14203 -5370 7476 11078 1997 -9716 -8835 4319 10168 2727 -6282 -6208 1127 7502 4815 -4926
2000 -4926 -6946 2318 7678 1695 -5100 -4231 1345 6064 4305 -3984 -6510 913 7131 4263 -2715
2015 -2715 -5911 -1885 5899 5581 -2826 -6574 699 5705 2389 -3136 -3737 -254 5025 4638 -2634 -6217
2031 -6217 -41 6442 4477 -2861 -7273 -2279 7213 8458 -3763 -10626 -2337 7819 7349 -826 -7654
2046 -7654 -7039 3431 10653 3210 -8731 -8586 1870 9209 5297 -6342 -9895 -48 9260 4371
2060 4371 -5021 -5987 -1177 3535 4278 -981 -6199 -2155 5172 3332 -4586 -6325 105 6980 4776
2075 4776 -5729 -10020 260 10299 5507 -6003 -9421 -3135 6876 10610 -170 -13390 -9887
2088 -9887 7042 14377 3007 -11936 -12952 1696 14055 8109 -7523 -11826 -2799 7301 8980
2101 8980 930 -9601 -8491 4491 10100 1984 -6867 -5171 758 4159 2673 -1188 -1628 343 -826
2116 -826 -2213 1344 4089 1212 -2529 -3884 -2739 3204 8567 3195 -8883 -9776 4062 13486 6990
2131 6990 -8411 -14582 -2346 14506 14227 -3592 -16080 -9984 7149 18724 8305 -13888 -18618
2144 -18618 1481 18977 11648 -7528 -16178 -5229 11748 14924 -266 -13767 -9611 4991 12894
2157 12894 6060 -7816 -12258 135 11358 5989 -5446 -6819 -343 4338 4258 -384 -4243 -2150
2171 -2150 2604 3043 324 -1278 -1521 -31 741 -316 -513 2888 2487 -4061 -6343 1642 7987 3770
2187 3770 -4603 -8228 -2908 7362 9224 -1192 -11564 -7851 5076 12197 4249 -11127 -14276 1790
2201 1790 15628 8142 -9346 -14556 -3263 10783 12530 -1653 -15567 -9429 8287 14741 2473
2214 2473 -12845 -12794 3118 15238 7127 -10027 -13460 -1199 9737 9218 -1362 -10993 -7526 5595
2228 5595 10149 1248 -7204 -5797 1439 5007 2632 -2917 -3558 443 1247 -475 381 1652 306 -1161
2244 -1161 -2178 -1996 1879 6277 1776 -6776 -6833 3202 9209 4494 -5731 -10297 -1809 9952 9113
2259 9113 -3016 -10288 -5305 6003 11997 3482 -10276 -10639 4056 12793 5137 -6758 -8721 -792
2273 -792 8001 7216 -2831 -7972 -1913 5868 5856 -909 -5856 -3153 5375 6586 -2267 -7164 -46 6754
2289 6754 4008 -3340 -6385 -2175 5579 7526 -1542 -9466 -4611 5603 9371 2362 -8293 -9140 2930
2304 2930 11173 3889 -7056 -7850 -848 6215 6407 -1134 -7878 -4265 4460 6102 -100 -4712 -3324
2319 -3324 1396 3815 -214 -3441 -460 2877 80 -3143 -1756 1189 2290 1101 -2722 -4979 -60
2334 -60 5640 3402 -4257 -6717 -1007 5821 5619 -3367 -9013 -2532 6468 6083 -1702 -6422 -4527 2901
2350 2901 8148 2269 -7653 -7227 2695 8216 2821 -5623 -7694 478 8095 4248 -5310 -6973 -259
2365 -259 5699 5255 -1203 -7762 -3876 6230 7443 -1535 -7986 -3979 4131 6921 1272 -6316 -5777
2380 -5777 3091 6959 2172 -3511 -5048 -739 5070 4872 -1725 -5671 -421 3957 2096 -644 -1340
2395 -1340 -441 1205 990 -721 -368 2170 1891 -1868 -2569 -199 2855 4569 350 -6214 -4747 4530
2411 4530 8123 1537 -6075 -6538 562 8192 6691 -3753 -9206 -3000 6180 7956 1286 -7159 -7188
2426 -7188 2651 8949 3289 -4970 -5737 -278 4399 4374 -762 -4874 -1896 2823 1910 -1386 -1576 -45
2442 -45 972 754 -2334 -2858 2054 4691 -284 -5437 -3589 1934 5252 2819 -4172 -7707 -1504 6840
2458 6840 6079 -2202 -7300 -5039 2874 8030 2763 -6484 -7057 257 5224 3959 -617 -5486 -3956
2473 -3956 2365 4538 716 -2252 -2235 -1403 415 1709 1065 -112 -932 -1874 -2591 1642 4437 1167 -3467
2490 -3467 -4576 -1402 4230 6311 -168 -7510 -5641 3105 7613 3550 -3957 -8091 -2517 7496 7810
2505 7810 -1229 -7214 -4908 2460 7541 4499 -4698 -6947 -162 5390 4160 -876 -3845 -2313 2215
2520 2215 3825 216 -2285 -624 1440 936 -630 -535 195 2341 1316 -2138 -2964 1367 3900 1425
2536 1425 -1769 -3639 -1616 4125 5016 -40 -5224 -3547 1958 4873 3141 -1856 -5133 -2046 3931
2551 3931 4125 655 -1938 -3123 -1477 2371 3389 758 -1388 -2231 -2524 515 4164 3275 -1835 -4407
2567 -4407 -3373 1699 6081 4441 -3953 -8067 -2699 5523 7652 2176 -7404 -8915 259 9378 6809
2582 6809 -3638 -9515 -6160 4063 10588 3889 -7767 -9506 -1069 7166 7388 -54 -8261 -7280 2238
2597 2238 8300 4040 -3085 -6825 -4125 2681 6183 2078 -3332 -4671 -2311 1529 4776 3196 -2682
2612 -2682 -5234 -2466 1461 3935 3587 -1795 -6358 -3119 3474 6039 2366 -3279 -6571 -2287 5335
2627 5335 6470 242 -5279 -5372 -70 5824 5712 -1212 -6537 -3282 2760 4620 2501 -1600 -4536 -2014
2643 -2014 3108 3819 1152 -1223 -2592 -1854 1720 3091 1185 -251 -1267 -2529 -111 4107 3811 -846
2659 -846 -4301 -2888 701 5480 4232 -2041 -6215 -2659 3628 6093 2834 -4379 -6702 -974 6514
2674 6514 5558 -1000 -5467 -4593 912 6188 4447 -2218 -5598 -2818 2162 4422 2772 -2109 -4425
2689 -4425 -1435 2104 2659 2516 -183 -3665 -3621 1021 4021 2411 -264 -3493 -4478 151 5418 3985
2705 3985 -1626 -6289 -4889 1959 7360 3974 -4165 -7487 -2248 3951 6282 2602 -5292 -8171 -1099
2720 -1099 6101 5760 -384 -5963 -5858 82 6060 4187 -1021 -4852 -4842 -80 5742 5514 -1553 -6893
2736 -6893 -4965 426 5444 5676 -907 -7810 -6571 2288 8522 5820 -3432 -10468 -5243 6371 10368
2751 10368 2487 -7508 -10074 -2235 9111 11114 -1145 -12159 -8728 3742 11467 7051 -4904
2764 -4904 -11804 -4633 7534 10272 2584 -6588 -9105 -1818 8422 8614 -1316 -7968 -5355 1197 6804
2779 6804 6252 -1048 -7054 -4775 2237 6422 5038 -1253 -6777 -4220 3233 6891 3576 -2399 -6168
2794 -6168 -3932 4017 8136 2154 -5876 -5580 343 6044 6072 -1212 -7149 -3962 4013 6367 2307 -3814
2810 -3814 -5542 -241 6079 4276 -2792 -4653 -1026 2800 3073 -154 -3517 -2359 2378 3694 -674
2825 -674 -3873 -1543 1954 3556 435 -4118 -3753 2082 4849 1208 -3493 -4338 -1320 4226 5194 -780
2841 -780 -6174 -3776 2034 4929 2843 -1741 -5703 -3275 2120 4813 2446 -1891 -5765 -3772 2467
2856 2467 6685 2285 -3680 -5951 -3768 3264 8359 3523 -7252 -10237 -1400 8076 9400 332 -11300
2871 -11300 -10024 2551 11980 7871 -4521 -12866 -7348 7201 14074 3504 -10519 -11630 -442
2884 -442 10112 9825 -1504 -11188 -8136 4096 10578 5441 -5020 -9604 -3693 6318 8363 1442
2898 1442 -5326 -5856 -1874 3937 6797 2009 -5452 -5566 -295 5102 5719 673 -5394 -5807 568 6534
2914 6534 5735 -411 -7015 -6295 3089 9253 4041 -5230 -7058 -1758 5388 7441 1124 -6633 -5871 2355
2930 2355 7381 3722 -3447 -6682 -1437 5576 5005 -1601 -4495 -1406 1927 3545 1689 -2907 -3500
2945 -3500 828 3746 703 -2620 -2164 654 2816 1542 -2435 -2600 915 2375 432 -944 -1306 -905
2961 -905 455 1735 43 -1993 -578 913 145 -281 -218 -63 -16 -679 -1197 137 2192 220 -2635
2978 -2635 -2374 1155 2264 1470 -501 -4214 -3052 2808 4999 147 -5135 -4671 825 5693 3961 -3242
2994 -3242 -6559 -1750 4209 5308 1286 -4787 -6003 279 6426 3693 -3210 -4917 -2115 2464 4330
3009 4330 1292 -2871 -2871 -681 1589 2019 1323 -1499 -2650 -831 1223 1746 1988 766 -3059 -3816 1221
3026 1221 4758 2784 -1451 -5170 -3106 3124 6945 1976 -4567 -5717 -1200 5276 6379 -50 -6755
3041 -6755 -4837 3100 6420 2748 -2831 -5184 -2004 4147 5410 108 -3886 -3074 428 3260 3027
3056 3027 -511 -2773 -1041 999 1227 1532 747 -1201 -2288 -224 1779 1720 1513 -1243 -3216 -778
3072 -778 3224 2961 -343 -3092 -2918 904 4482 1728 -3071 -3665 18 3246 2449 -438 -3377 -2072
3088 -2072 2793 3361 -589 -3585 -1805 1554 2827 606 -3511 -3150 1808 3993 766 -3050 -3343 -295
3104 -295 3626 3194 -1987 -5312 -1563 3274 3508 -285 -3942 -3698 869 4790 2034 -2481 -3695 -1072
3120 -1072 2036 3354 545 -3412 -3299 436 2670 2049 215 -2488 -2986 28 3158 2664 -58 -3069
3136 -3069 -3668 170 4929 3665 -2087 -5251 -3243 2407 6312 3530 -4535 -7354 -900 6377 6478
3151 6478 -156 -6991 -6222 2381 8596 4808 -4350 -7657 -2460 5274 7499 1108 -7161 -5674 1958
3166 1958 6513 3812 -2312 -5959 -2505 3894 5687 760 -3763 -3141 380 3325 3214 -719 -3097
3181 -3097 -1406 1354 1972 1640 -342 -1875 -1574 1062 1708 586 -13 -1118 -1674 647 2194 475
3197 475 -1103 -1038 -298 717 1258 -405 -1827 -494 1943 968 -892 -1596 -872 1278 2724 -157 -3218
3214 -3218 -1923 1573 3495 1068 -2496 -4708 -755 4802 3964 -1900 -5595 -2966 2615 5635 2458
3229 2458 -4492 -6610 -403 5346 4647 -894 -6056 -4765 1800 6503 2743 -3481 -5427 -1955 2910
3244 2910 5224 1053 -4728 -4666 -203 3657 3374 382 -3768 -4195 56 3961 3271 -827 -3512 -3794
3260 -3794 398 4688 3568 -1857 -4656 -2776 1522 4751 2612 -2813 -5304 -1135 3739 3961 517
3275 517 -3658 -4229 293 4915 2772 -1759 -3459 -1755 1673 3759 1414 -2525 -2809 411 2120 1575
3291 1575 396 -1509 -1294 696 1396 92 95 546 -493 -530 383 860 581 633 -553 -1765 123 2361
3309 2361 1929 -364 -1487 -1563 356 2639 1637 -1551 -2375 -153 1579 1928 864 -1724 -1666 369 1785
3326 1785 1067 -361 -919 -1096 -55 1281 752 -428 -239 -738 -601 351 1477 32 -1048 -629 -947
3343 -947 421 2000 1138 -1634 -1725 -71 552 1363 360 -1585 -1565 536 1739 649 -632 -1160 -1425
3360 -1425 265 1808 379 -1187 -594 -165 -649 641 929 90 -774 -789 -1108 116 1911 1072 -1365
3377 -1365 -2418 -1006 925 2392 1246 -2698 -3498 -259 3032 2784 -221 -3543 -3299 777 4260 2653
3393 2653 -2013 -4112 -2057 1926 4602 1913 -3493 -4057 -439 3314 3601 734 -3424 -3413 483 3826
3409 3826 2705 -673 -3437 -3195 816 4379 2514 -1798 -3620 -1811 1887 3900 2200 -2571 -4498
3424 -4498 -1002 3189 3932 980 -3121 -4071 266 4321 3320 -904 -3862 -2801 1620 4479 2592
3439 2592 -2795 -3926 -479 2640 3331 410 -2999 -2631 1546 3137 1868 -1120 -1976 -1093 1487 2657
3455 2657 118 -2219 -1204 1202 1260 943 -280 -1440 -402 1132 607 145 -333 -849 -408 968 1005
3472 1005 -758 -439 379 -86 -291 162 342 -467 -20 238 -297 -608 -428 -153 156 343 -693 -1217 203
3491 203 958 268 -217 -531 -1462 -717 1922 1801 -1097 -2727 -981 950 2235 1334 -2203 -3353 -771
3508 -771 2039 2851 473 -2858 -3459 649 4157 2288 -2242 -3645 -1458 1736 3550 1009 -2882 -3093
3524 -3093 -290 2736 2797 -478 -3403 -2886 1324 3071 1280 -1121 -2606 -1327 1200 3140 1658 -1769
3540 -1769 -2760 -625 1601 2154 662 -1656 -2179 92 1734 2022 894 -1860 -2798 360 3123 1998
3556 1998 -822 -1822 -1462 852 2761 1633 -1141 -2168 -595 1436 1833 604 -1901 -1767 716 1722
3572 1722 520 -331 -320 -901 156 1344 692 -370 -51 16 -339 40 516 686 681 -367 -1494 -662 1110
3591 1110 1409 -336 -1314 -955 -418 1042 1812 145 -2106 -1405 299 1311 1501 -647 -1819 -1063 796
3608 796 1246 733 -214 -1661 -1682 609 1878 471 -937 -1366 -1138 259 1727 1153 -1078 -2227 -926
3625 -926 950 2405 995 -2061 -2839 -81 2282 2077 13 -2489 -2826 553 3333 1798 -1710 -3050
3641 -3050 -1249 1478 2661 1276 -2235 -2592 -507 1293 2189 458 -2020 -2322 -156 1631 1440 449
3657 449 -911 -2177 -944 1487 2290 778 -1109 -2302 -1217 1896 3038 915 -2223 -2452 -608 2154
3673 2154 3059 309 -3069 -2606 933 2814 1883 -692 -2932 -2093 1648 3326 1083 -1516 -2348 -1050
3689 -1050 1557 2503 416 -1644 -1663 -695 1001 2380 1441 -1480 -2203 -310 1353 2150 1305 -716 -2357
3706 -2357 -981 1701 2687 721 -1731 -2573 -494 2945 2542 -485 -2461 -1476 285 2229 1787 -1217
3722 -1217 -2792 -845 1239 1398 606 -723 -1135 -158 586 487 2 49 -201 -635 -264 524 325 816 -108
3741 -108 -1543 -1346 991 2072 507 -1476 -2441 -730 1664 2439 136 -2610 -2090 -122 1872 2259
3757 2259 -126 -3137 -1865 691 2062 1021 -330 -2520 -1994 335 2414 1633 -629 -2559 -2432 429
3773 429 3247 1815 -1669 -3234 -2149 1249 3920 2743 -2875 -4921 -1547 3376 4375 979 -4081
3788 -4081 -4896 21 4951 3877 -1043 -4360 -3627 1653 5359 2769 -3194 -4982 -1291 2960 4087
3803 4087 1335 -2915 -3891 -420 3052 3142 561 -2564 -3383 -518 2929 2782 377 -1811 -2573 -844
3819 -844 2822 3240 305 -3009 -2845 24 3426 3202 -445 -3441 -2852 1493 3723 2154 -1648 -3682
3835 -3682 -1922 2304 3432 683 -1972 -2239 -536 2177 2665 72 -1729 -1622 26 929 1485 730
3851 730 -1145 -1300 -917 424 1668 1509 -565 -2508 -1253 1480 2547 1341 -1483 -3434 -1587 2490
3867 2490 3700 159 -2831 -3181 -243 3376 2833 -1029 -3331 -1994 1298 2367 1563 -1310 -2731 -992
3883 -992 1462 1720 190 -832 -1528 -940 502 1459 570 -371 -1037 -1760 -70 1759 1333 -776 -1892
3900 -1892 -1361 169 2252 1636 -1333 -3012 -875 1857 2480 884 -2031 -2928 -36 2672 1627 -552
3916 -552 -1934 -1453 373 2103 1284 -673 -1105 -715 -25 861 1054 70 -643 -877 -508 562 1718 1171
3934 1171 -1483 -2469 -324 1637 2600 646 -2697 -3285 601 3597 2869 -1282 -3508 -2005 2210 4555
3950 4555 1376 -3403 -3717 16 3348 3264 -64 -3553 -2805 1332 3355 1518 -1146 -2590 -1311 1492
3966 1492 2458 908 -1151 -1680 -645 666 1812 1196 -726 -1936 -874 1075 1958 1627 -1329 -2956
3982 -2956 -1004 1844 2415 829 -1932 -2976 -216 2997 2467 -1273 -3074 -1797 1072 2988 1223
3997 1223 -2000 -2475 -94 1886 1571 -159 -1301 -1127 360 1029 -438 -514 118 148 -740 -929 -85 897
4015 897 922 -235 -2266 -1417 1485 2281 653 -1811 -2748 -744 2779 2691 -911 -3914 -1959 1424 2790
4032 2790 1262 -2268 -3152 -391 2488 2562 -498 -2206 -1682 192 2204 1352 -799 -1842 -1057 89
4048 89 1099 1544 -134 -1651 -1306 -176 1101 1661 485 -1945 -1817 646 2334 1338 -867 -2661 -1518
4065 -1518 1944 3163 425 -2553 -2363 562 2889 2221 -951 -3292 -1114 1881 2785 460 -2060 -1884
4081 -1884 818 2612 872 -1695 -1613 597 1649 643 -648 -1199 246 1631 693 -1052 -1196 424
4097 424 1330 1235 -807 -1912 -249 2261 1607 -1035 -2207 -964 1311 2177 770 -1742 -2102 291 1732
4114 1732 1335 -209 -1744 -1211 675 1775 391 -766 -1113 -973 -237 1375 1593 -194 -1712 -1477 -54
4131 -54 2005 1916 -682 -2865 -1847 1235 3334 1390 -2162 -3923 -1161 2968 3741 -858 -3828 -3024
4147 -3024 977 4165 2298 -2566 -4528 -908 3132 3226 -376 -3509 -2938 1438 3665 1244 -1839 -2186
4163 -2186 -830 1610 1975 -251 -2098 -1411 828 1574 -73 -360 -668 80 694 209 -286 437 432 -626
4181 -626 -598 -52 265 268 445 -379 -915 -94 924 400 -384 -469 -288 64 32 -519 -78 333 225 -844 -603
4202 -603 714 1258 694 -566 -1491 -762 1529 2134 -176 -2774 -1912 1223 3218 1746 -1912 -3542 -675
4219 -675 3127 3075 -468 -3297 -2885 1257 4253 1999 -2765 -3885 -314 3244 3420 -230 -3569 -2490
4235 -2490 1584 3386 1662 -1556 -2880 -974 1966 2666 188 -1781 -1368 -215 789 1550 719 -1237
4251 -1237 -1174 -122 891 1295 647 -1470 -2503 -381 2031 1825 50 -1957 -2399 382 2636 1692 -1364
4268 -1364 -2461 -1114 1161 2334 756 -2139 -2172 435 2046 1192 -658 -1792 -823 1058 1552 -304
4284 -304 -1144 -228 -168 -60 170 -252 -40 439 170 -1267 -708 574 1351 533 -1497 -1610 -281 2212 1883
4303 1883 -1410 -2501 -894 1700 2547 573 -2408 -2665 642 3190 1924 -1250 -2691 -1259 1650
4318 1650 2385 689 -2084 -2087 -251 1352 1324 533 -1508 -1408 272 1338 943 361 -855 -1309 -267 1122
4336 1122 1663 235 -1378 -1564 -16 1757 1929 -23 -2167 -1220 681 2275 1758 -1221 -2607 -559
4352 -559 2131 1879 -281 -1752 -1105 682 2009 643 -784 -1118 194 1106 811 -223 -1389 -283
4368 -283 1095 540 -913 -390 981 1005 223 -1032 -1135 418 1852 1064 -1290 -2011 -398 1709 2180
4385 2180 31 -2794 -1932 1420 2825 638 -1599 -2625 -875 1995 2724 87 -2742 -2580 263 2530
4401 2530 2245 -639 -2764 -1837 715 2527 1816 -406 -2908 -2462 939 3367 1745 -1640 -3630 -2026
4417 -2026 2117 3857 1572 -2710 -4098 -1070 3540 4642 241 -4278 -4325 1013 4406 3276 -1389
4432 -1389 -4953 -2661 2122 5193 1579 -3621 -4178 -778 3549 3791 -106 -3731 -2911 1097 3208 2506
4448 2506 -876 -3193 -2058 1294 3051 1230 -1420 -2012 -1341 1181 2358 900 -1066 -2308 -1139
4463 -1139 891 2247 1043 -1296 -1966 -579 1468 1826 977 -1388 -2028 -147 1845 1688 -58 -1449
4479 -1449 -1517 261 1153 819 -513 -567 -633 247 614 631 96 -246 -623 -432 -352 745 1627 283 -1351 -1264
4499 -1264 -89 1987 1746 -523 -2226 -1343 839 2195 1338 -1169 -2875 -1198 1883 2827 47 -2033
4515 -2033 -2343 -473 1636 2084 -156 -2157 -1866 192 1824 1890 -413 -2196 -1624 200 1773 1511 -23
4532 -23 -2156 -2130 606 2320 1057 -709 -2406 -1743 986 2658 1415 -1355 -2571 -1094 1445 2896
4548 2896 882 -2171 -2810 -215 2193 2058 -45 -2333 -2395 484 2643 1660 -725 -2221 -1779 909
4564 909 2250 1323 -980 -2013 -867 856 2224 1502 -946 -2013 -998 970 1472 973 -617 -1864
4580 -1864 -947 1349 2016 564 -1108 -2002 -635 1626 2197 -257 -1664 -1494 22 1828 1563 218
4596 218 -1455 -1284 420 1209 911 -170 -1556 -752 996 1201 625 -795 -718 -258 341 1038 293 -300
4614 -300 -320 -528 -188 673 415 -131 -616 -218 -65 534 550 290 -745 -693 -80 309 918 128 -935 -694
4634 -694 132 883 721 275 -771 -1203 170 879 1047 -157 -607 -823 -219 1030 1107 -241 -1049 -902 112
4653 112 1285 1212 -327 -1833 -666 542 1447 1177 -533 -1804 -1132 1009 1689 527 -1246 -1794 -788
4670 -788 1461 1524 201 -1631 -1346 393 1336 1684 -298 -1920 -1171 520 1402 586 -679 -1772 -520
4687 -520 1093 1264 499 -924 -1180 -271 905 1208 17 -1232 -614 366 838 861 -110 -1055 -394 738
4705 738 1024 172 -153 -899 -511 789 684 293 -523 -168 -213 473 998 -154 -740 -202 357 631 621 -79
4725 -79 -513 33 700 500 -291 -209 -197 81 619 444 -405 -427 495 548 129 -220 -302 -227 524 538 45 -761 -409
4748 -409 411 743 410 -603 -953 158 842 673 -340 -586 -850 129 920 356 -332 -639 -188 259 684
4767 684 359 -549 -894 -206 733 395 55 -507 -667 -252 914 777 -306 -603 -680 92 1200 929 -693
4786 -693 -1225 -621 621 1147 659 -678 -1625 -141 1476 1034 32 -1160 -1248 -90 1783 881 -760
4803 -760 -1276 -409 1038 1187 346 -1334 -1413 103 1076 569 -4 -1078 -1089 270 1032 394 -350 -269 -556
4822 -556 8 1058 485 -412 -1003 -342 62 609 569 -567 -1046 -175 1032 977 90 -699 -1218 0 1259
4841 1259 1050 -570 -1376 -423 608 1348 789 -1063 -1280 209 1106 876 -269 -1084 -735 940 1355 108
4859 108 -967 -571 15 455 409 -39 -768 -349 426 953 -102 -356 -430 -142 294 442 -172 -35 250 -359
4879 -359 214 729 93 -84 -188 -5 -196 448 57 -502 -276 -16 226 429 60 -808 -546 730 893 -507
4899 -507 -615 -654 353 790 269 -546 -1286 -196 904 759 -366 -1011 -660 705 795 133 -1016 -570 409
4918 409 579 666 -188 -893 -389 556 708 97 -631 -753 21 349 597 -106 -429 -487 40 184 576 -47 -777
4939 -777 -462 67 404 486 -60 -871 -894 -163 1026 907 -536 -1207 -643 608 1259 439 -969 -1279 118
4958 118 1134 1046 -244 -1591 -1233 990 1455 94 -1237 -1027 224 1238 888 -498 -1384 -238 725
4975 725 842 497 -650 -879 145 1083 754 -346 -438 -58 194 523 69 -285 -518 -44 377 543 124
4994 124 -350 -720 21 61 401 349 -125 -1119 -418 881 707 -458 -1021 -680 309 942 516 -924 -1123 -145
5014 -145 912 768 75 -1034 -720 775 1204 298 -863 -777 92 1127 754 -489 -1247 -394 996 968
5032 968 62 -1005 -1043 552 1176 204 -889 -605 -117 563 653 99 -670 -656 334 731 11 -575 -364 -22
5052 -22 354 462 -232 -62 -223 -95 54 532 142 -382 -241 -19 429 207 -34 -295 -479 23 678 388
5072 388 -205 -800 -407 750 564 -398 -1242 -503 503 812 39 -509 -688 38 1184 851 -715 -1236 -45
5091 -45 734 941 304 -1052 -609 601 867 316 -390 -531 -55 866 680 -342 -672 29 893 341 15
5110 15 -132 -251 330 219 -26 -144 -270 26 350 238 -80 -403 -150 36 -16 -301 434 250 -148 15 84
5131 84 112 388 -20 -236 -179 -338 307 90 -57 -395 -16 578 199 -287 -603 37 282 203 122 -21 9 -15
5153 -15 642 -365 -338 255 245 264 -112 -465 -336 315 900 -148 -771 -600 324 768 500 -674 -1078 -15
5173 -15 778 727 -279 -1278 -669 814 919 120 -865 -842 202 515 580 -576 -960 -455 620 582 -139 -593
5193 -593 -457 588 603 -14 -150 -613 -183 350 -11 -102 -275 -343 131 377 89 -102 -427 -262 -349 135 274
5214 274 -227 -460 -300 168 520 282 -564 -439 120 928 687 -281 -675 -793 555 1306 446 -962 -986 207
5234 207 1331 684 -613 -1187 -435 961 1628 118 -1227 -1346 252 1915 1020 -923 -1624 -376 846
5251 846 1510 107 -1341 -1422 397 1633 1051 -347 -1105 -778 829 1126 281 -937 -1284 -64 674 888
5269 888 175 -1004 -922 31 908 825 9 -847 -502 180 1003 606 -605 -1050 -267 479 1005 -64 -1126
5288 -1126 -913 202 1020 379 -630 -949 -661 1025 944 -135 -1127 -740 174 1277 830 -837 -1162 -252
5306 -252 1068 869 -516 -1078 -403 539 1235 349 -726 -920 64 1118 648 -346 -790 -203 531 783 -135
5325 -135 -669 -429 239 809 446 -608 -831 66 384 413 -8 -409 -546 -128 604 120 -96 -232 -276 101
5345 101 535 347 -514 -440 -78 518 592 457 -223 -1036 189 711 181 53 -497 -561 596 753 25 -576
5365 -576 -908 -165 756 642 -375 -477 -136 463 333 -186 -740 -419 161 754 532 -804 -512 97 678
5384 678 325 -348 -704 31 754 928 -181 -571 -340 264 740 323 -568 -752 -152 895 669 -31 -783
5403 -783 -488 213 570 176 -573 -517 -146 582 521 229 -672 -666 -132 687 302 2 -488 -594 193 777 429
5424 429 -254 -450 -97 395 604 288 -907 -560 280 469 433 -21 -957 -357 550 778 68 -300 -390 227
5444 227 526 479 -221 -619 106 456 499 -159 -661 -617 251 558 -24 -407 -671 -57 812 335 -299 -833 -220
5465 -220 495 775 438 -532 -596 -89 829 577 -450 -877 -492 447 744 392 -553 -1124 -384 761 477 -16
5485 -16 -755 -509 55 452 751 -169 -767 -330 116 838 594 -230 -880 -477 582 718 196 -455 -711 -264
5505 -264 947 565 277 -217 -370 195 772 536 -427 -650 -247 660 186 318 -478 -442 105 231 303 289 -138
5526 -138 -45 148 283 178 26 137 133 -333 -6 255 194 -3 112 -330 -262 331 433 194 -330 -641 139 281
5548 281 521 117 -848 -136 160 368 415 -268 -832 -330 358 476 -244 -564 -431 -132 -101 518 -1 -653 -207
5569 -207 19 316 177 -189 -657 -445 139 116 83 -123 -501 -412 113 559 23 -150 -712 -380 444 731 -118
5590 -118 -621 183 209 442 209 160 -336 52 259 344 27 -55 178 -298 76 209 -290 -165 237 296 4 0
5612 0 -7 26 380 -112 -487 -279 76 349 -94 -221 -432 -118 451 536 140 -437 -397 10 411 880 -229 -410
5634 -410 -60 347 407 68 -94 -620 -379 414 901 157 -511 -372 -7 536 600 -124 -127 -181 23 622 570 39
5656 39 -752 -527 256 568 97 -274 -238 -218 421 434 -30 -846 -448 -91 350 419 -386 -683 -72 225 456 225
5678 225 -299 -327 -162 446 29 -318 -325 73 42 240 -95 -260 -430 443 -1 -253 -252 -121 -18 287 125 -15
5700 -15 -111 129 215 18 -60 -190 -412 -71 -30 -215 -144 376 88 -134 108 95 -252 -125 170 97 15 153 -378
5723 -378 -332 63 209 296 -276 146 -11 128 606 40 48 -3 -62 198 344 286 -417 -207 353 1 66 -33 -176
5746 -176 -224 224 109 -212 -444 -371 132 21 -102 -161 -51 174 323 209 -209 -27 125 102 -11 -31 -205 36
5768 36 -42 -332 137 -265 184 29 56 -231 -85 346 408 19 -134 -230 74 435 425 85 -237 102 251 -177
5790 -177 29 -65 -47 182 559 174 -458 -121 -155 -28 8 -76 -264 -40 182 -278 -86 -249 -118 37 -285 -429
5812 -429 -144 -243 -48 -6 -260 36 221 -80 -89 -47 109 21 30 -154 69 287 151 -26 -185 -203 -102 -23 4 -46
5836 -46 -430 -104 433 276 -134 -78 -211 6 474 166 -362 -463 -66 185 467 -9 -589 -228 482 315 37
5857 37 -239 -291 -6 426 269 -189 -485 -199 519 361 129 -169 -319 150 54 68 -128 -293 -333 -51 258 293
5879 293 -73 271 -63 -138 196 237 -86 -299 -398 304 245 149 -55 -396 -294 562 502 -228 -171 -536 188 399
5901 399 444 -187 -603 -91 149 400 343 -293 -770 -10 347 313 -220 -344 -199 535 429 197 -147 -70 141
5922 141 156 315 -130 -263 -77 112 -75 35 -52 -180 -260 221 -205 -365 -125 -233 84 89 76 -20 -127 -175 13
5945 13 -30 72 49 40 122 -189 248 -279 -119 -244 -27 283 318 -38 -371 -324 325 302 240 -268 -454 -286 254
5968 254 334 -169 -549 -187 38 333 -4 -258 -386 72 175 350 -110 -228 -143 -186 642 -24 -281 -297 88
5989 88 438 49 18 -110 37 -281 174 229 281 170 -196 -344 192 58 179 178 -237 -316 169 341 -80 -287
6011 -287 -392 233 449 160 57 -390 -62 282 222 15 84 -272 16 163 241 -84 -238 122 273 265 -400 -488
6033 -488 103 480 -327 186 -152 13 170 17 43 -290 63 432 -66 -176 -200 -237 280 -77 -132 11 5 167
6055 167 -101 -98 -131 -50 -168 -96 -240 -32 225 245 -92 2 -270 -109 162 97 -128 -498 -23 419 108 -105 -287
6078 -287 -3 301 358 -266 -490 -425 -96 204 127 -314 -395 -76 235 210 -105 30 -166 420 99 -126 -359 -12
6100 -12 -200 44 -46 194 65 -23 117 130 -34 24 24 47 -116 -38 -150 102 439 -123 -531 -203 250 89 -64
6123 -64 -418 -312 217 348 65 -4 -368 193 4 169 -94 -184 -76 -255 601 -302 -122 141 317 -175 172
6144 172 95 -99 241 -186 -518 120 564 -20 94 -227 160 118 565 112 -596 -535 181 389 207 92 -476
6165 -476 -126 114 720 66 -302 -160 172 -69 105 -33 -359 118 30 17 -188 -72 -24 -128 203 -81 -230
6186 -230 342 187 -93 41 -322 -55 259 266 -298 -295 -219 58 457 186 82 -177 -32 407 224 -151 -342 60
6208 60 -308 230 113 -54 -7 -19 128 -255 207 -23 -242 -172 -86 173 274 -48 -378 -358 348 232 309 -118
6230 -118 -154 -223 202 587 -63 -324 -384 159 457 469 -195 -352 -209 305 225 71 -253 -182 -112 354 158 66 -329
6253 -329 224 236 482 60 -344 -258 96 28 6 44 4 84 153 349 151 41 -137 65 -81 -155 28 102 -98
6276 -98 -11 -17 36 17 140 -205 -218 343 353 -55 -75 239 4 357 -134 -497 168 195 77 -71 -579 -71 187
6299 187 523 213 -411 -574 -137 630 404 -153 -773 -645 83 810 224 -82 -820 -260 206 575 -14 -622
6319 -622 -316 164 326 377 -13 -581 -352 286 501 461 -377 -395 -327 244 571 229 66 -395 142 180 235 65
6341 65 -289 -732 -156 390 365 -24 -360 -291 182 502 382 -85 -175 -391 517 352 -340 -446 -399 185 379 347
6363 347 144 -278 -159 331 1 65 230 22 60 117 -32 60 132 65 88 215 -227 -347 156 22 63 36 -19
6386 -19 295 205 101 -181 -26 -114 202 324 -215 -244 162 33 150 282 -154 -289 -408 1 316 376 -95 -419
6408 -419 52 99 250 225 -142 10 -173 95 416 32 -116 -411 -103 357 285 -117 -203 -321 -79 333 164
6429 164 -68 -475 -262 239 473 -25 -313 -114 47 201 251 153 -335 -150 109 35 50 367 -252 -188 38 155
6451 155 84 29 -281 -150 98 233 595 -294 -202 -126 50 182 -132 249 -259 -252 14 276 268 -311 -228 -285 -178
6474 -178 91 268 -245 -185 -395 140 411 85 -314 -289 -260 150 283 82 -116 -552 -398 266 250 47 -336
6495 -336 -271 5 366 105 -294 -306 -199 19 110 281 -10 -239 -221 42 464 -132 -374 118 -225 40 429
6516 429 158 -286 -129 46 498 163 -51 -87 20 149 400 -41 71 -268 -312 133 374 -344 -196 -190 39
6537 39 14 142 172 -225 -97 -76 187 132 -41 130 102 -18 283 17 -113 -39 50 -117 60 -4 338 73 -9
6560 -9 -142 -283 -105 229 26 -73 62 28 59 258 12 28 -313 -87 88 7 -43 -425 -464 430 261 136 7
6583 7 -292 -85 311 53 -176 -93 -85 -5 192 268 59 -278 -285 202 277 90 -124 -124 45 80 15 215 -160 15 -69
6608 -69 105 274 -171 -50 -221 63 188 389 179 -408 -163 400 106 -12 -109 -258 117 321 301 -104 -17
6629 -17 -389 -70 385 265 93 -165 -215 -224 84 -18 -134 -342 35 168 118 -110 -155 -212 -234 109 284 -44 -208
6652 -208 -225 -144 409 129 191 -364 -177 245 -61 236 -69 -414 -125 62 58 122 -7 190 -118 -187 -58 18 162
6675 162 -236 8 -260 161 384 184 -73 110 -24 -191 302 21 117 23 -108 -154 87 -238 -100 -61 -31 230
6697 230 136 215 -337 -33 -6 -4 31 172 -143 -72 12 40 -6 -266 -46 104 166 35 158 -26 -144 62 -279 171
6721 171 416 -99 -443 -242 -417 400 -135 -357 -258 -379 147 175 229 88 -16 -152 34 121 13 40 -136 114
6743 114 392 152 226 -24 20 -31 -54 -49 -84 -160 -411 -22 7 108 -121 201 -329 283 276 -23 -441 -63 -117 -68
6767 -68 317 111 -91 -100 267 325 194 -303 -131 -169 193 38 157 14 -279 135 -236 66 142 99 -150 -4
6789 -4 -413 -132 74 125 -14 -100 170 -311 220 222 -43 -153 -242 -82 -94 -145 181 -188 204 301 67 293 -196
6812 -196 -17 206 -95 248 -93 -255 179 174 -10 -219 181 -83 244 111 254 -267 -131 -126 -34 -1 42 74 223
6835 223 -26 269 212 -261 91 0 -240 -130 -14 -1 207 11 71 -176 146 -95 58 -169 -183 231 12 170
6857 170 68 -189 -150 -53 48 -162 60 8 152 -19 108 76 -239 64 -95 -81 191 243 67 -397 16 -104
6879 -104 106 -212 -354 -149 96 372 257 119 -76 -132 -49 321 15 -10 -44 91 12 361 153 -69 -94 -334
6901 -334 128 22 -8 -78 27 -178 -235 45 -155 -138 315 78 96 181 194 265 115 251 45 104 110 -129 -291 332
6925 332 72 -45 -178 176 303 22 -97 -187 -282 -214 -114 13 248 -34 13 -38 71 135 306 -72 25 113 36
6948 36 -181 452 65 139 111 65 148 -323 -122 142 -49 171 -185 115 -4 -78 172 -70 132 61 -71 -315
6970 -315 -94 -372 50 -65 208 -131 -48 -110 256 6 -196 97 9 -70 98 79 -163 7 229 -173 118 104
6992 104 68 80 -214 -273 41 -66 95 -195 -98 51 315 21 -55 -93 -252 0 74 -117 -247 -68 1 164 -108
7015 -108 -35 -338 -137 -226 321 39 250 -13 50 26 313 333 10 40 -270 64 52 -169 -103 20 -47 19 -197
7038 -197 39 -64 -77 -6 40 69 79 210 -7 -93 8 19 -57 255 -172 24 -96 136 54 -219 -106 -64 37
7061 37 174 -77 -33 -78 -142 -73 106 125 -11 63 -23 317 108 205 -158 -111 212 206 193 -136 17 -136 217 -18
7085 -18 -87 -110 75 46 161 165 -154 -147 -145 128 -135 74 -182 -156 -73 -213 18 -63 -5 -23 -9 -72 -140 85 3 -51 8
7112 8 259 87 -124 335 60 -179 36 -22 -26 -562 -78 78 3 219 -178 175 -344 -99 -45 -194 110 -207
7134 -207 -170 79 413 -17 72 79 189 -243 61 101 -82 -189 -24 45 -121 -58 -4 56 -152 0 271 -28 -95
7157 -95 -51 -3 -290 41 -99 46 -240 227 -222 161 -26 68 -32 95 46 -99 175 -22 -104 -184 -75 245
7179 245 11 53 71 -170 226 128 216 -240 17 256 -333 154 85 -90 -220 106 139 63 -89 -210 -183 -62 190
7202 190 3 -187 -188 70 135 139 199 -94 47 -158 -149 -163 57 -175 -116 -145 89 -56 -185 -181 -111 59 -105 -38 79
7227 79 -216 -121 -158 95 -82 12 -235 65 220 -167 33 23 25 -202 169 -47 38 74 -54 133 159 216 -128 -16
7251 -16 -194 28 -255 -2 -97 -14 50 -123 262 -203 -222 -217 104 -208 -195 -173 -6 -356 -193 -56 37 111 -61 15
7275 15 117 111 97 152 -304 14 22 -90 96 82 -187 45 114 -108 -138 125 -176 -197 364 10 106 24 30 319 -120
7300 -120 150 82 236 237 23 180 314 -22 38 192 64 -246 -24 -251 -5 411 -86 -65 -20 250 28 -90
7322 -90 99 225 59 197 115 -56 305 91 14 -214 43 -146 -96 57 5 215 -31 -52 -74 -5 29 -9 -62 246
7346 246 148 234 -298 -73 110 -79 -267 169 307 -57 62 -337 -25 86 -157 -175 -14 254 2 -49 -150
7367 -150 136 490 -118 -170 34 9 -247 -160 146 203 -2 66 -346 -127 22 98 209 -18 -45 290 5 -20 -75
7390 -75 -57 177 -64 -188 -249 -59 54 263 -34 -56 159 -97 73 22 8 40 -62 65 -28 12 87 -38 -199
7413 -199 -294 -38 -322 134 -394 -91 -12 -178 158 222 63 166 -5 74 -29 -199 75 -170 -56 -60 64 -295
7435 -295 59 -45 240 -92 -128 -219 45 13 140 -5 136 -35 -33 315 72 164 -40 -56 -13 21 -275 303 -249
7458 -249 -92 -106 167 -190 32 -129 -5 -69 160 50 -31 166 -216 -150 106 3 212 67 75 -27 12 -23 -203
7481 -203 106 25 144 84 -144 -106 83 126 66 -60 -154 -149 56 -46 -305 151 293 -123 244 220 521 73 -251
7504 -251 -72 -132 129 -75 -62 -8 -46 103 140 279 156 21 -87 -122 -171 -179 164 128 107 -4 53 54 108 207 45
7529 45 -209 -84 -48 -22 311 203 222 -305 -36 -3 34 139 -247 6 142 -237 6 -67 216 104 -45 375
7551 375 138 12 34 -85 249 -78 -182 -187 60 29 -40 -36 -83 -305 -29 8 -169 300 -26 -269 160 -89 -67
7574 -67 -77 -143 238 326 215 171 64 -321 -27 -54 96 -54 116 -173 -28 352 91 -36 19 110 264 246 -27
7597 -27 -98 127 -61 186 57 -11 -38 -91 -161 30 -336 -277 -159 -26 -171 267 -5 -117 154 158 58 183 -34
7620 -34 -62 -456 156 -60 -17 -6 -256 92 217 205 -57 35 -69 22 -59 371 -158 317 -58 20 -131 41 61
7643 61 -32 191 -16 134 93 -165 -120 -110 259 -403 -150 -2 122 137 141 -153 -156 23 102 159 2 -27 -252 439
7667 439 26 -246 40 -29 6 119 53 -28 -117 8 -201 3 231 -228 -147 20 -148 242 -164 -198 56 -250
7689 -250 -103 130 146 -200 -133 160 -293 414 -237 97 -61 78 82 311 -109 -151 -164 44 152 124 -44 218
7711 218 188 -76 153 38 -167 -4 78 131 225 82 -101 -54 36 203 -77 -65 -71 119 132 52 -292 127 123 13
7735 13 49 -26 32 -249 5 10 309 -45 141 31 -539 -32 68 -175 96 -73 -14 17 -36 214 -208 -201 -98 -212
7759 -212 63 144 -176 -92 307 108 19 -29 3 -183 -65 -99 -156 -217 -198 -15 -85 -67 313 -3 141 -94 119 35
7783 35 -85 -82 -5 -10 275 83 301 80 54 8 177 158 25 3 213 235 -385 27 105 186 2 -25 -38 -331 19
7808 19 225 -84 -74 34 -44 73 72 10 -305 27 -335 -122 -13 84 63 80 26 226 -90 72 -179 237 123
7831 123 188 68 -96 -88 -5 -102 -60 25 -422 -221 619 180 68 -28 -55 13 22 -74 -70 75 154 33 39 -155 119 -11
7857 -11 121 179 81 18 -34 84 -40 -79 138 -96 -37 -96 -36 17 1 -103 -149 -44 -16 -117 -80 39 21 -158 -1
7882 -1 89 -222 99 135 42 -66 -273 -45 25 -2 28 113 -153 -15 -212 403 218 231 36 -191 5 -65 111 186
7906 186 184 27 -132 -204 -78 -30 -65 -75 58 37 226 -309 -35 -140 -98 115 446 10 -271 174 -86 -27 -202
7929 -202 -62 -140 95 108 -219 -173 -145 -20 113 -128 -227 -72 95 252 166 161 -62 -31 51 -101 -55 50 -80 -71
7953 -71 -175 2 196 -253 114 -47 29 -236 85 86 -75 -17 -260 -30 -123 140 -61 -74 75 44 -95 115 -134
7976 -134 151 246 51 192 241 216 18 199 199 -85 215 171 224 -189 1 280 -117 -76 -139 69 27 140 213 -84
8000 -84 81 -399 -283 -87 -244 -210 57 -88 -47 -50 65 -48 -231 -129 -58 153 154 12 -120 109 148 -21 38
8023 38 41 -132 -51 43 -7 78 30 -40 -23 69 172 -20 -307 -272 -131 87 40 -150 -10 -73 -176 -4 92 80 -158
8048 -158 -62 104 405 -5 -89 126 118 207 -4 -23 -179 -133 -92 54 60 -91 -21 176 153 213 77 129 -78 6 102
8073 102 252 192 23 -171 -275 113 -48 -66 -40 60 53 39 6 -156 118 96 126 -112 188 -132 -186 -8 35 278
8097 278 12 68 -56 103 151 149 4 -153 184 118 146 116 -73 222 146 108 -426 27 143 -39 36 92 -127 -83
8121 -83 19 -73 592 -260 -392 -215 -218 -52 77 -52 -120 78 119 -44 -210 -2 159 336 4 -127 -31 -130 -46
8144 -46 98 48 56 42 91 155 88 119 -294 -51 120 -242 66 101 62 161 148 -12 88 -154 -40 -65 155 246 3
8169 3 -171 28 -165 49 50 -204 37 -134 -75 -171 -1 -190 -85 114 -346 -239 -52 -141 142 -251 -329 -156
8191a56
##END NTUPLES=NMR FID
##END=
