##TITLE=1H_CA-8692-1
 CDCl3, 8 sc, 
 6.3.2020
##JCAMPDX= 6.0         $$ Bruker NMR JCAMP-DX V2.0
##DATA TYPE= NMR FID
##DATA CLASS= NTUPLES
##ORIGIN= UXNMR, Bruker Analytische Messtechnik GmbH
##OWNER= root
$$ XWIN-NMR		Version 3.5
$$ Fri Mar  6 14:32:32 2020 Russian Standard Time (UT+4h)  she@DPX200
##.OBSERVE FREQUENCY= 200.1315
##.OBSERVE NUCLEUS= ^1H
##.DELAY= (6, 6)
##.ACQUISITION MODE= SIMULTANEOUS
##.ACQUISITION SCHEME= undefined
##.AVERAGES= 8
##.DIGITISER RES= 18
##SPECTROMETER/DATA SYSTEM= spect
##.PULSE SEQUENCE= zg30
##.SOLVENT NAME= D2O
##.SHIFT REFERENCE= (INTERNAL, D2O, 0, 15.7039)
##AUDIT TRAIL= $$ (NUMBER, WHEN, WHO, WHERE, WHAT)
$$ ##TITLE= Audit trail, XWIN-NMR		Version 3.5
$$ ##JCAMPDX= 5.01
$$ ##ORIGIN= Bruker BioSpin GmbH
$$ ##OWNER= she
$$ F:/spectra/data/she/nmr/H-F/1/audita.txt
$$ ##AUDIT TRAIL=  $$ (NUMBER, WHEN, WHO, WHERE, WHAT)
(   1,<2020-03-06 14:31:15.53 +0400>,<she>,<DPX200>,
      <created by zg, POWCHK disabled, PULCHK disabled
       configuration hash MD5:
       00 E9 B6 7A A2 85 ED C7 34 08 36 98 17 FE 4E 26
       data hash MD5: 16K
       1E 19 4D 9F 10 48 78 56 77 F4 F5 6F 36 64 9E F0>)
$$ ##END=
$$ 
$$ hash MD5
$$ A3 12 86 FE 0A 34 4E E2 BF 11 76 33 57 06 9A 20
##$RELAX= 
##$RELAX= 
##$RELAX= 
##$RELAX= 
##$RELAX= 
##$RELAX= 
$$ Bruker specific parameters
$$ --------------------------
##$DU= <F:/spectra>
##$EXPNO= 1
##$NAME= <H-F>
##$PROCNO= 1
##$TYPE= <nmr>
##$USER= <she>
##$AMP= (0..31)
100 100 100 100 100 100 100 100 100 100 100 100 100 100 100 100 100 100 
100 100 100 100 100 100 100 100 100 100 100 100 100 100 
##$AQSEQ= 0
##$AQ_mod= 1
##$AUNM= <au_zg>
##$AUTOPOS= <>
##$BF1= 200.13
##$BF2= 200.13
##$BF3= 200.13
##$BF4= 200.13
##$BF5= 200.13
##$BF6= 200.13
##$BF7= 200.13
##$BF8= 200.13
##$BYTORDA= 1
##$CFDGTYP= 0
##$CFRGTYP= 5
##$CHEMSTR= <none>
##$CNST= (0..31)
1 1 145 1 1 1 1 1 1 1 1 1 1 1 1 1 1 1 1 1 1 1 1 1 1 1 1 1 1 1 1 1 
##$CPDPRG= <>
##$CPDPRG1= <>
##$CPDPRG2= <>
##$CPDPRG3= <>
##$CPDPRG4= <mlev>
##$CPDPRG5= <mlev>
##$CPDPRG6= <mlev>
##$CPDPRG7= <mlev>
##$CPDPRG8= <mlev>
##$CPDPRGB= <>
##$CPDPRGT= <>
##$D= (0..31)
0 1.2 0 0 0 0 0 0 0 0.06 0 0.03 0 0 0 0 0.0002 0 0 0 0 0 0 0 0 0 0 0 0 
0 0 0 
##$DATE= 1583490674
##$DBL= (0..7)
120 120 120 120 120 120 120 120 
##$DBP= (0..7)
150 150 150 150 150 150 150 150 
##$DBP07= 0
##$DBPNAM0= <>
##$DBPNAM1= <>
##$DBPNAM2= <>
##$DBPNAM3= <>
##$DBPNAM4= <>
##$DBPNAM5= <>
##$DBPNAM6= <>
##$DBPNAM7= <>
##$DBPOAL= (0..7)
0.5 0.5 0.5 0.5 0.5 0.5 0.5 0.5 
##$DBPOFFS= (0..7)
0 0 0 0 0 0 0 0 
##$DE= 6
##$DECBNUC= <off>
##$DECIM= 24
##$DECNUC= <off>
##$DECSTAT= 4
##$DIGMOD= 1
##$DIGTYP= 9
##$DL= (0..7)
0 120 120 120 120 120 120 120 
##$DP= (0..7)
150 150 150 150 150 150 150 150 
##$DP07= 0
##$DPNAME0= <>
##$DPNAME1= <>
##$DPNAME2= <>
##$DPNAME3= <>
##$DPNAME4= <>
##$DPNAME5= <>
##$DPNAME6= <>
##$DPNAME7= <>
##$DPOAL= (0..7)
0.5 0.5 0.5 0.5 0.5 0.5 0.5 0.5 
##$DPOFFS= (0..7)
0 0 0 0 0 0 0 0 
##$DQDMODE= 0
##$DR= 18
##$DS= 0
##$DSLIST= <SSSSSSSSSSSSSSS>
##$DSPFIRM= 0
$$ [...]
##$SUBNAM2= <"">
##$SUBNAM3= <"">
##$SUBNAM4= <"">
##$SUBNAM5= <"">
##$SUBNAM6= <"">
##$SUBNAM7= <"">
##$SUBNAM8= <"">
##$SUBNAM9= <"">
##$SW= 24.9337058887773
##$SWIBOX= (0..15)
0 0 2 0 0 0 0 0 0 0 0 0 0 0 0 0 
##$SW_h= 4990.01996007984
##$TD= 16384
##$TD0= 1
##$TE= 0
##$TE2= 300
##$TE3= 300
##$TEG= 300
##$TL= (0..7)
0 120 120 120 120 120 120 120 
##$TP= (0..7)
150 150 150 150 150 150 150 150 
##$TP07= 0
##$TPNAME0= <>
##$TPNAME1= <>
##$TPNAME2= <>
##$TPNAME3= <>
##$TPNAME4= <>
##$TPNAME5= <>
##$TPNAME6= <>
##$TPNAME7= <>
##$TPOAL= (0..7)
0.5 0.5 0.5 0.5 0.5 0.5 0.5 0.5 
##$TPOFFS= (0..7)
0 0 0 0 0 0 0 0 
##$TUNHIN= 0
##$TUNHOUT= 0
##$TUNXOUT= 0
##$USERA1= <user>
##$USERA2= <user>
##$USERA3= <user>
##$USERA4= <user>
##$USERA5= <user>
##$V9= 5
##$VALIST= <valist>
##$VCLIST= <CCCCCCCCCCCCCCC>
##$VD= 0
##$VDLIST= <DDDDDDDDDDDDDDD>
##$VPLIST= <PPPPPPPPPPPPPPP>
##$VTLIST= <TTTTTTTTTTTTTTT>
##$WBST= 1024
##$WBSW= 4
##$XGAIN= (0..3)
0 0 0 0 
##$XL= 0
##$YL= 0
##$YMAX_a= 898939
##$YMIN_a= -739588
##$ZGOPTNS= <>
##$ZL1= 120
##$ZL2= 120
##$ZL3= 120
##$ZL4= 120
##$ABSF1= 10
##$ABSF2= 0
##$ABSG= 5
##$ABSL= 3
##$ALPHA= 0
##$AQORDER= 0
##$ASSFAC= 0
##$ASSFACI= 0
##$ASSFACX= 0
##$ASSWID= 0
##$AUNMP= <proc_1d>
##$AZFE= 0.1
##$AZFW= 0.1
##$BCFW= 1
##$BC_mod= 2
##$BYTORDP= 1
##$COROFFS= 0
##$CY= 11.3945322036743
##$DATMOD= 1
##$DC= 2
##$DFILT= <>
##$DTYPP= 0
##$F1P= 16.9975609425685
##$F2P= -3.02152046262296
##$FCOR= 0.5
##$FTSIZE= 0
##$FT_mod= 4
##$GAMMA= 1
##$GB= 0.15
##$INTBC= 1
##$INTSCL= 1
##$ISEN= 128
##$LB= 0.24
##$LEV0= 0
##$LPBIN= 0
##$MAXI= 10000
##$MC2= 0
##$MEAN= 0
##$ME_mod= 0
##$MI= 1.114404
##$NCOEF= 0
##$NC_proc= 0
##$NLEV= 6
##$NOISF1= 3.799351
##$NOISF2= 2.8
##$NSP= 1
##$NTH_PI= 0
##$NZP= 0
##$OFFSET= 15.70392
##$PC= 1
##$PHC0= -9786.814
##$PHC1= 14.00082
##$PH_mod= 1
##$PKNL= yes
##$PPARMOD= 0
##$PSCAL= 0
##$PSIGN= 0
##$REVERSE= no
##$SF= 200.130013532006
##$SI= 16384
##$SIGF1= 3
##$SIGF2= 2
##$SINO= 400
##$SIOLD= 16384
##$SREGLST= <1H.CDCl3>
##$SSB= 0
##$STSI= 0
##$STSR= 0
##$SW_p= 3612.71676300578
##$SYMM= 0
##$S_DEV= 0
##$TDeff= 0
##$TDoff= 0
##$TI= <>
##$TILT= no
##$TM1= 0
##$TM2= 0
##$TOPLEV= 0
##$USERP1= <user>
##$USERP2= <user>
##$USERP3= <user>
##$USERP4= <user>
##$USERP5= <user>
##$WDW= 1
##$XDIM= 8192
##$YMAX_p= 0
##$YMIN_p= 0
$$ End of Bruker specific parameters
$$ ---------------------------------
##NTUPLES= NMR FID
##VAR_NAME=  TIME,          FID/REAL,        FID/IMAG
##SYMBOL=    X,             R,               I
##VAR_TYPE=  INDEPENDENT,   DEPENDENT,       DEPENDENT
##VAR_FORM=  AFFN,          ASDF,            ASDF
##VAR_DIM=   8192,          8192,            8192
##UNITS=     SECONDS,       ARBITRARY UNITS, ARBITRARY UNITS
##FACTOR=    0.0002004,     1,               1
##FIRST=     0,             0,               0
##LAST=      1.6414764,     0,               0
##MIN=       0,             -739588,         0
##MAX=       1.6414764,     898939,          0
$$ Real data points
##PAGE= N=1
##DATA TABLE= (X++(R..R)), XYDATA
0@%%%%qJ6j5K3l2L2m1N4o2Q1j02J19j46J76k08K48k93L42l98M59n29O10o94P90
$$ 0 0 0 0 0 -8 8 -7 16 -16 16 -25 29 -33 48 -54 65 -81 95 -113 135 -158 184 -214 245 -284 326 -368 422
28D22r00J018j152J297j452J630j822K030k267K522k796L102l438L808m218M669
$$ 422 -478 540 -612 685 -767 863 -959 1071 -1196 1326 -1470 1632 -1806 2002 -2216 2453
44B453n171N733o363P072p880Q816r908J1198j2755J4680j7132K0376k4899L1699
$$ 2453 -2718 3015 -3348 3724 -4156 4660 -5248 5950 -6805 7875 -9257 11119 -13780 17919
58A7919m3209O7626k05405L84910O00555k94991o35385n61449O9293N56463N12190
$$ 17919 -25290 42336 -163069 221841 822396 527405 -107980 -669429 -600136 -43673 468517
69D68517n0683l62442l25637o6443J85820L00421Q2783j28562j47810q5604l4948
$$ 468517 417834 55392 -270245 -336688 -150868 149553 232336 103774 -44036 -129640 -164588
80a64588J37468K03153M3527j36593j68433j32870N3036K75836K16736r5603k57301
$$ -164588 -27120 176033 219560 82967 -85466 -218336 -165300 110536 327272 231669 -25632
91b5632j96071k6308J92544K69050M9854j72717j61042p6669j3003R9787J34705
$$ -25632 -221703 -248011 -55467 213583 263437 90720 -70322 -146991 -159994 -60207 74498
102G4498L3633k0638l3755j24834j26616N0041J59490J11997L0631r6703k01412
$$ 74498 108131 87493 53738 -71096 -197712 -147671 11819 123816 154447 57744 -143668
113a43668p5412J54067J78151M9047o5638j61049j27605R6484K19949P5190r9661
$$ -143668 -219080 -65013 113138 162185 96547 -64502 -192107 -95623 124326 199516 99855
124I9855j53226j21881M3703K29282J52035r8515j94716j21686P968J66640J86098
$$ 99855 -53371 -175252 -131549 97733 249768 151253 -43463 -165149 -157181 9459 195557
135A95557k7464j83735j05346J3031P1256J07068L2004j06125q4910K8445L3923
$$ 195557 168093 -15642 -120988 -107957 -36701 70367 102371 -3754 -88664 -60219 -26296
146b6296J7986M7320l835p6291l1438K0074J6890O3743P2101o3196j33491k2575
$$ -26296 -8310 39010 35175 -41116 -72554 -52480 -35590 28153 100254 37058 -96433 -119008
158a19008Q1393J02989Q0226n0968j83059p9515J24558J47828L9106o0437j34863
$$ -119008 -37615 65374 145600 94632 -88427 -167942 -43384 104444 143550 83113 -51750
169e1750q3194R5514J38922o311q5641m5202r780L7479O6063k2441q6634L860
$$ -51750 -134944 -39430 99492 93181 7540 -37662 -47442 -9963 56100 33659 -52975 -49115
181d9115O4236K915k4004q535k7435L103N7452J685o2452j147M1780M49J81J5899
$$ -49115 15121 18036 -5968 -14503 -41938 -38835 18617 20302 -42150 -43297 -1517 -1068 -887 15012
195A5012k6958k0592L0954k728l0049M8243P1367k3538p3556n9631k7861Q1248
$$ 15012 -11946 -32538 -1584 -4312 -34361 13882 85249 61711 -11845 -71476 -99337 -18089
207a8089J64885L5816j51287j53301l2692R1832J79533J00297j25607k03693n7543
$$ -18089 146796 182612 31325 -121976 -154668 -62836 116697 216994 91387 -112306 -169849
218a69849Q5901J34914J09127l7555j76589j06033N5683J08594R1138L0700j05712
$$ -169849 -83948 50966 160093 122538 -54051 -160084 -104401 4193 95331 126031 20319
229B0319j50311j2773J08926J04185N6615m1335j52377r5570P9153J30881O5824
$$ 20319 -129992 -142765 -33839 70346 126961 85626 -66751 -162321 -83168 47713 113537
240A13537k281q8624j21901m293J04548O4833P659j1300n9761o0628K6397N1008
$$ 113537 111256 22632 -99269 -103562 986 65819 73478 62178 2417 -58211 -31814 19194
252A9194N092J1636Q277n2192l9416L3881K9105J693J7065j8399o5559r598N1047
$$ 19194 24286 35922 44199 -7993 -47409 -13528 15577 17270 34335 15936 -49623 -59221 -8174
265h174K2758J3415K1628m2566p8667j1401L8830M9671P8937K8600j07956j28231
$$ -8174 14584 27999 49627 7061 -71606 -83007 -44177 5494 84431 113031 5075 -123156
277a23156p009Q7488J18097Q2049o6114j75015p0679R4421J22885O1352l4949
$$ -123156 -130165 -42677 75420 157469 91355 -83660 -154339 -59918 62967 124319 89370
288H9370j33007q8236P7671J27880L0959m6977q5392q3692K3415J24574P0461
$$ 89370 -43637 -131873 -54202 73678 104637 57660 -27732 -111424 -88009 36565 107026
299A07026k8912o3085q7528o4389O2843J36488N9778l7209r4347j21323k6707
$$ 107026 78114 15029 -72499 -136888 -74045 62443 122221 85012 -9335 -130658 -157365
310a57365J34861J40106J370q9865j04810n6764P1776J36062K5028q4745o3059
$$ -157365 -22504 117602 118972 29107 -75703 -132467 -60691 75371 100399 15654 -47405
321d7405j1257K7378P2108L2668o3165n4599J7159K0973J4792L5960k141m8098
$$ -47405 -58662 -31284 40824 73492 10327 -44272 -27113 -6140 8652 44612 42471 -5627
333e627j5224M806j5698K3682O0591J120m9634k6494j8461n337N4428M8615k8688
$$ -5627 -20851 -16045 -31743 -8061 52530 53650 4016 -22478 -40939 -46276 8152 56767 28079
346B8079l8002k327j4862o418L8518J9366j7040M968j517m3468p948M8577K2642
$$ 28079 -9923 -12250 -27112 -33530 4988 24354 7314 12282 10765 -32703 -40651 7926 30568
359C0568p844m270l4219l7020L7846O0693k604k8336k0852l4695K285O5016L3307
$$ 30568 22724 18454 -15765 -52785 -14939 45754 43150 14814 -6038 -40733 -38448 26568 59875
372E9875l3413k8577k0307k3959L2620O6033k55m7072k5796j9972J668O2666M3821
$$ 59875 26462 -2115 -22422 -46381 -13761 52272 52017 4945 -20851 -40823 -39155 23511 67332
385F7332m3287n3089r320M557L2727N3224j3216o4595j4200K4932J0641K1587
$$ 67332 24045 -29044 -38364 -33807 -1080 52144 38928 -25667 -39867 -14935 -4294 17293
397A7293J7360l6138l1297K1863J2352r136K1332J3201l1917j3804J3907o362
$$ 17293 34653 -1485 -32782 -10919 1433 -7703 13629 26830 -5087 -18891 -4984 -11346
409a1346M390L4979n202l8682J385J5564r192Q841J7756k1094j1225K8077l004
$$ -11346 -6956 28023 22821 -15861 -14476 1088 -8104 737 18493 -2601 -13826 14251 11247
422A1247l3306N271K1597N85J2217J858m6484k1220M7536L5961j1002j7539l2581
$$ 11247 -22059 -16788 4809 5394 17611 19469 -27015 -48235 -699 35262 24260 6721 -25860
435b5860l0122L8144O4831n693m3914k1791j5994P907N5074K7557l8703l1056
$$ -25860 -55982 -17838 46993 41300 -2614 -24405 -40399 -32492 22582 50139 11436 -19620
447a9620l834r520J9544N0897L019m1038j9755r388m658M5315M8265k6290n2524
$$ -19620 -23454 -32974 -13430 37467 40486 -552 -20307 -29695 -34353 10962 59227 32937 -19587
460a9587j5561K23K4927N7866R447o1227l7159J2871J6919L1544L0714l0494n1540
$$ -19587 -35148 -34925 -9998 47868 57315 -3912 -41071 -28200 -11281 20263 50977 20483 -31057
473c1057K451K0868N717K3794J4392l6002k7950J4084M691K822L1050L498l8506
$$ -31057 -28606 -7738 -2021 21773 36165 163 -27787 -13703 -9012 -6190 24860 28358 -10148
486a0148j1416J4184k398J1376K6926j5866l2322R477J1855p122J6768J4847k7345
$$ -10148 -21564 -7380 -9778 1598 28524 12658 -19664 -10187 1668 -5454 11314 26161 -1184
499a184j6275J7378l08l155K7145M025l3263r072R637n791J5915L1933j4808l6012
$$ -1184 -17459 -81 -389 -3544 23601 27626 -5637 -14709 -5072 -10863 5052 36985 22177 -13835
513a3835m26M039l780K6579K0845k7584k1648P410o533R1L2429O652l0294r233
$$ -13835 -14261 -10222 -14002 12577 33422 5838 -15810 -8400 -14933 -14842 17587 24239 -6055 -15288
527a5288N090q719J5933L1530j5100l2969J932N869J544K9263J4584l5898k4867
$$ -15288 -10198 -18917 -2984 28546 13446 -19523 -17591 -11722 -10178 19085 33669 -2229 -27096
540b7096J2125N580J2531L2045n876m2511j1276J0949J655K4058L0432k2795l9535
$$ -27096 -14971 -9391 3140 35185 29309 -13202 -24478 -13529 -11874 12184 42616 19821 -19714
553a9714k786M508O105L5014J4744l9451k7374J0321O183J2760K6898j3834m1787
$$ -19714 -22500 -17992 -11887 23127 37871 -1580 -28954 -18633 -12450 310 27208 13374 -28413
566b8413k6K2547O119J4177R228l4975k9162K1530K2097O588J7701n897m3611
$$ -28413 -28439 -5892 227 14404 23632 -11343 -40505 -18975 3122 9710 27411 21514 -22097
579b2097j3694K5948J3277J2134K1393j8569m1417l62J8658M518J8456J6167k7925
$$ -22097 -35791 -9843 3434 15568 36961 18392 -23025 -23387 -4729 -211 18245 34412 6487
592F487k6022J1927N708l093J9773O318k7687p426J4565o163L83K1258p541k7064
$$ 6487 -19535 -7608 -1900 -4993 14780 21098 -6589 -14015 550 -5613 -5230 16028 8487 -18577
606a8577M284J2813k547J4747J3240l0456k6613J5064J7581J2161K3560r839m9449
$$ -18577 -14293 -1480 -4027 10720 23960 -6496 -33109 -18045 -464 11697 35257 25418 -24031
619b4031j5810K7126K0900K0756J6556l1018m6636L236K6154J4073K2024M957
$$ -24031 -39841 -12715 8185 28941 45497 14479 -32157 -28921 -2767 11306 33330 38287
631C8287m1294k8831J9050J8340Q238J5178j5425m1919M95L5039J1434j137n314
$$ 38287 -3007 -31838 -12788 5552 13790 28968 13543 -28376 -27881 7158 18592 17455 12141
644A2141l4076k3442L4357L7184j791j1713j8960l3251M023M5173J7509j3050
$$ 12141 -21935 -45377 -11020 26164 24373 12660 -6300 -39551 -35528 9645 27154 14104
656A4104m746j5926k4465J5004L0032k490m328Q272j5986j7224J7350J0493j1605
$$ 14104 9358 -6568 -31033 -16029 14003 11513 7185 15457 -529 -17753 -403 10090 -1515
669a515N942R166j5631l063J5930q620j5015J3920O114j4293N243Q824j4509j31
$$ -1515 4427 13593 -2038 -5101 10829 2209 -12806 1114 7228 -7065 -1822 7002 -7507 -7638
683g638J7889j2094k1959R543J2568K908J7114K05m0320k0868K3700K3110J5939
$$ -7638 10251 -1843 -23802 -14259 -1691 1217 18331 18536 -21784 -42652 -18952 4158 20097
696B0097J5589k4582m6558k238L0150J7571J6828O070l3882l2351J5687K4408
$$ 20097 35686 11104 -35454 -37692 -7542 10029 26857 32927 -955 -33306 -17619 6789
708F789P939J0296r943l7820n238L6783J6721n956r806k9806k2924L2934M4825
$$ 6789 14728 25024 15081 -22739 -27977 8806 25527 19571 9765 -20041 -42965 -10031 34794
721C4794j796k2342k2530k9799L356M8570K5625j7038j5281j6262k2253J2025
$$ 34794 32998 10656 -11874 -41673 -38317 10253 35878 18840 3559 -12703 -34956 -22931
733b2931L5419M804q495K610j4098k1364J4649K1537n386k79O035j5806o867K1175
$$ -22931 12488 17292 8797 11407 -2691 -24055 -9406 12131 6745 6466 12501 -3305 -10172 11003
747A1003K846j6592L589M851j1691P041J8756r176j2347O926j0706j7648J7475
$$ 11003 13849 -2743 846 5697 -5994 1047 19803 10627 -1720 5206 -5500 -23148 -5673
760e673K4966k69k277j1101l7275j2703L8975L4266K797r658l2323l8744J2973
$$ -5673 19293 19024 16747 5646 -31629 -44332 -5357 28909 31706 22048 -10275 -49019 -36046
773c6046M9317J9253q607j5060l1551j5938L4097L4433p420j7443j5311j8643
$$ -36046 13271 32524 23917 8857 -22694 -38632 -4535 29898 22478 5035 -10276 -28919
785b8919J5067M6188R057l4887k8100j3841O604M9033M1889k6737n4994k6145
$$ -28919 -13852 32336 41393 6506 -21594 -35435 -28831 20202 62091 35354 -19640 -45785
797d5785J675L3575N6565J1482n1469m3498m533J4354L7290L4948j9364m7022
$$ -45785 -44110 -10535 46030 57512 6043 -37455 -41988 -27634 9656 44604 25240 -21782
809b1782j1813J3396J6346K7558N473l9900k8309J9452K6690J7062R316k8806
$$ -21782 -33595 -20199 -3853 23705 29178 -10722 -39031 -19579 7111 24173 33489 4683
821D683m8362J545M4221K8158P641j2743m4025k9475K6611L5996P446K681q977
$$ 4683 -43679 -42134 2087 30245 37886 25143 -18882 -48357 -21746 14250 21696 24377 15400
834A5400l0485j0145J8518N176L85J8045J377k5344p634O129k669J2035J9897
$$ 15400 -15085 -25230 -6712 -1536 -1151 16894 18271 -7073 -14707 -8578 -11247 788 20685
847B0685j3556k4640N233J0240J672J4036K956k8535j3827J7421J1514R978J7987
$$ 20685 7129 -17511 -12278 -2038 -366 13670 16626 -11909 -25736 -8315 3199 13177 31164
860C1164j3507m0606j3282J7205K2599L3638J7427m1394n6641o461L1346M0363
$$ 31164 17657 -22949 -36231 -19026 3573 37211 54638 13244 -43397 -49858 -18512 21851
872B1851L6567j2136o4824l7303K5105L9556K7739N928l8426m7416R224M1596
$$ 21851 58418 46282 -18542 -55845 -30740 8816 36555 42483 4057 -43359 -34135 7461
884G461J9519K37j5734l8195j3521L5609L1588n68q385k2583l2127O046L8845
$$ 7461 26980 27217 11483 -26712 -40233 -4624 26964 26396 18011 -4572 -36699 -30653 8192
897H192J8040k918m921k5231k5386J3899K5757L076L811M899j9076j4999R056
$$ 8192 26232 23314 18393 -6838 -32224 -18325 7432 10508 14319 19218 142 -14857 -5801
910e801N72n783J7403J5467j2283j0663l953j6284J884L1379J3130j6329j1590
$$ -5801 -5229 -11012 6391 21858 9575 -1088 -5041 -21325 -19441 11938 25068 8739 -2851
923b851j1712j1783K1162L2250p319k6707j0676l831J2175L5111R307l8164k9997
$$ -2851 -14563 -26346 -5184 27066 19747 -6960 -17636 -21467 -9292 25819 35126 -3038 -33035
936c3035M669J8124L0993K4658k5780m9892j0000K2474K3625K5661K863l7668
$$ -33035 -28366 -10242 20751 45409 19629 -30263 -40263 -17789 5836 31497 34360 -3308
948c308k9498J1329J6233J0404J6824m014k8883q476J2080K342P015J4558j1068
$$ -3308 -32806 -21477 -5244 5160 21984 17970 -10913 -19389 -7309 -4967 2048 16606 5538
961E538k0633O769J2276k676K479l86j8293J086K7482N909j7757r659o672k083
$$ 5538 -15095 -8326 3950 1274 3753 3367 -14926 -13840 13642 19551 1794 -7865 -14537 -16620
975a6620K4909K0748k0680k4409L079Q508R414J5476j0597k9500J915K4537N830
$$ -16620 8289 29037 8357 -16052 -12973 -4465 4949 20425 9828 -19672 -17757 6780 12610
988A2610l649l984j8571p812K5165J5698j2426p484j611j1769L002J9578L23q734
$$ 12610 8961 4977 -13594 -21406 3759 19457 7031 -453 -2064 -13833 -10831 8747 9070 336
1002C36Q235j896j7334R59J0372j697N580J3617j1002j6142O026L196p488R110
$$ 336 8571 6675 -10659 -9700 672 -1025 4555 18172 7170 -8972 -2946 250 -7238 1872
1016A872J1958p870k916M400j4912j1497J8227J6291m153k998j0506k0464Q068
$$ 1872 13830 5960 3044 7444 -7468 -18965 -738 15553 11400 8402 -2104 -22568 -14500
1029a4500L0834L830j8954j1622q190L699L1100J7734k7780l0562k122J0842K4517
$$ -14500 16334 20164 1210 -10412 -18602 -14903 16197 33931 6151 -24411 -26533 -15691 8826
1042H826K8904j0461m1166j5178J0515J1906K1547J6133j8449k4069R5J054j038
$$ 8826 37730 27269 -13897 -29075 -18560 -6654 14893 31026 12577 -11492 -11397 -10343 -11381
1055a1381J9142J4155j3714j1951j617q746L128K3830L683k0094n936L011j205
$$ -11381 7761 21916 8202 -3749 -5366 -14112 -10984 12846 16529 -3565 -9501 -6490 -7695
1068g695J2241J0999j8282j7106J0737J0352N66Q126k431j9729j070J3486m082
$$ -7695 4546 15545 -2737 -19843 -9106 1246 1812 9938 7507 -12222 -13292 194 -3888
1081c888k717J4759L622r395j234p876j5370J2511K9341K527j5658j1129j4654
$$ -3888 -6605 8154 11776 2381 1147 -6729 -22099 -9588 19753 22280 6622 -4507 -19161
1094a9161j419K9466J9068j7381j7848m158l177J1529K2666m987k2430k959M358
$$ -19161 -20580 8886 27954 10573 -7275 -11433 -14610 -3081 19585 14598 -7832 -10791 -6433
1107f433j925J0879J2824j1383j1019L105n653n338J8656J4695j0001r767o302
$$ -6433 -8358 2521 15345 3962 -7057 -3952 -9605 -14943 3713 18408 8407 -1360 -7662
1120g662j2136Q607K8307M357j9766q550k489L97J8881J2433j9528j6953R461
$$ -7662 -19798 -11191 17116 21473 1707 -6843 -9332 -8935 9946 22379 2851 -14102 -4641
1133d641Q359L364Q191p777j9988L667J5866l603l752P857k820p143M791n640
$$ -4641 3718 7082 15273 7496 -12492 -8825 7041 3438 -314 7543 4723 -2420 2371 -3269
1147c269j4292J2168K2677j968j3382q920j4390K378K9275J4067j7733j2758l004
$$ -3269 -17561 -5393 17284 15316 1934 -6986 -21376 -18998 10277 24344 6611 -6147 -9151
1160i151m572J0030J7709o040j2913P151K276j0222L095Q598m135J820O425j3275
$$ -9151 -13723 -3693 14016 7976 -4937 2214 4490 -5732 -2637 5961 1826 3646 10071 -3204
1174c204j1062J6072J3351o741n946q275j3137J1719K6483j943k1370p356j515
$$ -3204 -14266 1806 15157 8416 2470 -5805 -18942 -7223 19260 17317 -4053 -11409 -12924
1187a2924K743J9027P636j9958j1015R593K605q63Q099l285j1421P026P623j1000
$$ -12924 -10181 8846 16482 -3476 -14491 -4898 -2293 -3156 4943 1658 -9763 -2737 4886 -6114
1201f114j502J2347j81m597L263p745j0682J4412J7424o782q804l258j0290J838
$$ -6114 -7616 4731 4550 -47 3216 -4529 -15211 -799 16625 9843 1039 -2219 -12509 -10671
1215a0671K1336M572j4740j949J313p008L773R919q187n380J2364J990j2419K17
$$ -10671 10665 15237 497 -1452 -139 -7147 -3374 6545 -1642 -7022 5342 7332 -5087 -4870
1229d870J177o850Q370J4211r266j1479O137P89m097P772K172j1383M396J4296
$$ -4870 -3693 -10543 -2173 12038 2772 -8707 -2570 -1781 -5878 1894 4066 -7317 -2921 11375
1243A1375n865j0871J882j371O67J6197M338j8120o851R593N59J669O505q539
$$ 11375 5510 -5361 -3479 -4850 -4183 12014 16352 -1768 -8619 974 1533 3202 9707 1168
1257A168j0471J2801J0174j1830o480J988l661M976J4048n844j5259M843O294
$$ 1168 -9303 3498 13672 1842 -4638 -2650 -6311 -1335 12713 6869 -8390 -3547 2747
1270B747p806K43O290l594M141J0667j0904k0698N599J6667P097M738p622k3801
$$ 2747 -5059 -4816 1474 -2120 2021 12688 1784 -18914 -13315 3352 10449 15187 7565 -16236
1284a6236m415K5256J3429p226q061j0058p243J6202J7066r681j3574K580j64
$$ -16236 -20651 4605 18034 10808 2747 -7311 -14554 1648 18714 9033 -4541 -1961 -2125
1297b125j555J0411J447j0905L087N560j1951n635J2464N848j920K274j1100j7043
$$ -2125 -3680 6731 8178 -2727 360 5920 -6031 -11666 798 6646 4726 7000 -4100 -21143
1311b1143R973K1224N26p357m291j1809k882J8361Q744j1069k194L338p237M84
$$ -21143 -11170 10054 10580 3223 -1068 -12877 -15759 2602 11346 277 -1917 1421 -5816 -5332
1325e332R665l786m742J0406J417j2718J30P553l129K193P435j0210r642J1111
$$ -5332 4333 547 -4195 6211 7628 -5090 -4960 2593 -536 1657 9092 -1118 -10760 351
1339C51P718n586m67l170j2394M294J9127J666j0812l050p633o947J4901J5333
$$ 351 8069 2483 2016 -1154 -13548 -9254 9873 11539 727 -2323 -9956 -16903 -2002 13331
1353A3331p027q233Q3p735k305J4292M170q429L711L497r538k001P308k590n38
$$ 13331 6304 -1929 -1846 -9581 -11886 2406 6576 -1853 1858 5355 -4183 -6184 1124 -1466 -2004
1368b004J1498j319j2755K685O179n629M70N810o046j382J2982n10j5283k998
$$ -2004 9494 8175 -4580 -1895 4284 -1345 -875 4935 -1111 -2493 10489 9979 -5304 -8302
1382h302M370O76J0006Q626j3572j3352P393M639l263M584J519p498N599R171
$$ -8302 -3932 -3256 6750 15376 1804 -11548 -4155 484 -2779 1805 3324 -4174 1425 10596
1396A0596j1287j3350O242Q509M264Q336m306j9979j495J5179K082k145L589m890
$$ 10596 -691 -14041 -7799 710 4974 13310 9004 -10975 -12470 2709 4791 2646 6235 1345
1410A345o336R402L998j2302j370R540j647k213O217l870p126O835J561j2416
$$ 1345 -4991 4411 8409 -3893 -5263 4277 2630 417 6634 2764 -4362 2473 4034 -8382
1424h382O92J3403K116k537r94j3813j0208J6232J6449l897o830n405j0443L234
$$ -8382 -7690 5713 7829 5292 4298 -9515 -19723 -3491 12958 9061 2231 -3174 -13617 -10383
1438a0383J7572P87j0779J121K527m965M287N567r354l095J0227K59n592N913
$$ -10383 7189 7976 -2803 -1682 845 -4120 167 5734 -3620 -6715 3512 3771 -1821 4092
1452D092Q26r682N14N712m982J480J1869k381j0991j01j180m958R780J1371o573
$$ 4092 4918 -4764 -4250 1462 -3520 -2040 9829 7448 -3543 -3644 -4824 -9782 -2 11369 4796
1467D796o901J689o236m923J1122O065n615J770K650j0526l160Q855j55l322Q592
$$ 4796 -2105 -416 -6652 -11575 -453 5612 -3 1767 4417 -6109 -9269 -414 -569 -3891 4701
1482D701J239r726J339L883o572N06R700k199m702P457k26j0210K02M248l365
$$ 4701 5940 -3786 -2447 1436 -5136 -4630 5070 2871 -1831 5626 5400 -4810 -4608 -360 -3725
1497c725N521J2513n858j3849p89J47k24J2580P473j1763p621M517k134j842Q238
$$ -3725 1796 14309 8451 -5398 -6187 -6040 -6264 6316 13789 2026 -5595 -1078 -3212 -5054 3184
1512C184j26o742O764N246j0709n280N224q54J239J0761r11j1700J310L952o107
$$ 3184 3058 -3684 3080 8326 -2383 -7663 -2439 -3293 -2054 8707 7796 -3904 -2594 1358 -4749
1527d749J143R224k145k884O362l092j0975L801O263m022J605P452l806m511M040
$$ -4749 -3606 5618 3473 589 6951 3859 -7116 -3315 2948 -1074 531 7983 4177 -334 3706
1542C706n280j0374P542J2823J28r59l391j5451n092J6106J0618l951j898n017
$$ 3706 -1574 -11948 -4406 8417 8545 7586 4195 -11256 -16348 -242 10376 6425 4527 -490
1556d90j1185N195J3491k529p170J984j721l011R569M831j0782m092L757l566
$$ -490 -11675 -6480 7011 4482 -2688 -704 -2425 -5436 4133 8964 -1818 -5910 -2153 -5719
1570e719K573J3333K95j2041k845k112l977J0070J4499m507j0252j919n735k777
$$ -5719 -3146 10187 10482 -1559 -4404 -6516 -10493 -423 14076 9569 -683 -2602 -8337 -11114
1584a1114J3007Q785p019k850M99q189k214J0967J542m379M002q29r776K549R192
$$ -11114 1893 10678 3659 809 1308 -6881 -9095 1872 3414 -965 3037 2208 -7568 -5019 4173
1599D173l274l534L164m371m010J1600O455q913n755r87m999O227J6079J276j2368
$$ 4173 899 -2635 529 -3842 -7852 3748 10203 1290 -4465 -5452 -10451 -4224 11855 13131 763
1614G63n417m192l932J3156J4742n174r837l184o340m5J5100O868r517n147n12
$$ 763 -4654 -8846 -12778 378 15120 9946 109 -3075 -9415 -9460 5640 12508 2991 -2156 -2668
1629b668m274M880J2743m087j1943L56K888L43Q859L956j3990q689O795M687L540
$$ -2668 -6942 -2062 10681 6594 -5349 -4993 -2105 -1762 7097 11053 -2937 -11626 -4831 -144 3396
1644C396P753m780j5400o65Q524J692M398N384q731j0097N254M671k466M994L072
$$ 3396 11149 6369 -9031 -9696 -1172 520 4918 10302 1571 -8526 -3272 1399 -1067 3927 6999
1659F999q981j744P565k006m600M784m04n135N909N609q005l940M641k224p28
$$ 6999 -1982 -3726 3839 1833 -2767 2017 1613 -3522 2387 7996 -9 -3949 692 -1532 -2260
1674b260P883o11r320K347N285m203q13L919n920k226J0851L304q802k816j399
$$ -2260 5623 5012 -4308 -1961 3324 -879 -1692 2227 -3693 -5919 4932 8236 -566 -3382 -4781
1689d781m924P916J4333k846j1569l884l912L73J4612J0534j0072j0883k146k142
$$ -4781 -9705 -1789 12544 9698 -1871 -5755 -9667 -9294 5318 15852 5780 -5103 -7249 -9391
1703i391O866J4672r31j5456m310M196K541Q198N282j2940j1719O766Q082K816
$$ -9391 -2525 12147 11216 -4240 -8550 -4354 -1813 6385 11667 -1273 -12992 -6226 1856 4672
1717D672M824m005j5594k941J0364M587L253M970p038j4499J093O629J810P640
$$ 4672 9496 5491 -10103 -13044 -2680 1907 5160 10130 3092 -11407 -10314 -3685 -1875 5765
1731E765N942j1106j0165L102K437J229Q967K741r834k976K908l792J067J0742
$$ 5765 11707 601 -9564 -6462 -4025 -2796 6171 8912 -922 -3898 -990 -4782 -3715 7027
1745G027L55q295j720j121k661J0500J0989r901j5010j931M656J1381J6093l861
$$ 7027 7382 -913 -2633 -3754 -6415 4085 15074 5173 -9837 -11768 -7112 4269 20362 16501
1759A6501k5648j3642Q991J5268J6577N566k0106k5764L10J6825J4571J1427n149
$$ 16501 -9147 -22789 -13798 1470 18047 23613 3507 -22257 -21947 -5122 9449 20876 15727
1772A5727k4307j4673J0362J5807J1811N461j4709k4649k191J9853J6036O270
$$ 15727 -8580 -23253 -12891 2916 14727 20188 5479 -19170 -21361 -1508 14528 20798
1784B0798p519k5157j5082J6598K5254P972o883j8653k0869L556K6066J4744m620
$$ 20798 13279 -11878 -26960 -10362 14892 22864 15981 -2672 -23541 -19985 6081 20825 16205
1797A6205j0695j6149j0444J2771J9650L321n932p758j3621m424J5575J3834k562
$$ 16205 5510 -10639 -21083 -8312 11338 14659 8727 969 -12652 -17076 -1501 12333 9771
1810I771n552q915j1116N840J7796M653p588o522p036m020J1651J2227l549n578
$$ 9771 4219 -4696 -15812 -9972 7824 12477 4889 -1633 -8669 -12689 -1038 11189 7640 2062
1824B062k496p443k478J1939P491k682j814m909j1407J757J5245N297m466l992
$$ 2062 -434 -7877 -10355 1584 9075 6393 4579 -330 -11737 -9980 5265 10562 6096 2104
1838B104r200o283J1070J2575l147n910l425p492l45J2914N903m926l091n437
$$ 2104 -7096 -13379 -2309 10266 7119 1209 -2216 -9708 -10053 2861 8764 3838 747 -4690
1852d690q522N409J5935K905p458p255r165j091J7694J3994q267j4582o981l67
$$ -4690 -13212 -7803 8132 11037 3579 -3676 -12841 -13932 3762 17756 9489 -5093 -12074 -12441
1866a2441J1690J7875k254j8653q228L577O454J0971N462j1790j2557K497N124
$$ -12441 -751 17124 14870 -3783 -12011 -8434 -1980 8991 14453 2663 -9894 -7397 -2273
1879b273L869Q146l92j3593o969N380N175O981O345j0272j6086J433J2356O805
$$ -2273 1596 9742 9350 -4243 -11212 -5832 -657 6324 12669 2397 -13689 -12256 100 6905
1893F905L239n178j5346l529J4279R468m287m950n161l898Q708R730o482q091
$$ 6905 10144 4966 -10380 -13909 370 9838 5551 601 -4560 -8458 250 9980 3498 -4593
1907d593L219K984LK957k949q371M327J0192j024n424j606m929j847J0631P308
$$ -4593 -1374 1610 1613 4570 1621 -6750 -2423 7769 6745 1321 -285 -5214 -7061 3570 10878
1922A0878n353n262m542p376M345J6721N931j0351j1084q714jJ9248J6550q734
$$ 10878 5525 263 -4279 -11655 -7310 9411 15342 4991 -6093 -14807 -14808 4440 20990 12256
1936A2256k0299r820L017J5698K0196k264k3931j4817N057J3113J6131P308j5605
$$ 12256 -8043 -17863 -14846 852 21048 18784 -5147 -19964 -14907 -1794 14337 21645 6040
1949F040k0767j979R841J1370J3215j0j8979j5722K999J0381J3080J0436r089
$$ 6040 -14727 -16706 -6865 4505 17720 17710 -1269 -16991 -13992 -3611 9469 19905 10816
1962A0816k2305o958J0706J1063Q824p91j4800j1246P427J0056N56L21j674p439
$$ 10816 -11489 -18447 -7741 3322 12146 11355 -3445 -14691 -7264 2792 3348 3669 1995 -5444
1976e444j016N281n54L34Q303L00j0728o260Q74M432J2494J0146j0753j8546m622
$$ -5444 -6460 -1179 -1733 -1399 6904 7204 -3524 -9784 -8910 -4478 8016 18162 7409 -11137 -15759
1991a5759O848J0394J4544J766j6928j3975k0N131J1379J5208k537j9450j2453
$$ -15759 -8911 1483 16027 17793 865 -13110 -13130 -7999 3380 18588 16051 -3399 -15852
2004a5852O21J0104J8493R582j7203k4156l165J4483J9403J1859j2327k9039j1235
$$ -15852 -15231 -5127 13366 22948 5745 -18411 -21576 -7093 12310 24169 11842 -17197 -28432
2017b8432J7485K2618J1077n058k3439k0457P417K2663J3501J780j0756k1644
$$ -28432 -10947 11671 22748 17690 -5749 -26206 -18789 3874 17375 19155 8399 -13245
2029a3245r087J4868J8214O500k962j5698j7143N010K0798R611n630j2516j2849
$$ -13245 -22332 -7464 10750 17250 14288 -1410 -18553 -13543 7255 16866 11236 -1280 -14129
2042a4129J69J9186J3942r180j5264o583R53J1233J3455l679j3641l772K881O54
$$ -14129 -13960 5226 19168 9988 -5276 -11859 -10906 327 13782 10103 -3538 -7310 -4429 -3775
2056c775M631M834m367l064K734k247l965M795M075l990o07L011k236L2L751m448
$$ -3775 856 5690 1323 -1741 993 -1254 -5219 -424 3651 -339 -946 2065 -171 -139 3612 -836
2072h36n288O275O217k365k985k088m091L759R157l381r648Q47N968K476J478
$$ -836 -6124 151 6368 4003 1018 -1070 -5161 -1402 7755 4374 -5274 -4427 1541 4017 5495
2087E495m729j1027M25J4722P025o819q562o902q97J2606J0582o278j0225k133
$$ 5495 766 -10261 -9836 4886 11911 5092 -3470 -10372 -11269 1337 11919 5641 -4584 -6717
2101f717L4L507Q886J210q292l440J373n48L879Q029k667r988k197K306M683R853
$$ -6717 -6683 -3176 5710 6920 -1372 -4812 -3439 -3987 -108 7921 5254 -4734 -6931 -4625 58 9911
2117I911K077j4319j1181M747J0347Q200L294j0211j5672J351J1993O288R0k670
$$ 9911 11988 -2331 -13512 -8765 1582 9782 13076 2865 -12807 -11456 537 6825 6915 4245
2131D245q794m079P640M214l455J89J049l799L19N041j505l789J695m00k178N391
$$ 4245 -4549 -8628 -988 3226 -229 -40 1009 -2790 -2471 2570 1065 -2724 -1029 -1429 -3607 1784
2147A784N172o145n446Q01J065M083O601l581r876N31P840K254n54l337q080K13
$$ 1784 6956 811 -4635 -3834 -2769 1314 7915 4334 -5542 -5011 2829 5083 4529 1192 -6888 -6675
2163f675J2406O273p128p723m625j653Q842J1195j628q250l957m330j972Q923
$$ -6675 5731 12004 4876 -2847 -7472 -9125 -283 10912 9284 1034 -2923 -7253 -9225 -302
2177c02R805j440n291n740p749J731J4716N647q209p745l528K314J1120P895j0782
$$ -302 9503 8063 2772 -2968 -10717 -8986 5730 11377 3168 -4577 -8105 -5791 5329 13224 2442
2192B442j3005J029Q898P907N028o277j3805k449R052M120J051K090k837m891
$$ 2442 -10563 -9534 -636 7271 12299 6022 -7783 -10232 -1180 2940 3991 6081 3244 -1647
2206a647J91q55l634M517Q930j183n944k570k467k17O654J685n825q7N466p54
$$ -1647 -1456 -2311 -5945 -1428 7502 6319 375 -2195 -4662 -4879 1775 3460 -2365 -2452 3014 2260
2222B260l748q65l056K2Q382L445o319k710K052j465o12K284j910L26P899K717
$$ 2260 -1488 -2353 -5409 -5387 2995 6440 121 -2589 -537 -2002 -2614 -330 -2240 -1914 5985 8702
2238H702r138p378L06L392Q526Q102o186j2084j521L973L044M591J535o937l464
$$ 8702 -436 -7814 -7508 -4116 4410 12512 6326 -5758 -7279 -3306 -262 4329 5864 -1073 -4537
2253d537M786J199j460J680k252n770K548P350J692j289l130q876m362J0072J0896
$$ -4537 249 1448 -12 1668 -584 -6354 -3806 3544 5236 3947 817 -8059 -12421 -2349 8547
2268H547M46m675p184q946L105J2293M442l612k865l979l992M652N975j385k089
$$ 8547 8993 4318 -2866 -11812 -8707 3586 8028 4416 1551 -2428 -6420 -1768 4207 2822 733
2283G33J660l636k213N769L123l926k108j436k400N170P800k100r621k214R75
$$ 733 2393 -1243 -3456 2313 5436 1510 -598 -2034 -4434 736 8536 6436 -3185 -5399 -4424
2298d424L284O961J424q747l950M706J555j215L55n83j183N199J652p696l846
$$ -4424 -1140 5821 7245 -1502 -5452 -746 809 -406 -51 -634 -1817 3382 5034 -2662 -6508
2313f508M323L763J741J612m264n921L596M970k743j801K168j06N10K720l517
$$ -6508 -2185 1578 3319 4931 667 -5254 -1658 3312 569 -1232 936 830 1340 4060 543
2328E43n517L243N827j914k152P81k350N38M483k415o526K901O139k67j500k462
$$ 543 -4974 -1731 4096 2182 30 811 -1539 -1001 3482 1067 -5459 -2558 3581 3314 1814 -648
2344f48n590M10Q130K004n107j079P75j294K154J826m586j557O668K802l826k288
$$ -648 -6238 -5828 2302 4306 -801 -1880 -1105 -2399 -245 1581 -3005 -4562 2106 4908 1082 -1206
2360a206j665k453M368O304k061l738P78j333k512K793K929k157J585K060m768
$$ -1206 -2871 -5324 -956 5348 3287 -451 327 -1006 -3518 -725 2204 47 1632 3692 -1076
2375a076l044L747Q83j991K894O47l771Q63K542l618k080L700R78j048K605l48
$$ -1076 -4120 -373 510 -1481 1413 2060 -1711 -848 1694 -1924 -4004 -304 674 -374 2231 1883
2391A883m972l01K948j291M4N244k70m722K84p50k424L814N170k356k980J517
$$ 1883 -3089 -3390 -442 -1733 -1689 3555 3285 -1437 -1153 -1903 -4327 -513 4657 2301 -679 838
2407H38j425j735K848J038k619K321L260l637k920J905p9p56L519m81m194K017
$$ 838 -587 -2322 526 1564 -1055 1266 4526 889 -2031 -126 -205 -961 2558 2077 -2117 -100
2423a00L889l497l412Q79M78K053N439j123q949j972M474K396K333J569n235m057
$$ -100 3789 292 -3120 -2241 -1763 290 5729 4606 -4343 -6315 -1841 555 2888 4457 -778 -4835
2439d835M405L356l239o40J560j723J956L387k989l744K517J584k422J118K027
$$ -4835 -430 2926 -313 -953 607 -1116 840 4227 1238 -2506 11 1595 -827 291 2318
2454B318j788J095J724m443m355M397M336l50l12j745n481P57N693o43k568K101
$$ 2318 530 1625 3349 -1094 -5449 -1052 3284 2934 2622 877 -4604 -3847 1846 1203 -1365 736
2470G36J96k079J135k27m318J837O239j25m193j055j296k40N138L271n642k956
$$ 736 932 -1147 -12 -239 -4557 -2720 3519 3394 -799 -1854 -3150 -3390 1748 5019 -623 -3579
2486c579K740J136J165K709l654o200K519N024J237O73m86o561l782M808N551
$$ -3579 -839 297 1462 4171 517 -5683 -3164 1860 3097 3770 3284 -3277 -7059 -2251 3300
2501C300R06R88l953q366j5P416L812K26j216o709m911N213P393l53k044k805
$$ 3300 4206 5194 1241 -7125 -7140 276 4088 4314 3098 -3611 -8522 -3309 4084 3731 1687 -1118
2517a118n221J135Q289K786m465l492k312j251N914P785l170o383k515j032K217
$$ -1118 -6339 -5204 3085 5871 1406 -2086 -4398 -5649 265 8050 4880 -1503 -4018 -5050 -2833
2532b833Q396K723o949n423Q04J090L603N082l228o197M92L351l15J326J09l893
$$ -2833 5563 8286 1337 -4086 -3282 -2192 1411 6493 3265 -2932 -2440 911 596 1922 2031 -1862
2548a862q34M719K62k997J07O02k160J877K839l273j239K780m33j432J314P31
$$ -1862 -2696 2023 2285 -712 -605 -3 -2163 -286 2553 -720 -1959 821 388 -1044 270 1001
2564A001l518J615L421j646p39J499k501l103L930L683r15m83j396m930j31P085
$$ 1001 -2517 -902 2519 873 134 1633 -868 -3971 -41 3642 2727 2244 848 -4082 -4213 2872
2580B872K443l046j812l035k104N616N328l891n231m13N12K270O047j288p901
$$ 2872 5315 2269 457 -2578 -4682 934 6262 2371 -2860 -3273 -2761 -491 5556 4268 -3633
2595c633j880L019K397K898K018n071n849K914L083Q06K304q04n083j779N093
$$ -3633 -5513 -2494 -97 2801 4819 -252 -6101 -3187 -104 702 3006 2202 -2881 -4660 433
2610D33J745o26M72k736l971K848N612k25k366j291l760Q0O185L309m017k942
$$ 433 2178 1552 2024 -712 -4683 -1835 3777 3552 1186 -105 -3865 -3785 2400 5709 1692 -1250
2626a250j036j791L656N245k436n059K13P17P20L700N48o007k333M077R86J306
$$ -1250 -2286 -4077 -421 4824 2388 -2671 -2458 -1741 -1021 2679 3227 -2780 -5113 -1036 -50 1256
2642A256J697l344m759K055M872o9k39n39m052j106N823K780k748j755j864k291
$$ 1256 2953 -391 -5150 -3095 1777 1708 1469 930 -3122 -4228 1595 4375 1627 -128 -1992 -4283
2658d283M215O290j685n658j922j101J952P370K399o556n551K66J711M563N424
$$ -4283 -68 6222 4537 -1121 -3043 -4144 -2192 5178 7577 1021 -4530 -4264 -2553 2010 7434
2673G434l629p983j031L959K250L474Rp353m370M809M933J418K68m301p029J452
$$ 7434 3805 -4178 -5209 -1250 1000 4474 4483 -2870 -7240 -2431 2502 3920 4188 -113 -7142 -5690
2689e690P898K764j229j505n706k985N993N218j077k098j287l103P27N965n5n048
$$ -5690 2208 4972 3743 2238 -3468 -6453 -460 4758 3681 1583 296 -2807 -2080 3885 3830 -1218
2705a218j68J182r9K493K316n036l436K678K090M09J902j631n341J142M396n55
$$ -1218 -1386 -204 -303 2190 4506 -530 -3966 -1288 802 1211 3113 1482 -3859 -2717 1679 1124
2721A124j716L81j711q76M853J496n090k251J421P24L831L597m147p203O56M444
$$ 1124 -592 -211 -1922 -2798 2055 3551 -1539 -3790 -2369 -1645 2186 5783 1636 -5567 -4911 -467
2737d67K470L011p39p669k905N497M567M02j167n134n316M747Q132J000m333m742
$$ -467 2003 5014 4275 -3394 -6299 -802 3765 4167 3000 -2134 -7450 -2703 5429 6429 2096 -2646
2753b646n104J225J0115N758m626o802n268j895P200J0658m24q280n841k266L248
$$ -2646 -7750 -6525 3590 9348 4722 -2080 -7348 -9243 -2043 8615 8191 -89 -5930 -8196 -4948
2768d948R398N106p014q437j258K713O584O824l471j0346l292N049N173M914L00
$$ -4948 4450 9556 2542 -5895 -7153 -4440 2144 8968 5497 -4849 -8141 -3092 2081 6995 7295
2783G295q782o447L411O219K556J688l136p135j001N327K220j43J263l131l684
$$ 7295 -1487 -7934 -4523 1696 4252 5940 2804 -4331 -5332 -5 2215 2072 3335 204 -3480
2798c480J819K722j473J67J922k204j347K771K08l129Q83J758j087J415K310l756
$$ -3480 -1661 1061 -412 -245 1677 -527 -1874 897 1105 -2024 -1141 617 -470 945 3255 -501
2814e01l189K928K152l87J534j322m408J532N257l3l220j367j691P15N797L138
$$ -501 -3690 -762 1390 1003 2537 1215 -3193 -1661 3596 3563 343 -1024 -2715 -2000 3797 6935
2830F935n495m886k99R66L966N917k590p230j657J708J652L799K123n192m254
$$ 6935 1440 -3446 -3745 -2779 1187 7104 4514 -2716 -4373 -2665 -1013 2786 4909 -283 -4537
2845d537K333K591Q86J090k039n086P16N810J862j518j392m777k500N931O750
$$ -4537 -2204 387 1273 2363 324 -4762 -4046 1764 3626 2108 716 -4061 -6561 -630 6120
2860F120j337l091m418m012K604Q594K513m675l742k738j01O342M986m338o367
$$ 6120 4783 1692 -2726 -6738 -4134 4460 6973 2298 -1444 -4182 -4283 2059 7045 2707 -3660
2875c660j118J917M178N582k153r461l529M560N084M698O57p528q145K593O508
$$ -3660 -4778 -2861 1317 6899 4746 -4715 -8244 -3684 1400 6098 6755 -773 -8918 -6325 183
2890A83L491Q97k289o885j439N886K650j633l93k064j664L513M026k885l294q2
$$ 183 3674 4571 2282 -4603 -6042 -156 2494 861 468 -1596 -3260 253 4279 1394 -1900 -1982
2906a982o22J453N616O42n556k458M84L41L616L923k894n438J05K196J056K249
$$ -1982 -2604 -1151 4465 5107 -449 -2907 -2423 -2082 1534 5457 2563 -2875 -2770 -574 482 2731
2922B731p20n665l73N761K433j492k933m448k046O045P536j590m862l860k977
$$ 2731 2011 -3654 -4027 1734 4167 2675 -258 -4706 -6752 -707 6829 5239 377 -3483 -6460
2937f460K646P889K278m754l462n54k31K931M256k405m590J731J258J92J882m
$$ -6460 -3814 4075 6353 1599 -1863 -2417 -2648 283 4539 2134 -2456 -725 533 725 2607 2603
2953B603m782j524L862J661M21J133k762m720J042L771O98O46P12l888k267L339
$$ 2603 -2179 -3703 159 1820 2241 3374 612 -4108 -3066 705 1403 2049 2761 -1127 -3394 -55
2969e5J051j863O19M54p55J519K272m110m000K181K913J815K352j754p009j346
$$ -55 996 -867 -248 206 -549 970 3242 -868 -4868 -2687 226 2041 4393 2639 -4370 -5716
2985e716M862L033J340J63m598m401L409N501o96j739k056l426J536O738J716
$$ -5716 -854 2179 3519 3682 -916 -5317 -1908 3593 2897 1158 -898 -4324 -2788 3950 5666
3000E666m834l220k475j95N929O353k551o163k783j390J836O593L281m545m216
$$ 5666 832 -2388 -4863 -5058 871 7224 4673 -1490 -4273 -5663 -3827 2766 6047 1502 -2714
3015b714o90n30K644N344j301n068n00J693J009L049N48n540l297L740M049J212
$$ -2714 -3404 -3934 -1290 4054 2753 -2315 -2815 -1122 -113 2936 3484 -2056 -5353 -1613 2436 3648
3031C648L82l791o235J192N927K254j01n78m262k835L486K903j483K59L64j944
$$ 3648 4030 239 -5996 -4804 1123 3377 3276 2698 -1564 -4399 -913 1990 507 766 1130 -814
3047h14j22K379j019k627J457J199j177J907J365l484j567K096k53j84K599N37
$$ -814 -936 1443 424 -2203 -746 453 -724 1183 2548 -936 -2503 -407 -660 -844 1755 2292
3063B292k718k82J002k123K83L391j48j668J893n25l448K62K072K75J271K135
$$ 2292 -426 -708 294 -1829 -1546 1845 1697 29 1922 1397 -2051 -1789 283 558 1829 3964
3079C964k501m457P97K065O20K821M04n145k039K996J592J56P11k890l647K696
$$ 3964 1463 -2994 -2197 -132 488 3309 3713 -1432 -3471 -475 1117 1273 1984 -906 -4553 -1857
3095a857M937K57k123k057l820p0O286L609k292k613k929k543K919O148Q77l115
$$ -1857 3080 3337 1214 -843 -4663 -4733 1553 5162 2870 257 -2672 -5215 -2296 3852 4729 1614
3111A614j788k642j549M210M219j318k269j287k016O99M708J064l817j297j86
$$ 1614 -174 -2816 -4365 -155 4064 2746 477 -810 -2826 -2127 2581 3645 -172 -1469 -1655
3126a655j75K455L404l249l669P06Q51J188K612L55m097j597J760J8N65K527p73
$$ -1655 -1830 625 4029 780 -2889 -2183 -1332 -144 2468 2823 -1274 -2871 -1111 -1093 -528 1999 1226
3143A226k713R38M51j524O39K357n20j196J235q95k239J651J916j415R15J050
$$ 1226 -1487 -549 -98 -1622 -983 1374 854 -342 893 -2 -2241 -590 1326 -89 826 1876
3159A876k264j403K348N37j563J230k75k095J146K306j200j841Q13j127l42L541
$$ 1876 -388 -1791 557 1094 -469 761 486 -1609 -463 1843 643 -1198 -385 -1512 -1854 1687
3175A687J626k951j963J22q49J168L788j93k728p42o09n46K404L133k161k111
$$ 1687 3313 362 -1601 -1479 -2328 -1160 2628 2435 -293 -1035 -1644 -2190 214 3347 1186 -925
3191i25O06n04l68K983P93l388n76K030p6P02J377k821k873J838K546L43L36k22
$$ -925 -319 -823 -1191 1792 2585 -803 -1379 651 575 1277 2654 -167 -3040 -1202 1344 1687 2023 1801
3209A801l371j186K639O73J7J704l84l315k62J191r99R06K790r28k022N23j11
$$ 1801 -1570 -2756 -117 556 573 2277 1893 -1422 -1684 -493 -1492 -586 2204 1276 -746 -223 -334
3226c34j835J622J704j173k26J892j498j832J681J057j411Q23M35j998L72K945
$$ -334 -2169 -547 1157 -16 -242 1650 152 -1680 1 1058 -353 470 905 -1093 -721 2224
3242B224q54k515P4j31l66L505J886l410k747K37n3J515L985Q0l753j980o6m39
$$ 2224 1370 -1145 -1071 -1202 -1568 1937 3823 413 -2334 -2097 -2150 -635 3350 3430 -323 -2303 -2369 -2808
3260b808K446L382j063l395l64J08l0L142J570l650k267J956N32J002K284j493
$$ -2808 -362 3020 1957 -1438 -1802 -1694 -1724 1418 2988 -662 -2929 -973 -441 561 2845 1352
3276A352m510O50K787M60J148R99l428k714K086J280M75J976j00l801j214J983
$$ 1352 -3158 -2508 279 739 1887 2886 -542 -3256 -1170 110 585 2561 2461 -1340 -2554 -571
3292e71Q30K87K006j651l626J317J821JM85J87k767p31K693J032j489L61l05j819
$$ -571 259 546 2552 901 -2725 -1408 413 414 899 1086 -1681 -2412 281 1313 -176 185 -120 -1939
3310a939O65K329m58o84J740j735j840J141J671k90J012P95l135j518K160J444
$$ -1939 -1274 1055 597 -87 1653 -82 -1922 -781 890 600 1612 2407 -728 -2246 -86 1358
3326A358m47J161j311k822P63K454N1o42J110j956k400J728K087n42P56K78k960
$$ 1358 911 2072 761 -2061 -1298 1156 1207 565 1675 -281 -2681 -953 1134 592 1348 1626 -1334
3343a334j656K492J770r6R77k107l800J314L930R07j068m71k933j681L552K715
$$ -1334 -2990 -498 1272 1176 2153 46 -3754 -2440 1490 2397 1329 858 -2075 -3756 -204 2511
3359B511n95p09j207k958P55M034J046j293p69k017k363K559M087m22j834j244
$$ 2511 1916 1207 0 -2958 -2203 1831 2877 1584 815 -1202 -3565 -1006 3081 2659 825 -419
3375d19k101j57L416K308k478j200m56j098J667K289n51k063J8K73j274J665K064
$$ -419 -2520 -2677 739 3047 569 -631 -1087 -2185 -518 1771 1220 -843 -825 -552 -1826 -161 1903
3392A903j240j522M31r27l74K929Q04j884o49L1j103J027K463p72j685J086j51
$$ 1903 663 -859 -428 -1355 -1729 1200 2004 120 -529 -498 -1601 -574 1889 1117 -568 518 367
3409C67j620N13J315m63O57R70k428j938K144J928n55J54p88l149P54L684K50
$$ 367 -1253 -740 575 112 769 1739 -689 -2627 -483 1445 890 1044 256 -2893 -2139 1545 1795
3426A795j653n48j351o55K802K113j838j215K24j538J48K590J437j792o81r17
$$ 1795 142 -406 -1757 -2412 390 2503 665 -550 -326 -1864 -1716 874 2311 519 -162 -1079
3442a079j731J946M064k52k539j189j537J58L848K547k728k645k38l07J321L196
$$ -1079 -2810 -864 3200 2948 409 -780 -2317 -2159 1689 4236 1508 -1137 -1375 -1682 -361 2835
3458B835o09k980r20J012j12J352J778j902j781O56J57q14K664R94k160j775P35
$$ 2835 2226 -754 -1674 -662 -774 578 2356 454 -1327 -671 -514 -1328 1336 2330 170 -1605 -870
3475h70l84P04K948l23l036j74K30l16J707K527j524k031k14o05l14K947J826
$$ -870 -1254 -550 2398 2075 -961 -1135 -905 -1221 486 3013 1489 -542 -756 -1361 -1675 1272 3098
3492C098k272j830j08q34J246L429j07l028j200K55p3K702J813k503k941J95O84
$$ 3098 826 -1004 -1112 -1946 -700 2729 2622 -406 -1606 -1351 -1424 1278 3091 588 -2353 -2158 -1474
3509a474J175K908M88l917k164N41R73K560K949k183m444o92R54K050L301N42
$$ -1474 -299 2609 3097 -820 -2984 -2443 -1470 1090 4039 1856 -2588 -3280 -2326 -276 3025 3567
3525C567l895k920J219K115J083J619j478l385j81K842p5P08Q86k398k523J224
$$ 3567 -328 -3248 -2029 86 1169 2788 1310 -2075 -2256 586 511 1219 2105 -293 -2816 -1592
3541a592J910P43J402n43l626k031K397J808J399J178k350m152m1K975J434Q67
$$ -1592 318 1061 2463 1920 -1706 -3737 -1340 468 1867 3045 695 -3457 -3498 -523 911 1778
3557A778o3k322k373J862J542R6P94J7k413n68J807K99L48Q96r15k584N12J704
$$ 1778 1715 -607 -2980 -1118 424 520 1314 1331 -1082 -1650 157 456 804 1700 785 -1799 -1287 417
3575D17P55N57r3k683k025K557J997N78K3q72l532p25L052J354p3J196j995l157
$$ 417 1172 1729 1636 -1047 -3072 -515 1482 2060 2083 1211 -2321 -3046 6 1360 1287 2483 488 -2669
3593b669J98K060Q35J527N43k948k607J379K344M65J169q45l532j36K486J470
$$ -2669 -2471 -411 424 1951 2494 -454 -3061 -1682 662 1127 2296 1451 -2081 -2217 269 1739
3609A739j53%k135k838K047L233L14n16r65l174q45L238K632m52o37k025l087
$$ 1739 1586 1586 -549 -3387 -1340 1893 2207 1691 726 -2448 -3293 -55 2577 2125 1488 -537 -3624
3626c624J293L638N63j12q22k101j662J674K194m02p8J35k080p51K379L99l17
$$ -3624 -2331 1307 1870 1758 936 -1165 -2827 -1153 1041 639 561 696 -1384 -2135 244 643 326
3643C26L7k23k061L39K547J36m53n2j876j390K350K279m67k00j048k577p70L789
$$ 326 363 140 -1921 -1582 965 1101 648 596 -1280 -2670 -320 1959 1492 1292 244 -2333 -3103 686
3661F86J936n16p47k021l257J421L801J383p37j011l379j366L217K859m02j543
$$ 686 2622 2106 1359 -662 -3919 -2498 1303 2686 1949 938 -2441 -3807 -590 2269 1867 324
3677C24j503j938J490L751J002k624j767j228n5L171L044j282l002j449r89J172
$$ 324 -1179 -3117 -1627 2124 3126 502 -1265 -2493 -2548 623 3667 2385 -617 -2066 -3055 -1883
3693a883L933J794k292j924j369r90J903L480O22k555j211j013q38K115L078j331
$$ -1883 2050 3844 1552 -372 -1741 -2731 -828 2652 3274 719 -492 -1505 -2343 -228 2850 1519
3709A519j489m24r03j1K519J082k542p24k60J08J370K618r63k851j021j49P72
$$ 1519 30 -394 -1297 -1308 1211 2293 -249 -973 -1233 -1125 245 2863 1900 -951 -1972 -2121 -1349
3726a349L425J848k323l383q51K22K055L430M74l588j618j11N78J749K657k024
$$ -1349 2076 3924 1601 -1782 -2633 -2411 -356 3074 3548 -40 -1658 -1769 -1191 558 3215 1191
3742A191k267N00L61M2J493O0k154n57J160O80p3J382j260k249K10J083r3J245
$$ 1191 -1076 -576 -215 -173 1320 1380 -774 -1331 -171 509 436 1818 558 -1691 -1481 -398 -491 754
3760G54J300j800k203M55Q50P0K226M95k002j701P82l65Q04K402k32k128p45J57
$$ 754 2054 254 -1949 -1494 -644 -574 1652 2147 145 -1556 -774 -1139 -335 2067 1835 -293 -1038 -881
3778h81l51J496J823j374j999O39O89j44J722l06l145n52K236J070R13m6k522
$$ -881 -1232 264 2087 713 -1286 -647 42 -102 1620 1314 -1831 -2383 -147 923 1836 1790 -732
3795g32k287J604J963J84K67j22k403n22J959L79m31O78Kj716L40J132n50n72
$$ -732 -3019 -1415 548 732 999 877 -1526 -2048 -89 290 -141 537 539 -1177 -837 295 -255 -827
3813h27J301j97o46P77L51j371L10J173p44k85J016o92p78J053M66j532K4P88
$$ -827 474 277 -369 408 759 -612 -302 871 127 -158 858 166 -612 441 907 -625 -601 187
3831A87n02M88J561o54k545L36R40K13J393M70k353j334Q46O67L13J752l18k159
$$ 187 -315 173 1734 1080 -1465 -1129 -189 24 1417 1887 -466 -1800 -954 -287 26 1778 1460 -699
3849f99o41P43L03P21J101j386j361J007P19l16M63M38j757o91K127J93o79O14
$$ -699 -1340 -597 -294 427 1528 142 -1219 -212 507 191 654 1092 -665 -1356 771 964 285 899
3867H99l54j709N27J141m57R00J039j952j773K41J199P24J574q9l092j428J156
$$ 899 545 -1164 -637 504 47 947 1986 34 -1739 -1498 -299 425 1999 1910 -1182 -2610 -1454
3884a454J578J164P40j498l095N02K800O43o2p66k247o37K471J432n11m21n45
$$ -1454 124 1288 2028 530 -2565 -2063 737 1380 1318 552 -1695 -2332 139 1571 1060 639 94
3901I4k256P75K328P12l30n94j842j462J513L032l4j120r54k016n8K675J326j412
$$ 94 -2162 -1387 941 1653 1323 729 -1113 -2575 -1062 1970 1936 816 -138 -2154 -2212 463 1789 377
3919C77l47l43r67R54P82m95o15J051j43j339O20P18n49J142Pj335j610J594J818
$$ 377 30 -313 -1280 -326 456 -39 -654 397 254 -1085 -465 253 -296 846 853 -482 -2092 -498 1320
3938A320j45k0j479k319J123K404P95k97j121j535j144K063K174k01n95q75k054
$$ 1320 1175 1155 -324 -2643 -1520 884 1679 1382 261 -1274 -2418 -355 1819 1618 1023 148 -1906
3955a906p0K787J113p82o86j528q09J536K424r20j515p44k19Q10K158%k268p83
$$ -1906 -1976 811 1924 1142 456 -1072 -1881 -345 2079 1159 -356 -1100 -1319 -509 1649 1649 -619 -1402
3973a402Q89Q4R87Q14j036j374N19M70k17O86P08j010o12O51K19j64M10j45j144
$$ -1402 -513 -429 558 1372 336 -1038 -519 -49 -266 420 1128 118 -494 157 376 212 622 477 -667
3992f67N02J398o38r05j7l86n2K272k7j813n56N4P91N10J059j877r42P92J311
$$ -667 -165 1233 595 -310 -327 -713 -765 1507 1480 -333 -889 -835 -44 466 1525 -352 -1294 -502 809
4011H09o18J56j14j033k9J420j44p34N45Q5j057K67O26R3L95M27j511j238R51
$$ 809 191 347 233 -800 -829 591 447 -287 258 343 -714 -447 179 272 667 1094 -417 -1655 -704
4030g04J479K19P3o95j897L10K318J21j360q0n14m34J360Q97j493n13Q57K0o04
$$ -704 775 994 1067 372 -1525 -1215 1103 1224 -136 -216 -730 -1164 196 1093 -400 -913 -56 -36 -640
4049f40Q43p2m65P61k62j586M6J853O11m84j68j049j086J383J846p42m26j85q37
$$ -640 203 131 -334 427 165 -1421 -1375 478 1089 605 437 -612 -1698 -315 1531 789 363 178 -659
4068f59l39J431J94o99O51k18j568j49J892J86J08j17j278j302J500J810n36j96
$$ -659 -998 433 627 -72 579 361 -1207 -1356 536 722 830 713 -565 -1867 -367 1443 907 711
4086G11j312j271P4K526P82o63p41r22j227J406J967L7r60o25q89n49K207J582
$$ 711 -601 -1872 -1798 728 1510 847 106 -816 -2043 -637 1330 1367 407 -218 -1107 -1656 551 2133
4104B133p48j568p38n32J065K561k90k221p42J14N49R52J299j359j059K66J99
$$ 2133 1385 -183 -921 -1453 -388 2173 1883 -338 -1080 -966 -417 535 1834 475 -584 -318 -119
4121a19o33J423M15p82j14j59o35J84J687k76j674o3M09k25J019O39j298j045
$$ -119 -752 671 1086 304 190 31 -604 -420 1267 991 -683 -746 -337 -562 457 1096 -202 -1247
4139a247R55N54l35O91k63j083O15P65j235k3J447K72n97n18p93p57J497J766
$$ -1247 -292 262 -73 618 355 -728 -113 652 -583 -606 841 1113 516 -2 -795 -1552 -55 1711
4157A711m54j610n27l51M30J984R4j723q92J424j93M72P39j321j004O03N56k81
$$ 1711 1257 -353 -880 -1231 -801 1183 1277 -446 -1338 86 -107 365 1104 -217 -1221 -618 -62 -343
4175c43J148O95j460j195j80J13J079K282n35k512j004P40P18J468P99j622j628
$$ -343 805 1500 40 -1155 -1335 -1222 -143 2139 1604 -908 -1912 -1172 -454 1014 1813 191 -1437
4192a437M77J227k18P17Rj123l54J193k70l74J127n97j394n8R43J12Q44O21j502
$$ -1437 -960 267 49 766 775 -348 -702 491 221 -153 974 377 -1017 -1075 -132 -20 824 1445 -57
4211e7j476O34R33l76J459N19j636r78K50n18Q08J732P31j949q57l34j52J757
$$ -57 -1533 -899 34 -342 1117 1636 0 -978 -728 -1246 -438 1294 2025 76 -781 -1115 -1267 490
4229D90J877j285j693j61J20K98J876P5k146o99J151K36P44Q95j253j988K09P87
$$ 490 2367 1082 -611 -772 -652 -354 1522 1597 -549 -1248 -97 139 883 1778 525 -1463 -1254 -467
4247d67P34R77P50k111j998M25J385J306J019p22k736o90J676J331J16Qj410j317
$$ -467 267 1244 1994 -117 -2115 -1690 -305 1001 2020 1298 -1438 -2128 -452 879 995 1003 -407 -1724
4265a724J259J215n24l4R5n50k76Q58M6n38Q76l8j435l6R98K08K44M49j361j216
$$ -1724 -465 750 226 192 287 -263 -539 319 365 -173 703 665 -770 -806 192 400 644 1093 -268 -1484
4285a484O47J478O1k27l69j453K15J544K08k19L04n64j210M4Q79L91N33N92j517
$$ -1484 -837 641 702 475 106 -1347 -1132 412 620 401 705 141 -1069 -1025 -146 245 778 1370 -147
4304a47j713J029J125N25L01q00k207K56K109R09n51p99r96p30J548J860l44j234
$$ -147 -1860 -831 294 819 1120 320 -1887 -1631 478 1387 836 37 -959 -1689 -141 1719 1375 141
4322A41o71r60j52K208J413n73o74j331j402K21K811Q43j074m86j645q30J867
$$ 141 -530 -1490 -1642 566 1979 1406 732 -599 -2001 -1780 1031 1874 800 314 -1331 -2161 -294
4339b94J680l91r23k7q94N3J382J61r58P4M08r97O74J192k58p03k27n61j90R46
$$ -294 1386 995 72 45 -849 -796 586 747 -211 -137 271 -726 -52 1140 882 179 -48 -609 -799 147
4359A47J775o79j255l91j148M76J553J063l98n00k67j951Q8J729R85k41J74j362
$$ 147 1922 1243 -12 -403 -1551 -1075 478 1541 1143 643 376 -1575 -1487 242 1227 986 1160 -202
4377b02k002J397J593M30l85j245j277K10K443Q34j677j125l24L23J566J603p69
$$ -202 -2204 -807 786 1216 831 -414 -1691 -1481 962 1796 119 -1006 -1330 -1007 559 2162 1393
4394A393j707o23n14J58K301J340j427j348k97o30M84K295K58j316r22j73j59
$$ 1393 -314 -937 -1451 -1293 1008 2348 921 -427 -724 -1354 -870 1425 1683 367 -555 -728 -887
4411h87J389J001j244j177P40K19N09L97n86j431l17J107K48L02Q41j053j115
$$ -887 502 1503 259 -918 -178 41 550 947 361 -1070 -1387 -280 -32 270 1111 58 -1057
4428a057K85L84r4Q72J109j110r39j03l03L87J349M74j164l28jp42Q03J088p0
$$ -1057 -772 -388 -482 390 1499 389 -550 -653 -956 -569 780 1254 90 -238 -239 -981 -178 910 840
4447H40r26l4k22j80J400P47j500p95l13J18R94J771k47k351j344P60J271J441
$$ 840 -86 -120 -342 -522 878 1625 125 -670 -983 -865 129 1900 1653 -698 -2042 -1282 -11 1430
4465A430J149j870k683K85J145P03J642r4k283j040N40Q40O59J286q39k306O7
$$ 1430 2579 709 -1974 -1689 -544 159 1801 1707 -576 -1616 -1076 -236 423 1709 870 -1436 -1369
4482a369J385P32P0J64j586r96J419J362J31n08n95j513M65J679k5m13r2o88p34
$$ -1369 16 748 818 982 -604 -1600 -181 1181 1312 804 209 -1304 -839 840 815 402 310 -378 -1112
4501a112Q95O01n09J48Q10j074j69L57O6m71P44O13j102j16M56o48M9Q14K34m78
$$ -1112 -217 384 -125 23 833 -241 -410 -53 13 -458 286 899 -203 -319 137 -511 -462 352 586 108
4521A08m21L52r34P26J392j074o13L74J02J44P65J24j817l9R50R7M57K02j237
$$ 108 -313 39 -895 -169 1223 149 -464 -90 12 156 921 1045 -772 -811 139 236 693 895 -342
4540c42j029L28J720j94R9J71j344o54R04R62n10K56J21j444M76R13j52p22M68
$$ -342 -1371 -1043 677 483 582 753 -591 -1245 -341 621 111 367 488 -956 -480 433 281 -441 27
4559B7p31K6J192Q43j324n20m6j66O08J468o13j256R1J37k67J011M35j090k42
$$ 27 -704 -678 514 1357 33 -487 -533 -699 -91 1377 764 -492 -401 -264 -531 480 915 -175 -417
4578d17P44k70m96M78L5p29O10R85j021k96M20m85k19J037O04j166rj3n11O06
$$ -417 327 57 -439 39 74 -655 -45 940 -81 -377 43 -442 -661 376 980 -186 -195 -208 -719 -113
4598a13J027l30j041J32L21K11N09l18p51q28J202R02j57M71j174j550P01J488
$$ -113 914 584 -457 -325 -4 207 716 398 -353 -1181 21 923 766 1237 63 -1487 -786 702
4616G02L41k77l80j310o60J505R04l10j16n21p99J91J454K54j251K47p05J17J063
$$ 702 1043 766 386 -924 -1584 -79 825 515 399 -122 -921 -730 724 978 -273 -26 -731 -614 449
4635D49O35o91j170J85k38N19J145Q5j107j48r3J00O98P64q67p47O55K80o25R2
$$ 449 1084 393 -777 -592 -830 -311 834 919 -188 -336 -429 -329 369 1133 266 -481 174 454 -171 -79
4655g9K69n36K44O19j98n86Q7j67m52P83R30j077k02R4o1o4J114n46p89O7P83
$$ -79 190 -346 -102 517 319 -267 -180 -347 -799 -16 914 -163 -365 -271 -332 -396 718 172 -617 -550 233
4676B33J56l31M9o06m04J183M29j60j82o83r14P51J252J46o90m25k19n68J345
$$ 233 389 58 107 -499 -903 280 709 549 367 -316 -1230 -479 773 919 229 -196 -415 -983 362
4695C62P27o68m30k22l12K19R79m8r76l18M50M17J73P46j396r17N11J016Q7N42
$$ 362 1089 421 -9 -231 -543 -324 655 607 -369 -687 -237 180 353 1099 -297 -1214 -703 313 400 942
4715I42o41j824K88J472J68K23j30m87j167J096J069p14n17k02m08N76J322k09
$$ 942 301 -1523 -1235 237 405 628 498 11 -1156 -60 1009 295 -222 -424 -832 -256 1066 857
4733H57j301j50K08l1J244O36j300q10j4K39M93J033l11j641j4J170K1K79L1q86
$$ 857 -444 -594 -386 -417 827 1463 163 -647 -661 -422 71 1104 793 -848 -862 308 329 608 639 -247
4753b47j027J216Q21Q3k87n07j071M6J572K50m63k43p84l83J061J007p68j13m10
$$ -247 -1274 -58 763 846 559 52 -1019 -973 599 849 386 143 -641 -1024 37 1044 276 163 -247
4772b47j86j53J337O6q98k77L36l84O85L98l37q10N64q3p0J20P62j030OO83l59
$$ -247 -433 -586 751 817 -81 -358 -22 -406 279 677 340 -470 94 11 -59 61 823 -207 -201 482 123
4793A23p07N59K67o46N94J92o13k81L68j44K95N63k00j308J76O78M49L28J39j510
$$ 123 -584 -25 242 -404 190 382 -231 -512 -144 -288 7 570 370 -938 -762 -84 365 693 832 -678
4813f78m86J220L96J44l07o11o65L4J646K08m03n32o93p63J400J299k60j074k84
$$ -678 -1164 56 452 596 289 -322 -987 -953 693 901 498 -34 -727 -1490 -90 1209 949 -125 -409
4832d09p19K48J928K57j349q57j2j08J313J361j103j281j43K17J21J496L35j410
$$ -409 -1128 -880 1048 1305 -44 -901 -913 -1021 292 1653 550 -731 -874 -657 -536 960 1295 -115
4850a15p05K11L28Q07O68m39j706o9J072L78K03L37j222j79M37J63p7P4J13j035
$$ -115 -820 -609 -281 526 1194 755 -951 -1020 52 430 633 970 -252 -431 6 169 92 166 279 -756
4870g56M67Q18j17n22J56l64l20J072J95o79l8K90j28l61O62q09l92Q94P20p35
$$ -756 -289 529 412 -110 46 -318 -638 434 629 -50 -88 202 74 -287 375 -434 -826 68 788 53
4890E3j11j23p97N35J131J59o38o67j64k47J035Q32k47j032j68o15R97Q29K40
$$ 53 -58 -181 -978 -443 688 847 209 -458 -622 -869 166 998 751 -281 -449 -1064 -67 762 1002
4909A002j140n97M41j94J080N07r16j140P1N50N58L91K4j156q28O19P78O92K12
$$ 1002 -138 -735 -294 -488 592 1099 183 -957 -886 -336 222 613 637 -519 -1347 -728 50 742 954
4928I54j097o55kO68K68K56J51q04n35P22O73p54N50J39j125K25R02k68m28J40
$$ 954 -143 -798 -800 -132 136 392 543 -261 -796 -74 599 -155 395 534 -591 -366 536 268 -160 -20
4948b0j05m15O00K76m89M7M36l49l26L79n8n77O74P05o96k26r8k80R0J218J8o81
$$ -20 -125 -540 60 336 -153 -106 330 -19 -345 34 -24 -601 73 778 82 -144 -242 -522 -432 786 804 123
4970A23q41N2p2R50P19m91j214M88l8J23Q31J50j343o26R43M05N64M35p09j617
$$ 123 -718 -666 -738 212 931 440 -774 -286 -324 -201 630 780 -563 -1189 -246 159 723 1158 449 -1168
4990a168K89Q40N86N04k25j256r44P01J500j85L65o01j505J82R09O10J34k52p63
$$ -1168 -879 -39 547 1051 826 -430 -1374 -673 827 642 1007 406 -1099 -917 -8 602 736 484 -279
5009b79q12R49M61j02j53O3l02j71N90k5q0J75o78j77K02Q30p4n55K29k58m85
$$ -279 -1091 -142 319 217 64 127 -175 -346 244 219 139 314 -364 -541 -339 491 417 -138 91 -167 -652
5030f52P95N18l44M90m68o03p06J100O8K70J58o00j123K76J053L00J75k09r96
$$ -652 143 661 317 807 339 -264 -970 130 198 468 626 26 -1097 -821 232 532 707 498 -498
5049d98l63M42O27Q5L23n56p75N1J109K70n01k7m79p81O39J462k35l53o40p74
$$ -498 -861 -419 208 293 616 60 -715 -664 445 715 214 187 -292 -1073 -434 1028 793 440 -200 -974
5069i74L7J084Q34Kr76n31j71J84R49L04m95k21l55m16N34J179j04j093K9o00
$$ -974 -937 147 981 983 7 -524 -695 -511 438 742 247 26 -329 -745 -211 968 864 -229 -200 -800
5089h00M52N99M38o51k73P4n34O92J048o59q70K20j86r0R98M78l32o94P3n15K35
$$ -800 -348 251 689 38 -235 -161 -695 -3 1045 386 -484 -264 -450 -540 458 936 604 -90 -17 -532 -297
5110b97N65N09l58l78J02n99J91P03k99Q7L17k51o53L12M85l61j47J3k22M7Q02
$$ -297 268 777 419 41 143 -456 -265 438 139 226 543 292 -361 -49 436 75 -72 -59 -281 -234 568
5131E68k60o11L5K5J50K99N70m01q85R2O7j08R18L21n38m02j28l31M00P46j24
$$ 568 308 -303 -268 -243 -93 206 776 375 -510 -418 -351 -459 459 780 242 -160 -288 -619 -219 527 403
5152D03m44j57K02j85K56P19n97o26O10j14k80P52P2q55m61M23K39K70M48l04
$$ 403 -41 -198 4 -181 75 794 197 -429 181 67 -213 539 611 -244 -705 -282 -43 227 675 371
5172C71p89k37N07p9N98M92m96o89r7J5j95J214L38q91n58M58o13N63O25l37k73
$$ 371 -418 -655 -148 -227 371 863 367 -322 -419 -404 -599 615 953 62 -496 -38 -651 -88 537 200 -73
5193g3j08N9J23J60K84m45m14L18j9M30K13o1r49k17M84J21N63L59k06j189o2
$$ -73 -181 -122 1 161 445 0 -414 -96 -115 315 528 467 -482 -699 -215 -94 469 828 622 -567 -629
5214f29J76K32N78M49n49o07Mk02M44M09J10o04J7K96k66K75K68l39k01q5K39
$$ -629 -453 -221 357 806 257 -350 -346 -548 -104 305 415 -189 -172 124 -142 133 401 62 -139 -224 15
5235A5J66J19L18p97l78N83j23K52P23l86q96l09O68O3M16L94n62j163M14J24
$$ 15 181 300 618 -179 -557 26 -97 155 878 492 -404 -713 -45 18 434 828 266 -897 -483 -359
5255c59N23L56J55p95m25J67N24J96j28J02r03K64O42r2K78m24p22j72Q11K25
$$ -359 164 520 675 -120 -545 -378 146 342 214 316 -587 -323 319 227 505 81 -641 -813 -2 223
5275B23J60J46n87n52J54L56O68j19l0m56n48J92N07J74p2j94q2o56O71L84l48
$$ 223 383 529 -58 -610 -456 -100 568 449 419 -37 -585 -393 114 288 216 22 -60 -716 -45 339 -9
5296iM63j21p90jQ60l47M54j63p66j38M7N37L88j95l9n88n8N19J96j33K00n8p88
$$ -9 454 333 -457 -458 402 55 509 346 -420 -558 -511 26 414 219 180 -408 -466 53 249 116 316 258 -530
5319e30l70Q37K57L96O8q94o44J89R72L61J17p69l35o91J010J72L87N1q22k51
$$ -530 -900 -63 194 590 658 -236 -880 -691 281 642 759 -10 -345 -1036 -26 146 533 584 -238 -489
5339d89j6Q34m9J68m02l98l54M70J178p76j99l30m76J32J131M31n53l22k11n88
$$ -489 -505 329 280 448 46 -352 -706 -236 942 166 -33 -363 -839 -707 424 855 302 -20 -231 -819
5359h19P02M56J44l74n23K24l27K41Q38n30K79J14n95l32O05k72J06L17k3l71
$$ -819 -117 339 483 109 -414 -190 -517 -276 562 32 311 425 -170 -502 103 -169 -63 254 231 -140
5379a40O4N0J68p2J9l64q6M37M24L6n2n82n63K41N30L37J99mp54p12K66Q70J99
$$ -140 -76 -26 142 70 89 -275 -361 76 500 536 484 -98 -661 -420 110 447 646 642 -112 -824 -558 312 511
5402E11k62o8q28m2M13O30N4j6o66k19M89M26l4k81l39j50q6O84L75k08p10k54
$$ 511 249 181 -647 -689 -276 354 408 392 -274 -493 -4 422 388 107 -232 -382 -468 216 591 383 -327 -581
5424e81j55N46R32m3p24m18j30J71J76R10k73n08l0j11R4N66J19n79l51J91jJ82
$$ -581 -736 -190 742 699 -25 -443 -573 -402 -226 684 411 -97 -127 -238 -144 422 541 -38 -389 -198 -199 -17
5446a7M33l94K1k96J50o9J71L92m52k92J94K67m00M77J83k19n31L75m29L2P20
$$ -17 416 22 43 -253 -103 -172 -1 391 -61 -353 -159 108 -292 185 368 149 -382 -7 -436 -404 316
5467C16k17k14R5n99l2O83N83j6m11k80k25l07P56M47j55m91j71M7K8P62P8p42
$$ 316 99 -115 -20 -619 -651 32 615 599 188 -92 -317 -624 132 579 424 -67 -238 -191 -163 599 677 -65
5489f5l98M5J59M71P45o70o98J0j81N40N07J47n42o50K93j09R84J6k21m17k97
$$ -65 -463 -418 -259 212 957 287 -411 -401 -582 -42 465 612 70 -580 -287 -396 588 604 383 -34 -331
5510c31J5J90M51M81q10k98K33m3J23K42O3n60j64O85m37M93M63n07n16N6L57
$$ -331 -316 -126 325 806 -4 -302 -69 -112 11 253 316 -244 -408 277 -160 333 796 289 -227 -171 186
5531A86k37nN59o00KJ11l93j14Q84J07m66j09k01J49m9Q05l02l30k37K09l87P85
$$ 186 -51 -56 503 -97 -95 16 -377 -491 393 500 34 -75 -276 -127 -176 629 327 -3 -240 -31 -418 367
5553C67J20n24l10r7j89Q33N02l50p38j76J31M64M16O4n02n57m2P31J37K16N0
$$ 367 487 -37 -347 -444 -633 200 702 352 -386 -562 -431 33 449 513 11 -546 -588 143 280 496 546
5574E46j027k04N63J45N44j63m70o60K58N55O9L87l06l93n19L61P32M6k44l4o93
$$ 546 -481 -685 -122 23 567 404 -66 -726 -468 87 156 543 237 -156 -675 -314 418 464 220 186 -507
5595e07KM27K49J56L4l62o55N38N90n79K28l5k68l96N11K34o0Pj77m5J49l2J74
$$ -507 -505 -78 171 327 361 -1 -656 -118 472 -107 121 86 -182 -578 -67 167 107 114 -63 -108 41 9 183
5618A83R0P6j89m09K04J20jN35l65k54l35O6M17j85M85Jo08m59P13K05j89K93
$$ 183 273 349 160 -249 -45 75 74 609 244 -10 -345 -279 138 -47 438 439 -169 -628 85 290 101 394
5640C94n14j71J53N33j58j47M40r73k84P18J66L36O1m26n90J3Q19K1j36k87n68
$$ 394 -120 -291 -138 395 237 90 530 -443 -727 -9 157 493 554 128 -462 -449 370 391 255 -32 -600
5661f00p2O53N76o3k44l28l22J38O85K51o27J20m96p7O60K18l01l44O1p6q9M63
$$ -600 -672 -19 557 494 250 -78 -400 -262 423 674 47 167 -329 -406 254 472 171 -173 -112 -188 -277 186
5683A86J92n30m0J35l26O30J52k59l72J81L17j85K05q0l43J27P3j01k58K16K03
$$ 186 378 -152 -192 -57 -383 247 399 140 -232 -51 266 81 286 206 -137 -10 63 -38 -296 -80 123
5704A23L0J64j6o12j56M43J77j58O4j57k38K14K63k05M14q4m60o11O21M67r3m1
$$ 123 153 317 301 -311 -467 -24 153 -5 59 -98 -336 -122 141 -64 350 266 -194 -805 -184 283 190 149
5726A49k96k27K24O52J91l92k17l23r9L79K67M7m68K78l90m0N33mj27m3j49l90
$$ 149 -147 -374 -150 502 693 301 84 -239 -338 41 308 355 -113 165 -225 -265 268 264 137 94 -55 -445
5748d45L61J39NQ1m03K99o9J78J56l84k41K87k60J50M59j68m26K87o8j06M00K
$$ -445 -84 55 60 141 -262 37 -32 146 302 -82 -323 -36 -296 -146 313 145 -281 6 -62 -168 232 234
5770B34j37m18O13k57o4k5L42k82L4K31k43k53M82k2N9l9l4n67q0P47k77L3J19
$$ 234 97 -321 292 35 -29 -54 288 6 40 271 28 -225 257 235 294 255 221 -346 -426 321 44 77 196
5793A96l91NK10M15j76l63j9m57P28P05n52k44m85Q4J3L29M27j06o20Q1j13Q5
$$ 196 -195 -190 20 435 259 -104 -123 -580 148 853 301 57 -428 -344 -331 -2 425 319 -301 -220 -333 -248
5815b48Q04k20m46k38K13k36N81K82K60r18m0O2Q5K06K98l03m19M6M65j35L12
$$ -248 556 336 -110 -348 -135 -371 210 492 752 -166 -206 -144 -59 147 445 142 -277 -231 234 99 411
5836D11Oq05K55L3j97L33K82j2k51k75J56J8J51K25n03j54N44m72L54o6K23n90
$$ 411 417 -388 -133 -100 -297 36 318 306 55 -220 -64 -46 105 330 -173 -327 217 -255 99 33 256 -334
5858c34J37L29q6J25P3k56k98L85K35n58N55o3m05j83L15N9k45M85r1o0k58l39
$$ -334 -197 132 46 171 244 -12 -310 75 310 -248 307 244 -161 -344 -29 30 -215 270 179 119 -139 -478
5880d78P8K73N87l48m25K80r8L45P0j65J20k75l32L06o1K44m0l23J64j5K94k10
$$ -478 -400 -127 460 112 -313 -33 -131 214 284 119 239 -36 -368 -62 -123 121 81 -242 -78 -93 201 -9
5902iL02m59k00J75N64o8l01K71q83M29R4P2K93Kl98k62J62L86m1j38L41l24l46
$$ -9 293 -166 -366 -191 373 305 4 275 -608 -179 -85 -13 280 282 -116 -378 -216 170 129 -9 332 8 -338
5925c38L93k27l26O45J02k42k68M01j71k02N46j74m19J23K81o1k33rN5L8K36k31
$$ -338 55 -172 -498 147 249 7 -261 140 -31 -233 313 139 -280 -157 124 63 -170 -179 -124 -86 150 -81
5947h1j57J84J56k87L4l1J76N1K22l79j20R5j20L01J32K85m05k66L3K20L17J85
$$ -81 -238 -54 102 -185 -151 -182 -6 45 267 -112 -232 -137 -257 44 176 461 56 -210 -177 43 360 545
5969E45k98m88Q4J14K53p3K83n82m18N41K93Q8n3j44o43L0O21j09J64L1k52k07
$$ 545 247 -241 -157 -43 210 137 420 -162 -580 -39 254 342 289 145 -498 -468 153 44 208 239 -13 -220
5991b20j30M69mK2Q0r9l71K72M85n07K19j48k64J36N2K01m56K64R8j57j1j02K91
$$ -220 -350 119 115 137 217 118 -253 19 504 -3 216 68 -196 -60 -8 193 -263 1 99 -58 -69 -171 120
6014A20Q7l32P4k14K98l59N34p5m2j60K2J18j72L05K73l10k46J9L91m20K90J6
$$ 120 207 -125 -51 -265 33 -326 208 133 91 -69 -47 71 -101 204 477 167 -79 -60 331 -89 201 217
6036B17m20nl4M18L8l18J64l30k8O23L08m42k0l91qk13P32j2k15L2k05n7J54J08
$$ 217 -203 -208 -242 176 214 -104 60 -270 -298 325 633 191 171 -220 -228 -441 291 279 64 96 -109 -166 -12 96
6060I6kj88m28K4L08M80j55O7l87k06j48M65L25l21M5Lj39R5J90J18l26J81p9
$$ 96 94 -94 -522 -498 -190 290 135 202 -185 -391 -539 -74 251 -70 -25 -22 -161 -66 124 242 -84 97 18
6083A8l62L58K59n13M74l00k04P3J50K57k79L61p3l76N9J58K17j76m1j36j41J90
$$ 18 -344 14 273 -240 234 -66 -270 -197 -47 210 -69 292 219 -157 -98 60 277 101 60 -76 -217 -27
6105b7J10L11l57k6k60j62P82j21k30l2j85J65K1L40k31k44l5K75l5M1K96l81
$$ -27 83 394 37 11 -249 -411 371 250 20 -12 -197 -32 -11 329 98 -146 -181 94 59 100 396 15
6127A5r7p5Q6J00Q4K41k61j87j84J32M7J85K47l49l58M11j7K15K9m00K9J1j05
$$ 15 -82 -157 -71 29 113 354 93 -94 -278 -146 -99 86 333 -16 -374 37 20 235 264 -136 -107 -96 -201
6150b01lM79l28M26m55L04p9j67M07j95m54M83l51L44J01k64k17r7J10L08O4n3
$$ -201 -204 275 -53 373 -82 222 143 -24 383 188 -266 217 -134 210 311 47 -170 -267 -157 151 215 162
6172A62J04k33j48k9j37J69K44j17J29l45K75J0J7L00n12j05J48L64l27K79j36
$$ 162 266 33 -115 -144 -281 -112 132 15 144 -201 74 84 101 401 -111 -216 -68 296 -31 248 112
6193A12l66L4J55L03j86J05j99JO7j03k13M66L01n37N3k25J17L65r3q5j10k68
$$ 112 -254 -220 -65 238 52 157 -42 -41 26 -77 -290 176 477 -60 -7 -232 -115 250 157 72 -38 -306
6215c06K65J5K07p0N2l05N4KK4J89j68J94k78J26O3p5J30L2l46O1M28k69m7J31
$$ -306 -41 -26 181 111 163 -142 -88 -86 -62 127 -41 153 -125 1 64 -11 119 151 -195 -134 294 25 -22 109
6239A09R2m93M12Mk17K55J62n81K6J33L0J34k19L5p4J18K00k18o1K94J16o74K53
$$ 109 201 -292 120 124 -93 162 324 -257 -231 -98 -68 66 -153 -118 -192 -74 126 -92 -153 141 257 -417 -164
6262a64L27l03K41J8l84J22N30l62K46j1j73k34J95k66P0J15L40m55k66L18J9
$$ -164 163 -140 101 119 -265 -143 387 25 271 260 87 -147 48 -218 -148 -33 307 -148 -414 -96 -77
6283g7L60j52k89n7j00N44p5L19l94j25k38J24K89k02L75l56j68j57M88R4k5l36
$$ -77 283 131 -158 -215 -315 229 154 473 79 -46 -284 -160 129 -73 302 -54 -222 -379 109 203 178 -158
6305a58p9K50R5l4J99j8l93Q5j49L85Pm08L02l07K92j17L50j83r1j32J63k15J61
$$ -158 -237 13 108 74 273 255 -138 -53 -202 183 190 -218 84 -223 69 -48 302 119 28 -104 59 -156 5
6328EP4j61N3K8q1j9LN04k94j25M5P6l03M50Kk14l45K08NJ15r4k3K18k36j08J05
$$ 5 79 -82 -29 -1 -82 -101 -98 406 112 -13 32 108 -195 255 257 43 -302 -94 -89 26 -68 -91 127 -109 -217 -112
6354a12L91m8k75qL9J31m42L51K03l41nJ62r9j34L23o1j06k64K22k08J72L30l45
$$ -112 279 231 -44 -52 -13 118 -324 27 230 -111 -116 46 -53 -187 136 75 -31 -295 -73 -281 -109 221 -124
6377a24Q3K7O3j10K93l49J03k90J33L47k76N86l83J64n68N58J9j25j7j20j57J38
$$ -124 -41 -14 49 -61 232 -117 -14 -304 -171 176 -100 486 103 267 -301 257 276 151 134 14 -143 -5
6399eJ18r1j16K70l09j7L05k59j5L09j06j08M6k76J14L94l52J29k79J96j49L55
$$ -5 113 22 -94 176 -133 -150 155 -104 -119 190 84 -24 22 -254 -140 254 -98 31 -248 -52 -201 154
6421A54j64j81J82Q1j63J6O3P8j20J97k67j11M02N0k01o4l4J88l5j27n1J0K42
$$ 154 -10 -191 -9 72 -91 -75 -12 66 -54 143 -124 -235 167 217 16 -48 -82 106 71 -56 -107 -97 145
6444A45l51N2K66j7Q8j67J69l58L51m30K10L46j86k61L03j18k78L31l78M49Qj82
$$ 145 -206 -154 112 95 183 16 185 -173 178 -252 -42 304 118 -143 160 42 -236 95 -283 166 174 -8
6466hj25J77k6M1J0l34J94l7J22j51K10q4K22k82J09j28L1P2Q9J59m41J22J31
$$ -8 -133 44 18 59 69 -265 -71 -108 14 -137 73 -11 211 -71 38 -90 -59 13 102 261 -180 -58 73
6489G3J09l34K66J12k77O8o3k03J55L21l14L91k89j37J17k89K05o2N4L29l97K8
$$ 73 182 -152 114 226 -51 17 -46 -249 -94 227 -87 304 15 -122 -5 -294 -89 -151 -97 232 -165 -137
6511a37l3QL76q6l16L49j59kj31M7J92j80l52J65K02k26M60n19L8K46J64q2K00
$$ -137 -170 -162 214 128 -188 161 2 0 -131 -84 108 -72 -424 -259 -57 -283 177 -342 -304 -58 106 24 224
6534B24m00K08p5Q6j25M04M3m33J09k6j96j12M18Lj19p7J44j81J88J10k96K31
$$ 224 -176 32 -43 43 -82 322 365 -68 41 15 -181 -293 125 128 9 -68 76 -105 83 193 -103 128
6556A28q8n37M20M7Ro5L9L3J13j95J2J53K8j7m65N14j8j31J53k4J09Q3k98J02
$$ 128 40 -497 -77 -30 -21 -86 -47 -14 99 -96 -84 69 97 80 -385 129 111 -20 133 109 218 301 3 105
6580A05Ml09l6J00K72O8m23K50m1k7L67l91R2p4P6J75k27K7l43M29j36J65m47
$$ 105 109 -200 -236 -136 136 204 -219 31 -10 -37 330 -61 31 -43 33 208 -19 8 -335 94 -42 123 -324
6603c24N92j85j12O3J22j44n4M6J45J14l66J11J95n08J65o1j66L11J26Q0j10n9
$$ -324 268 83 -29 34 156 12 -42 4 149 263 -103 8 203 -305 -140 -201 -367 -56 70 150 40 -19
6625a9j53L93k9n7k29K46k99m1N32l41Q8k13K99k68K23j09R7L9J7j41l78K81K8
$$ -19 -172 221 192 135 -94 152 -147 -188 344 3 91 -122 177 -91 132 23 120 159 176 35 -343 -62 -34
6648c4M3J04j69L1J28J1j51L9l59L55J54j22N6k04J9k41K69j22o3N46o32J20l6
$$ -34 9 113 -56 -25 103 114 -37 2 -357 -2 152 30 86 -118 -99 -340 -71 -193 -256 290 -342 -222 -258
6671b58L36rJ2j15n8Q6j90K05K7n1j33K79J41k65J60l3j48k0K2j30L4J22k03M20
$$ -258 78 69 81 -34 -92 -6 -196 9 36 -15 -148 131 272 7 167 134 -14 -34 -12 -142 -108 14 -189 231
6695B31k44j89J81J9o1J06J01k86J21J20l58R7J09Q6k27K74j5m97L10J04k0r2
$$ 231 -13 -202 -21 -2 -63 43 144 -142 -21 99 -259 -162 -53 33 -194 80 65 -432 -122 -18 -38 -130
6717a30K03n24M44k2p2j12l5K68K09k74P6N6k25K01L1k7J47j32r9q7O8j9R6j60
$$ -130 73 -451 -7 -29 -101 -213 -248 20 229 -45 31 87 -138 63 94 67 214 82 -17 -104 -36 -55 41 -119
6741a19N29m79J21n9j1J70k74J49r8J72j98J93k03J77M15n24L61k60q1P9r8J8
$$ -119 410 -69 52 -7 -18 152 -122 27 -71 101 -97 96 -107 70 485 -39 322 62 -19 60 -38 -20
6763b0L7K87j85Q1l44L3P7k8RO1J56k08j1L1J21q6q5K4l9o5K5O4rJ7j65lK39k15
$$ -20 17 304 119 200 -144 -111 -34 -62 -53 8 164 -44 -55 -24 97 11 -74 -50 -89 -154 -129 -65 -74 -57 -222 -225 14 -201
6791b01k7J46M90l84J64j34N2j32K32m94J14L91m89K85K50j91k13M1L79j80l30
$$ -201 -228 -82 408 24 188 54 106 -26 206 -288 -174 217 -272 13 263 72 -141 -100 279 99 -231
6812b31K85j24j08K87l1j30k02J62K64l09L63l32K39k57L9m3l7K51j53M8j47K41
$$ -231 54 -70 -178 109 78 -52 -254 -92 172 -137 226 -106 133 -124 -85 -128 -165 86 -67 -19 -166 75
6834G5J87N4j94j62K28q8j03q3K99j11j99r1KJ0J05k08L59k38K33J82l30K42J4
$$ 75 262 316 122 -40 188 100 -3 -86 213 102 -97 -188 -186 -176 -71 -279 80 -158 75 257 -73 169 183
6857A83k72j25K37k3l55K38K85l10j32J88J25l1k6R4k40O0j40K23K88n18m1M7
$$ 183 -89 -214 23 0 -355 -117 168 -142 -274 -86 39 8 -18 76 -164 -104 -244 -21 267 -251 -292 -245
6879b45K58j03J25L76l28j56J74n7j09K02m63P7M09j87k5O4o4J44p5K33l73K58
$$ -245 13 -90 35 411 83 -73 101 44 -65 137 -326 -249 160 -27 -52 12 -52 92 17 250 -123 135
6901A35j05N0k07j00K69K8J48m67K26J52J08j08p9k00K91l8l90M20j03j2R7r2
$$ 135 30 80 -127 -227 42 70 218 -249 -23 129 237 129 50 -150 141 103 -287 133 30 18 115 23
6923B3m3j99K60l03m5M11k27K6kK31l56J69QM3j20J77R5n06O21j04q1qj83K01
$$ 23 -20 -219 41 -262 -307 104 -123 -97 -99 132 -224 -55 -47 -4 -124 53 148 -358 263 159 78 70 -113 88
6947H8J26k57J12J33o98K87Q5J23p3k86J36K39j60J30k64P2J55j51L54l37J85
$$ 88 214 -43 69 202 -496 -209 -124 -1 -74 -360 -224 15 -145 -15 -279 -207 -52 -203 151 -186 -1
6968aj71K06m5J4K97m03R3J32K6l46J07J41p1L62k09j97K32k41j9k57M75j2l12
$$ -1 -172 34 -11 3 300 -103 -10 122 148 -198 -91 50 -21 341 132 -65 167 -74 -93 -350 125 113 -199
6991a99J93L1o1K79k56J94q7N6q8K06k24P9j90K10j68R3K27l68N5k74M83j21Q3
$$ -199 -6 25 -36 243 -13 181 94 150 62 268 44 123 -67 143 -25 68 295 -73 -18 -292 191 70 153
7014A53n0oq2m0L4R8r8l25Q5N60l81L03M2l99J64j73J26j18L0RM2J76j72N4K00
$$ 153 103 97 15 -25 9 107 9 -316 -231 329 -52 251 293 -106 58 -115 11 -107 -77 -68 -26 150 -22 32 232
7039B32k51K33m24J41J22rJ01J32l45L6J84q6R0k39j49J74K17q3p5k9J47j89l05
$$ 232 -19 214 -210 -69 53 44 145 277 -68 -32 152 66 156 -83 -232 -58 159 76 1 -28 119 -70 -375
7062c75L34J12K68j39k66N7Q5J43j97O4Q2j39j17o1P3K41p0j80Q7k14K9O0J6L33
$$ -375 -41 71 339 200 -66 -9 76 219 22 86 168 29 -88 -149 -76 165 95 -85 2 -212 -183 -123 -107 226
7086B26j10l48L20j03l40L88J38k46j47Q1j67j3M76m9j27j80O16l77J62j66J1
$$ 226 116 -232 88 -15 -355 33 171 -75 -222 -141 -308 -321 155 106 -21 -201 415 38 200 34 45
7107D5j02J21J44l50K29j30J7nQ8k06K21j86J60k7l26L03r6k9L59k40k76K81j16
$$ 45 -57 64 208 -142 87 -43 -26 -31 57 -149 72 -114 46 19 -307 -4 -100 -129 230 -10 -286 -5 -121
7130a21K30l42L23J79n89n7K67K55l59J54q7n0J30J45k05N0J22j47L82l68L10
$$ -121 109 -233 90 269 -320 -377 -110 145 -214 -60 -147 -197 -67 78 -127 -77 45 -102 280 -88 222
7151B22pj85j53K03j7j26N5Q1K90m48J17J36mk1K12k86l60M79l21M0MK74k73r3
$$ 222 215 30 -123 80 63 -63 -8 73 363 -85 32 168 164 143 355 69 -291 188 -133 -93 -89 185 -88 -181
7175a81L74l22J99m15L38k3oK01j32o2J64j03jk11M37J80n82L7K87j24Jm5r7K23
$$ -181 193 -129 70 -345 -7 -30 -36 165 33 -29 135 32 31 -180 257 437 -145 -108 179 55 56 11 -86 137
7199A37K23l14oO8j44J26R8m86J09M21m19KM22l75j34K84m0j41K80J19j08k34
$$ 137 360 46 40 108 -36 90 188 -298 -189 232 -187 -185 237 -138 -272 12 -28 -169 111 230 122 -112
7221a12L6O0L4M1j76k51N01k81K73k4P2l31p8L86j62R7j83oj17n2J54J76j96M08
$$ -112 -76 -16 18 59 -117 -368 133 -148 125 101 173 -158 -236 150 -12 85 -98 -104 -221 -273 -119 57 -139 269
7245B69m49K27k02M09k52J50q8k52K09k1p6K08j11j29K38l54J12N00l63k1j8J70
$$ 269 -180 47 -155 254 2 152 64 -188 21 0 -76 132 21 -108 130 -224 -112 388 25 4 -14 156
7267A56n2qnj92K23J0j49Rl91M16J63j81k52Q5K1L29j19J50j55r9J98l8k7r0k17
$$ 156 104 96 91 -101 122 132 -17 -8 -399 17 180 -1 -253 -168 -147 182 63 213 58 -41 157 119 92 2 -215
7292b15J10k41M11m4R3pK52k57k91J36m8K90k57J15O6q4L2J04j31k8r9K57N8l15
$$ -215 -105 -346 65 21 114 107 359 102 -189 -53 -101 189 -68 47 113 29 61 165 34 6 -93 164 222 -93
7316i3K56r9l7l50K53L39q2J39l30Q6m25L77K12o16L71k01J00J0K87j54j93J08
$$ -93 163 64 27 -323 -70 269 187 326 -4 82 -343 34 246 -370 1 -200 -100 -90 197 43 -150 -42
7338d2J0J17k21Q1J19p7J38J2j55J80l69K06P9q9J59J23l02Q9j31j76R1j31K51
$$ -42 -32 85 -136 -55 64 -13 125 137 -18 162 -207 -1 78 -11 148 271 -31 58 -73 -249 -158 -289 -38
7361c8J86R5k09k79R1k15N16J76m13j60K41j63J88J1J06m7k37J60M9l71P87k73
$$ -38 148 243 34 -245 -154 -369 147 323 -90 -250 -9 -172 16 27 133 86 -151 9 58 -313 474 201
7383B01m36J37j05K69J62J18n76j91K13K87k36M3L19j99k68L70m42L35m9j15Q0
$$ 201 -235 -98 -203 66 228 346 -230 -421 -208 79 -157 -114 205 6 -262 108 -334 1 -48 -163 -83
7404h3L02j45m0l1L5j47K86Nl49L88k53N0K6Q4pm67L61J75k91Q3o9L10m26K47
$$ -83 219 74 34 3 38 -109 177 182 -167 221 -32 18 44 128 121 -346 15 190 -101 -18 -87 223 -203 44
7428D4N8j65M4m4k05K74P7N4K27l64j58k03J71K00L29l68M9J56n43L69J74m25
$$ 44 102 -63 -19 -63 -268 6 83 137 364 0 -158 -361 -190 10 339 -29 20 176 -367 2 176 -249
7450b49L2j11L87M1J42l3j48l98K23L2L85p2k59k5J10r0j62K61k94L6p9K40Mj18
$$ -249 -217 -328 59 100 242 209 61 -337 -114 -82 303 231 -28 -53 57 -33 -195 66 -228 -192 -271 -31 -27 -145
7474a45L81k15j52R5j32K44j51N4R1m1O6l88L49N8k45k26L27L2J42j36J73o1j06
$$ -145 236 21 -131 -36 -168 76 -75 -21 70 29 95 -293 56 114 -131 -357 -30 2 144 8 181 120 14
7497A4R8k10k34L04M09m34q0J22nmJ30J08l97M02l25K0O2K51K15p27J53m1L48
$$ 14 112 -98 -332 -28 381 -53 -133 -11 -16 -20 110 218 -179 223 -102 -82 -20 231 446 -281 -128 -169 179
7520A79oK57m21q7l08O30j74K46m69p1Q5O7N01m16Lk3k51M98m12L00Q4k50k89
$$ 179 173 430 9 -78 -386 244 70 316 -153 -224 -139 -72 429 13 16 -7 -258 240 -172 128 212 -38 -327
7543c27R3K00J2J42Q3L0k71k55M03j51L23j00n26L47J57l0k16j00N93n30q2N39
$$ -327 -234 -34 -22 120 203 233 -38 -293 110 -41 282 182 -344 3 160 130 -86 -186 407 -123 -205 334
7565C34m06K1jj31J95P2j38K48J49k57j14j20J72K14M3j65k04M6j85J30l9j2L97
$$ 334 -72 -51 -52 -183 12 84 -54 194 343 86 -28 -148 24 238 281 116 -88 -42 -227 -97 -136 -148 249
7588B49j85l98J24L16m1j44j23L44M9k20k2m1J40J07j39r4R5L07R4Km90k23L65
$$ 249 64 -334 -210 106 65 -79 -202 142 191 -29 -51 -92 48 155 16 -78 17 324 418 420 -70 -293 72
7611G2O7K86K03m48l74p4L08R0K9k06M4m8O6j95P4M6M6n3O4J46p4J14r2j51j3
$$ 72 139 425 628 180 -194 -268 40 130 159 -47 -3 -51 15 -180 -106 -60 -14 -67 -3 143 69 183 91 -60 -73
7636g3J06M06l84r6L7j75L25l01M05k16j20R3L7m82L90PkJ83r9p0O3k26K76j97
$$ -73 33 439 55 -41 -4 -179 146 -155 250 34 -86 7 44 -438 -48 -41 -43 140 41 -29 34 -192 84 -113
7660a13K30k67q0O4j47M75l23M66j60q19O06J82J61l72R9j29P2N0J46J3j94j86
$$ -113 117 -150 -230 -166 -313 162 -161 305 145 -674 -68 114 275 -97 2 -127 -55 -5 141 154 -40 -226
7682b26p7K83J72L8N5l00J05N6j10L07k75K3q9m17P93nm55Q6L42l37n3R6j55P0
$$ -226 -303 -20 152 190 245 -55 50 106 -4 303 28 51 -38 -455 338 333 -122 -36 306 -31 -84 12 -143 -73
7706g3k48J14m2M43k95K58l77M99j84m37M52k3N4k23K08j27k2k18J06L61j34J39
$$ -73 -321 -207 -249 194 -101 157 -220 279 95 -342 110 87 141 -82 126 -1 -23 -241 -135 226 92 231
7728B31l94k40L11J30l55N95M1l94L65l5l31J80n9r2k95K90r7J48K24l14k49K48
$$ 231 -163 -403 -92 38 -317 278 319 -75 290 255 -76 104 45 -47 -342 -52 -149 -1 223 -91 -340 -92
7750i2j8L19j84O9j2m08M95jKk64R6q5k56O18j17p2k10k4j67O06j31k42k55J42
$$ -92 -110 209 25 94 82 -326 169 168 170 -94 2 -83 -339 279 162 90 -120 -144 -311 295 164 -78 -333 -191
7774a91J34k21O34j78l69J20J34k26K99K10j71n55P6N47l38M37j77k99J87J25
$$ -191 -57 -278 356 178 -191 -71 63 -163 136 346 175 -380 -304 243 -95 342 165 -134 53 178
7794A78j10l07K59O6k98J89J84l42K92J14m70K12R4j18n5L48n10J84J99O7k52
$$ 178 68 -239 20 86 -212 -23 161 -181 111 225 -245 -33 61 -57 -112 236 -274 -90 109 176 -76
7815g6K48J18l9j30r3M0J6O2k56K75m84K51q8J39n1L56L8l88j54J26J5J77M2l27
$$ -76 172 290 251 121 28 68 84 146 -110 165 -319 -68 -156 -17 -68 288 326 -62 -216 -90 -75 102 144 -183
7839a83J19jR6p2J82K16o42N6J41K4J35L0j04r8j10L7K6J37J15j62M4k9j7K1J28
$$ -183 -64 -65 31 -41 141 357 -285 -229 -88 -64 71 101 -3 -101 -211 -174 -148 -11 104 -58 -14 -43 -60 -39 89
7864H9P4m12N6K33o5K57j64k27J82j9K8j58J87rk52p1L44k2k16M41n02J61q4L10
$$ 89 163 -249 -193 40 -25 232 68 -159 23 4 32 -126 61 52 -200 -271 73 51 -165 276 -226 -65 -149 161
7888A61k09pK27R0k21l3m4j38M65j9p18Q05n42J49j11K79l4k56L65j73J53n2J29
$$ 161 -48 -55 172 262 41 8 -36 -174 291 272 -446 359 -183 -34 -145 134 100 -156 209 36 189 137 266
7911B66l63j58N06j62j64K34k97R3j03PN9L08j7k14l95J34K65m7M42n36R2m08
$$ 266 -97 -255 251 89 -75 159 -138 -45 -148 -141 -82 226 209 -5 -400 -266 -1 -48 394 -142 -50 -458
7933d58J91L35j91K93l43R2k71L83K7J18Jl61j64O53j27j01J24n9m44K20J66j60
$$ -458 -267 68 -123 170 -173 -81 -352 31 58 176 177 -184 -348 305 178 77 201 142 -302 -82 84 -76
7955g6M3j66L60n31M06n3J51k6k09M22n02M4n8O31l53M8l34J16K07k59L31L9l60
$$ -76 -33 -199 161 -370 36 -17 134 108 -101 321 -181 -137 -195 436 83 131 -203 -87 120 -139 192 231 -129
7978a29j29J52M5j43J37K78l73j25M97l06J41o8j82J11k82N40J72k86J24n35J75
$$ -129 -258 -106 -61 -204 -67 211 -162 -287 210 -96 45 -23 -205 -94 -376 164 336 50 174 -361 -186
7999a86K11J01o5lj47l0q6K58l6j94M2K55r6l28K12J08K8L44k60m01K99Q5j14
$$ -186 25 126 61 58 -89 -119 -205 53 17 -177 -135 120 24 -304 -92 16 44 388 128 -273 26 111 -3
8022cj92R8J72j48K67p3k60M69n18l0J38J79j18J74j38l17L55M3l7o%j88j64N21
$$ -3 -195 -97 75 -73 194 121 -139 330 -188 -218 -80 99 -19 155 17 -300 55 98 61 55 55 -133 -297 224
8046B24k8j98jJ59j07k78L30j90j9r8M7J36q6J61j57P7j07J22j89K84J06l47j21
$$ 224 196 -2 -3 156 49 -229 101 -89 -108 -206 -159 -23 -109 52 -105 -28 -135 -13 -202 82 188 -159 -280
8069b80J60J76l45M03n6Qm18N00j29k67J80p1K2RJ79o3l71M09j51J58J26j82k51
$$ -280 -120 56 -289 114 58 66 -352 148 19 -248 -68 -139 -117 -108 71 8 -363 46 -105 53 179 -3 -254
8092b54M01J86j93o04O27q6l9L35k90L9k19K34k48K05L12k22l21N5J00J11l44
$$ -254 147 333 140 -464 163 77 38 373 83 122 -97 137 -111 94 406 184 -137 -82 18 129 -215
8113b15K07n4k09J64J42k20L67k52k78L48j99P8J06K76k43k82J02K38j01rl0J94
$$ -215 -8 -62 -271 -107 35 -185 182 -70 -348 0 -199 -121 -15 261 18 -264 -162 76 -25 -34 -64 130
8135A30r1j27P8J17p7j25K61j38qj29J88J05l36R3R8J25q6lJ41q6o9k22L15k90
$$ 130 39 -88 -10 107 30 -95 166 28 20 -109 79 184 -152 -59 39 164 78 75 216 130 61 -161 154 -136
8159a36M18q8k90m0J83k04L30N5l97k06L54J24k35L61m5j05j20L07m3k23L20k90
$$ -136 282 194 -96 -136 47 -157 173 228 -169 -375 -21 103 -132 229 184 79 -41 266 223 0 320 30
8181C0m81J91K78m11M91j93j34o5L65l65
$$ 30 -451 -260 18 -393 98 -95 -229 -294 71 -294
8191b94
$$ Imaginary data points
##PAGE= N=2
##DATA TABLE= (X++(I..I)), XYDATA
0@%%%qJ6j6K4l2L2m8O5p3R6j21J44j76K11k50K99l52M10m81N59o44P43q51R70
$$ 0 0 0 0 -8 8 -8 16 -16 16 -32 33 -40 56 -65 79 -97 114 -136 163 -189 221 -260 299 -345 398 -453 517
27E17j105J251j414J599j797K016k259K520k810L129l473L856m278M738n247N806
$$ 517 -588 663 -751 848 -949 1067 -1192 1328 -1482 1647 -1826 2030 -2248 2490 -2757 3049
43C049o428P124p898Q771r766J0903j2219J3767j5616J7874k0699K4358k9318
$$ 3049 -3379 3745 -4153 4618 -5148 5755 -6464 7303 -8313 9561 -11138 13220 -16098
56a6098L6445m7645O7954j16471M39162N35592p36480o56784k45263M43577O31958
$$ -16098 20347 -27298 40656 -75815 363347 898939 162459 -494325 -739588 -296011 335947
67C35947L12355l54185n01993k16839J59254K89215K44917n3246k38756j61202
$$ 335947 648302 294117 -207876 -424715 -265461 23754 268671 215425 -23331 -184533
77a84533J7172O8127J51018J34424n4390k07748j22139R980J52217K41404R2137
$$ -184533 -167361 -99234 51784 186208 131818 -75930 -198069 -188089 -35872 205532 297669
88B97669k22961k77667o4622J45202K42331J84791p9300k61409j44897L8962R2920
$$ 297669 74708 -202959 -267581 -122379 119952 304743 225443 -35966 -180863 -141901 -48981
99d8981J24075R9524l5434j04952o5635p4220m5968J11459J71104L5583q5903
$$ -48981 75094 174618 139184 34232 -31403 -105623 -151591 -40132 130972 166555 80652
110H0652j36680j39644J5142K05748J48537n7180j45804j26860l2604J51537J99105
$$ 80652 -56028 -195672 -180530 25218 173755 116575 -29229 -156089 -188693 -37156 161949
121A61949j0326j81909j33105q709J24643K06345O1518j87636k01385j6621J23688
$$ 161949 151623 -30286 -163391 -172100 -47457 158888 220406 32770 -168615 -185236 -61548
132f1548J76974J07390j09026k13080n4435J06177J06812O1615k1161j23192p3075
$$ -61548 115426 222816 113790 -99290 -153725 -47548 59264 120879 99718 -23474 -96549
143i6549O7145O7110l95N337k0751p5528j8498N4481L2163K3905K1039p9124j14222
$$ -96549 -29404 37706 37311 42648 21897 -53631 -72129 -17648 14515 38420 59459 -19665 -133887
156a33887K7238J25254P3562m567r3133j47191j0454J77096J34051m2576j18315
$$ -133887 -106649 18605 92167 87600 -5533 -152724 -163178 13918 147969 105393 -12922
167a2922j00832j1971J32051J29805m7624j21234k5592L8447M6701M4447k9830
$$ -12922 -113754 -125725 6326 136131 88507 -32727 -58319 -19872 26829 71276 41446
178D1446q0718J1882P7976l07m7687q603m517L874M3623k188o6138l577N3043
$$ 41446 -39272 -27390 50586 50279 2592 -6011 -10528 -6654 36969 34781 -31357 -34934 18109
191A8109m98k3800N485j8677k1714L1285J3765k6705K9092M9136m6713q1733j4866
$$ 18109 17611 -6189 -704 -19381 -41095 -9810 3955 -22750 6342 55478 8765 -72968 -87834
204h7834L8154Q9317J06307l3909j82096j06526P3060J50474J27040J745j77861
$$ -87834 -49680 39637 145944 112035 -70061 -176587 -103527 46947 173987 175732 -2129
215b129j76511L6046J68891J19463J5932j04936j69538m3314J31222J28293K5446
$$ -2129 -178640 -142594 26297 145760 161692 56756 -112782 -156096 -24874 103419 128865
226A28865n1084j21977j07101N2699J51222P1146l2717r3439j25537k9547J34651
$$ 128865 77781 -44196 -151297 -98598 52624 123770 91053 -2386 -127923 -157470 -22819
237b2819J34625j855p9643r7135p1869M9457J33698N0187m8188m8136m4763k9278
$$ -22819 111806 109951 30308 -66827 -138696 -89239 44459 94646 46458 -1678 -46441 -75719
249g5719N0859O8676l911j9875k941l7354k5018M8590M0873j5463r850j6233m5990
$$ -75719 -24860 43816 39905 20030 17089 -20265 -45283 3307 44180 28717 18867 2634 -43356
262d3356O762O7249K0936k2537r509l9955n7460K1090P3082M0660J8079k5314
$$ -43356 -36594 30655 51591 29054 19545 -20410 -77870 -56780 16302 56962 75041 49727
274D9727j14541q7938O2297J30646P6783p017j12555j49012j838J55154J16509
$$ 49727 -64814 -152752 -90455 40191 116974 109957 -2598 -151610 -153448 1706 118215
285A18215j3492r1272j11958k9362J20195J24264k1863r9407p0385j9583O7585
$$ 118215 104723 13451 -98507 -127869 -7674 116590 94727 -4680 -75065 -94648 -27063
296b7063J22607K9070r0000q5898l9122N421R5707J19264m067j07504r9285n0183
$$ -27063 95544 124614 34614 -51284 -90406 -84985 10722 129986 125919 18415 -80870 -131053
308a31053M5738J51931R7416p6986j37646o8899J7498J03268J12663k2651j23701
$$ -131053 -85315 66616 164032 87046 -50600 -119499 -102001 1267 113930 91279 -32422
319c2422n4643L6315N2482N0067M593p4399m9947M2476M4898M988J0211j2534
$$ -32422 -87065 -50750 1732 51799 56392 -18007 -67954 -25478 19420 24408 34619 22085
331B2085m9810r102L0326P178J6015M1748j6084o5161j8629J7413J7176M4229
$$ 22085 -27725 -36827 -6501 677 16692 58440 42356 -22805 -41434 -24021 -6845 37384
343C7384L0165m7309n2350Q522J1272J743L2364J5179l1228j2797L507k6357m25
$$ 37384 67549 20240 -32110 -23588 -12316 -10573 21791 36970 5742 -7055 -3548 -29905 -30330
356c0330N2110J6759l2136j8219j6092j5844M2511N4809k2629n1085j2964l071
$$ -30330 21780 38539 6403 -11816 -27908 -43752 -1241 53568 30939 -20146 -33110 -36181
368c6181J7299N7900J7809n5672l7499M734O251L3978N0254j9106o4853j7599
$$ -36181 -18882 39018 56827 1155 -36344 -31610 -25359 8619 58873 39767 -25086 -42685
380d2685J5257J9991M7941K2617o1008n6635J6744L3900K6917K7009k7372o7426
$$ -42685 -27428 -7437 40504 63121 2113 -54522 -37778 -3878 23039 50048 22676 -44750
392d4750l076M8934J6666L86K382l3753k8616L0394K5962j3777N272R648l0646
$$ -44750 -47826 1108 17774 18160 20542 -13211 -41827 -11433 14529 752 6024 15672 -14974
405a4974j5403K5126O636k539K2097o871m0643K721K9583l595j683J4654j6161
$$ -14974 -30377 -5251 1385 -1154 20943 14072 -26571 -23850 5733 2138 455 15109 -1052
418a052j5857K4454M167l1439N994L0680j973p026j484l1390r829N2182L1439
$$ -1052 -16909 7545 11712 -19727 -13733 16947 14974 7948 6464 -24926 -34755 17427 48866
431D8866l3243l1869j3049m576M1368N2456k4620o1932j2212J5248K0225M1623
$$ 48866 15623 -16246 -29295 -33871 7497 59953 35333 -26599 -38811 -23563 -3338 38285
443C8285J0627n3411l6091J6847J5014J6869L4421j1402n3447j5238J7965J3166
$$ 38285 48912 -4499 -40590 -23743 -8729 8140 42561 31159 -22288 -37526 -19561 -6395
455f395L2652K8233m1665n8238M514L1666K7143L2564j0480o8122k7156M0539
$$ -6395 26257 54490 12825 -45413 -40899 -9233 17910 50474 39994 -28128 -55284 -14745
467a4745L3687J4018O645l6294m7729J6878M1487O184L246K171l5502k4994K6954
$$ -14745 18942 32960 39605 3311 -44418 -27540 13947 20131 23377 25548 -9954 -34948 -7994
480g994J9837k866J4136k093m0287r863K8656O584J40J5480j7363l2946J2933
$$ -7994 11843 8977 23113 21020 -19267 -29130 -474 6110 6250 21730 4367 -28579 -15646
493a5646K3777p055L303J0405k5209j6870K4053J0168q072J4447J850l4283p637
$$ -15646 8131 1076 4379 14784 -10425 -27295 -3242 6926 -1146 13301 15151 -19132 -26769
506b6769K4844M668O136J9760j8747l8266O900K2589J872J4179J2942l1897k5301
$$ -26769 -1925 2743 8879 28639 9892 -28374 -21474 1115 2987 17166 30108 -1789 -27090
519b7090J7419R793r34K1228K151l6033j0761J8914J940O818K0890j8267l6700
$$ -27090 -9671 122 -812 20416 22567 -13466 -24227 -5313 -3373 3445 24335 6068 -30632
532c0632Q398K1968J564J3279N564l7597k2700K6969J9952K831J4029j2524m2373
$$ -30632 -22234 -266 1298 14577 20141 -17456 -40156 -13187 6765 9596 23625 11101 -31272
545c1272l288L0625J2264R853J4790k8039m0223J0605K6424Q972J8417L129m2768
$$ -31272 -34560 -3935 8329 18182 32972 4933 -35290 -24685 1739 10711 29128 32257 -10511
558a0511k4408K6516K0281L388J1161j6970l8605O945L5833M535n330j131k9296
$$ -10511 -34919 -8403 11878 15266 26427 9457 -29148 -22203 13630 18165 12835 11704 -17592
571a7592k0799L1655L0291o141m591j0938l5262l922M0252J8691m743K518k0579
$$ -17592 -38391 -6736 23555 17414 12823 1885 -33377 -37299 2953 21644 16901 19419 -1160
584a160l5692J0504L5657O740K153M880k6909k4204K1285J9591n154Q423M227
$$ -1160 -36852 -26348 9309 16049 18202 23082 -3827 -28031 -6746 12845 7691 16114 20341
597B0341k6851q182K2171J637o599J3728n817k6945O136K2053l083K8N171k6753
$$ 20341 -6510 -14692 7479 9116 2517 16245 10428 -16517 -10381 11672 8589 8617 13788 -12965
611a2965k1585K6322K6407p45N19j5937m2451j915M4414K3850j557n155l2574
$$ -12965 -34550 -8228 18179 17434 17953 2016 -40435 -42350 2064 25914 24357 19202 -13372
624a3372l6273K0655M3009J0780p95p705l6948j9085L4041K8740l268k713j4987
$$ -13372 -49645 -28990 14019 24799 24004 16299 -20649 -39734 -5693 23047 19779 17066 2079
637B079l1397R364M2746P203k0643j2253j9420q518L8901L3706k0295l0310j3080
$$ 2079 -29318 -19954 22792 29995 9352 -2901 -22321 -30839 8062 41768 21473 -8837 -21917
650b1917j2981J4719M5487Q535l2530j5902n310j0503J8769L2142p271j8877L621
$$ -21917 -34898 -20179 25308 33843 1313 -14589 -19899 -30402 -11633 20509 13238 -5639 -2018
663b018p911j3279J9043J6642j3384k075J1350j1421o465J7136k416j5472J2343
$$ -2018 -9929 -23208 -4165 12477 -907 -2982 8368 -3053 -9518 7618 5202 -10270 2073
676B073J2194j4565m96J2085j0848n204J5901p093k0964J2988J9395l701m79m863
$$ 2073 14267 -298 -794 11291 443 -4761 11140 4047 -16917 -3929 15466 11765 11286 6423
690F423l3055j0253L6988K6390l215p395k6462l5941J3428M5269J4915o602q760
$$ 6423 -26632 -36885 103 26493 23278 15883 -10579 -46520 -33092 12177 27092 20490 11730
703A1730l0858k1856K9029L3452j352p728j0898k6363M125M1329J3017k3388j6444
$$ 11730 -19128 -40984 -11955 21497 20145 12417 1519 -24844 -20719 20610 33627 10239 -6205
716f205j3441m887L7001L8312k0099m0141j5182m094J7250M5327J3448l7451k7041
$$ -6205 -19646 -24533 12468 50780 30681 -9460 -24642 -28736 -11486 33841 47289 9838 -17203
729a7203l851l993J7955L3787k234k5133m684o290j3225J7788K4379r225j1480
$$ -17203 -21054 -25047 -7092 26695 24461 -672 -5356 -11646 -24871 -7083 17296 8071 -3409
742c409M797r193o776K0067O495j9912Q54J2155p072K275J6390r609j6915O902
$$ -3409 1388 -7805 -14581 5486 11981 -7931 -7077 5078 -1994 281 16671 7062 -9853 -2951
756b951J363j0446J7091K4017j1078j8356q986j9523K490M4313K7020k1420k8663
$$ -2951 -1588 -12034 5057 29074 17996 -360 -9346 -28869 -26379 17934 44954 23534 -5129
769e129k3334j6510K7712N1063M676l2827k2676j5405J25L8181K9142k2377k9705
$$ -5129 -28463 -44973 -17261 33802 38478 5651 -17025 -32430 -32305 5876 35018 12641 -17064
782a7064n760Q60J8715L6303m610m5680k1548J3092K3426L7589J8393m5147n6663
$$ -17064 -22824 -21964 -3249 33054 28444 -17236 -38784 -25692 -2266 35323 53716 8569 -48094
795d8094p10L4691L8726L2623j4603o4031l4078K5424L5496K7236J1628l3314
$$ -48094 -48804 -14113 24613 57236 42633 -21398 -55476 -30052 5444 32680 44308 10994
807A0994m8759K008L3667J7844Q781p495l8467j9215L3778L1996p82j2711k7495
$$ 10994 -37765 -35757 -2090 15754 24535 17040 -21427 -40642 -6864 25132 24350 11639 -15856
820a5856l1450J9226N3978J6923k0700k6211l1883q820M2360L9742p253j8953
$$ -15856 -47306 -28080 25898 42821 22121 -4090 -35973 -44793 -2433 37309 30056 11103
832A1103j3110k0948j203K8659J1862p159O874k609k5355n878J6945N011M566
$$ 11103 -2007 -22955 -24158 4501 16363 9204 16078 13469 -11886 -17764 -819 4192 8758
845H758J1360j4883k5032R478J9173q89J244j133k3845q462K5918J6088l344P03
$$ 8758 20118 5235 -19797 -10319 8854 7965 9209 8076 -15769 -24231 1687 17775 14431 15134
859A5134j6267l3360J909L5862K3864R115p304m5805m1818K1078N3187L0705K462
$$ 15134 -1133 -34493 -32584 3278 27142 36257 28953 -16852 -58670 -37592 15595 46300 48762
872D8762l3615n9576j4270N0881M6213M088k0274m0042l0536K6508N0151Q184
$$ 48762 15147 -44429 -58699 -7818 38395 42483 22209 -17833 -48369 -21861 28290 36474
884C6474k3389k2410k3020K398M2313K6484j9639k5352j6014j2863J8423M1954
$$ 36474 13085 -9325 -32345 -29947 12366 38850 19211 -6141 -22155 -35018 -16595 25359
896B5359Q334k3716j6095j5825j1320K3653L1238l006j2113j782j5067j2345J5593
$$ 25359 33693 9977 -6118 -21943 -33263 -9610 21628 18622 6509 4727 -10340 -22685 -7092
909g092J0881m966J0686J0537j8885j5694L376k077N894K7328N623k7148j5786
$$ -7092 3789 -1177 9509 20046 1161 -14533 -11157 -13234 -7340 19988 25611 -1537 -17323
922a7323J132J688J9687K4075j5962l3507k957J3682J4316K1613l309m1970k1824
$$ -17323 -16191 -14503 5184 29259 13297 -20210 -23167 -9485 4831 26444 23135 -18835 -40659
935d0659K4584K9593J6463J796l4483m2773Q739M2683K2323L539j3955l8249j9379
$$ -40659 -16075 13518 29981 31777 -2706 -45479 -36740 5943 28266 31805 17850 -20399 -39778
948c9778K7052K8034K994M72j0342k7290l100K2355Q221j144O364j1182j9485
$$ -39778 -12726 15308 18302 18774 8432 -18858 -21958 397 8618 7474 13838 2656 -16829
961a6829Q831J7894m721n278J219j0778K199K4164J912k5715r064O660N686J8336
$$ -16829 -7998 9896 5175 -103 1116 -9662 -7463 16701 18613 -7102 -16166 -9506 -3820 14516
975A4516J2165k5610k5133J2245J8533N146L720j1482k4631O830K9795K511j5486
$$ 14516 26681 1071 -24062 -11817 6716 11862 15582 4100 -20531 -13701 16094 18605 3119
988C119o202q761j424K4340J3345k0435j4038L831k114L877J7821j025j5511K706
$$ 3119 -3083 -11844 -13268 11072 24417 3982 -10056 -6225 -8339 -4462 13359 12334 -3177 -471
1002d71J701j4042K093J6289K42k043O975r990j6901Q078J1281n580N079J0566
$$ -471 1230 -12812 -10719 5570 5812 3769 10744 754 -16147 -8069 3212 -2368 2711 13277
1016A3277r821r587N403o256p063J9540J5617j2628j1790n198r021J1475K7871
$$ 13277 3456 -6131 -728 -6984 -14047 5493 21110 8482 -3308 -8506 -17527 -6052 21819
1029B1819k348k7823r692O055J0064K1395O283l4352k6747J4113K5156J7205R135
$$ 21819 19471 -8352 -18044 -11989 -1925 19470 25753 -8599 -35346 -21233 3923 21128 30263
1042C0263k2117m0864m425K9894J8758R078J694k4100k4631Q435J5097K942J2274
$$ 30263 8146 -32718 -37143 -7249 11509 20587 22281 -1819 -26450 -18015 -2918 24 12298
1055A2298P992j8866j6325N893K563M352J8986M4k4350n999J1899L648M729O447
$$ 12298 20290 1424 -14901 -9008 -6445 -2093 16893 16937 -7413 -13412 -1513 2135 6864 13311
1069A3311j7271j5171J5245J5905m761j769l311j6423N01J7834L78p301J0139
$$ 13311 -3960 -19131 -3886 12019 7258 5489 2178 -14245 -13744 4090 4468 -2833 7306
1082G306K096j4473m391J317n556J2698K5633o265k5750r070O24P390K6169J1652
$$ 7306 9402 -5071 -9462 -8145 -13701 -1003 24630 18365 -7385 -16455 -15831 -8441 17728 29380
1096B9380k5719k1523O186Q732J0446J4657r287k5553k10J4923J633M569P737
$$ 29380 3661 -17862 -11676 -2944 7502 22159 12872 -12681 -12891 2032 3665 8234 15971
1109A5971j3635j4340O766L719l012J4306R942j7206j4882O18l67J0232K2523
$$ 15971 2336 -12004 -5238 -1519 -4531 9775 19717 2511 -12371 -11753 -12120 -1888 20635
1122B0635k399k7575q040Q959N887J2571O636k0539j5959J5376J4583k531M1o893
$$ 20635 18236 -9339 -17379 -8420 -2533 10038 16674 -3865 -19824 -4448 10135 7604 7645 752
1136G52j5493O495J9978k663r787N890j069r229M003J007q669J0625J9592q938
$$ 752 -14741 -8246 11732 9069 -718 5172 4103 -5126 -1123 -116 -8785 1840 21432 12494
1150A2494k1779n182m81P859K5181O784k7261j7232O752N342Q481J2294q018j7020
$$ 12494 -9285 -14467 -14948 -7089 18092 24876 -2385 -19617 -12865 -7523 958 13252 5234 -11786
1164a1786N704P644q776J462J0803l926l778N481p744q720J6807J3339j2375j1342
$$ -11786 -6082 1562 -7214 -5752 5051 1125 -2653 2828 -4916 -13636 3171 16510 4135 -7207
1178g207j268k093J2138K1614q051k6579l989J0399O983J1900K317k1652j1667
$$ -7207 -8475 -10568 1570 23184 15133 -11446 -15435 -5036 1947 13847 16164 -5488 -17155
1191a7155J5182P478m515L440k513j1270N033R709r045m495J2526N33r581R37
$$ -17155 -1973 5505 990 4430 1917 -9353 -4320 5389 -3656 -8151 4375 4908 -4673 -3736
1205c736j213o639J3277J5541j1470j5295J060L79L986J8335K099j9137m821P671
$$ -3736 -4949 -11588 1689 17230 5760 -9535 -8475 -8096 -4110 14225 16324 -2813 -7634 37
1219C7k370K287J0200n616q205J0241K941j3497j633P177k759M427J0666r908
$$ 37 -2333 -46 10154 4538 -3667 6574 9515 -3982 -5615 1562 -1197 3230 13896 3988
1233C988j4735O932O370n163L890L965j0479R35J2913n972j3936M176O118O86
$$ 3988 -10747 -3815 2555 -2608 1282 5247 -5232 -4297 8616 2644 -11292 -7116 -998 -312
1247c12R440J817j9022o272J4807N100l266L321m916q882J1241J0360j2609r234
$$ -312 9128 10945 -8077 -14349 458 5558 2292 5613 697 -8185 3056 13416 807 -8427
1261h427P519K464J939R147o079j6200M307J1012n794k946Q195k367k190O033
$$ -8427 -908 1556 3495 12642 6563 -9637 -5330 5682 -112 -3058 5137 2770 580 6613
1275F613r278j6863J0171K0746R86p513r189j6160K237K7507J0582j7597j2394
$$ 6613 -2665 -19528 -9357 11389 12375 4862 -4327 -20487 -18250 9257 19839 2242 -10152
1288a0152k167P59J5019J4213j3781j6978O470O700o74O927J423j1271p7Q157
$$ -10152 -12319 -11560 3459 17672 3891 -13087 -6617 83 -591 6336 7759 -3512 -3589 4568
1302D568p498n641J4471N725p966l570n915r627J1510K1228m308j6680m319l654
$$ 4568 -2930 -8571 5900 11625 3659 89 -5826 -15453 -3943 17285 12977 -3703 -8022 -11676
1316a1676J691J7055O760j5733o764O615k973j190R984j968p320P355L021j2638
$$ -11676 -9985 7070 13830 -1903 -8667 -2052 -5025 -6215 3769 1801 -5519 1836 4857 -7781
1330g781k5J1054j431j569N419o545q799J1729R743q836m780P51n705N066J7740
$$ -7781 -7806 3248 1817 248 5667 -878 -9677 2052 11795 2959 -1821 -1070 -6775 -1709 16031
1345A6031k237j7339l556Q32n42J2806J2782j2582j4030K407o48k36J2974L919
$$ 16031 13794 -3545 -7101 -6269 -6811 5995 18777 6195 -7835 -5428 -6076 -6312 6662 10581
1359A0581j1846j721N361p720l176J0063O02l504P286n33j3281J629J0093l543
$$ 10581 -1265 -2986 2375 -5345 -8521 1542 2144 -1360 5926 5393 -7888 -6259 3834 291
1373B91k437P188l214l949R933j74j5373j163J1277K832L433L981j3327j2924
$$ 291 -2146 5042 1828 -2121 7812 7638 -7735 -8898 2379 5211 8644 12625 -702 -13626
$$ [...]
8191b29
##END NTUPLES=NMR FID
##END=
