##TITLE=1H_CA-8687-2
 CDCl3, 8 sc, 
 5.2.2020
##JCAMPDX= 6.0         $$ Bruker NMR JCAMP-DX V2.0
##DATA TYPE= NMR FID
##DATA CLASS= NTUPLES
##ORIGIN= UXNMR, Bruker Analytische Messtechnik GmbH
##OWNER= root
$$ XWIN-NMR		Version 3.5
$$ Wed Feb  5 13:55:35 2020 Russian Standard Time (UT+4h)  she@DPX200
##.OBSERVE FREQUENCY= 200.1315
##.OBSERVE NUCLEUS= ^1H
##.DELAY= (6, 6)
##.ACQUISITION MODE= SIMULTANEOUS
##.ACQUISITION SCHEME= undefined
##.AVERAGES= 8
##.DIGITISER RES= 18
##SPECTROMETER/DATA SYSTEM= spect
##.PULSE SEQUENCE= zg30
##.SOLVENT NAME= D2O
##.SHIFT REFERENCE= (INTERNAL, D2O, 0, 15.7039)
##AUDIT TRAIL= $$ (NUMBER, WHEN, WHO, WHERE, WHAT)
$$ ##TITLE= Audit trail, XWIN-NMR		Version 3.5
$$ ##JCAMPDX= 5.01
$$ ##ORIGIN= Bruker BioSpin GmbH
$$ ##OWNER= she
$$ F:/spectra/data/she/nmr/H-F/1/audita.txt
$$ ##AUDIT TRAIL=  $$ (NUMBER, WHEN, WHO, WHERE, WHAT)
(   1,<2020-02-05 13:54:23.78 +0400>,<she>,<DPX200>,
      <created by zg, POWCHK disabled, PULCHK disabled
       configuration hash MD5:
       00 E9 B6 7A A2 85 ED C7 34 08 36 98 17 FE 4E 26
       data hash MD5: 16K
       45 B7 31 8A A1 DA D0 A3 98 F6 52 B7 43 A8 AA A9>)
$$ ##END=
$$ 
$$ hash MD5
$$ 54 C3 F1 28 CE EE 46 91 7C 69 CE 06 18 C2 54 1E
##$RELAX= 
##$RELAX= 
##$RELAX= 
##$RELAX= 
##$RELAX= 
##$RELAX= 
$$ Bruker specific parameters
$$ --------------------------
##$DU= <F:/spectra>
##$EXPNO= 1
##$NAME= <H-F>
##$PROCNO= 1
##$TYPE= <nmr>
##$USER= <she>
##$AMP= (0..31)
100 100 100 100 100 100 100 100 100 100 100 100 100 100 100 100 100 100 
100 100 100 100 100 100 100 100 100 100 100 100 100 100 
##$AQSEQ= 0
##$AQ_mod= 1
##$AUNM= <au_zg>
##$AUTOPOS= <>
##$BF1= 200.13
##$BF2= 200.13
##$BF3= 200.13
##$BF4= 200.13
##$BF5= 200.13
##$BF6= 200.13
##$BF7= 200.13
##$BF8= 200.13
##$BYTORDA= 1
##$CFDGTYP= 0
##$CFRGTYP= 5
##$CHEMSTR= <none>
##$CNST= (0..31)
1 1 145 1 1 1 1 1 1 1 1 1 1 1 1 1 1 1 1 1 1 1 1 1 1 1 1 1 1 1 1 1 
##$CPDPRG= <>
##$CPDPRG1= <>
##$CPDPRG2= <>
##$CPDPRG3= <>
##$CPDPRG4= <mlev>
##$CPDPRG5= <mlev>
##$CPDPRG6= <mlev>
##$CPDPRG7= <mlev>
##$CPDPRG8= <mlev>
##$CPDPRGB= <>
##$CPDPRGT= <>
##$D= (0..31)
0 1.2 0 0 0 0 0 0 0 0.06 0 0.03 0 0 0 0 0.0002 0 0 0 0 0 0 0 0 0 0 0 0 
0 0 0 
##$DATE= 1580896463
##$DBL= (0..7)
120 120 120 120 120 120 120 120 
##$DBP= (0..7)
150 150 150 150 150 150 150 150 
##$DBP07= 0
##$DBPNAM0= <>
##$DBPNAM1= <>
##$DBPNAM2= <>
##$DBPNAM3= <>
##$DBPNAM4= <>
##$DBPNAM5= <>
##$DBPNAM6= <>
##$DBPNAM7= <>
##$DBPOAL= (0..7)
0.5 0.5 0.5 0.5 0.5 0.5 0.5 0.5 
##$DBPOFFS= (0..7)
0 0 0 0 0 0 0 0 
##$DE= 6
##$DECBNUC= <off>
##$DECIM= 24
##$DECNUC= <off>
##$DECSTAT= 4
##$DIGMOD= 1
##$DIGTYP= 9
##$DL= (0..7)
0 120 120 120 120 120 120 120 
##$DP= (0..7)
150 150 150 150 150 150 150 150 
##$DP07= 0
##$DPNAME0= <>
##$DPNAME1= <>
##$DPNAME2= <>
##$DPNAME3= <>
##$DPNAME4= <>
##$DPNAME5= <>
##$DPNAME6= <>
##$DPNAME7= <>
##$DPOAL= (0..7)
0.5 0.5 0.5 0.5 0.5 0.5 0.5 0.5 
##$DPOFFS= (0..7)
0 0 0 0 0 0 0 0 
##$DQDMODE= 0
##$DR= 18
##$DS= 0
##$DSLIST= <SSSSSSSSSSSSSSS>
##$DSPFIRM= 0
$$ [...]
##$SUBNAM2= <"">
##$SUBNAM3= <"">
##$SUBNAM4= <"">
##$SUBNAM5= <"">
##$SUBNAM6= <"">
##$SUBNAM7= <"">
##$SUBNAM8= <"">
##$SUBNAM9= <"">
##$SW= 24.9337058887773
##$SWIBOX= (0..15)
0 0 2 0 0 0 0 0 0 0 0 0 0 0 0 0 
##$SW_h= 4990.01996007984
##$TD= 16384
##$TD0= 1
##$TE= 0
##$TE2= 300
##$TE3= 300
##$TEG= 300
##$TL= (0..7)
0 120 120 120 120 120 120 120 
##$TP= (0..7)
150 150 150 150 150 150 150 150 
##$TP07= 0
##$TPNAME0= <>
##$TPNAME1= <>
##$TPNAME2= <>
##$TPNAME3= <>
##$TPNAME4= <>
##$TPNAME5= <>
##$TPNAME6= <>
##$TPNAME7= <>
##$TPOAL= (0..7)
0.5 0.5 0.5 0.5 0.5 0.5 0.5 0.5 
##$TPOFFS= (0..7)
0 0 0 0 0 0 0 0 
##$TUNHIN= 0
##$TUNHOUT= 0
##$TUNXOUT= 0
##$USERA1= <user>
##$USERA2= <user>
##$USERA3= <user>
##$USERA4= <user>
##$USERA5= <user>
##$V9= 5
##$VALIST= <valist>
##$VCLIST= <CCCCCCCCCCCCCCC>
##$VD= 0
##$VDLIST= <DDDDDDDDDDDDDDD>
##$VPLIST= <PPPPPPPPPPPPPPP>
##$VTLIST= <TTTTTTTTTTTTTTT>
##$WBST= 1024
##$WBSW= 4
##$XGAIN= (0..3)
0 0 0 0 
##$XL= 0
##$YL= 0
##$YMAX_a= 366454
##$YMIN_a= -166614
##$ZGOPTNS= <>
##$ZL1= 120
##$ZL2= 120
##$ZL3= 120
##$ZL4= 120
##$ABSF1= 10
##$ABSF2= 0
##$ABSG= 5
##$ABSL= 3
##$ALPHA= 0
##$AQORDER= 0
##$ASSFAC= 0
##$ASSFACI= 0
##$ASSFACX= 0
##$ASSWID= 0
##$AUNMP= <proc_1d>
##$AZFE= 0.1
##$AZFW= 0.1
##$BCFW= 1
##$BC_mod= 2
##$BYTORDP= 1
##$COROFFS= 0
##$CY= 11.3945322036743
##$DATMOD= 1
##$DC= 2
##$DFILT= <>
##$DTYPP= 0
##$F1P= 16.9975609425685
##$F2P= -3.02152046262296
##$FCOR= 0.5
##$FTSIZE= 0
##$FT_mod= 4
##$GAMMA= 1
##$GB= 0.15
##$INTBC= 1
##$INTSCL= 1
##$ISEN= 128
##$LB= 0.24
##$LEV0= 0
##$LPBIN= 0
##$MAXI= 10000
##$MC2= 0
##$MEAN= 0
##$ME_mod= 0
##$MI= 1.114404
##$NCOEF= 0
##$NC_proc= 0
##$NLEV= 6
##$NOISF1= 3.799351
##$NOISF2= 2.8
##$NSP= 1
##$NTH_PI= 0
##$NZP= 0
##$OFFSET= 15.70392
##$PC= 1
##$PHC0= -9785.819
##$PHC1= 14.00081
##$PH_mod= 1
##$PKNL= yes
##$PPARMOD= 0
##$PSCAL= 0
##$PSIGN= 0
##$REVERSE= no
##$SF= 200.130013532006
##$SI= 16384
##$SIGF1= 3
##$SIGF2= 2
##$SINO= 400
##$SIOLD= 16384
##$SREGLST= <1H.CDCl3>
##$SSB= 0
##$STSI= 0
##$STSR= 0
##$SW_p= 3612.71676300578
##$SYMM= 0
##$S_DEV= 0
##$TDeff= 0
##$TDoff= 0
##$TI= <>
##$TILT= no
##$TM1= 0
##$TM2= 0
##$TOPLEV= 0
##$USERP1= <user>
##$USERP2= <user>
##$USERP3= <user>
##$USERP4= <user>
##$USERP5= <user>
##$WDW= 1
##$XDIM= 8192
##$YMAX_p= 0
##$YMIN_p= 0
$$ End of Bruker specific parameters
$$ ---------------------------------
##NTUPLES= NMR FID
##VAR_NAME=  TIME,          FID/REAL,        FID/IMAG
##SYMBOL=    X,             R,               I
##VAR_TYPE=  INDEPENDENT,   DEPENDENT,       DEPENDENT
##VAR_FORM=  AFFN,          ASDF,            ASDF
##VAR_DIM=   8192,          8192,            8192
##UNITS=     SECONDS,       ARBITRARY UNITS, ARBITRARY UNITS
##FACTOR=    0.0002004,     1,               1
##FIRST=     0,             0,               0
##LAST=      1.6414764,     0,               0
##MIN=       0,             -166614,         0
##MAX=       1.6414764,     366454,          0
$$ Real data points
##PAGE= N=1
##DATA TABLE= (X++(R..R)), XYDATA
$$ [...]
$$ plain form
2401 1975 2215 -545 373 2118 512 436 2301 977 -386 1965 2049 -36 818 2118 264 -199 2361
2418 2361 1525 -171 1529 1417 -308 1301 2701 431 -589 1929 1398 320 1379 1398 -712 899
2434 899 2879 153 -830 932 811 -162 1598 1207 -959 306 1544 -178 -872 1201 347 -1102 931
2451 931 999 -1333 -505 547 -1056 -1207 1261 409 -2079 -766 156 -1154 -161 750 -1790 -2008 442
2468 442 340 -1741 -846 -316 -1464 -150 954 -1749 -2559 -111 -214 -1097 -513 -63 -2398 -1181 587
2485 587 -1199 -2115 -316 -389 -2299 97 526 -2203 -1999 77 -494 -685 810 -441 -3008 -650 1558
2502 1558 -534 -863 -260 -1124 -728 1830 649 -2371 -883 1433 143 242 759 -1391 -1535 1384 1757
2519 1757 -749 77 676 -418 386 2394 266 -1350 638 1543 300 1214 1321 -986 -230 2642 2208
$$ packed form
2401A975K40k760R18J745j606p6J865j324j363K351Q4k085Q54J300j854m63K560
2418B361q36j696J700j12j725J609J400k270j020K518n31j078J059J9k110J611
2434H99J980k726r83J762j21r73J760l91k166J265J238j722o94K073q54j449K033
2451I31O8k332Q28J052j603j51K468q52k488J313R22j310R93R11k540k18K450
2468D42j02k081Q95N30j148J314J104k703q10K448j03q83N84M50k335J217J768
2485E87j786r16J799p3j910K396M29k729K04K076n71j91J495j251k567K358K208
2502A558k092l29O03q64L96K558j181l020J488K316j290R9N17k150j44K919L73
2519A757k506Q26N99j094Q04K008k128j616J988R05j243R14J07k307P56K872m34
$$ plain form
2536 2208 89 866 252 -753 1815 3119 -127 -878 1478 1559 1079 1962 819 -1304 743 3055 1091
2553 1091 -148 822 170 -287 2388 1986 -430 -312 1439 427 540 1717 164 -1220 1180 1969 239
2570 239 -21 566 -965 -393 2175 1258 -1224 -432 150 -671 857 1544 -1626 -2044 645 814 -542 -136
2588 -136 -639 -1631 -31 1926 -685 -2380 -425 -681 -1495 504 235 -2097 -1776 -18 -299 -765 325
2605 325 -1565 -2932 -122 1520 -771 -1741 -926 -1642 -861 1655 -70 -2641 -1651 155 -584 126 413
2622 413 -2063 -2109 836 1267 -1197 -719 -736 -1534 454 1984 -682 -2295 134 113 -65 964 535 -1685
2640 -1685 -1117 1711 940 47 495 -561 -1425 1921 2678 -284 -1394 655 685 923 2350 479 -1687
2657 -1687 309 2405 1139 262 859 -178 -42 2569 2123 -608 -222 1076 412 1773 2514 45 -1476
$$ packed form
2536B208k119P77o14j005K568J304l246p51K356Q1m80Q83j143k123K047K312j964
2553A091j239R70o52m57K675m02k416J18J751j012J13J177j553j384K400P89j730
2570B39k60N87j531N72K568r17k482P92N82q21J528O87l170m18K689J69j356M06
2588a36n03r92J600J957k611j695J955k56q14J999k69k332L21J758k81m66J090
2605C25j890j367K810J642k291r70Q15p16P81K516j725k571R90J806p39P10K87
2622D13k476m6K945M31k464M78j7p98J988J530k666j613K429k1j78J029m29k220
2640a685N68K828p71q93M48j056q64L346P57k962j110K049L0K38J427j871k166
2657a687J996K096j266q77N97j037J36K611m46k731L86J298o64J361P41k469j521
$$ plain form
2674 -1476 1052 2123 707 1158 1094 -895 209 2723 1847 -569 2 483 59 1766 2033 -1047 -1295
2691 -1295 1303 1360 654 832 -353 -1812 594 2275 83 -1122 312 -191 -548 1299 696 -1741 -1003
2708 -1003 750 -176 -285 567 -1241 -2272 172 1066 -710 -891 -555 -1893 -681 1282 -81 -2373
2724 -2373 -1205 -221 -1187 -10 250 -2148 -2401 -64 440 -1107 -771 -1024 -2408 -480 1433 -1032 -2157
2741 -2157 -608 -466 -1015 461 -40 -1973 -1626 637 -162 -736 -22 -1142 -2023 499 1593 -963 -1432
2758 -1432 -574 -904 184 2080 196 -2381 -213 1500 641 630 355 -1256 -570 1938 1655 -699 -128
2775 -128 219 -168 1244 2333 131 -1476 943 1707 631 1440 817 -1082 -38 2669 1827 245 403
2792 403 197 -280 2121 2354 -634 -671 1323 1537 1042 2073 304 -1428 730 2596 544 114 522
$$ packed form
2674a476K528J071j416M51o4j989J104K514q76k416N71M81m24J707K67l080k48
2691a295K598N7p06J78j185j459K406J681k192j205J434n03l57J847o03k437P38
2708a003J753r26j09Q52j808j031K444Q94j776j81L36j338J212J963j363k292
2724b373J168R84r66J177K60k398k53K337N04j547L36k53j384J928J913k465j125
2741b157J549J42n49J476n01j933L47K263p99n74P14j120q81K522J094k556m69
2758a432Q58l30J088J896j884k577K168J713q59j1k75j611O86K508k83k354N71
2775a28L47l87J412J089k202j607K419P64j076Q09o23j899J044K707q42j582J58
2792D03k06m77K401K33k988l7J994K14m95J031j769j732K158J866k052m30M08
$$ plain form
2809 522 -293 41 2394 1363 -1052 -395 1040 327 777 1507 -266 -1284 654 1408 207 305 -5 -1249
2827 -1249 -137 1846 527 -1515 -620 270 -483 824 681 -1773 -1828 383 675 -786 -332 -899 -2068
2844 -2068 -78 1326 -555 -1917 -633 -885 -1083 606 20 -2416 -1613 175 -727 -947 -57 -1459 -2142
2861 -2142 27 628 -1204 -1533 -989 -1993 -906 865 -385 -2319 -972 252 -564 -33 337 -2305
2877 -2305 -1441 822 327 -1390 -839 -698 -1122 386 1529 -689 -1653 226 314 -248 723 375 -1764 -561
2895 -561 1677 622 -135 511 -317 -932 1431 1835 -853 -889 905 375 700 1846 86 -1362 641
2912 641 1862 961 181 680 -423 54 2596 1545 -902 172 1326 533 1415 1643 -286 -921 1314
2929 1314 1680 459 803 601 -595 508 2470 737 -778 -146 592 271 1369 954 -1176 -706 1268
$$ packed form
2809E22q15L34K353j031k415O57J435p13M50P30j773j018J938P54j201R8l10j244
2827a249J112J983j319k042Q95Q90p53J307j43k454n5K211K92j461M54n67j169
2844b068J990J404j881j362J284k52j98J689n86k436Q03J788r02k20Q90j402o83
2861b142K169O01j832l29N44j004J087J771j250j934J347J224q16N31L70k642
2877b305Q64K263m95j717N51J41m24J508J143k218r64J879Q8n62R71l48k139J203
2895e61K238j055p57O46q28o15K363M04k688l6J794n30L25J146j760j448K003
2912F41J221r01p80M99j103M77K542j051k447J074J154p93Q82K28j929o35K235
2929A314L66j221L44k02j196J103J962j733j515O32P38l21J098m15k130M70J974
$$ plain form
2946 1268 934 -111 247 -180 -852 629 1454 -404 -1143 48 -449 -333 1143 8 -2068 -309 1013
2963 1013 -435 -840 54 -1377 -1335 378 383 -1211 -1080 -406 -1353 -335 791 -760 -2385 -347 160 -1013
2981 -1013 -660 -602 -2167 -1426 738 -228 -1612 -852 -763 -1475 41 367 -1611 -1631 -92 -279 -775 56 -613
3000 -613 -2353 -458 947 -420 -1278 -609 -606 -851 884 370 -1504 -1147 504 114 -40 879 -351 -1518
3018 -1518 599 1052 -505 -322 198 -685 194 1977 588 -1096 52 962 397 1106 1261 -695 -492
3035 -492 1333 1380 -91 706 614 -181 962 2235 661 -533 519 849 572 1729 1096 -967 -35 1831
3053 1831 1350 -20 637 190 -154 1736 1840 -215 -494 1142 574 715 1617 243 -1313 362 1677
3070 1677 320 -22 125 -417 -232 1616 469 -954 -557 259 -187 456 956 -829 -1477 559 944 -420
$$ packed form
2946A268l34j045L58m27o72J481Q25j858p39J191m97J16J476j135k076J759J322
2963A013j448m05Q94j431M2J713Nj594J31O74r47J018J126j551j625K038N07j173
2981a013L53N8j565P41K164r66j384P60Q9p12J516L26j978k0J539j87m96Q31o69
3000f13j740J895J405j367q58O69Lk45J735n14j874L57J651l90j54R19j230j167
3018a518K117M53j557J83N20q83Q79J783j389j684J148R10n65P09J55j956K03
3035d92J825M7j471P97r2p95J143J273j574j194J052L30k77J157o33k063R32J866
3053A831m81j370O57m47l44J890J04k055k79J636n68J41R02j374j556J675J315
3070A677j357l42J47n42J85J848j147j423L97Q16m46O43N00j785o48K036L85j364
$$ plain form
3088 -420 -121 -538 -1640 -384 1630 -192 -1514 -809 -330 -511 868 130 -2022 -972 584 196 -1088
3105 -1088 -394 -1082 -1688 -143 792 -1114 -1410 -525 -897 -732 561 -278 -2222 -1188 497 -455 -541 -90
3123 -90 -1313 -1575 721 510 -1123 -802 -111 -875 33 1305 -437 -1884 -494 659 -410 -15 36 -1342
3141 -1342 -536 1331 474 -1016 -240 27 -518 728 1098 -651 -968 458 261 307 888 282 -898 -245
3159 -245 1667 786 -83 316 -390 -294 1796 1538 -1003 -547 843 475 679 1333 -125 -986 837 1518
3177 1518 520 311 343 -747 440 1946 1287 -835 246 537 291 1315 1235 -462 -1064 1184 1159 184
3195 184 566 187 -950 307 1682 134 -837 48 125 264 1246 276 -1637 -865 1143 665 -34 47 -910
3214 -910 -1263 857 1230 -288 -911 -7 -767 -148 1335 -92 -1616 -711 640 -76 -400 -72 -1568 -1004
$$ packed form
3088d20K99m17j102J256K014j822j322P05M79j81J379p38k152J050J556l88j284
3105a088O94o88o06J545R35j906k96Q85l72J65J293q39j944J034J685r52q6M51
3123i0j223k62K296k11j633L21O91p64R08J272j742j447J390J153j069L95N1j378
3141a342Q06J867q57j490P76K67n45J246L70j749l17J426j97M6N81o06j180O53
3159b45J912q81q69L99p06R6K090k58k541M56J390l68K04O54j458q61J823O81
3177A518r98k09L2j090J187J506o59k122J081K91k46J024q0j697o02K248k5r75
3195A84L82l79j137J257J375j548r71Q85P7J39R82r70j913P72K008m78o99Q1r57
3214i10l53K120L73j518o23R04p60O19J483j427j524R05J351p16l24L28j496N64
$$ plain form
3232 -1004 919 441 -1062 -875 -334 -866 41 856 -746 -1872 -343 316 -516 -47 -202 -1877 -947 963
3250 963 282 -1214 -889 -991 -851 595 552 -1204 -1377 169 -153 -72 568 -399 -1529 -208 778 -354
3268 -354 -258 -152 -862 -680 1126 670 -1168 -531 201 -217 451 995 -485 -864 590 989 25 -51 348
3287 348 -912 -61 1781 475 -707 137 481 230 1025 992 -459 -386 1255 713 360 848 152 -746 738
3306 738 2041 536 -632 237 19 520 1644 998 -803 -130 1075 815 409 779 -348 -652 1165
3323 1165 1508 -219 -199 94 47 233 1253 299 -1410 -413 658 395 646 177 -1187 -1000 1120 522
3341 522 -452 -232 -627 -967 568 996 -513 -1211 -87 54 -252 355 -511 -1502 -717 616 191 -703 -522
3360 -522 -942 -1149 152 493 -1391 -1404 -195 -458 -231 174 -720 -1913 -635 569 -603 -480 -573 -1481
$$ packed form
3232a004J923m78j503J87N41n32R07Q15j602j126J529O59q32M69j55j675R30J910
3250I63o81j496L25j02J40J446m3j756j73J546l22Q1O40r67j130J321R86j132
3268c54R6J06p10J82J806m56j838O37P32m18O68N44j480l79J454L99r64p6L99
3287C48j260Q51J842j306j182Q44L44k51P95l3j451P3J641n42l53M88o96q98J484
3306G38J303j505j168Q69k18N01J124o46j801O73J205k60m06L70j127l04J817
3323A165L43j727K0K93m7J86J020r54j709R97J071k63K51m69j364J87K120n98
3341E22r74K20l95l40J535M28j509o98J124J41l06O07q66r91P85J333m25q94J81
3360e22m20k07J301L41j884j3J209k63K27M05q94j193J278J204j172J23r3r08
$$ plain form
3378 -1481 -873 818 248 -1381 -696 -73 -645 12 328 -955 -1381 81 422 -485 33 -195 -1107 -373
3396 -373 1148 133 -1094 -262 -93 -434 582 721 -497 -530 832 400 190 614 -357 -788 673 1416
3414 1416 83 -248 233 -173 46 1046 1029 -565 -120 617 434 567 893 -12 -654 1347 1558 291
3432 291 148 584 -375 759 1349 544 -262 395 710 37 580 899 -374 -474 1275 841 -92 269 4
3451 4 -461 721 1185 314 -991 230 256 -105 623 70 -1071 -279 693 366 -80 40 -309 -330 758 653
3471 653 -981 -948 -203 -62 74 430 -437 -1390 -300 307 -560 -320 -29 -1224 -687 598 33 -1237 -782
3490 -782 -499 -439 39 203 -983 -1298 -41 -125 -727 -130 -256 -1109 -341 597 -597 -1023 -412 -150 -524 399
3510 399 110 -1204 -861 450 118 -221 186 -1 -699 256 430 -443 -597 465 -116 -326 528 -25 -663
$$ packed form
3378a481O08J691n70j629O85O23n72O57L16j283m26J462L41r07N18k28r12P34
3396c73J521j015j227Q32J69l41J016J39j218l3J362m32k10M24r71m31J461P43
3414A416j333l31M81m06K19J000j7j594M45P37j83J33L26r05o42K001K11j267
3432B91j43M36r59J134N90q05q06O57L15o73N43L19j273j00J749m34r33L61k65
3451Dm65J182M64q71j305J221K6l61P28n53j141P92R72l27m46J20l49k1J088j05
3471F53j634L3P45J41J36L56q67r53J090O07q67K40K91j195N37J285n65j270M55
3490g82K83O0M78J64j186l15J257q4o02N97j26q53P68R38j194m26O11K62l74R23
3510C99k89j314L43J311l32l39M07j87o98R55J74q73j54J062n81k10Q54n53o38
$$ plain form
3529 -663 170 1009 95 -195 610 -406 -619 909 613 -190 213 459 38 444 500 243 -601 743 641
3548 641 -58 552 816 -600 4 1343 515 -179 438 405 62 777 1142 -442 -109 1020 582 129 931
3567 931 341 -478 482 1296 199 157 807 -127 133 840 340 -613 114 693 -77 298 559 -373 -496 512
3587 512 346 -467 -106 454 -696 -356 348 129 -911 -217 210 -580 -171 358 -1059 -311 502 223 -706
3606 -706 -321 -391 -875 -14 390 -729 -875 187 -448 -626 -15 -275 -808 -260 288 -946 -587 120 -535
3625 -535 -732 501 292 -1224 -597 -2 -282 -246 345 -509 -853 261 358 -632 -135 -30 -497 -49 628 -45
3645 -45 -654 -102 367 -222 358 539 -264 -214 884 752 -295 -60 268 25 138 1020 -240 -401 423 530
3665 530 -107 321 409 -555 87 881 528 16 572 78 -285 947 808 -292 -301 928 528 -60 893 156
$$ packed form
3529f63Q33Q39r14k90Q05j016k13J528k96q03M03K46m21M06N6k57q44J344j02
3548F41o99O10K64j416O04J339q28o94O17l3l43P15L65j584L33J129m38m53Q02
3567I31n90q19R60Q14j097m2O50r34K60P07n00r53P27N79p70L75K61r32j23J008
3587E12j66q13L61N60j150L40P04k19j040O94M27p90M09N29j417P48Q13k79r29
3606g06L85p0m84Q61M04j119j46J062o35j78O11k60n33N48N48j234L59P07o55
3625e35j97J233k09j516O27N95k80L6N91q54l44J114R7r90M97J05m67M48O77o73
3645d5o09N52M69n89N80J81q03N0J098j32j047K35L28k43J13Q82j260j61Q24J07
3665E30o37M28Q8r64O42P94l53n12N56m94l63J232j39j100rJ229m00n88R53p37
$$ plain form
3685 156 -483 714 1169 -51 272 578 -135 -271 643 657 -417 -72 470 102 176 741 -318 -637 687
3704 687 618 -564 123 387 -635 61 618 -135 -591 -145 129 -240 313 662 -690 -715 419 -172 -449
3723 -449 147 -351 -919 130 290 -603 -365 -97 -428 -485 421 -427 -917 -103 273 -431 -345 -48 -928 -930 16
3744 16 -2 -708 -374 -267 -852 -648 562 -345 -964 -227 257 -486 -54 -204 -711 -604 411 162 -505 -223
3764 -223 -52 -667 201 706 -705 -834 179 -7 -430 287 -107 -845 29 588 -12 -47 187 -371 -151 524
3784 524 554 -461 -172 675 284 153 599 -13 -391 289 714 4 -40 401 -252 144 905 433 -628 242
3804 242 568 64 662 684 -373 -466 762 886 286 340 503 -293 244 992 138 -216 291 149 -127 821
3824 821 502 -536 -82 991 191 392 227 92 -348 671 843 -69 -273 418 -83 -81 517 194 -539 -99
$$ packed form
3685A56o39J197M55j220L23L06p13j36R14J4j074L45N42l68P4N65j059l19J324
3704F87o9j182O87K64j022O96N57p53m56M46K74l69N53L49j352k5J134n91k77
3723d49N96m98n68J049J60q93K38K68l31n7R06q48m90Q14L76p04Q6K97q80kR46
3744A6j8p06L34J07n85K04J210r07o19P37M84p43M32j50n07J07J015k49o67K82
3764b23J71o15Q68N05j411j29J013j86m23P17l94p38Q74N59o00l5K34n58K20O75
3784E24L0j015K89Q47l91j31M46o12l78O80M25p10m4M41o53L96P61m72j061Q70
3804B42L26n04N98K2j057r3J228J24o00N4J63p96N37P48q54l54N07j42k76R48
3824H21l19j038M54J073q00K01j65j35m40J019J72r12k04O91n01KN98l23p33M40
$$ plain form
3844 -99 561 -80 -32 254 -589 -659 291 383 -363 23 236 -629 7 308 -383 -807 64 207 -556 -144 -60 -964
3866 -964 -359 134 -415 -680 -246 -368 -701 -12 183 -948 -833 -130 -415 -658 77 -168 -743 -28 521 -496
3886 -496 -658 -430 -542 -895 493 87 -700 -452 118 -529 -165 462 -393 -600 134 176 -254 -60 9 -554
3906 -554 -337 569 74 -411 333 202 -132 127 319 -97 -162 957 269 -305 220 283 -234 700 877 237
3926 237 -250 505 195 22 890 549 -356 -4 846 579 -61 229 254 -339 748 670 -387 -57 594 60
3946 60 523 609 296 -483 425 591 188 223 660 61 88 614 327 -123 235 127 -281 309 669 83 -456
3967 -456 190 260 -358 223 327 -618 -368 571 -1 -636 -111 72 -695 253 266 -675 -494 -37 -625 -406 8
3988 8 -418 -579 -106 449 -330 -459 614 -385 -425 200 -133 -852 -457 169 -611 -146 15 -459 -719 106 -176
$$ packed form
3844i9O60o41M8K86q43p0R50R2p46L86K13q65O36L01o91m24Q71J43p63M12Q4r04
3866i64O05M93n49k65M34j22l33O89J95j131J15P03k85k43P35k45n75P15N49j017
3886d96j62K28j12l53J388m06p87K48N70o47L64O27q55k07P34M2m30J94O9n63
3906e54K17R06m95m85P44j31l34K59J92m16o5J119o88n74N25O3n17R34J77o40
3926B37m87P55l10j73Q68l41r05L52Q50k67o40K90K5n93J087p8j057L30O51n34
3946F0M63Q6l13p79R08J66m03L5M37n99K7N26k87m50L58j08m08N90L60n86n39
3967d56O46P0o18N81J04r45K50R39n72o35N25J83p67R48J3r41J81M57n88K19M14
3988Hm26j61M73N55p79j29J073r99m0O25l33p19L95O26p80M65J61m74k60Q25k82
$$ plain form
4009 -176 -484 -107 -97 -545 -286 200 -81 -793 185 -266 -612 -260 -9 -628 -647 262 -17 -162 105 -188 -464
4030 -464 -89 353 -423 -507 182 -78 170 439 266 -518 63 968 35 -175 358 -6 -31 792 566 -234 120
4051 120 495 -85 57 722 -80 -620 342 819 171 392 378 -164 -65 976 495 11 441 658 164 716
4071 716 728 -193 -299 788 392 -186 718 307 -92 381 870 -22 -556 226 96 135 599 213 -309 152
4091 152 635 -104 -546 404 -402 -579 476 306 -243 -163 277 -160 -188 305 -310 -741 223 126 -705 -243 15
4112 15 -481 -440 364 -69 -588 -15 -295 -691 -280 238 -852 -522 152 -182 -327 -218 -187 -995 -329 442 -478
4133 -478 -806 -52 -48 -499 219 -73 -722 -367 170 -124 -287 161 -186 -865 -1 342 -474 -585 450 -220
4153 -220 -470 499 -70 -634 72 290 -211 -42 -15 -384 -279 393 664 -99 -168 157 -126 248 1068 -417
$$ packed form
4009a76l08L77J0m48K59M86k81p12R78m51l46L52K51o19j9R09k79j45K67k93k76
4030d64L75M42p76q4O89k60K48K69j73p84N81R05r33k10N33l64k5Q23k26q00L54
4051A20L75n80J42O65q02n40R62M77o48K21j4n42R9J041m81m84M30K17m94N52
4071G16J2r21j06J087l96n78R04m11l99M73M89q92n34P82j30L9M64l86n22M61
4091A52M83p39m42R50q06j77J055j70n49Q0M40m37k8M93o15m31R64r7q31M62K58
4112A5m96M1Q04m33n19N73k80l96M11N18j090L30O74l34j45J09L1q08O66P71r20
4133d78l28P54Mm51P18k92o49L55N37k94j63M48l47o79Q64L43q16j11J035o70
4153b20k50R69n69n64P06K18n01J69K7l69J05O72K71p63o9L25k83L74Q20j485
$$ plain form
4173 -417 -286 451 689 151 426 592 -523 -63 885 518 61 167 -97 -261 510 1116 36 -517 407
4192 407 201 221 696 144 -241 274 890 333 184 406 -201 -393 849 432 -612 -180 314 285 263 811
4212 811 -368 -822 590 256 -30 77 17 -403 -209 813 108 -822 -446 -218 -452 238 713 -857 -524
4231 -524 92 438 -188 8 -455 -669 200 690 -488 -792 -370 -252 -127 217 21 -658 -153 219 65 -241
4251 -241 322 -758 -701 237 385 -533 -564 -192 -201 -225 156 -349 -900 -531 57 -64 -73 154 -822 -343 574 181
4273 181 -448 -500 -361 -211 61 656 -529 -878 113 337 40 367 27 -860 -189 718 197 -408 -126 57
4293 57 -296 474 552 -532 -149 298 157 436 484 -175 -752 437 771 291 471 330 24 41 961 617 -512
4314 -512 76 564 -35 349 703 -223 -561 795 878 106 299 167 -512 560 1077 315 -278 12 19 31 703
$$ packed form
4173d17J31P37K38n38K75J66j115M60R48l67m57J06k64j64P71O06j080n53R24
4192D07k06K0M75n52l85N15O16n57j49K22o07j92J242m17j044M32M94k9k2N48
4212H11j179m54J412l34k86J07o0m20J94J022p05r30L76K28k34O90M75j570L33
4231e24O16L46o26J96m63k14Q69M90j178l04M22J18J25L44j96o79N05L72j54l06
4251b41N63j080N7R38J48r18l1L72rk4L81n05n51L69N88j21rK27r76M79R17l93
4273A81o29n2J39J50K72N95j185l49R91K24k97L27l40q87O71R07n21o05K82J83
4293E7l53P70P8j084L83M47j41K79M8o59n77J189L34m80J80j41l06J7R20l44j129
4314e12N88M88n99L84L54r26l38J356Q3p72J93j32o79J072N17p62n93K90PJ2O72
$$ plain form
4335 703 584 -403 -485 488 294 -111 232 -674 -581 311 1252 135 -425 -133 -125 192 735 -27 -724 -273 443
4356 443 175 -198 58 -430 -766 404 484 -168 -203 -478 -456 -51 422 -130 -833 -246 410 17 -59 -275 -696
4377 -696 -643 412 400 -514 -392 -356 -494 77 237 -524 -870 -315 20 -290 96 -29 -994 275 835 -309
4397 -309 -540 -296 -157 -480 172 131 -572 -538 -273 21 -231 345 -368 -570 186 363 85 -373 153 -146 5
4418 5 676 1 -669 173 356 47 242 559 -417 -75 777 329 -100 296 110 -158 467 658 80 -198 439
4439 439 237 582 817 566 -357 104 688 200 300 704 -80 -583 419 454 63 -7 341 -66 34 808
4459 808 187 -683 157 473 59 140 224 -299 -563 913 391 -138 68 -19 -494 318 661 -82 -561 207 448
4480 448 -160 257 292 -579 -417 441 -2 -363 -245 13 -473 182 375 -455 -563 114 -24 -261 25 -214
$$ packed form
4335G03j19r87q2R73j94m05L43r06R3Q92R41j117n60K92QL17N43p62o97M51P16
4356D43k68l73K56m88l36J170Q0o52l5k75K2M05M73n52p03N87O56l93p6k16m21
4377f96N3J055j2r14J22L6j38N71J60p61l46N55L35l10L86j25r65J269N60j144
4397c09k31K44J39l23O52m1p03L4K65K94k52N76p13k02P56J77k78m58N26k99J51
4418EO71o75o70Q42J83l09J95L17r76L42Q52m48m29L96j86k68O25J91n78k78O37
4439D39k02L45K35k51r23M61N84m88J00M04p84n03J002L5l91p0L48m07J00P74
4459H08o21q70Q40L16m14Q1Q4n23k64J476n22n29K06q7m75Q12L43p43m79P68K41
4480D48o08M17L5q71J62Q58m43l61J18K58m86O55J93q30j08O77j38k37K86k39
$$ plain form
4500 -214 -684 189 200 -346 -467 -256 -324 -497 254 -118 -627 -528 -63 -332 -464 -100 -642 -893 -246 146 -194
4521 -194 -486 -142 -301 -206 180 78 -900 75 169 -348 187 293 -660 -255 484 48 -322 108 212 -359 96
4542 96 711 86 -372 330 205 199 461 430 -277 163 677 284 -89 471 141 -268 552 823 150 -21 281
4563 281 65 339 846 194 -227 274 571 -7 293 324 -68 -285 806 591 -329 416 420 65 124 583 -84
4584 -84 -261 660 207 -186 463 524 -339 41 475 346 -130 382 177 -212 437 505 -470 -136 100 -84 -52
4605 -52 426 -13 -633 362 275 -164 -173 41 -416 -305 466 78 -571 -335 -60 -241 -5 26 -539 -720 87 39
4627 39 -563 -566 -9 -457 37 617 -387 -779 -137 -437 -435 -28 -7 -899 -368 209 2 -753 -185 -138 -616 67
4649 67 422 -427 -449 189 -246 -243 156 -320 -578 189 541 -430 -129 48 -148 -201 459 482 -256 -102 38 27
$$ packed form
4500b14m70Q73J1n46j21K11o8j73P51l72n09R9M65k69j32L64n42k51O47L92l40
4521a94k92L44j59R5L86j02r78R75R4n17N35J06r53M05P39m36l70M30J04n71M55
4542I6O15o25m58P02j25oK62l1p07M40N14l93l73N60l30m09Q20K71o73j71L02
4563B81k16K74N07o52m21N01K97n78L00L1l92k17J091k15r20P45Ml55N9M59o67
4584h4j77R21m53l93O49O1q63L80M34j29m76N12k05l89O49O8r75L34K36j84L2
4605e2M78m39o20R95q7m39rK14m57J11P71l88o49K36K75j81K36L1n65j81Q07m8
4627C9o02lN57m48M94N80j004l92O42l00KM07K1q92N31N77k07p55N68M7m78O83
4649F7L55q49k2O38m35LL99m76k58P67L52r71L01J77j96n3O60K3p38J54J40j1
$$ plain form
4671 27 169 631 -392 -405 409 833 203 -231 325 -305 237 674 434 -140 24 461 194 678 419 -42
4691 -42 22 725 347 18 113 198 -357 385 535 158 -107 268 140 43 567 288 -75 272 544 30 202 431
4713 431 -110 -246 807 336 -125 -244 -41 -83 -29 345 -273 -598 36 167 -222 -62 -98 -404 -555 387 213
4734 213 -251 -57 59 -545 195 864 -16 -473 263 -29 -250 151 -10 -869 -284 506 -256 -797 -469 -533
4754 -533 -658 236 -266 -792 -646 -33 13 -135 59 -455 -894 -143 159 -423 11 349 -488 -269 303 24
4774 24 -631 -495 81 354 59 144 -403 -498 482 414 -295 -137 -177 -662 70 430 -174 -414 15 55 -190 245
4796 245 317 -564 -264 569 60 46 104 -119 -239 285 854 107 -234 420 291 6 464 245 -401 -105 580
4817 580 50 443 211 17 -107 461 730 -140 19 168 171 590 615 -294 -262 443 320 189 358 190 -313
$$ packed form
4671B7J42M62j023j3Q14M24o30m34N56o30N42M37k40n74J64M37k67M84k59m61
4691d2O4P03l78l29R5Q5n55P42J50l77k65L75j28r7N24k79l63L47K72n14J72K29
4713D31n41j36J053m71m61j19K03m2N4L74o18l25O34J31l89J60l6l06j51R42j74
4734B13m64J94J16o04P40O69q80m57P36k92k21M01j61q59N85P90p62n41L28o4
4754e33j25Q94n02n26J46O13M6j48J94n14m39P51L02n82M34L38q37K19N72k79
4774B4o55J36N76K73k95Q5n47r5R80o8p09J58m0m85P32L60o04k40M29M0k45M35
4796B45P2q81L00Q33n09j4N8k23j20N24N69p47l41O54j29k85M58k19o46K96O85
4817E80n30L93k32j94j24N68K69q70J59J49LM19K5r09L2P05j23j31J69j68n03
$$ plain form
4838 -313 -103 749 594 -190 244 26 -339 336 568 -143 -428 396 249 -58 278 68 -477 143 434 182
4858 182 -421 -224 -102 -351 311 377 -405 -461 61 -83 -9 493 -345 -562 -8 53 -196 -190 54 -420 -231 578
4880 578 23 -393 -227 -224 -346 96 294 -458 -467 54 454 -365 -54 -210 -489 -10 660 -261 -607 104 -130
4901 -130 -133 176 103 -700 -248 139 -140 -35 -70 -245 -377 297 181 -310 -147 160 36 -313 697 -11 -639
4922 -639 -9 435 205 3 -96 -488 -90 558 464 7 -214 178 130 158 443 143 -328 245 330 -199 334 239
4944 239 -304 60 678 385 -169 319 138 5 320 680 157 -94 414 193 39 62 -1 -167 388 538 160
4965 160 170 356 48 88 593 374 -206 -90 288 -101 -140 483 -49 -278 491 317 -285 2 431 -226 -27
4986 -27 318 -302 -358 259 -34 -340 140 194 -182 -248 261 -136 -406 32 8 -498 -37 315 -338 -653 66 -230
$$ packed form
4838c13K10Q52j55p84M34k18l65O75K32p11k85Q24j47l07L36k10n45O20K91k52
4858A82o03J97J22k49O62O6p82n6N22j44P4N02q38k17N54O1k49OK44m74J89Q09
4880E78n55m16J66Lj22M42J98p52rN21M00q19L11j56k79M79O70r21l46P11k34
4901a30lL09p3q03M52L87k79J05l5j75j32O74j16m91J63L07j24l49J010p08o28
4922f39O30M44k30k02r9l92L98O48r4m57k21L92m8K8K85l00m71N73Q5n29N33r5
4944B39n43L64O18k93n54M88j81j33L15L60n23k51N08k21j54K3o3j66N55J50l78
4965A60J0J86l08M0N05k19n80J16L78l89l9O23n32k29P69j74o02K87M29o57J99
4986b7L45o20n6O17k93l06M80N4l76o6N09l97k70M38k4n06M61L52o53l15P19k96
$$ plain form
5008 -230 -252 299 -114 -323 -377 28 -225 -214 11 -218 -685 -115 56 -121 -173 105 -301 -515 208 -78 -627
5029 -627 79 165 -390 -326 -237 -566 -319 58 113 -312 -85 109 -420 81 211 143 -546 242 179 -400 359 271
5051 271 -239 147 373 -81 -237 215 109 -237 101 237 -111 -139 503 1 165 429 -68 -41 238 416 159
5072 159 256 272 -85 226 733 274 -332 432 654 141 -47 411 106 -26 472 142 -162 285 471 1 8
5093 8 492 -80 -104 410 447 -173 207 411 -221 77 369 267 -225 -4 355 -217 -153 75 -387 -445 542 27
5115 27 -143 177 -269 -458 -242 127 -572 -464 26 83 -453 57 -457 -597 -362 98 -346 -511 -208 -268 -501
5136 -501 -86 -56 -571 -289 -12 -526 -685 21 -194 -570 -282 -22 -273 -135 -42 -514 -468 237 -40 -354 60
5157 60 -2 -353 -371 109 -338 -341 482 -142 -489 162 -84 -321 -253 279 -220 -147 125 -186 -76 101 270 -273
$$ packed form
5008b30k2N51m13k09n4M05k53J1K25k29m67N70J71j77n2K78m06k14P23k86n49
5029f27P06Q6n55O4Q9l29K47L77N5m25K27J94n29N01J30o8o89P88o3n79P59q8
5051B71n10L86K26m54j56M52j06l46L38J36l48k8O42n02J64K64m97K7K79J78k57
5072A59R7J6l57L11N07m59o06P64K22n13j88M58l05j32M98l30l04M47J86m70P
5093HM84n72k4N14L7o20L80K04o32K98K92j02m92K21L59n72O4K28m62n8R87n15
5115B7j70L20m46j89K16L69o99J08M90N7n36N10n14j40K35M60m44j65L03o0k33
5136e01M15L0n15K82K77n14j59P06k15l76K88K60k51J38R3m72M6P05k77l14M14
5157F0o2l51j8M80m47lQ23o24l47O51k46k37O8N32m99P3K72l11J10J77J69n43
$$ plain form
5179 -273 17 294 -47 100 458 115 -234 317 291 117 -268 421 80 -86 345 145 -242 -42 411 -118
5199 -118 143 559 121 -219 545 376 33 246 399 127 361 694 466 -339 362 413 115 363 488 -197
5219 -197 11 447 -33 53 191 195 -274 320 262 -152 -65 242 -76 154 188 -6 -328 86 675 -136 -229 161
5241 161 -31 -198 384 90 -87 -90 380 -220 -192 104 -283 -759 -20 129 -326 -216 45 -365 -270 86 -201
5262 -201 -859 -56 -198 -675 -4 352 -550 -408 105 -357 -306 -77 140 -108 282 52 -245 -445 194 131 -218
5283 -218 480 32 -706 -201 254 -479 -263 238 -484 -221 128 119 -142 -77 444 -25 -314 362 142 -275 12
5304 12 172 -152 183 56 -142 -441 419 547 -226 -106 311 -162 335 609 111 -96 165 281 75 409
5324 409 240 -202 -85 325 502 -47 289 105 255 567 574 152 -11 431 189 302 559 285 -330 85 558
$$ packed form
5179b73K90K77l41J47L58l43l49N51k6j74l85O89l41j66M31k00l87K00M53n29
5199a18K61M16m38l40P64j69l43K13J53k72K34L33k28q05P01N1k98K48J25o85
5219a97K08M36m80Q6J38Mm69N94n8m14Q7L07l18K30L4j94l22M14N89q11r3L90
5241A61j92j67N82k94j77lM70o00K8K96l87m76P39J49m55J10K61m10R5L56k87
5262b01o58Q03j42m77O71L56r02J42N13m62N1K29K17k48L90k30k97k00O39o3l49
5283b18O98m48p38N05M55p33K16N01p22K63L49rk61O5N21m69k89O76k20m17K87
5304A2J60l24L35j27j98k99Q60J28p73J20M17m73M97K74m98k07K61J16k06L34
5324D09j69m42J17M10J77n49L36j84J50L12Pm22j63M42k42J13K57k74o15M15M73
$$ plain form
5345 558 146 -190 238 -237 -245 599 159 -471 -4 284 -94 154 622 52 -487 -25 253 -6 108 169 -668
5366 -668 -11 429 -104 -190 -12 91 -343 250 177 -529 -183 233 -81 -93 -25 -229 -442 -114 105 -213 -660
5387 -660 -121 -559 -216 166 -205 -447 52 -137 -103 -66 -70 -811 -631 216 76 -557 -157 -127 -144 -173 436 -234
5409 -234 -546 -136 141 -144 -106 183 -542 -548 -16 188 -307 62 93 -110 295 353 -169 -154 -58 -157 -18 259 59
5432 59 -353 -298 377 316 126 18 20 -320 605 625 -239 -56 501 318 -35 599 9 -281 64 485 93 154
5454 154 276 -200 -116 311 294 -147 180 326 180 107 477 -265 61 488 192 -204 167 294 -227 206 789
5475 789 318 99 148 220 185 333 225 -345 -287 467 -18 -78 200 -174 -554 95 200 12 -29 87 98 11 345
5498 345 3 -423 -51 323 -208 -3 146 -184 -535 245 216 -369 -268 -231 -281 -100 355 -406 -742 -56 -318
$$ packed form
5345E58m12l36M28m75qQ44m40o30M67K88l78K48M68n70n39M62K78k59J14O1q37
5366f68O57M40n33q6J78J03m34N93p3p06L46M16l14j2O8k04k13L28K19l18m47
5387f60N39m38L43L82l71k42M99j89L4L7mp41J80Q47j40o33M00L0j7k9O09o70
5409b34l12M10K77k85L8K89p25oN32K04m95L69L1k03M05N8n22J5R6r9J39K77k00
5432E9m12N5O75o1j90j08Kl40R25K0q64J83N57j83l53O34n90k90L45M21l92O1
5454A54J22m76Q4M27j7m41L27J46j46p3L70p42L26M27k96l96L71J27n21M33N83
5475G89m71k19M9P2l5J48j08n70N8P54m85o0K78l74l80O49J05j88m1J16J1q7L34
5498C45l42m26L72L74n31K05J49l30l51P80k9n85J01L7n0J81M55p61l36O86k62
$$ plain form
5519 -318 7 133 142 -234 -178 341 181 -442 22 -328 -212 132 267 -434 -687 96 -53 -286 -53 -255 -377
5540 -377 -43 263 -132 -344 -40 -304 57 114 48 -572 -314 304 -83 43 400 -371 -457 316 574 138 12
5561 12 2 114 -167 638 -121 -240 21 332 70 42 460 -294 -192 456 287 -373 145 239 -164 441 639
5582 639 -212 -54 175 35 2 557 333 -357 153 203 218 82 -7 162 -131 466 550 -210 -22 501 -30 82
5604 82 284 321 -607 343 436 -169 35 -244 -169 -147 413 27 -323 216 -48 -302 -77 178 -200 -34 118 -50
5626 -50 -184 277 174 -248 -139 256 -47 -385 331 -225 -359 152 91 -535 -118 392 -400 -291 3 -396 -574
5647 -574 -38 409 -361 -667 -276 -390 -234 59 14 -474 -128 77 -198 -436 227 -187 -622 88 405 -263
5667 -263 -148 83 -351 -181 303 69 -429 -135 -77 -234 -74 90 -179 -3 382 0 -229 258 80 143 92
$$ packed form
5519c18L25J26Rl76N6N19j60o23M64l50J16L44J35p01k53P83j49k33K33k02j22
5540c77L34L06l95k12L04k64L61N7o6o20K58O18l87J26L57p71q6P73K58m36j26
5561A2j0J12k81Q05p59j19K61L11k62k8M18p54J02O48j69o60N18R4m03O05J98
5582F39q51J58K29j40l3N55k24o90N10N0J5j36q9J69k93N97Q4p60J88N23n31J12
5604H2K02L7r28R50R3o05K04k79P5K2N60l86l50N39k64k54K25K55l78J66J52j68
5626e0j34M61j03m22J09L95l03l38P16n56j34N11o1o26M17N10p92J09K94l99j78
5647e74N36M47p70l06L91j14J56K93m5m88L46K05k75k38O63m14m35P10L17o68
5667b63J15K31m34J70M84k34m98K94N8j57J60J64k69J76L85l82k29M87j78O3n1
$$ plain form
5688 92 387 -258 -328 365 -77 14 38 142 -310 250 539 273 -255 420 208 -360 490 387 -316 123 345
5709 345 290 328 569 51 -20 409 230 53 97 590 -8 -62 401 305 -353 269 105 -13 160 410 -60 -100
5731 -100 646 373 -128 222 -147 -355 139 492 198 -101 535 -52 175 452 249 -348 -162 86 -24 -111
5751 -111 5 -158 -379 279 274 -165 -105 212 -220 -279 -109 -144 -478 161 251 -305 -76 -161 -320 -506 48 -202
5773 -202 -107 -204 272 -162 -143 -97 -536 -455 -115 153 -200 238 -96 -603 -513 360 -12 -391 -122 -199 -330 250
5795 250 148 -406 -495 -152 -3 -158 422 -179 -370 163 515 -102 -178 160 -292 -216 265 90 -121 57 309
5816 309 -184 -35 427 -69 -265 276 149 115 -5 453 -392 202 578 250 -180 118 291 171 336 776
5836 776 68 -123 526 354 135 212 159 -204 245 533 44 142 49 264 -2 189 325 -346 47 554 45
$$ packed form
5688I2K95o45p0O93m42R1K4J04m52N60K89k66n28O75k12n68Q50j03p03M39K22
5709C45n5L8K41n18p1M29j79j77M4M93n98n4M63r6o58O22j64j18J73K50m70m0
5731a00P46k73n01L50l69k08M94L53k94k99O36n87K27K77k03n97J86K48j10q7
5751a11J16j63k21O58nm39O0L17m32n9J70l5l34O39R0n56K29q5j59j86N54k50
5773b02R5r7M76m34J9M6m39Q1L40K68l53M38l34n07R0Q73l72l79K69p7j31N80
5795B50j02n54q9L43J49j55N80o01j91N33L52o17p6L38m52P6M81j75k11J78K52
5816C09m93J49M62m96j96N41j27l4j20M58q45N94L76l28m30K98J73j20J65M40
5836G76p08j91O49j72k19P7n3l63M49K88m89R8r3K15k66J91J36o71L93N07n09
$$ plain form
5857 45 145 210 -142 -219 317 901 -262 78 138 -8 -85 188 0 -88 49 302 -166 180 309 -144 -421 133
5879 133 87 -59 4 -13 -190 -176 285 -212 -193 -84 -37 -424 223 -7 -768 -517 71 6 -156 -18 -428 -615
5901 -615 66 241 -363 -430 2 -187 -76 321 -73 -1001 -173 234 -263 -116 74 -404 -297 404 240 -581
5921 -581 -369 -167 -152 -163 126 -419 -621 233 40 -187 46 257 -477 -118 433 305 -148 38 380 -183 184
5942 184 328 -421 -283 495 -104 -225 301 399 10 142 432 130 -159 146 -267 -30 252 207 -166 5 533
5963 533 -86 315 295 -38 -207 234 463 -194 -15 400 255 114 732 -66 -33 67 435 -36 318 461 -364
5984 -364 -195 313 167 119 -17 -157 -114 182 570 26 -221 372 16 -291 89 112 -177 71 251 -145 -302
6005 -302 325 -355 -275 123 168 -144 -361 49 -323 -503 404 43 -545 -274 28 -259 -76 332 -379 -263 583
$$ packed form
5857D5J00O5l52p7N36N84j163L40O0j46p7K73j88q8J37K53m68L46J29m53k77N54
5879A33m6j46O3j7j77J4M61m97J9J09M7l87O47k30p61K51N88o5j62J38m10j87
5901f15O81J75o04o7M32j89J11L97l94r28Q28M07m97J47J90m78J07P01j64q21
5921e81K12K02J5j1K89n45k02Q54j93k27K33K11p34L59N51j28m53J86L42n63L67
5942A84J44p49J38P78n99j21N26R8l89J32K90l02k89L05m13K37K82m5l73J71N28
5963E33o19M01k0l33j69M41K29o57J79M15j45j41O18p98L3J00L68m71L54J43q25
5984c64J69N08j46m8j36j40M3K96L88n44k47N93l56l07L80K3k89K48J80l96j57
6005c02O27o80Q0L98M5l12k17M10l72j80R07l61n88K71L02k87J83M08p11J16Q46
$$ plain form
6026 583 -147 -352 -429 17 -357 -184 162 -559 -571 -92 -132 -104 -204 89 -389 -287 302 -322 -335 -18 -268 -242
6048 -242 18 169 -273 -178 -181 40 -66 190 -170 -778 -73 248 198 -339 -44 -86 -141 325 116 -501 110 -25
6070 -25 -196 198 198 62 -211 245 294 -247 80 322 -254 291 471 -87 -337 -30 320 168 178 372 -25 -115
6092 -115 405 49 -6 573 280 -262 171 455 -219 218 364 94 70 457 216 -285 28 442 81 -134 438
6113 438 90 51 120 12 -302 286 696 -28 -224 174 -40 -399 377 298 -121 5 242 -47 -190 375 -153
6134 -153 -340 142 39 -356 -216 23 -321 -116 275 278 -409 32 132 -362 -183 80 -72 -400 -229 -239 -595
6155 -595 171 -20 -394 -160 -139 -115 -383 61 -85 -173 -126 464 -178 -198 -67 -475 -204 -261 -294 -486 6 -94
6177 -94 -223 -264 -21 -494 -277 88 186 -406 -157 90 -232 387 91 -272 -439 -93 62 57 -24 39 -280 -70
$$ packed form
6026E83p30k05p7M46l74J73L46p21j2M79m0K8j00K93m78J02N89o24j3L17k50K6
6048b42K60J51m42R5lK21j06K56l60o08P05L21n0n37K95m2n5M66k09o17O11j35
6070b5j71L94%j36k73M56M9n41L27K42n76N45J80n58k50L07L50j52J0J94l97r0
6092a15N20l56n5N79k93n42M33K84o74M37J46k70k4L87k41n01L13M14l61k15N72
6113D38l48l9O9j08l14N88M10p24j96L98k14l59P76p9m19J26K37k89j43N65n28
6134a53j87M82j03l95J40K39l44K05L91Lo87M41J00m94J79K63j52l28J71j0l56
6155e95P66j91l74K34K1K4k68M44j46q8M7N90o42k0J31m08K71n7l3j92M92j00
6177i4j29m1K43m73K17L65R8n92K49K47l22O19k96l63j67L46J55nq1O3l19K10
$$ plain form
6199 -70 472 -2 -331 120 140 -293 9 480 -169 -314 -11 151 6 55 131 -455 428 739 185 -115 478
6220 478 141 -110 105 25 -125 330 304 -1 -143 274 -44 6 400 330 66 89 245 140 345 346 183 -20
6242 -20 440 250 123 369 215 71 -221 286 -82 127 299 -204 -170 209 437 19 -119 490 -51 -105 223
6263 223 -6 -179 80 255 -602 -130 337 79 -212 -104 -66 -544 -89 293 -193 -409 123 31 -671 33 -65
6284 -65 -436 -214 -140 -222 -152 1 -151 -473 -176 -259 -412 -245 216 -229 -291 219 -192 -306 105 301 -656 -99
6306 -99 230 -480 -529 180 223 -391 -2 103 40 -92 479 -224 -35 381 113 -47 144 251 -294 259 55
6327 55 -1 -7 423 248 -98 541 195 125 -71 19 -1 -113 566 384 35 264 76 -10 333 448 -35 -145 183
6350 183 397 165 310 278 21 8 705 180 -341 386 -202 -71 -137 292 91 -365 80 351 -203 197 -43
$$ packed form
6199g0N42m74l29M51K0m33L02M71o49j45L03J62j45M9P6n86Q83L11n54l00N93
6220D78l37k51K15q0j50M55k6l05j42M17l18N0L94p0k64K3J56j05K05Jj63k03
6242b0M60j90j27K46j54j44k92N07l68K09J72n03L4L79K28m18j38O09n41n4L28
6263B23k29j73K59J75q57M72M67k58k91J08L8m78M55L82m86k16N32r2p02P04r8
6284f5l71K22P4q2P0J53j52l22K97q3j53J67M61m45o2N10m11j14M11J96r57N57
6306i9L29p10m9P09M3o14L89J05o3j32N71p03J89M16k68j60J91J07n45N53k04
6327E5n6oM30j75l46O39l46p0j96R0k0j12O79j82l49K29j88q6L43J15m83j10L28
6350A83K14k32J45l2k57j3O97n25n21P27n88J31o6M29k01m56M45K71n54M00k40
$$ plain form
6371 -43 -372 204 565 -127 52 196 -111 109 462 -96 -100 -85 149 35 49 110 -214 -124 131 -58 -242 -318 -115
6394 -115 -414 267 -103 -186 -341 299 101 -338 141 -89 -313 -486 127 -328 -420 -163 72 -322 -200 -74 -92
6415 -92 -270 56 247 -608 -113 64 -351 -194 41 -56 -244 162 -21 -465 -31 -12 -497 -300 115 -314 -266
6436 -266 279 329 -262 -58 258 -299 -35 287 260 -122 78 64 -156 428 175 -65 152 214 -177 -272 196 207
6458 207 180 94 585 -120 142 442 -88 77 348 -18 -246 230 342 258 -47 41 -20 -66 439 200 -209 136
6480 136 245 -107 -64 139 88 316 154 -31 -332 494 154 182 -69 377 -130 -321 85 220 214 266 287 -204
6502 -204 102 173 339 59 -43 499 2 287 121 -417 -284 208 -37 -187 37 86 126 115 441 -7 -109
6523 -109 78 -120 -241 8 -48 -47 -21 195 -353 -240 -53 -270 -363 -118 -4 -523 -92 168 -247 -105 55 -182
$$ packed form
6371d3l29N76L61o92J79J44l07K20L53n58mJ5K34j14J4O1l24R0K55j89j84p6K03
6394a15k99O81l70q3j55O40j98m39M79k30k24j73O13m55r2K57K35l94J22J26j8
6415i2j78L26J91q55M95J77m15J57K35r7j88M06j83m44M34J9m85J97M15m29M8
6436b66N45N0n91K04L16n57K64L22k7l82K00j4k20N84k53k40K17O2l91r5M68J1
6458B07k7q6M91p05K62L00n30J65K71l66k28M76J12q4l05Q8o1m6N05k39m09L45
6480A36J09l52M3K03n1K28j62j85l01Q26l40K8k51M46n07j91M06J35oN2K1m91
6502b04L06P1J66k80j02N42m97K85j66n38J33M92k45j50K24M9M0j1L26m48j02
6523a09J87j98j21K49n6JK6K16n48J13J87k17r3K45J14n19M31K60m15J42J60k37
$$ plain form
6545 -182 -340 -119 -175 -97 -285 17 -169 -393 295 -140 -296 -45 -198 1 -117 57 -449 -304 -12 -127 -213
6566 -213 312 4 -128 76 155 47 -196 2 -11 -185 178 283 -240 16 25 -167 -97 -21 -169 -220 23 441
6588 441 81 -116 345 283 30 337 307 69 321 124 91 121 272 90 -104 -113 38 -238 398 370 9 -158
6610 -158 183 269 -66 103 211 96 227 182 59 79 140 3 -176 147 220 -160 44 527 76 -152 115 209
6632 209 -73 370 322 -129 -55 320 -130 -227 -122 -68 -78 -217 -87 -2 89 101 -112 -224 62 -216 -220 -71 -59 -478
6656 -478 -350 40 -276 -383 54 14 -428 144 -214 -34 7 42 -249 3 276 -280 -373 174 -204 -365 312
6677 312 -182 -460 -185 -88 -123 -306 -134 -54 -338 44 95 -207 105 9 -112 -252 36 87 -378 -135 181 286
6699 286 -52 24 38 -61 -61 -25 -110 -163 82 -272 226 449 215 37 84 105 -137 165 249 -55 -114 186 404 182
$$ packed form
6545a82j58K21n6P8j88L02j86k24O88m35j56K51j53J99j18J74n06J45K92j15q6
6566b13N25l08j32K04P9j08k43J98j3j74L63J05n23K56Rj92P0P6j48n1K43M18
6588D41l60j97M61o2k53L07l0k38K52j97l3L0J51j82j94rJ51k76O36k8l61j67
6610a58L41Q6l35J69J08j15J31m5j23K0O1j37j79L23P3l80K04M83m51k28K67R4
6632B09k82M43m8m51P4L75m50r7J05N4j0j39J30Q5R1J2k13j12K86k78mJ49J2m19
6656d78J28L90l16j07M37m0m42N72l58J80M1L5k91K52K73n56r3N47l78j61O77
6677C12m94k78K75R7l5j83J72Q0k84L82N1l02L12r6j21j40K88N1m65K43L16J05
6699B86l38P6J4r9%L6q5n3K45l54M98K23k34j78M7K1k42L02Q4l04n9L00K18k22
$$ plain form
6723 182 163 234 297 402 232 102 129 66 216 -110 25 -232 -181 338 499 240 222 354 65 207 150 463 90
6746 90 -32 369 -34 0 96 162 31 54 213 -61 -119 415 -218 56 65 -19 -178 -72 534 -110 197 195 -65 -379
6770 -379 216 -214 -138 -49 -88 -27 -104 158 91 -4 -56 -15 -384 -154 -69 -381 -342 107 -16 -102 -132 -127 -111 -537 -71
6795 -71 -77 -478 215 -58 -253 15 -14 2 15 -293 -34 55 77 -270 -453 306 264 -464 -342 150 -235 25 379
6818 379 -136 -515 -11 -142 112 -61 168 -125 -326 261 -127 113 -310 207 -251 -79 238 105 -138 127
6838 127 63 -203 432 107 -126 -59 356 183 123 305 -217 -163 267 253 -243 5 44 -75 39 -38 46 -154 153
6861 153 291 107 185 231 -419 -50 340 173 114 -233 298 127 108 351 -476 -183 -176 163 231 73 66 -93 -52
6884 -52 114 8 -28 0 -104 -168 -11 391 -352 -263 120 133 197 115 -296 43 296 47 -14 -32 123 0 -371
$$ packed form
6723A82j9P1O3J05j70j30K7o3J50l26J35k57N1N19J61k59j8J32k89J42n7L13l73
6746I0j22M01m03L4R6O6j31K3J59k74n8N34o33K74Rq4j59J06O06o44L07kk60l14
6770c79N95m30P6Q9l9O1p7K62o7r5n2M1l69K30Q5l12L9M49j23q6l0NJ6m26M66
6795g1om01O93k73j95K68k9J6J3l08K59Q9K2l47j83P59m2p28J22M92l85K60L54
6818C79n15l79N04j31K54j73K29k93k01N87l88K40m23N17m58J72L17j33k43K65
6838A27o4k66O35l25k33O7M15j73o0J82n22N4M30j4m96K48L9j19J14p7Q4k00L07
6861A53J38j84P8M6o50L69L90j67n9l47N31j71j9K43q27K93PL39O8j58pj59M1
6884e2J66j06l6K8j04o4J57M02p43Q9L83J3O4q2m11L39K53k49o1j8J55j23l71
$$ plain form
6907 -371 -181 -48 -69 -81 -56 -498 -2 -148 -170 -248 47 9 -349 55 186 -84 -55 -20 44 -422 -196 211 -369
6930 -369 -254 -194 -562 2 117 -324 -335 220 -50 -398 184 8 -345 -342 19 -8 -385 182 -140 -325 184 188
6952 188 32 87 142 -205 -67 248 -40 -408 -246 375 -50 -117 390 -150 -318 351 352 208 -64 155 -220 95
6974 95 231 82 6 366 236 -219 126 403 122 -230 392 45 -126 250 -32 48 169 295 169 187 264 224
6996 224 -42 132 219 -10 83 203 -69 41 43 12 -72 352 136 -155 -217 -56 93 105 262 -67 -433 -179 -177
7019 -177 -168 -9 154 189 -286 0 -85 -169 -83 -216 -160 172 -42 -147 -72 -52 88 -100 202 -47 -468 -118 31
7042 31 -157 -351 102 -181 -273 223 -252 -181 -137 65 54 -205 24 1 -77 -92 59 -202 149 55 -316 -324 19 103
7066 103 -156 -215 62 -52 11 39 -208 -190 -120 19 -274 103 45 -40 -35 -10 -11 -204 173 -78 -28 192 201 -277 -104
$$ packed form
6907c71J90J33k1j2K5m42M96j46k2p8K95l8l58M04J31k70K9L5O4m66K26M07n80
6930c69J15O0l68N64J15m41j1N55k70l48N82j76l53LL61k7l77N67l22j85N09M
6952A88j56N5N5l47J38L15k88l68J62O21m25o7N07n40j68O69Jj44k72K19l75L15
6974I5J36j49p6L60j30m55L45K77k81l52O22l47j71L76k82Q0J21J26j26J8P7m0
6996B24k66J74Q7k29R3J20k72J10Kl1q4M24k16k91o2J61J49J2J57l29l66K54K
7019a77RJ59J63L5m75K86q5q4Q6j33N6L32k14j05P5K0J40j88L02k49m21L50J49
7042C1j88j94M53k83r2M96m75P1M4K02j1k59K29k3p8j5J51k61L51r4l71qL43Q4
7066A03k59n9K77j14O3K8k47J8P0J39k93L77n8q5NK5jj93L77k51N0K20Rm78J73
$$ plain form
7091 -104 100 -195 -368 -29 -15 -134 77 520 -6 -104 371 174 4 206 18 -254 226 55 -222 -20 78
7112 78 293 -2 193 26 272 -5 249 -26 156 17 -52 19 169 250 -59 -9 321 -145 15 123 -133 -41
7134 -41 -233 116 195 171 168 -32 -34 -13 -95 97 -124 -131 -242 53 372 -244 -237 52 199 -179 19 259 -542 -169
7158 -169 -456 5 -100 232 -59 -203 185 -75 -49 -76 15 -175 -226 -46 144 -17 56 -148 -228 89 -207 -318
7180 -318 -426 92 -56 -171 169 -103 92 -30 -112 -147 -27 29 -195 -297 147 -36 -176 -128 -194 -288 105 3
7202 3 -158 -113 153 111 -149 -272 343 -126 -155 120 -70 -264 -386 133 44 -369 405 18 -168 203 69 -62
7224 -62 -233 288 -29 -60 385 -139 -87 166 293 -81 192 403 100 168 304 -68 286 18 225 177 299 370
7246 370 63 190 469 266 -352 64 343 6 61 369 251 181 297 279 -151 209 -96 -116 -92 442 -170 2
$$ packed form
7091a04K04k95j73L39J4j19K11M43n26r8M75j97j70K02j88k72M80j71k77K02R8
7112G8K15k95J95j67K46k77K54k75J82j39o9P1J50Q1l09N0L30m66J60J08k56R2
7134d1j92L49P9k4lk00kK1q2J92k21pj11K95L19o16PK89J47l78J98K40q01L73
7158a69k87M61j05L32k91j44L88k60K6k7R1j90n1J80J90j61P3k04q0L17k96j11
7180c18j08N18j48j15L40k72J95j22q2l5J20N6k24j02M44j83j40M8o6r4L93j02
7202Cj61M5K66m2k60j23O15m69k9K75j90j94j22N19q9m13P74l87j86L71j34j31
7224f2j71N21l17l1M45n24N2K53J27l74K73K11l03O8J36l72L54k68K07m8J22P1
7246C70l07J27K79k03o18M16K79l37N5L08j18p0J16j8m30L60l05k0K4N34o12J72
$$ plain form
7268 2 100 24 -450 35 346 -200 77 -108 -145 -168 155 166 -106 -46 127 -89 -63 -113 -280 -207 -5 -162 -264 -72
7292 -72 10 -531 -147 237 -285 -208 245 -119 -278 -66 161 -102 -34 -108 -118 -490 126 -226 -275 -365 -40 -223 -47
7315 -47 98 -107 -123 -93 -117 -608 8 149 -345 103 100 -291 -276 59 -143 -91 23 -274 -121 66 -26 -104 -297
7338 -297 -19 174 5 166 8 -170 -78 217 -37 -125 258 219 23 223 258 -211 81 204 -44 211 172 118
7360 118 -102 -44 250 -25 55 177 -109 44 624 324 -68 41 479 -32 73 382 51 -72 127 382 -211
7381 -211 13 -51 -172 15 450 -105 54 -76 259 -517 144 21 -175 -120 163 167 -343 400 -36 140 106 195
7403 195 -289 -314 357 -59 1 31 -77 -308 -86 124 -201 -75 -88 17 -265 122 252 -239 -59 48 -16 28
7425 28 388 -155 -122 -204 4 -182 -388 -49 -443 -534 116 29 -327 -61 24 -195 -176 129 56 -246 150 151 -410
$$ packed form
7268BR8p6m74M85L11n46K77j85l7k3L23J1k72O0J73k16K6n0j67P3K02j57j02J92
7292g2Q2n41L84L84n22P7M53l64j59K12K27k63O8p4j0l72O16l52m9r0L25j83J76
7315d7J45k05j6L0k4m91O16J41m94M48ll91J5L35k02N2J14k97J53J87r2p8j93
7338b97K78J93j69J61j58j78R2K95k54q8L83l9j96K00L5m69K92J23k48K55l9n4
7360A18k20N8K94k75Q0J22k86J53N80l00l92J09M38n11J05L09l31j23J99K55n93
7381b11K24o4j21J87M35n55J59j30L35p76O61j23j96N5K83Mn10P43m36J76l4Q9
7403A95m84k5O71m16O0L0j08k31K22K10l25J26j3J05k82L87J30m91J80J07o4M4
7425B8L60n43L3q2K08j86k06L39l94r1O50q7l56K66Q5k19J9L05p3l02L96Jn61
$$ plain form
7448 -410 -284 -33 -8 21 144 -210 -334 -51 -55 -126 13 190 66 23 26 -131 -388 137 102 81 70 312 41 -132
7472 -132 81 33 -76 156 21 -228 448 128 11 106 375 66 -254 75 -131 -46 342 140 -92 -98 117 -62
7494 -62 52 -123 206 164 -5 99 32 -70 540 36 -127 415 29 -137 206 178 30 39 129 -226 -249 125 278
7517 278 -220 51 83 -62 73 181 7 -238 281 207 -235 -74 -21 -335 154 42 39 -52 -200 23 -114 14
7539 14 -35 -237 72 285 -143 -65 225 176 190 179 206 -92 39 201 -81 -180 -240 132 -263 127 147 -241 -487
7562 -487 19 -265 -221 306 -32 -191 -248 -85 -220 116 148 -166 -294 147 -119 7 -383 -181 -9 0 5 140
7584 140 -172 135 280 21 -43 -57 448 -299 -34 211 -130 124 121 190 109 300 -143 90 -126 332 261 255 278
7607 278 -180 263 74 -32 200 57 -4 -29 192 311 122 305 15 25 146 110 -176 -240 36 15 37 200
$$ packed form
7448d10J26K51K5K9J23l54j24K83mp1J39J77j24m3Lj57k57N25l5k1j1K42k71j73
7472a32K13m8j09K32j35k49O76l20j17R5K69l09l20L29k06Q5L88k02k32oK15j79
7494f2J14j75L29m2j69J04o7j02O10n04j63N42l86j66L43k8j48RR0l55k3L74J53
7517B78m98K71L2j45J35J08j74k45N19p4m42J61N3l14M89j12lr1j48K23j37J28
7539A4m9k02L09K13m28P8K90m9J4j1K7k98J31J62k82r9o0L72l95L90K0l88k46
7562d87N06k84M4N27l38j59n7J63j35L36L2l14j28M41k66J26l90K02J72RNJ35
7584A40l12L07J45k59o4j4N05p47K65K45l41K54lO9q1J91m43K33k16M58p1oK3
7607B78m58M43j89j06K32j43o1k5K21J19j89J83k90J0J21l6k86o4K76k1K2J63
$$ plain form
7629 200 162 168 -59 279 182 171 177 167 -308 492 48 -37 252 -40 96 45 -153 210 33 71 88 84 -226 161 86
7654 86 -321 275 28 -4 -67 188 -161 -158 -155 -121 -294 -42 -99 -4 93 -32 -124 -205 68 164 -41 -64 50 -452 -27
7679 -27 355 -276 6 -178 119 16 -91 55 79 -12 279 -60 -206 -26 -153 -393 -240 -81 -294 -483 205
7700 205 -115 -188 -78 -169 -107 282 -270 -371 -93 226 194 -282 73 65 -183 -55 319 -192 -93 -176 74 23 120
7723 120 114 -296 -22 21 280 78 527 141 -82 -2 82 -154 -5 265 -182 -121 427 117 -123 259 228 -160
7745 -160 -8 260 -98 -107 58 310 -74 65 18 37 167 47 33 -86 159 205 -180 234 264 -7 -34 201 266
7768 266 -49 157 -147 -211 -49 222 67 125 61 -121 5 390 6 -322 -45 301 -117 37 171 38 19
7789 19 -237 229 -345 73 -45 -300 -57 -40 149 26 18 -466 -205 17 -206 21 -54 -8 -232 -207 -16 238
$$ packed form
7629B00l8Ok27L38r7j1Oj0m75Q00m44q5K89k92J36n1j98L63j77L8J7ml10L87p5
7654H6m07N96k47l2o3K55l49LLL4j73K52n7R5R7j25r2q1K73R6k05k3J14n02M25
7679b7L82o31K82j84K97j03j07J46K4r1K91l39j46J80j27k40J53J59k13j89O88
7700B05l20p3J10r1O2L89n52j01K78L19l2m76L55qk48J28L74n11R9q3K50n1R7
7723A20om10K74M3K59k02M49l86k23Q0Q4k36J49K70m47O1N48l10k40L82l1l88
7745a60J52K68l58rJ65K52l84J39m7J9J30j20j4j19K45M6l85M14L0k71k7K35O5
7768B66l15K06l04o4J62K71j55N8o4j82J26L85l84l28K77L46m18J54J34j33j9
7789A9k56M66n74M18j18k55K43J7J89j23qm84K61K22k23K27p5M6k24K5J91K54
$$ plain form
7811 238 -144 -157 22 -219 -267 70 -211 -379 -73 100 -222 -183 129 104 -28 -54 -43 -487 -27 -83 -318 -52
7833 -52 -66 -78 -46 140 -77 -120 41 3 -238 91 124 59 151 492 39 -339 72 413 -106 -229 96 -296 123
7856 123 472 33 110 -68 -19 205 128 370 74 -302 422 61 -130 -81 -310 11 -213 113 -90 -301 291
7877 291 167 -213 217 175 56 377 105 -52 -230 41 164 16 124 107 18 143 174 -160 -44 -126 0 -198
7899 -198 140 302 24 71 193 -283 159 238 -100 62 -261 275 -224 -18 303 151 -230 172 -349 -282 101
7920 101 -195 -253 83 76 -131 -325 -5 151 -315 70 202 -74 -171 -31 31 -129 43 -41 -206 46 -205 -182
7942 -182 61 -190 -364 -263 -76 169 71 128 47 -183 37 48 -121 -94 -206 -10 -111 -83 326 -150 16 45
7964 45 143 35 220 -118 -124 -53 118 -44 280 13 -226 92 -66 241 -31 122 443 -245 110 154 -38 -92
$$ packed form
7811B38l82j3J79k41m8L37k81j68L06J73l22L9L12k5j32k6J1m44M60n6k35K66
7833e2j4j2L2J86k17m3J61l8k41L29L3o5R2L41m53l78M11L41n19j23L25l92M19
7856A23L49m39P7j78M9K24p7K42k96l76P24l61j91M9k29L21k24L26k03k11N92
7877B91j24l80M30m2j19L21k72j57j78K71J23j48J08j7q9J25L1l34J16q2J26j98
7899a98L38J62k78M7J22m76M42P9l38J62l23N36m99K06L21j52l81M02n21O7L83
7920A01k96n8L36pk07j94L20J56m66L85J32k76r7J40O2j60J72q4j65K52k51K3
7942a82K43k51j74J01J87K45r8N7q1k30K20J1j69K7j12J96j01K8M09m76J66K9
7964D5R8j08J85l38oP1J71j62L24k67k39L18j58L07k72J53L21o88L55M4j92n4
$$ plain form
7986 -92 22 -75 -99 102 237 93 18 -34 -86 -205 232 193 65 158 120 154 -11 390 -80 -61 103 195 44 -49
8010 -49 38 19 96 -34 227 78 192 269 -21 302 140 188 102 119 42 -102 53 28 -315 119 213 80 215 -50
8034 -50 -109 -222 171 181 -200 -85 7 -138 35 133 -30 -166 261 113 37 -84 46 -125 -293 195 -362 -168
8056 -168 177 128 66 212 4 -70 -69 -89 -184 -170 -25 -37 -327 180 212 -109 -58 -52 93 -371 16 174 -228 322
8080 322 148 -200 -127 102 -19 -112 42 256 230 -117 -227 441 11 -58 48 -406 131 234 189 -93 -17 135
8102 135 -186 200 261 -149 138 57 -43 40 218 130 -39 -126 8 -129 348 31 -127 257 -28 190 203 174
8124 174 50 68 9 51 -27 196 159 -54 -118 50 277 139 130 61 -31 -140 244 93 72 22 189 82 221 416
8148 416 366 126 -181 44 31 210 71 -179 18 125 -25 74 271 7 -198 -80 -126 69 155 108 91 7 187
$$ packed form
7986i2J14r7k4K01J35j44p5n2n2j19M37l9j28R3l8L4j65M01m70J9J64R2j51r3
8010d9Q7j9P7j30K61j49J14P7k90L23j62M8q6J7p7j44J55k5l43M34R4j33J35k65
8034e0n9j13L93J0l81J15R2j45J73R8j63j36M27j48p6j21J30j71j68M88n57J94
8056a68L45m9o2J46k08p4Jk0r5J4J45j2k90N07L2l21N1OJ45m64L87J58m02N50
8080C22j74l48P3K29j21r3J54K14k6l47j10O68m30o9J06m54N37J03m5k82P6J52
8102A35l21L86O1m10K87q1j00Q3J78q8j69q7J34j37M77l17j58L84k85K18J3k9
8124A74j24J8n9M2p8K23l7k13o4J68K27j38ro9r2j09L84j51k1n0J67j07J39J95
8148D16n0k40l07K25j3J79j39k50J97J07j50R9J97k64k05J18m6J95Q6m7j7q4J80
$$ plain form
8171 187 -27 -47 193 73 -24 69 -168 -131 -107 -197 -213 -62 -124 16 21 88 160 -163 -426 3
$$ packed form
8171A87k14k0K40j20r7R3k37L7K4r0j6J51o2J40NO7P2l23k63M29
8191C
$$ Imaginary data points
##PAGE= N=2
##DATA TABLE= (X++(I..I)), XYDATA
$$ plain form
0 0 0 0 0 0 1 0 8 -8 8 -12 16 -17 24 -32 40 -42 56 -64 74 -89 105 -121 138 -160 184 -211 239 -271 310 -350
30 -350 392 -440 494 -552 616 -686 764 -848 940 -1041 1155 -1277 1413 -1566 1736 -1924
46 -1924 2140 -2387 2666 -2993 3383 -3850 4424 -5155 6114 -7438 9389 -12570 18646 -34506
60 -34506 163025 366454 60184 -51333 10576 142158 175495 144960 65197 104957 177405
71 177405 137118 40424 72229 104671 68848 90250 188368 179293 79577 -5943 -28397 52169
83 52169 200106 198266 40886 -24732 46282 72388 54839 60878 41430 15241 63764 97818
95 97818 42891 -17074 -47294 -59388 31299 159800 101263 -91570 -139468 -30766 45294 38961
107 38961 -13753 -67580 -34792 34712 -17162 -115955 -82552 -5293 -20521 -34749 1322 -17015
$$ packed form
0@%%%%JjQj6J6k0K8l3M1n6P2q2R8j20J38j63J94k26K59k98L44l95M50n10N81o60
30c50P42q32R34j046J168j302J450j612J788j981K196k432K690k979L302l660
46a924M064m527N053n659O376p233Q274r579J1269j3552J6827k1959L1216n3152
60c4506J97531K03429l06270j11517O1909J31582L3337l0535p9763L9760P2448
71A77405m0287r6694L1805L2442l5823K1402R8118r075r9716q5520k2454Q0566
83E2169J47937j840j57380o5618P1014K6106j7549O039j9448k6189M8523L4054
95I7818n4927n9965l0220j2094R0687J28501n8537j92833m7898J08702P6060o333
107C8961n2714n3827L2788O9504n1874r8793L3403P7259j5228j4228L6071j8337
$$ plain form
119 -17015 -84478 -116797 -108319 -37955 69873 48185 -113317 -166614 -51491 18244 -21804 -64096
131 -64096 -74429 -42948 25760 14544 -93140 -123042 -43603 2358 11671 31964 -12073 -101625
143 -101625 -92157 -11313 20636 18935 4779 -45687 -52533 13276 17990 -46620 -39109 17015 17054
156 17054 10579 26932 -9168 -57470 -33157 13368 41455 71183 35287 -70942 -76219 42388
168 42388 87725 18048 -29484 -16625 24946 72633 43788 -57307 -62619 46657 89601 38794
180 38794 6994 -8564 -29628 983 47903 37787 22974 28921 -4363 -25841 29104 54814
192 54814 -2809 -24471 18771 41885 43220 31365 -29809 -61652 13902 82240 52896 7425
204 7425 -14259 -37619 -8363 64185 54652 -18087 -22718 22209 37404 35372 9478 -43096 -23951
$$ packed form
119a7015o7463l2319Q478P0364J07828k1688j61502n3297J15123O9735m0048m2292
131f4096j0333L1481O8708j1216j07684k9902P9439M5961R313K0293m4037q9552
143a01625R468Q0844L1949j701j4156n0466o846O5809M714o4610P511N6124L9
156A7054o475J6353l6100m8302K4313M6525K8087K9728l5896j06229n277J18607
168D2388M5337o9677m7532J2859M1571M7687k8845j01095n312J09276M2944n0807
180C8794l1800j5558k1064L0611M6920j0116j4813N947l3284k1478N4945K5710
192E4814n7623k1662M3242K3114J335j1855o1174l1843P5554O8338k9344m5471
204G425k1684k3360K9256P2548r533p2739m631M4927J5195k032k5894n2574J9145
$$ plain form
217 -23951 67712 79042 2947 -24488 -4337 1171 21928 46535 20988 1176 20443 6804
229 6804 -17500 22818 49791 -1233 -25346 18971 42077 27598 4826 -37983 -41765 41107
241 41107 84920 10688 -50517 -22799 8876 19261 27570 -1891 -34536 580 35422 2322
253 2322 -21148 -6140 -13861 -14072 26251 27457 -20196 -27184 -9012 -17545 -6266 25782 5416
266 5416 -29158 -15670 -7390 -20622 445 12865 -28958 -38324 10370 20246 -15449 -32804 -40005
279 -40005 -30060 25659 43243 -28953 -69104 -18993 16412 875 -9686 -20240 -27378 5127
291 5127 21086 -22687 -36966 4948 8568 -16465 1914 19000 -6095 -15716 -7237 -12792 8232
304 8232 43170 12042 -37656 -12963 28555 17996 4777 1948 -14241 3515 47363 27844
$$ packed form
217b3951R1663J1330p6095k7435K0151N508K0757K4607k5547j9812J9267j3639
229F804k4304M0318K6973n1024k4113M4317K3106j4479k2772m2809l782Q2872
241D1107M3813p4232o1205K7718L1675J0385Q309k9461l2645L5116L4842l3100
253B322k3470J5008p721k11M0323J206m7653o988J8172q533J1279L2048k0366
266E416l4574J3488Q280j3232K1067J2420m1823r366M8694R876l5695j7355p201
279d0005R945N5719J7584p2196m0151N0111L5405j5537j0561j0554p138L2505
291E127J5959m3773j4279M1914L620k5033J8379J7086k5095r621Q479n555K1024
304H232L4938l1128m9698K4693M1518j0559j3219k829j6189J7756M3848j9519
$$ plain form
316 27844 -25257 -17812 15555 21771 32122 29605 -14795 -24319 27632 41391 5964 104 11967
329 11967 8884 23220 32493 -2033 -13659 25870 30656 3042 15518 31573 3264 -8509 12050
342 12050 17426 22931 34204 1998 -30252 10612 50497 15018 -20344 -5876 11923 25695
354 25695 31910 -8560 -44030 -2074 43499 17457 -13631 -8138 -10426 -6648 17734 7372 -25065
367 -25065 -10937 12554 -4527 -11827 2461 -12373 -24857 1582 7832 -15210 -7073 1749 -25782
380 -25782 -28038 6703 7914 -12979 -12595 -19287 -28131 3715 20323 -24225 -44652 -5027 14601
393 14601 -847 -12822 -30374 -36808 5582 30550 -14417 -42546 -11737 2867 -9382 -5152
405 -5152 -8330 -22315 -5285 8663 -17002 -21831 7641 -64 -25572 -7798 11535 -888 -4699
$$ packed form
316B7844n3101P445L3367O216J0351k517m4400r524N1951J3759l5427n860J1863
329A1967l083J4336R273l4526j1626L9529M786k7614J2476J6055k8309j1773K0559
342A2050N376N505J1273l2206l2250M0864L9885l5479l5362J4468J7799J3772
354B5695O215m0470l5470M1956M5573k6042l1088N493k288L778K4382j0362l2437
367b5065J4128K3491j7081p300J4288j4834j2484K6439O250k3042Q137Q822k7531
380b5782k256L4741J211k0893L84o692q844L1846J6608m4548k0427L9625J9628
393A4601j5448j1975j7552o434M2390K4968m4967k8129L0809J4604j2249M230
405e152l178j3985J7030J3948k5665m829K9472p705k5508J7774J9333j2423l811
$$ plain form
418 -4699 -5429 -24564 -10980 30157 18918 -23250 -19059 4254 7399 15559 12448 -20689 -19440 25788
432 25788 30552 -5081 -11788 -1858 34 20468 29892 -5276 -20387 11986 20030 -45 6883
445 6883 15000 -1811 94 14733 4307 2387 20056 4798 -19377 8881 36289 11325 -12345
458 -12345 -6787 -842 17965 38799 8208 -34308 -8574 34980 24922 1472 -5325 -12313 4042
471 4042 36790 19827 -23174 -14108 16082 12819 8908 12499 -8365 -17136 10417 15854 -4902
484 -4902 1283 8559 -13080 -11598 15596 10501 -9119 -6062 -8310 -12045 16261 24554 -17776 -36035
498 -36035 -1038 18769 11073 1968 -20872 -31359 8279 36781 116 -31368 -13715 4122
510 4122 9310 14527 -6071 -31494 -7358 22326 3989 -13027 -1286 -5171 -14188 3906 9776
$$ packed form
418d699p30j9135J3584M1137j1239m2168M191K3313L145Q160l111l3137J249M5228
432B5788M764l5633o707R930J892K0434R424l5168j5111L2373Q044k0075O928
445F883Q117j6811J905J4639j0426j920J7669j5258k4175K8258K7408k4964k3670
458a2345N558N945J8807K0834l0591m2516K5734M3554j0058k3450o797o988J6355
471D042L2748j6963m3001R066L0190l263l911L591k0864q771K7553N437k0756
484d902O185P276k1639J482K7194n095j9620L057k248l735K8306Q293m2330j8259
498c6035L4997J9807p696r105k2840j0487L9638K8502l6665l1484J7653J7837
510D122N188N217k0598k5423K4136K9684j8337j7016J1741l885r017J8094N870
$$ plain form
523 9776 -7863 -5872 726 -15523 -9507 19511 8618 -23513 -17124 2030 5196 12377 4640 -28911
537 -28911 -24662 21080 26304 -7992 -19138 -11820 -3919 18445 22104 -16154 -28552 6421 19847
550 19847 2609 -376 -3012 -14147 1612 20223 2147 -9526 6286 2088 -12346 6490 20582
563 20582 299 -9328 -1656 -3622 7725 27627 4722 -29548 -9421 26318 20974 4128 -6897
576 -6897 -18287 398 37167 23953 -18996 -15673 12193 17174 17576 13752 -9302 -11060 20582
589 20582 25638 3251 4950 11415 -1409 4902 26374 17511 1496 7401 4484 622 24851 32876
603 32876 -1096 -15749 9810 24686 22282 17708 -6786 -20512 15230 44648 16101 -14266
615 -14266 -8604 4063 18773 30800 6425 -25797 -6227 26924 17213 -560 -580 -6918 -6228 15356
$$ packed form
523I776j7639J991O598j6249O016K9018j0893l2131O389J9154L166P181p737l3551
537b8911M249M5742N224l4296j1146P318P901K2364L659l8258j2398L4973J3426
550A9847j7238k985k636j1135J5759J8611j8076j1673J5812m198j4434J8836J4092
563B0582k0283r627P672j966J1347J9902k2905l4270K0127L5739n344j6846j1025
576f897j1390J8685L6769j3214m2949L323K7866M981M02l824k3054j758L1642
589B0582N056k2387J699O465j2824O311K1472q863j6015N905k917l862K4229Q025
603C2876l3972j4653K5559J4876k404m574k4494j3726L5742K9418k8547l0367
615a4266N662J2667J4710J2027k4375l2222J9570L3151r711j7773k0o338O90K1584
$$ plain form
629 15356 14930 -7873 -6439 2566 -8732 -3678 17592 5547 -19581 -13667 -1120 177 9280 3180
643 3180 -28945 -28034 11019 17210 -10575 -23407 -23004 -15645 9752 13661 -24710 -40081 -9592 5738
657 5738 -5495 -9888 -18614 -28923 -8812 9516 -11010 -25802 -10893 -8291 -15413 -3538 -131
670 -131 -16961 -14682 -4210 -11827 -8222 10665 -1856 -26300 -12824 9524 5373 -407 -5668 -18863
684 -18863 -7510 23027 14548 -18155 -15235 5689 10067 12284 7699 -14009 -11480 18990 19730 -4062
698 -4062 -2663 8074 2715 6223 15361 3808 -1137 12792 9175 -3502 10883 21213 2199
711 2199 -4390 9170 10480 10677 17914 2552 -14825 6271 28316 11064 -6099 -2191 -441 7642
725 7642 20798 4568 -20787 -4761 18020 7462 -5021 -3075 -8471 -6641 10343 4826 -15520
$$ packed form
629A5356m26k2803J434R005j1298N054K1270j2045k5128N914J2547J297R103o100
643C180l2125R11L9053O191k7785j2832M03P359K5397L909l8371j5371L0489J5330
657E738j1233m393q726j0309K0111J8328k0526j4792J4909K602p122J1875L407
670a31j6830K279J0472p617L605J8887j2521k4444J3476K2348m151n780n261j3195
684a8863J1353L0537q479l2703K920K0924M378K217m585k1708K529L0470P40k3792
698d062J399J0737n359L508R138j1553m945J3929l617j2677J4385J0330j9014
711B199o589J3560J310J97P237j5362j7377K1096K2045j7252j7163L908J750Q083
725G642J3156j6230k5355J6026K2781j0558j2483J946n396J830J6984n517k0346
$$ plain form
738 -15520 -8213 4345 -7774 -11379 2209 -2562 -12760 -5676 -6286 -13636 -211 5247 -18039 -22267
752 -22267 1748 5760 -8340 -11845 -15203 -15922 4800 12762 -15118 -26855 -4885 4959 -2375 -3349
766 -3349 -10470 -18486 718 13995 -7244 -19461 -3172 2802 -3075 2439 -119 -11856 -2205 8215
780 8215 -4751 -7347 9661 6059 -8916 -1014 6460 159 3944 7530 -6188 -3910 17404 12001
794 12001 -9640 -4880 8533 7679 11148 9394 -9339 -6888 17774 15649 -6505 -3157 8397 5348
808 5348 7893 8278 -7962 -7083 15089 13429 -5622 -2427 5874 -1006 597 6254 -4518 -5442 10941
823 10941 5745 -12298 -5007 6523 -1757 -3987 2757 -4212 -5250 6621 -1468 -17290 -3656 12026
837 12026 223 -8625 -3489 -6364 -3862 7679 -1135 -16974 -2712 13288 -271 -11617 -5675
$$ packed form
738a5520P307J2558j2119l605J3588m771j0198P084o10p350J3425N458k3286m228
752b2267K4015M012j4100l505l358p19K0722P962k7880j1737K1970R844p334r74
766c349p121q016J9204J3277k1239j2217J6289N974n877N514k558j1737R651J0420
780H215j2966k596J7008l602j4975P902P474o301L785L586j3718K278K1314n403
794A2001k1641M760J3413q54L469j754j8733K451K4662k125k2154L348J1554l049
808E348K545L85j6240Q79K2172j660j9051L195Q301o880J603N657j0772r24J6383
823A0941n196j8043P291J1530q280k230O744o969j038J1871q089j5822J3634J5682
837A2026j1803q848N136k875K502J1541q814j5839J4262J6000j3559j1346N942
$$ plain form
850 -5675 -4622 -589 10429 1124 -16097 -4096 10475 -1440 -9249 912 708 -1676 5546 -148
864 -148 -12313 -963 10430 -2459 -6599 6353 4679 -3390 766 -1518 -7311 7125 16267 -3223
878 -3223 -11969 3705 7824 1254 3933 -195 -6543 7544 16190 -3572 -13402 2359 7464 2363
892 2363 6152 1240 -9796 -532 8873 -4283 -8326 6917 4609 -8185 -3907 351 -5127 -726
906 -726 2030 -11087 -8690 9854 4009 -17032 -13285 -1892 -241 4504 2080 -17488 -18015 5215
920 5215 6930 -10317 -10709 -4906 -6369 1695 4297 -13202 -18515 567 4727 -5606 -3385 -2531 -12322
935 -12322 -8130 3193 -3319 -6737 2927 -3161 -14253 -2665 7639 -3276 -9156 -3010 -3730 2147
949 2147 12558 -1862 -20957 -6484 15042 10476 129 -3479 -9101 -899 17144 9699 -10591
$$ packed form
850e675J053M033J1018r305j7221J2001J4571j1915p809J0161k04k384P222n694
864a48j2165J1350J1393j2889m140J2952j674q069M156k284n793J4436R142j9490
878c223q746J5674M119o570K679m128o348J4087Q646j9762r830J5761N105n101
892B363L789m912j1036R264R405j3156m043J5243k308j2794M278M258n478M401
906g26K756j3117K397J8544n845k1041L747J1393J651M745k424j9568n27K3230
920E215J715j7247l92N803j463Q064K602j7499n313J9082M160j0333K221Q54r791
935a2322M192J1323o512l418R664o088j1092J1588J0304j0915n880O146p20N877
949B147J0411j4420j9095J4473K1526m566j0347l608n622Q202J8043p445k0290
$$ plain form
962 -10591 -3789 11938 8310 4684 6027 -2940 -3614 12940 13726 1166 4879 9106 -1774 -238
976 -238 13762 10947 2709 6585 3367 -1857 11171 17496 -459 -7001 8235 13126 8970 8658 -2084
991 -2084 -10683 7853 23248 6756 -7158 -392 3395 4641 11609 3822 -9859 894 13621
1004 13621 2879 -4210 3376 298 -5125 3908 5933 -2219 1032 2813 -10659 -8505 10329 7804
1018 7804 -8391 -8443 -3793 -2738 5245 4412 -14980 -16911 5387 8916 -5302 -9656 -10589 -11965 2230
1033 2230 9282 -7949 -17183 -4798 -1176 -6423 -2104 -2662 -12992 -7785 2347 -4322 -7948 -701
1047 -701 -6537 -14856 -1551 7915 -2542 -8512 -7746 -11229 -2158 13405 2650 -18759 -11807 5206
1061 5206 5673 2243 -3539 -15139 -7901 14841 11910 -10051 -11614 -2071 1120 7358 9389 -5864
$$ packed form
962a0591O802J5727l628l626J343q967o74J6554P86j2560L713M227j0880J536
976b38J4000k815q238L876l218n224J3028O325j7955o542J5236M891m156l12j0742
991b084q599J8536J5395j6492j3914O766L787J246O968p787j3681J0753J2727
1004A3621j0742p089P586l078n423R033K025q152L251J781j3472K154J8834k525
1018G804j6195n2M650J055P983q33j9392j931K2298L529j4218m354r33j376J4195
1033B230P052j7231r234J2385L622n247M319n58j0330N207J0132o669l626P247
1047g01n836q319J3305R466j0457n970P66l483R071J5563j0755k1409O952J7013
1061E206M67l430n782j1600P238K2742k931k1961j563R543L191O238K031j5253
$$ plain form
1075 -5864 -11273 3791 7455 -692 3237 4922 -6095 -2643 10662 7701 -220 1614 -1983 -4501
1089 -4501 12153 19309 -287 -10701 307 7616 11173 13659 -275 -13293 3290 20358 9632
1102 9632 -3232 -2162 -1111 6451 17780 8323 -10647 -4672 9607 7738 4773 7129 -1717 -5866
1116 -5866 5794 8670 330 2688 4528 -5355 -2799 12033 8544 -4790 -4235 -1653 946 12226
1130 12226 11487 -10162 -15016 4560 12168 4268 -269 -7190 -10271 5253 14297 -2326 -13040 -2632
1144 -2632 2012 843 5433 -446 -12790 -6157 4969 116 -3250 2266 -5110 -12629 -1356 6230
1158 6230 -2063 -4459 -4116 -10514 -3769 10889 2528 -15602 -11290 622 3663 4995 -1228 -17062
1172 -17062 -14157 8536 10377 -5798 -10164 -6985 -4933 3954 7047 -8449 -14181 -426 4056 -2165
$$ packed form
1075e864n409J5064L664q147L929J685j1017L452J3305k961p921J834l597k518
1089d501J6654P156j9596j0414J1008P309L557K486j3934j3018J6583J7068j0726
1102I632j2864J070J051P562J1329r457j8970N975J4279j869k965K356q846m149
1116e866J1660K876q340K358J840r883K556J4832l489j3334N55K582K599J1280
1130A2226p39k1649m854J9576P608p900m537o921l081J5524R044j6623j0714J0408
1144b632M644j169M590n879j2344O633J1126m853l366N516p376p519J1273P586
1158F230q293k396L43o398O745J4658q361j8130M312J1912L041J332o223j5834
1172a7062K905K2693J841j6175m366L179K052Q887L093j5496n732J3755M482o221
$$ plain form
1186 -2165 405 -1327 -10928 -6748 5771 2496 -2731 -506 -6486 -10554 4260 12171 -2543 -10800
1200 -10800 -4130 -100 5399 10028 -3328 -16548 -2560 14342 8145 -1993 -5098 -7970 627
1213 627 15827 8727 -9839 -6586 5833 6107 5768 6028 -3937 -5729 8477 10852 930 1893 3808
1228 3808 -3256 952 13070 8073 -2123 192 1005 1084 11929 12679 -4837 -9037 6525 11958 6461
1243 6461 3292 -4606 -6396 9186 17880 1319 -9041 -530 4717 5579 9446 1376 -9558 -823
1257 -823 10675 3359 -2507 1824 -1913 -4587 4810 5928 -3684 -3202 286 -5101 -2150 8057 847
1272 847 -11576 -6255 987 93 1922 -1085 -13718 -11059 5932 5678 -8073 -10254 -7469 -5748 2506
1287 2506 3592 -11904 -15939 -1277 2247 -4901 -4596 -5794 -11126 -4480 3334 -4302 -8605 -2440 -4733
$$ packed form
1186b165K570j732r601M180J2519l275n227K225n980m068J4814P911j4714q257
1200a0800O670M030N499M629j3356j3220J3988J6902o197j0138l105k872Q597
1213F27J5200p100j8566L253J2419K74l39K60r965j792J4206K375r922R63J915
1228C808p064M208J2118m997j0196K315Q13P9J0845P50j7516m200J5562N433n497
1243F461l169p898j790J5582Q694j6561j0360Q511N247Q62L867q070j0934Q735
1257h23J1498p316n866M331l737k674R397J118r612M82L488n387K951J0207p210
1272H47j2423N321P242q94J829l007j2633K659J6991k54j3751k181K785J721Q254
1287B506J086j5496m035J4662L524p148L05j198n332O646P814p636m303O165k293
$$ plain form
1302 -4733 -9074 -352 3724 -6612 -8649 -3109 -4099 -1208 5081 -4192 -15064 -3760 8038 2044
1316 2044 -3828 -5053 -8717 -1752 10883 4032 -10985 -6787 3597 3458 3877 2703 -6797 -6272 7934
1331 7934 8240 -2293 -895 2478 -1419 2234 9601 2813 -3234 2704 3243 587 8112 8889 -4014
1346 -4014 -4972 6506 8461 4107 3689 -2530 -5695 8277 14849 952 -7656 -389 4234 6126 8298
1361 8298 -990 -9804 900 11797 4056 -2888 -282 -2043 -829 7827 4478 -5892 -2845 3246
1375 3246 -682 -158 5326 -1664 -7711 -131 3515 -623 826 484 -8305 -4917 7420 4297 -6822
1390 -6822 -5943 -2657 -1823 5094 4227 -9840 -11243 3280 5818 -1747 -3762 -5796 -7432 2164 6899
1405 6899 -4426 -9244 -607 879 -3127 876 -181 -7517 -3495 3023 -1664 -2972 2257 -2922 -8944
$$ packed form
1302d733m341Q722M076j0336k037N540r90K891O289r273j0872J1304J1798n994
1316B044n872j225l664O965J2635o851j5017M198J0384j39M19j174r500N25J4206
1331G934L06j0533J398L373l897L653P367o788o047N938N39k656P525P77j2903
1346d014r58J1478J955m354m18o219l165J3972O572j3897q608P267M623J892K172
1361H298r288q814J0704J0897p741o944K606j761J214Q656l349j0370L047O091
1375C246l928N24N484o990o047P580L646m138J449l42q789L388J2337l123j1119
1390f822Q79L286Q34O917q67j4067j403J4523K538p565k015k034j636R596M735
1405F899j1325m818Q637J486m006M003j057p336M022O518m687j308N229n179o022
$$ plain form
1420 -8944 383 5772 -1050 -4049 -2430 -5180 -576 8130 1141 -10379 -4572 4480 1872 569 -589
1435 -589 -8063 -5076 7392 5456 -5755 -4675 -133 -1629 2372 4809 -3896 -6499 2406 2612 -2574
1450 -2574 1097 2397 -4760 -3348 4485 1815 -1619 1193 -2701 -5985 4455 9674 -1412 -7018
1464 -7018 -1358 1861 4465 7378 -1887 -9626 1175 10800 3355 -2802 -928 -1693 1503 9499 5109
1479 5109 -5683 -1998 5131 2602 3177 6250 -722 -4476 3954 6270 1498 3534 3255 -3536 331
1494 331 10167 5841 -2373 -846 1413 2211 9247 8299 -5304 -6649 5940 9370 4138 2563 -2406
1509 -2406 -4387 6470 12303 131 -6582 1000 3995 3123 5431 636 -6222 -572 6126 1772 -410
1524 -410 2648 -2563 -6553 2190 5514 -1382 -2938 -1993 -4797 -636 6848 -507 -10356 -4910 2285
$$ packed form
1420h944R327N389o822k999J619k750M604Q706o989j1520N807R052k608j303j158
1435e89p474K987J2468j936j1211J080M542j496M001K437q705k603Q905K06n186
1450b574L671J300p157J412P833k670l434K812l894l284J0440N219j1086n606
1464g018N660L219K604K913r265p739J0801R625p445o157J874p65L196P996m390
1479E109j0792L685P129k529N75L073o972l754Q430K316m772K036k79o791L867
1494C31R836m326q214J527K259P98P036r48j3603j345J2589L430n232j575m969
1509b406j981J0857N833j2172o713P582K995q72K308m795o858N650O698m354k182
1524d10L058n211l990Q743L324o896j556R45k804M161P484p355r849N446P195
$$ plain form
1539 2285 1262 792 -2528 -10589 -6960 5704 3776 -5949 -6638 -4494 -4391 945 2515 -7215 -9984
1554 -9984 -813 576 -4065 -2126 -3171 -8299 -4502 1959 -2043 -4830 -1704 -5677 -8806 507 4378
1569 4378 -4552 -8141 -3633 -3338 -223 3957 -4350 -11392 -2321 6275 1146 -3926 -3774 -6163 -1710
1584 -1710 7307 3126 -7100 -3783 1784 -358 1610 4178 -2446 -4872 2933 4137 222 2352 2018
1599 2018 -4273 -621 8538 4963 -1584 -143 -406 231 8530 9354 -2540 -5567 3763 6745 5285
1614 5285 4823 -1622 -4624 5557 12141 3154 -3446 134 1903 4427 9144 4058 -5267 -589 6450
1629 6450 3635 2730 4793 -636 -3480 4646 7212 1144 302 -82 -3309 1737 9917 3260 -7058
1644 -7058 -3534 1794 3406 5631 1798 -8558 -6003 6299 5814 -2528 -4081 -3919 -3285 3482 5511
$$ packed form
1539B285j023m70l320q061L629J2664j928r725o89K144J03N336J570r730k769
1554i984R171J389m641J939j045n128L797O461m002k787L126l973l129R313L871
1569D378q930l589M508K95L115M180q307p042R071Q596n129n072J52k389M453
1584a710R017m181j0226L317N567k142J968K568o624k426P805J204l915K130l34
1599B018o291L652R159l575o547J441k63O37Q299Q24j1894l027R330K982j460
1614E285m62o445l002J0181O584q987o600L580J769K524M717n086r325M678P039
1629F450k815r05K063n429k844Q126K566o068q42l84l227N046Q180o657j0318
1644g058L524N328J612K225l833j0356K555J2302m85q342j553J62O34O767K029
$$ plain form
1659 5511 -4840 -8809 -1586 772 -571 860 -2270 -9139 -4182 2791 -656 -3642 -1976 -5259 -6601
1674 -6601 1176 3171 -4637 -6655 -3872 -3969 -529 3908 -3672 -11559 -4812 3383 867 -1765 -4599
1689 -4599 -8958 -3922 5620 1847 -7588 -6007 -1052 -1166 1085 1735 -5470 -6424 963 1741 -1449 920
1705 920 -36 -6251 -2890 5071 2809 -2057 -799 -2619 -2207 5641 6557 -3276 -5298 1913 3860 3434
1721 3434 4751 -1862 -6458 2683 9419 3293 -1080 -356 -1066 2415 9069 4242 -4429 -1132 4840
1736 4840 3684 3376 4281 -1373 -2368 4606 6042 1611 2583 1541 -2990 938 9387 5423 -2155 -1447
1752 -1447 979 3068 7917 4831 -5317 -4360 6759 7237 1604 -527 -2397 -2414 5117 8017 -890
1767 -890 -4732 469 1498 1339 4586 1017 -5917 -1806 4481 1806 -518 -88 -3618 -3981 3337 4257
$$ packed form
1659E511j0351l969P223K358j343J431l130o869M957O973l447k986J666l283j342
1674f601P777J995p808k018K783r7L440M437p580p887O747Q195k516k632k834
1689d599m359N036R542l773r435J581M955j14K251O50p205r54P387P78l190K369
1705I20r56o215L361P961k262m866J258j820M12P848R16r833k022P211J947m26
1721C434J317o613m596R141O736o126m373P24p10L481O654m827q671L297N972
1736D840j156l08R05n654r95O974J436m431R72j042m531L928Q449l964p578P08
1752a447K426K089M849l086j0148R57J1119M78n633k131j870j7P531K900q907
1767h90l842N201J029j59L247l569o934M111O287k675k324M30l530l63P318R20
$$ plain form
1783 4257 -2538 -3456 -1473 -3121 187 4974 -1293 -8003 -3195 2071 553 515 -2226 -7946 -4021 5841
1799 5841 2301 -6075 -5566 -2031 -1374 1414 854 -6028 -6027 750 448 -3237 -1059 -1231 -5456 -2958 2173
1816 2173 -1008 -3264 -1931 -3503 -3889 2369 2657 -5106 -5476 -380 72 -210 1389 -2843 -6464 109
1832 109 4014 -415 -2576 -1268 -3142 -529 4959 1026 -5405 -1919 2810 887 781 1759 -2417 -2405
1848 -2405 3693 2792 -1303 1510 2111 -2004 -26 4871 2511 -1007 966 822 479 5257 4671 -3102
1864 -3102 -2522 4709 4980 1771 1639 -324 -1274 4312 6704 -160 -1970 2626 2401 1668 4510 1969
1880 1969 -2545 1367 5149 1609 574 2719 -304 -1288 3977 3985 -797 274 1711 -589 544 4774
1896 4774 1176 -3384 335 2049 421 1740 485 -4378 -2083 4931 2252 -3412 -2367 -962 -976
$$ packed form
1783D257o795r18J983j648L308M787o267o710M808N266j518l8k741n720L925R862
1799E841l540q376N09L535O57K788n60o882JO777l02l685K178j72m225K498N131
1816B173l181k256J333j572l86O258K88p763l70N096M52k82J599m232l621O573
1832A09L905m429k161J308j874K613N488l933o431L486M729j923j06R78m176J2
1848b405O098r01m095K813O01m115J978M897k360l518J973j44l43M778n86p773
1864c102N80P231K71l209j32j963r50N586K392o864j810M596k25p33K842k541
1880A969m514L912L782l540j035K145l023r84N265Qm782J071J437k300J133M230
1896D774l598m560L719J714j628J319j255m863K295P014k679n664J045J405j4
$$ plain form
1911 -976 2035 1546 -4599 -4191 2331 1085 -2678 -1525 -1281 -3758 -384 1689 -2325 -3435 -9 -1691
1927 -1691 -3457 581 636 -4198 -3091 -310 -2039 -1729 880 -2797 -4931 129 1788 -3007 -3355 -1356
1943 -1356 -2779 -1157 2122 -1569 -5964 -1517 1476 -1214 -1388 -141 -3034 -2020 2479 -343 -3786
1958 -3786 -811 1424 -1276 -403 1683 -1537 -1735 1735 798 -1781 1501 2234 -1987 -1208 2419 610
1974 610 -694 1638 118 -1488 2615 3351 -1658 -1381 3226 1879 527 2313 363 -1428 2617 4292
1990 4292 -291 -418 3236 1578 327 3318 1686 -972 2253 3735 5 555 3658 998 -244
2005 -244 2788 2381 37 2326 3010 -1177 314 3812 1957 -915 1671 1751 108 2430 2623 -1918
2021 -1918 -800 4118 2579 -1003 607 738 -897 2073 2828 -1427 -1308 2518 1190 -1188 1253 1268
$$ packed form
1911i76L011m89o145M08O522j246l763J153K44k477L374K073m014j110L426j682
1927a691j766M038N5m834J107K781j729L10K609l677k134N060J659m795l48J999
1943a356j423J622L279l691m395M447K993k690j74J247k893J014M499k822l443
1958c786K975K235k700Q73K086l220j98L470r37k579L282P33m221P79L627j809
1974F10j304K332j520j606M103P36n009K77M607j347j352J786j950j791M045J675
1990D292m583j27L654j658j251K991j632k658L225J482l730N50L103k660j242
2005b44L032m07k344K289O84m187J491L498j855k872K586Q0j643K322J93m541
2021a918J118M918j539l582J610J31j635K970P55m255J19L826j328k378K441J5
$$ plain form
2037 1268 -1941 139 1941 -950 -799 1556 -795 -2646 1389 1930 -1808 -1342 264 -1847 -394 2357
2053 2357 -1090 -4199 -101 2138 -1204 -1742 -674 -3031 -1292 2518 -329 -4412 -1355 250 -1510
2068 -1510 -282 186 -3149 -2953 1436 168 -2764 -918 -565 -3035 -918 1025 -1925 -2679 -480 -1251
2084 -1251 -2188 1147 945 -3528 -2727 1119 184 -708 632 -1901 -2950 1713 2754 -1864 -2418 824
2100 824 27 14 2268 -503 -3272 1078 2618 -653 -217 1674 -342 -901 2631 1543 -1000 887
2116 887 2005 -705 927 3268 841 -919 2140 2232 291 2630 2457 -1428 107 4110 2340 7
2132 7 1792 1117 353 3341 3468 -881 -311 3063 2023 521 2189 1439 -684 1596 3290 33 383
2149 383 2875 625 -603 2192 1961 -754 672 1526 -1010 349 3007 -324 -2722 409 1980 5
$$ packed form
2037A268l209K080J802k891J51K355k351j851M035N41l738M66J606k111J453K751
2053B357l447l109M098K239l342n38J068k357J739L810k847m083L057J605j760
2068a510J228M68l335J96M389j268k932J846L53k470K117J943k950p54K199p71
2084a251r37L335k02m473Q01L846r35q92J340k533j049M663J041m618n54L242
2100H24p97j3K254k771k769M350J540l271M36J891k016n59L532j088k543J887
2116H87J118k710J632K341k427j760L059R2j941K339j73l885J535M003j770k333
2132GJ785o75p64K988J27m349N70L374j040j502J668p50k123K280J694l257L50
2149C83K492k250j228K795k31k715J426Q54k536J359K658l331k398L131J571j975
$$ plain form
2165 5 380 380 -2392 -875 2830 440 -2768 -826 221 -1349 808 1075 -2813 -2813 860 152 -1865 -348
2183 -348 -812 -3131 -1198 758 -1923 -2448 -421 -1919 -2720 450 380 -3495 -2849 -223 -1600 -764 394
2200 394 -2683 -4135 133 1551 -2095 -2449 -1069 -1708 -729 2006 -1246 -3955 -665 1173 -818 -431
2216 -431 45 -2428 -1669 1792 564 -1698 74 324 -1514 203 2712 -185 -1286 938 822 -112
2232 -112 2081 1638 -2207 -385 2933 1715 -39 980 33 -605 2845 3217 -716 -641 1869 1434 1378
2249 1378 2852 947 -839 2371 3354 130 401 2310 592 287 3269 2433 -13 1271 1959 54
2265 54 1312 3832 788 -964 1860 2238 684 1890 1427 -1452 395 3756 1327 -895 614 515
2281 515 -65 2057 2189 -1458 -915 2159 524 -449 1110 307 -1795 368 1986 -1090 -980 749 -858
$$ packed form
2165EL75%k772J517L705k390l208J942J047j570K157K67l888%L673p08k017J517
2183c48m64k319J933J956k681n25K027j498q01L170p0l875O46K626j377Q36J158
2200C94l077j452M268J418l646l54J380o39R79K735l252k709L290J838j991L87
2216d31M76k473P59L461j228k262J772K50j838J717K509k897j101K224j16r34
2232a12K193m43l845J822L318j218j754J019r47o38L450L72l933P5K510m35n6
2249A378J474j905j786L210R83l224K71J909j718l05K982q36k446J284O88j905
2265E4J258K520l044j752K824L78j554J206m63k879J847L361k429k222J509r9
2281E15n80K122J32l647N43L074j635r73J559q03k102K163J618l076J10J729j607
$$ plain form
2298 -858 -1481 1208 932 -2125 -1029 155 -872 -65 1094 -1487 -3339 -269 946 -1240 -1187 -755 -2396
2315 -2396 -1023 1799 -1373 -3455 -1257 310 -1366 -432 -284 -2740 -2438 746 -646 -2097 -632 -664
2331 -664 -2740 -724 965 -1687 -2335 -155 -550 -1409 787 139 -3073 -1573 1344 -83 -760 275
2347 275 -1319 -1886 1482 1560 -1952 -1387 1051 -86 107 917 -899 -2027 1391 2236 -551 -372 1194
2364 1194 -455 -103 2201 678 -844 1193 2034 -173 626 2107 1 -441 2244 1738 371 1354
2380 1354 1485 -410 996 3270 864 -321 1566 1294 107 1786 1918 -745 863 2725 1126 -350
2396 -350 1126 861 -388 1831 2188 -810 105 1830 686 -136 1174 764 -605 1013 1686 -887 -165
2413 -165 1599 -15 -479 1150 884 -1292 -86 579 -994 -285 1533 -746 -2258 380 215 -1529
$$ packed form
2298h58o23K689k76l057J096J184j027Q07J159k581j852L070J215k186N3M32j641
2315b396J373K822l172k082K198J567j676R34J48k456L02L184j392j451J465l2
2331f64k076K016J689k652o48K180l95q59K196o48l212J500K917j427o77J035
2347B75j594n67L368P8l512N65K438j137J93Q10j816j128L418Q45k787J79J566
2364A194j649L52K304j523j522K037Q41k207P99J481k106m42K685n06j367R83
2380A354J31j895J406K274k406j185J887k72j187J679J32k663J608J862j599j476
2396c50J476k65j249K219L57k998R15J725j144q22J310m10j369J618O73k573P22
2413a65J764j614m64J629k66k176J206O65j573P09J818k279j512K638j65j744
$$ plain form
2429 -1529 -283 68 -1538 -541 1095 -973 -2458 -54 190 -1500 -492 180 -2056 -1507 296 -1040
2445 -1040 -2195 -61 -200 -2081 -795 142 -1642 -1924 54 -1091 -1765 204 -138 -2719 -1361 493
2461 493 -1000 -738 46 -1414 -2298 708 818 -1612 -1060 252 -611 -158 916 -875 -1897 251 1291
2478 1291 -323 -43 601 -1131 -762 1993 301 -1311 999 1253 -331 885 2026 -296 -944 1635
2494 1635 1316 63 1284 902 -1398 772 2971 965 -482 1225 1028 481 2406 1616 -960 106
2510 106 3020 1454 375 1124 78 -506 2665 2784 -265 -306 1539 639 639 2350 615 -1238 1004
2527 1004 2061 249 520 1348 -556 -464 2237 1786 -710 -81 335 -178 1176 2272 -852 -1867 911
2544 911 1434 -122 104 -128 -1844 180 2065 154 -1864 -447 -245 -675 1207 553 -2294 -1519 358
$$ packed form
2429a529J246L51j606R97J636k068j485K404K44j690J008O72k236N49J803j336
2445a040j155K134j39j881J286R37j784k82J978j145o74J969l42k581J358J854
2461D93j493K62P84j460q84L006J10k430N52J312q63M53J074j791j022K148J040
2478A291j614K80O44j732L69K755j692j612K310K54j584J216J141k322o48K579
2494A635l19j253J221l82k300K170K199k006j447J707j97n47J925p90k576J066
2510A06K914j566j079P49j046n84L171J19l049m1J845r00%J711j735j853K242
2527A004J057j812K71Q28j904R2K701m51k496O29M16n13J354J096l124j015K778
2544I11N23j556K26k32j716K024J885j911k018J417K02m30J882o54k847P75J877
$$ plain form
2561 358 -148 -1037 102 -1107 -2532 -106 1199 -1348 -1724 -487 -1338 -1599 1129 78 -2947 -1753
2577 -1753 -182 -617 -164 778 -1920 -2661 272 876 -1508 -1604 -941 -1335 -130 1391 -758 -2673 -616
2594 -616 380 -952 481 461 -2015 -1564 640 166 -720 225 -160 -1825 726 2117 -324 -1279 -44
2611 -44 -54 231 2078 944 -2129 -380 2031 783 528 948 -904 -807 2153 2173 -369 -639 579 489
2629 489 1121 2509 238 -1594 801 2159 1140 1178 1310 -716 -254 2575 2108 124 717 568 -118
2646 -118 1991 2847 -349 -1226 1011 2179 1130 1386 426 -1737 289 3096 993 -724 402 -212
2662 -212 -55 1645 1599 -1461 -1134 864 860 319 1328 -1001 -2000 635 1717 -359 -796 80 -1451 -548
2680 -548 1444 294 -1975 -1473 251 -743 377 51 -2264 -2380 522 1194 -959 -972 -1492 -1908 -378
$$ packed form
2561C58n06q89J139j209j425K426J305k547l76J237q51k61K728j051l025J194
2577a753J571m35M53R42k698p41K933O04k384r6O63l94J205J521k149j915K057
2594f16R96j332J433k0k476M51K204m74q86R45l85j665K551J391k441r55J235
2611d4j0K85J847j134l073J749K411j248k55M20j852R7K960K0k542k70J218r0
2629D89O32J388k271j832K395J358j019L8J32k026M62K829m67j984N93j49o86
2646a18K109Q56l196q77K237J168j049K56r60k163K026K807k103j717J126o14
2662b12J57J700m6l060L27J998mn41J009k329r99K635J082k076m37Q76j531R03
2680e48J992j150k269N02J724r94J120l26k315j16K902O72k153j3n20m16J530
$$ plain form
2697 -378 1208 -869 -2723 -1047 -283 -1221 -141 -149 -2498 -2164 450 -226 -1317 -236 -1360 -2419 55
2714 55 1298 -1062 -1984 -475 -1347 -749 1121 -84 -2507 -1053 892 -347 11 328 -1537 -1646 1191
2731 1191 1321 -812 -770 -20 -648 394 1990 -199 -1741 503 1254 299 939 1222 -1118 -606 2188
2748 2188 1374 -181 668 13 -454 1646 2386 272 -984 734 821 918 2371 693 -1429 89 2776
2765 2776 1231 165 571 -418 -8 2511 2109 -400 -540 941 764 1074 1815 -65 -1570 866 1841
2782 1841 538 429 140 -1249 -299 2331 1067 -1182 -567 -217 -281 1305 1240 -1494 -1981 728 1041 -123
2800 -123 -159 -601 -2207 117 1959 -48 -1833 -548 -655 -751 964 288 -2115 -1865 252 -604 -762 -427
2818 -427 -1505 -2399 -73 679 -1271 -1793 -937 -1481 -917 954 -274 -2985 -1328 -18 -334 -217 -23
$$ packed form
2697c78J586k077j854J676P64r38J080qk349L34K614o76j091J081j124j059K474
2714E5J243k360r22J509q72N98J870j205k423J454J945j239L58L17j865j09K837
2731A191J30k133M2P50o28J042J596k189j542K244P51r55O40K83k340N12K794
2748B188q14j555Q49o55m67K100P40k114j256J718Q7R7J453j678k122J518K687
2765B776j545j066M06r89M10K519m02k509j40J481j77L10P41j880j505K436R75
2782A841j303j09k89j389R50K630j264k249O15L50o4J586o5k734m87K709L13j164
2800a23l6m42j606K324J842k007j785J285j07r6J715o76k403K50K117q56j58L35
2818d27j078q94K326P52j950n22Q56n44N64J871j228k711J657J310l16J17J94
$$ plain form
2835 -23 -2096 -2183 706 488 -1170 -917 -819 -1481 -22 1312 -760 -2026 -508 217 -727 372 -25 -2006
2853 -2006 -1102 1248 713 -490 398 -453 -1142 849 1775 -590 -1163 461 4 320 1831 434 -1608
2870 -1608 92 1889 573 288 737 -542 -478 2162 1489 -497 -262 1038 314 1031 2364 1 -1108
2887 -1108 1045 1648 703 1106 1184 -462 -63 2438 1326 -273 636 553 388 1642 1915 -625 -709 1438
2905 1438 1207 796 1169 364 -1313 712 2203 431 -725 186 -383 -83 1803 772 -1467 -622 1060
2922 1060 305 186 688 -801 -1413 729 1093 -948 -663 -158 -1130 -394 1565 -555 -2160 -701 201
2939 201 -334 -44 -332 -1780 -1393 759 319 -1397 -1082 -921 -1651 -182 836 -1623 -2353 -428 -121 -747
2957 -747 36 -1063 -2472 -917 716 -366 -1672 -722 -909 -1197 577 561 -1647 -1332 104 -438 -425 343
$$ packed form
2835b3k073q7K889k18j658K53R8o62J459J334k072j266J518P25r44J099l97j981
2853b006R04K350n35j203Q88q51o89J991R26k365n73J624m57L16J511j397k042
2870a608J700J797j316k85M49j279O4K640o73j986K35J300p24P17J333k363j109
2887a108K153O03r45M03P8j646L99K501j112j599R09q3j65J254K73k540q4K147
2905A438k31m11L73q05j677K025J491j772j156R11n69L00J886j031k239Q45J682
2922A060p55j19N02j489o12K142L64k041K85N05r72P36J959k120j605J459R02
2939B01n35K90k88j448L87K152m40j716L15J61p30J469J018k459p30J925L07o26
2957g47P83j099j409J555J633j082j306R50j87k88J774j6k208L15J436n42J3P68
$$ plain form
2975 343 -582 -1849 85 920 -438 -881 141 -1218 -755 1567 569 -1629 -575 599 242 246 980 -566
2993 -566 -998 1050 1266 -33 271 130 -536 323 2040 602 -666 536 701 78 1496 1738 -835
3010 -835 -207 1820 1333 548 1107 443 -334 1298 2107 115 -399 824 346 508 2106 856 -849 262
3028 262 1848 745 791 538 -526 -582 1808 1375 -344 -160 692 -36 623 1815 -371 -1324 282 1039
3046 1039 -158 930 392 -1492 -369 1299 696 -1157 -455 -97 -634 609 1084 -1086 -1582 323 381
3063 381 -384 162 -547 -1558 -115 1014 -274 -1185 -434 -630 -896 911 195 -2017 -1070 512 -240 -457
3081 -457 235 -1421 -1794 164 793 -802 -745 -624 -790 -262 1055 -525 -2348 -505 316 -215 -105 44
3099 44 -1282 -1184 1301 731 -738 -204 -94 -932 730 1152 -639 -1128 305 645 -354 764 265 -1410
$$ packed form
2975C43r25j267J934Q35j358m43J022j359M63K322r98k198J054J174l57MP34j546
2993e66m32K048K16j299L04j41o66Q59J717j438j268J202J65o23J418K42k573
3010h35O28K027m87p85N59o64p77J632Q09j992n14J223m78J62J598j250j705J111
3028B62J586j103M6k53j064n6K390m33j719J84Q52p28O59J192k186r53J606P57
3046A039j197J088n38j884J123J668o03j853P02L58n37J243M75k170m96J905N8
3063C81p65N46p09j011J443J129j288r11P51j96k66J807p16k212R47J582p52k17
3081d57O92j656l73J958O29j595N7J21j66N28J317j580j823J843Q21n31J10J49
3099D4j326R8K485n70j469N34J10q38J662M22j791m89J433L40r99J118m99j675
$$ plain form
3117 -1410 -172 1732 459 -343 496 -504 -462 1180 1439 -892 -282 798 332 381 1635 347 -1208
3134 -1208 620 1382 647 316 528 -621 -1 1897 1127 -681 9 1256 544 806 1484 -47 -728 945
3152 945 1254 577 634 271 -841 34 1929 617 -539 27 -39 28 1129 1185 -912 -916 1052 712 -75 436
3172 436 -614 -1243 423 1735 26 -903 -198 -601 99 1110 363 -1724 -663 488 156 87 227 -971
3190 -971 -1319 701 838 -721 -687 -475 -1260 -248 1168 -516 -1965 -464 189 -273 42 -251 -1573 -1146
3208 -1146 892 422 -835 -724 -966 -906 369 627 -1138 -1836 -163 -319 -121 463 -538 -1933 -578
3225 -578 814 173 -603 -377 -942 -1182 1036 934 -1343 -1091 -129 -281 1 927 -665 -1511 91 988
3243 988 74 -18 -88 -733 -167 1809 791 -1013 -376 428 67 878 1018 -687 -1005 811 1097 176 573
$$ packed form
3117a410J238J904j273q02Q39j000M2J642K59k331O10J080m66M9J254j288j555
3134a208J828P62p35l31K12j149O20J898p70j808O90J247p12K62O78j531o81J673
3152I45L09o77N7l63j112Q75J895j312j156N66o6O7J101N6k097mJ968l40p87N11
3172D36j050o29J666J312j709r29P05m03P00J011p47k087J061J151l32o9J40j198
3190i71l48K020J37j559L4K12p85J012J416j684j449J501O53m62L15k93j322M27
3208a146K038m70j257J11k42O0J275K58j765o98J673j56J98N84j001j395J355
3225e78J392o41p76K26n65k40K218j02k277K52R62j52K82R26j592q46J602Q97
3243I88r14r2p0o45N66J976j018j804O37Q04l61Q11J40j705l18J816K86r21L97
$$ plain form
3262 573 352 -772 249 2014 587 -538 429 4 154 1365 1233 -846 -314 1330 1012 507 992
3279 992 -97 -941 1016 1489 208 175 421 -198 375 1533 695 -963 123 928 146 437 717 -851
3297 -851 -775 1176 1136 -394 34 122 -899 558 1128 39 -1181 -47 32 -194 439 157 -1575 -820 942
3316 942 369 -453 -398 -839 -1030 585 1155 -926 -1765 -280 -368 -450 683 -353 -1690 -441 707 -177
3334 -177 -595 -544 -1805 -1175 761 644 -1148 -1011 -263 -545 -155 367 -677 -1989 -19 408 -300 -130
3352 -130 -546 -1253 -725 1077 302 -1275 -435 -380 -643 585 601 -1313 -1002 681 275 -138 578 -493 -1192
3371 -1192 336 1231 76 -554 55 -451 52 1020 959 -838 -396 879 777 498 398 -389 -546 562
3389 562 1253 427 -176 492 90 429 1677 493 -469 431 716 322 612 1165 -485 -272 1320 948 -104
$$ packed form
3262E73k21j124J021J765j427j125R67m25J50J211j32k079N32J644l18n05M85
3279I92j089q44J957M73j281l3K46o19N73J158q38j658J086Q05p82K91K80j568
3297h51P6J951m0j530M28Q8j021J457N70j089j220J134P9k26O33k82j732P55J762
3316I42n73q22N5m41j91J615N70k081q39J485q8q2J133j036j337J249J148q84
3334a77m18N1j261O30J936j17j792J37P48k82L90N22j044j312J970M27p08J70
3352a30m16p07N28J802p75j577Q40N5k63J228J6j914L11J683m06m13P16j071o99
3371a192J528Q95j155o30O09n06N03R68o1j797M42J275j02k79j00p87j57J108
3389E62O91q26o03O68m02L39J248j184r62R00K85l94K90N53j650K13J592l72j052
$$ plain form
3408 -104 560 207 -156 649 1596 363 -324 628 149 435 1134 1095 -694 -578 944 256 249 532 -246 -738
3428 -738 817 851 -512 -422 223 -243 93 793 15 -1082 -17 231 -480 -194 -23 -1147 -992 728 529
3447 529 -939 -575 -309 -823 290 614 -396 -1348 -351 116 -545 123 -402 -1314 -866 669 -546 -685
3465 -685 -490 -376 -620 410 224 -1172 -1204 174 -181 -27 205 -644 -1331 239 554 -346 -580 -76 -461
3484 -461 -594 629 17 -1193 -421 437 -18 209 441 -641 -815 855 792 -613 -91 406 -246 214 922
3503 922 173 -535 216 652 -289 301 810 -731 -363 1183 524 13 458 219 -28 835 1123 -364 -358 925
3523 925 657 207 861 239 -278 524 1035 317 366 618 144 -125 1132 1009 -330 -178 1093 79 158
3542 158 960 -28 -830 476 905 -128 -173 369 -383 -430 680 60 -584 209 13 -298 26 582 -650
$$ packed form
3408a04O64l53l63Q05R47j233o87R52m79K86O99l9j789J16J522o88pK83p78m92
3428g38J555L4j363R0O45m66L36P00p78j097J065K48p11K86J71j124J55J720j99
3447E29j468L64K66n14J113L24j010r52R97M67o61O68n25r12M48J535j215j39
3465f85J95J14k44J030j86j396l2J378l55J54K32q49o87J570L15r00k34N04l85
3484d61j33J223o12j210P72Q58m55K27K32j082j74J670o3j405N22M97o52M60P08
3503I22p49p08P51M36r41N90N09j541L68J546o59n11M45k39k47Q63K88j487OJ283
3523I25k68m50O54o22n17Q02N11p18M9K52m74k69J257j23j339J52J271j014P9
3542A58Q02r88q02J306M29j033m5N42p52m7J110o20o44P93j96l11L24N56j232
$$ plain form
3561 -650 -964 582 242 -712 189 -17 -822 24 427 -364 -561 75 -322 -814 45 -107 -1175 -691 259
3580 259 -92 -830 -207 -426 -884 -64 166 -873 -773 122 -508 -706 469 -486 -1053 -306 67 -829 -407
3599 -407 110 -852 -881 364 -171 -888 -311 19 -619 42 344 -673 -744 412 280 -314 247 128 -565 -430
3619 -430 643 -130 -578 -5 21 -239 539 477 -531 -289 724 608 215 483 110 -378 758 1049 -125
3638 -125 27 707 586 234 1081 508 -485 166 986 101 129 526 32 -397 966 1051 -126 353 607 198
3658 198 344 633 -40 -515 660 535 38 407 435 -411 3 1048 651 -427 196 185 -81 515 285 -441
3678 -441 -630 457 292 -326 -113 -179 -777 -7 745 -407 -604 -188 -250 -455 246 -90 -987 -388 551 -23
3698 -23 -624 13 -729 -1007 70 441 -589 -858 -212 -659 -288 292 -540 -1065 -336 -275 -352 -28 -95 -1029 -949
$$ packed form
3561f50l14J546l40r54R01k06q05Q46M03p91j97O36l97m92Q59j52j068M84R50
3580B59l51p38O23k19m58Q20K30j039J00Q95o30j98J175r55n67P47L73q96M22
3599d07N17r62k9J245n35p17N77L30o38O61L02j017p1J156j32n94N61j19o93J35
3619d30J073p73m48N73K6k60P78o2j008K42J013j16l93K68l73m88J136K91j174
3638a25J52O80j21l52Q47n73r93O51Q20q85K8L97m94m29J363Q5j177M79K54m09
3658A98J46K89o73m75J175j25m97L69K8q46M14J045l97j078O23j1k66N96k30p26
3678d41j89J087j65o18K13o6n98P70P52j152j97M16o2k05P01l36q97N99R39n74
3698b3o01O37p42k78J077L71j030k69O46m47L71N80q32n25P29O1p7L24o7r34Q0
$$ plain form
3719 -949 415 -108 -890 -190 -271 -782 21 577 -644 -789 -20 -237 -237 325 80 -1128 -355 288 -27 -633
3739 -633 194 -291 -554 783 762 -375 -350 657 -223 -69 455 -172 -614 101 233 -29 94 89 -96 25
3759 25 648 556 -324 178 626 124 469 631 -134 -195 423 748 182 352 427 -579 64 950 440 65 328
3780 328 552 124 638 986 -625 -140 757 567 327 663 298 -717 495 1234 -203 -135 604 32 34 794
3800 794 146 -708 -175 694 533 504 645 -494 -476 222 413 -358 -177 335 -457 -142 592 -515 -815 174
3820 174 454 -280 214 114 -707 -270 415 193 -699 -208 -29 -665 50 497 -688 -501 210 -229 -451 75
3840 75 -124 -1116 -116 441 -350 -261 135 -752 -668 315 16 -773 -686 -71 -374 -28 105 -586 -783 146 476
3861 476 -219 -146 148 -539 -309 431 177 -548 -51 63 -456 157 490 -138 -379 375 347 -100 -78 65 -682
$$ packed form
3719i49J364n23p82P00q1n11Q03N56j221j45P69k17%N62k45j208P73O43l15o06
3739f33Q27m85k63J337k1j137K5J007q80J54N24o27m42P15J32k62J23nj85J21
3759B5O23r2q80N02M48n02L45J62p65o1O18L25n66J70P5j006O43Q86n10l75K63
3780C28K24m28N14L48j611M85Q97j90k40L36l65j015J212P39j437O8P39n72KP60
3800G94o48q54N33Q69j61k9J41j139J8O98J91p71J81N12p92L15P34j107l00R89
3820A74K80p34M94j00q21M37O85k22q92M91J79o36P15M47j185J87P11m39k22N26
3840G5j99r92J000N57p91Q9L96q87Q4R83k99p89Q7O15l03L46J33o91j97R29L30
3861D76o95P3K94o87K30P40k54p25M97J14n19O13L33o28k41P54k8m47K2J43p47
$$ plain form
3882 -682 182 1038 -244 -173 309 200 -20 713 492 -55 -49 586 359 101 399 101 -370 670 908 -201
3902 -201 35 69 260 194 1171 518 -157 580 909 -15 480 621 -303 -113 778 544 -159 198 384 -276 54
3923 54 1061 412 -369 337 690 33 314 308 -545 101 933 -68 -197 500 129 -255 280 550 -215 -370
3943 -370 407 76 -316 443 -100 -839 -149 559 -335 -191 142 -443 -403 587 82 -769 -268 -51 -556 -506 152
3964 152 -364 -674 41 149 -921 -326 -57 -645 -443 360 -444 -960 -118 -130 -485 -185 353 -589 -367 19
3984 19 -24 -455 249 -133 -654 -13 396 -280 -459 -141 -86 -445 314 -127 -910 13 387 -206 -19 339 -258
4005 -258 -280 393 343 -2 3 318 -445 151 647 221 -391 132 540 -129 321 369 103 -19 775 678 -161 271
4027 271 387 -359 338 942 -271 -485 336 179 -97 400 549 -154 293 939 193 -118 350 335 200 488
$$ packed form
3882f82Q64Q56j282P1M82j09k20P33k21n47OO35k27k58K98k98m71J040K38j109
3902b01K36L4J91o6R77o53o75P37L29r24M95J41r24J90Q91k34p03L57J86o60L30
3923E4J007o49p81P06L53o57K81oq53O46Q32j001j29O97l71l84N35K70p65j55
3943c70P77l31l92P59n43p39O90P08q94J44L33n85M0R90n05q51N01K17n05N0O58
3964A52n16l10P15J08j070N95K69n88K02Q03q04n16Q42j2l55L00N38r42K22L86
3984A9m3m31P04l82n21O41M09o76j79L18N5l59P59m41p83R23L74n93J87L58n97
4005b58k2O73n0l45NL15p63N96M96m26o12N23M08o69M50M8k66j22P94r7q39M32
4027B71J16p46O97O04j213k14Q21j57k76M97J49p03M47O46p46l11M68j5j35K88
$$ plain form
4047 488 765 -549 -195 279 65 -207 454 -83 -899 486 580 -78 -336 245 -129 -84 330 49 -702 -127
4067 -127 187 -238 313 76 -384 -389 412 293 -813 -204 -90 -555 -193 495 -836 -573 75 208 -363 72
4087 72 -49 -1017 -559 129 -193 -606 -61 -274 -883 180 233 -854 -660 94 -121 -509 205 -368 -585 7
4107 7 416 -229 -729 -138 -474 -279 486 153 -784 -230 461 37 -121 284 -548 -562 229 487 -330 -72 -12
4128 -12 -240 -28 772 157 -534 56 237 -240 132 378 -217 -316 783 312 -298 133 -11 -370 601 893
4148 893 -66 358 323 418 52 611 336 -303 238 792 415 112 514 12 -200 819 752 -79 40 378 -52
4169 -52 320 688 188 -337 357 633 151 136 55 -354 180 737 281 -151 -23 185 98 412 672 -408 -404 237
4191 237 305 66 107 -144 -522 124 551 -172 -541 -131 -79 -425 535 319 -878 -565 23 232 -308 -32 -327
$$ packed form
4047D88K77j314L54M74k14k72O61n37q16J385R4o58k58N81l74M5M14k81p51N75
4067a27L14m25N51k37m60nQ01j19j106O09J14m65L62O88j331K63O48J33n71M35
4087G2j21r68M58O88l22m13N45k13o09J063N3j087J94P54k15l88P14n73k17N92
4107GM09o45n00N91l36J95P65l33r37N54O91m24j58M05q32j4P91K58q17K58O0
4128a2k28K12Q00o15o91N90J81m77L72K46n95r9J099m71o10M31j44l59R71K92
4148H93r59M24l5R5l66N59k75o39N41N54l77l03M02n02k12J019o7q31J19L38m30
4169e2L72L68n00n25O94K76m82j5q1m09N34N57m56m32J28K08q7L14K60j080MO41
4191B37O8k39M1k51l78O46M27p23l69M10N2l46R60k16j197L13N88K09n40K76k95
$$ plain form
4212 -327 -808 65 608 -525 -520 -68 -548 -366 497 0 -1170 -344 250 -241 -68 173 -774 -705 243 274 -323
4233 -323 -614 -341 -714 164 299 -328 -1100 -14 222 -113 265 246 -902 -305 758 541 96 -129 -169 -382
4253 -382 357 715 -479 -440 437 116 328 399 9 -848 -56 861 282 -102 287 -256 -221 758 343 -101 -41
4274 -41 211 182 375 640 4 -666 624 674 448 420 -49 -250 353 811 309 -368 33 631 -115 687 733
4295 733 -163 -45 901 474 222 377 -241 -329 165 1028 14 -430 192 -28 51 689 458 -438 -326 465
4315 465 170 -62 226 -609 -625 255 456 -12 -575 -196 -338 -67 564 -83 -725 -237 273 -517 0 -119
4335 -119 -637 -691 618 485 -499 -284 -436 -604 3 580 -431 -654 -296 -97 -160 209 -209 -884 -573 446
4355 446 -68 -63 -204 -526 -713 384 668 -716 -566 -103 -230 -242 185 -105 -746 -212 401 -28 -334 -10
$$ packed form
4212c27m81Q73N43j133NM52m80J82Q63m97j170Q26N94m91J73K41r47O9R48L1n97
4233c23k91K73l73Q78J35o27p72J086K36l35L78j9j148N97J063k17m45k25m0k13
4253c82P39L58j194L9Q77l21K12P1l90q57P92R17n79l84L89n43L5R79m15m44O0
4274d1K52k9J93K65o36o70J290N0k26k8m69k01O03M58n02o77M01N98p46Q02M6
4295G33q96J18R46m27k52J55o18q8M94Q63j014m44O22k20P9O38k31q96J12P91
4315D65k95k32K88q35j6Q80K01m68n63L79j42K71O31o47o42M88N10p90N17j19
4335a19n18n4J309j33r84K15j52j68O07N77j011k23L58J99o3L69m18o75L11J019
4355D46n14Nj41l22j87J097K84j384J50M63j27j2M27k90o41N34O13m29l06L24
$$ plain form
4375 -10 -299 -124 414 112 -654 -501 113 -81 30 535 -362 -456 254 418 295 311 84 -565 -176 1042 233
4396 233 -435 233 273 -155 507 259 -295 -11 597 439 68 474 226 -339 510 1165 299 -292 398 170
4416 170 268 911 399 -156 191 709 305 205 583 -79 -264 627 515 -239 -3 36 -111 325 975 36 -453
4437 -453 191 353 -22 323 447 -547 -589 449 77 -100 30 -346 -667 311 825 -568 -540 -132 -446 -273
4457 -273 386 -166 -749 -148 378 -94 -700 -195 -486 -688 196 41 -631 -651 -242 -516 115 235 -372 -637
4477 -637 -294 -95 -290 -399 -222 -833 -307 342 89 -885 -439 -434 -471 114 30 -725 -715 420 -74 -88 -147 -495
4499 -495 -597 75 638 -205 -353 93 -50 -352 747 187 -546 -208 346 31 -66 499 -174 -321 178 711
4519 711 -324 -368 203 -3 -77 528 398 -324 192 582 421 407 528 -172 -204 710 546 92 360 211 177
$$ packed form
4375a0k89J75N38l02p66J53O14j94J11N05q97r4P10J64j23J6k27o49L89J218q09
4396B33o68O68M0m28O62k48n54K84O08j58l71M06k48n65Q49O55q66n91O90k28
4416A70R8O43n12n55L47N18m04j00L78o62j85Q91j12p54K36L9j47M36O50r39m89
4437d53O44J62l75L45J24r94m2J038l72j77J30l76l21R78N14j393K8M08l14J73
4457b73O59n52n83O01N26m72o06N05k91k02Q84j55o72k0M09k74O31J20o07k65
4477f37L43J99j95j09J77o11N26O49k53r74M46Nl7N85q4p55J0J135m94j4n9l48
4499d95j02O72N63q43j48M46j43l02J099n60p33L38N54l15r7N65o73j47M99N33
4519G11j035m4N71k06p4O05j30p22N16L90j61j4J21p00l2R14j64m54K68j49l4
$$ plain form
4540 177 512 747 66 -258 105 230 135 385 588 -308 33 834 213 36 194 444 -52 466 339 -113
4560 -113 -355 273 239 -50 429 -182 -653 255 555 48 -127 286 -72 -498 543 368 -573 -246 249 -273
4580 -273 -71 414 -327 -653 41 347 -388 -215 -111 -393 -326 492 -364 -654 -501 -418 -435 -158 -172 -914 -412
4601 -412 215 -190 -242 -22 -209 -715 33 286 -442 -356 -70 -234 -236 86 -1 -680 -386 84 -50 -432 -147 -364
4623 -364 -406 249 45 -334 -378 240 153 130 540 -147 -687 223 257 -6 200 131 -590 -399 772 189 -40 -29
4645 -29 143 -57 209 895 -111 -111 226 590 83 316 125 -245 274 805 360 -173 401 60 41 416 705
4666 705 -261 101 716 118 186 576 484 -425 386 614 142 -240 133 -21 174 731 319 -133 101 533 121
4687 121 -3 345 -141 -356 327 195 -424 -27 88 -196 39 727 -10 -509 -96 174 -419 40 -42 -530
$$ packed form
4540A77L35K35o81l24L63J25r5K50K03q96L41Q01o21j77J58K50m96N18j27m52
4560a13k42O28l4k89M79o11m71R08L00n07j75M13l58m26J041j75r41L27M95n22
4580b73K02M85p41l26O94L06p35J73J04k82O7Q18q56k90J53Q3j7K77j4p42N02
4601d12O27m05n2K20j87n06P48K53p28Q6K86j64kL22q7o79K94M70j34l82K85k17
4623c64m2O55k04l79m4O18q7k3M10o87n40R10L4k63K06o9p21J91J171n83k29J1
4645b9J72k00K66O86j006%L37L64n07K33j91l70N19N31m45n33N74l41j9L75K89
4666G05r66L62O15n98O8L90r2r09Q11K28m72l82L73j54J95N57m12m52K34M32m12
4687A21j24L48m86k15O83j32o19L97J15k84K35O88p37m99M13K70n93M59q2m88
$$ plain form
4707 -530 -226 232 148 -459 273 -229 -475 -86 25 -491 -714 106 -260 -217 129 -47 -797 25 0 -508 -457
4728 -457 -138 -302 -831 11 248 -730 -275 -74 -199 -322 593 -111 -754 304 176 -276 -348 193 -523 -282
4748 -282 370 -9 -743 -76 -340 -226 365 402 -664 -708 550 221 75 144 435 -216 159 781 -78 -199
4768 -199 330 -186 -243 680 210 -278 -8 571 344 47 405 207 -245 586 599 -148 37 310 226 97 821
4789 821 367 -288 654 785 176 485 691 -105 -8 821 47 -80 349 103 85 424 598 -5 -123 220 290
4810 290 -229 278 464 -172 -124 380 20 -48 264 -283 -188 280 245 -495 -169 103 194 106 300 -13 -887 85
$$ packed form
4707e30L04M58q4o07P32n02k46L89J11n16k23Q20l66M3L46j76p50Q22k5n08N1
4728d57L19j64n29Q42K37r78M55K01j25j23R15p04o43J058j28m52p2N41p16K41
4748b82O52l79p34O67k64J14N91L7j066m4J258l29j46O9K91o51L75O22q59j21
4768a99N29n16n7R23m70m88K70N79k27k97L58j98m52Q31J3p47J85K73q4j29P24
4789H21m54o55R42J31o09L09K06p96R7Q29p74j27M29k46j8L39J74o03j18L43P0
4810B90n19N07J86o36M8N04l60o8L12n47R5M68l5p40L26K72R1q8J94l13q74R72
$$ [...]
8191B07
##END NTUPLES=NMR FID
##END=
