##TITLE=1H_CA-8687-1
 CDCl3, 8 sc, 
 5.2.2020
##JCAMPDX= 6.0         $$ Bruker NMR JCAMP-DX V2.0
##DATA TYPE= NMR FID
##DATA CLASS= NTUPLES
##ORIGIN= UXNMR, Bruker Analytische Messtechnik GmbH
##OWNER= root
$$ XWIN-NMR		Version 3.5
$$ Wed Feb  5 13:48:39 2020 Russian Standard Time (UT+4h)  she@DPX200
##.OBSERVE FREQUENCY= 200.1315
##.OBSERVE NUCLEUS= ^1H
##.DELAY= (6, 6)
##.ACQUISITION MODE= SIMULTANEOUS
##.ACQUISITION SCHEME= undefined
##.AVERAGES= 8
##.DIGITISER RES= 18
##SPECTROMETER/DATA SYSTEM= spect
##.PULSE SEQUENCE= zg30
##.SOLVENT NAME= D2O
##.SHIFT REFERENCE= (INTERNAL, D2O, 0, 15.7039)
##AUDIT TRAIL= $$ (NUMBER, WHEN, WHO, WHERE, WHAT)
$$ ##TITLE= Audit trail, XWIN-NMR		Version 3.5
$$ ##JCAMPDX= 5.01
$$ ##ORIGIN= Bruker BioSpin GmbH
$$ ##OWNER= she
$$ F:/spectra/data/she/nmr/H-F/1/audita.txt
$$ ##AUDIT TRAIL=  $$ (NUMBER, WHEN, WHO, WHERE, WHAT)
(   1,<2020-02-05 13:47:22.39 +0400>,<she>,<DPX200>,
      <created by zg, POWCHK disabled, PULCHK disabled
       configuration hash MD5:
       00 E9 B6 7A A2 85 ED C7 34 08 36 98 17 FE 4E 26
       data hash MD5: 16K
       FD 40 88 9E 52 67 51 3F 08 A6 B7 C1 9D BE A2 7E>)
$$ ##END=
$$ 
$$ hash MD5
$$ A7 C2 17 02 DF E1 16 88 39 AF 62 9D ED 26 72 DB
##$RELAX= 
##$RELAX= 
##$RELAX= 
##$RELAX= 
##$RELAX= 
##$RELAX= 
$$ Bruker specific parameters
$$ --------------------------
##$DU= <F:/spectra>
##$EXPNO= 1
##$NAME= <H-F>
##$PROCNO= 1
##$TYPE= <nmr>
##$USER= <she>
##$AMP= (0..31)
100 100 100 100 100 100 100 100 100 100 100 100 100 100 100 100 100 100 
100 100 100 100 100 100 100 100 100 100 100 100 100 100 
##$AQSEQ= 0
##$AQ_mod= 1
##$AUNM= <au_zg>
##$AUTOPOS= <>
##$BF1= 200.13
##$BF2= 200.13
##$BF3= 200.13
##$BF4= 200.13
##$BF5= 200.13
##$BF6= 200.13
##$BF7= 200.13
##$BF8= 200.13
##$BYTORDA= 1
##$CFDGTYP= 0
##$CFRGTYP= 5
##$CHEMSTR= <none>
##$CNST= (0..31)
1 1 145 1 1 1 1 1 1 1 1 1 1 1 1 1 1 1 1 1 1 1 1 1 1 1 1 1 1 1 1 1 
##$CPDPRG= <>
##$CPDPRG1= <>
##$CPDPRG2= <>
##$CPDPRG3= <>
##$CPDPRG4= <mlev>
##$CPDPRG5= <mlev>
##$CPDPRG6= <mlev>
##$CPDPRG7= <mlev>
##$CPDPRG8= <mlev>
##$CPDPRGB= <>
##$CPDPRGT= <>
##$D= (0..31)
0 1.2 0 0 0 0 0 0 0 0.06 0 0.03 0 0 0 0 0.0002 0 0 0 0 0 0 0 0 0 0 0 0 
0 0 0 
##$DATE= 1580896041
##$DBL= (0..7)
120 120 120 120 120 120 120 120 
##$DBP= (0..7)
150 150 150 150 150 150 150 150 
##$DBP07= 0
##$DBPNAM0= <>
##$DBPNAM1= <>
##$DBPNAM2= <>
##$DBPNAM3= <>
##$DBPNAM4= <>
##$DBPNAM5= <>
##$DBPNAM6= <>
##$DBPNAM7= <>
##$DBPOAL= (0..7)
0.5 0.5 0.5 0.5 0.5 0.5 0.5 0.5 
##$DBPOFFS= (0..7)
0 0 0 0 0 0 0 0 
##$DE= 6
##$DECBNUC= <off>
##$DECIM= 24
##$DECNUC= <off>
##$DECSTAT= 4
##$DIGMOD= 1
##$DIGTYP= 9
##$DL= (0..7)
0 120 120 120 120 120 120 120 
##$DP= (0..7)
150 150 150 150 150 150 150 150 
##$DP07= 0
##$DPNAME0= <>
##$DPNAME1= <>
##$DPNAME2= <>
##$DPNAME3= <>
##$DPNAME4= <>
##$DPNAME5= <>
##$DPNAME6= <>
##$DPNAME7= <>
##$DPOAL= (0..7)
0.5 0.5 0.5 0.5 0.5 0.5 0.5 0.5 
##$DPOFFS= (0..7)
0 0 0 0 0 0 0 0 
##$DQDMODE= 0
##$DR= 18
##$DS= 0
##$DSLIST= <SSSSSSSSSSSSSSS>
##$DSPFIRM= 0
$$ [...]
##$SUBNAM2= <"">
##$SUBNAM3= <"">
##$SUBNAM4= <"">
##$SUBNAM5= <"">
##$SUBNAM6= <"">
##$SUBNAM7= <"">
##$SUBNAM8= <"">
##$SUBNAM9= <"">
##$SW= 24.9337058887773
##$SWIBOX= (0..15)
0 0 2 0 0 0 0 0 0 0 0 0 0 0 0 0 
##$SW_h= 4990.01996007984
##$TD= 16384
##$TD0= 1
##$TE= 0
##$TE2= 300
##$TE3= 300
##$TEG= 300
##$TL= (0..7)
0 120 120 120 120 120 120 120 
##$TP= (0..7)
150 150 150 150 150 150 150 150 
##$TP07= 0
##$TPNAME0= <>
##$TPNAME1= <>
##$TPNAME2= <>
##$TPNAME3= <>
##$TPNAME4= <>
##$TPNAME5= <>
##$TPNAME6= <>
##$TPNAME7= <>
##$TPOAL= (0..7)
0.5 0.5 0.5 0.5 0.5 0.5 0.5 0.5 
##$TPOFFS= (0..7)
0 0 0 0 0 0 0 0 
##$TUNHIN= 0
##$TUNHOUT= 0
##$TUNXOUT= 0
##$USERA1= <user>
##$USERA2= <user>
##$USERA3= <user>
##$USERA4= <user>
##$USERA5= <user>
##$V9= 5
##$VALIST= <valist>
##$VCLIST= <CCCCCCCCCCCCCCC>
##$VD= 0
##$VDLIST= <DDDDDDDDDDDDDDD>
##$VPLIST= <PPPPPPPPPPPPPPP>
##$VTLIST= <TTTTTTTTTTTTTTT>
##$WBST= 1024
##$WBSW= 4
##$XGAIN= (0..3)
0 0 0 0 
##$XL= 0
##$YL= 0
##$YMAX_a= 919501
##$YMIN_a= -521578
##$ZGOPTNS= <>
##$ZL1= 120
##$ZL2= 120
##$ZL3= 120
##$ZL4= 120
##$ABSF1= 10
##$ABSF2= 0
##$ABSG= 5
##$ABSL= 3
##$ALPHA= 0
##$AQORDER= 0
##$ASSFAC= 0
##$ASSFACI= 0
##$ASSFACX= 0
##$ASSWID= 0
##$AUNMP= <proc_1d>
##$AZFE= 0.1
##$AZFW= 0.1
##$BCFW= 1
##$BC_mod= 2
##$BYTORDP= 1
##$COROFFS= 0
##$CY= 11.3945322036743
##$DATMOD= 1
##$DC= 2
##$DFILT= <>
##$DTYPP= 0
##$F1P= 16.9975609425685
##$F2P= -3.02152046262296
##$FCOR= 0.5
##$FTSIZE= 0
##$FT_mod= 4
##$GAMMA= 1
##$GB= 0.15
##$INTBC= 1
##$INTSCL= 1
##$ISEN= 128
##$LB= 0.24
##$LEV0= 0
##$LPBIN= 0
##$MAXI= 10000
##$MC2= 0
##$MEAN= 0
##$ME_mod= 0
##$MI= 1.114404
##$NCOEF= 0
##$NC_proc= 0
##$NLEV= 6
##$NOISF1= 3.799351
##$NOISF2= 2.8
##$NSP= 1
##$NTH_PI= 0
##$NZP= 0
##$OFFSET= 15.70392
##$PC= 1
##$PHC0= -9784.425
##$PHC1= 14.60081
##$PH_mod= 1
##$PKNL= yes
##$PPARMOD= 0
##$PSCAL= 0
##$PSIGN= 0
##$REVERSE= no
##$SF= 200.130013532006
##$SI= 16384
##$SIGF1= 3
##$SIGF2= 2
##$SINO= 400
##$SIOLD= 16384
##$SREGLST= <1H.CDCl3>
##$SSB= 0
##$STSI= 0
##$STSR= 0
##$SW_p= 3612.71676300578
##$SYMM= 0
##$S_DEV= 0
##$TDeff= 0
##$TDoff= 0
##$TI= <>
##$TILT= no
##$TM1= 0
##$TM2= 0
##$TOPLEV= 0
##$USERP1= <user>
##$USERP2= <user>
##$USERP3= <user>
##$USERP4= <user>
##$USERP5= <user>
##$WDW= 1
##$XDIM= 8192
##$YMAX_p= 0
##$YMIN_p= 0
$$ End of Bruker specific parameters
$$ ---------------------------------
##NTUPLES= NMR FID
##VAR_NAME=  TIME,          FID/REAL,        FID/IMAG
##SYMBOL=    X,             R,               I
##VAR_TYPE=  INDEPENDENT,   DEPENDENT,       DEPENDENT
##VAR_FORM=  AFFN,          ASDF,            ASDF
##VAR_DIM=   8192,          8192,            8192
##UNITS=     SECONDS,       ARBITRARY UNITS, ARBITRARY UNITS
##FACTOR=    0.0002004,     1,               1
##FIRST=     0,             0,               0
##LAST=      1.6414764,     0,               0
##MIN=       0,             -521578,         0
##MAX=       1.6414764,     919501,          0
$$ Real data points
##PAGE= N=1
##DATA TABLE= (X++(R..R)), XYDATA
$$ [...]
$$ plain form
3058 -1157 1670 423 118 1943 217 -2226 641 2293 -597 -292 969 -753 -637 2432 716 -1948
3074 -1948 -231 1049 -225 1428 2170 -1519 -2757 976 1285 -379 912 547 -2312 -326 2221 148
3090 148 -1293 245 -360 -1155 2265 1395 -2769 -1994 844 596 504 1078 -1846 -3384 874 2048 -656
3107 -656 -923 -272 -1685 -773 2126 361 -2855 -697 404 -618 1093 1015 -3241 -3241 1558 1693 -929
3124 -929 -63 -1030 -2847 272 2299 -702 -2133 -354 -638 -592 1692 202 -4027 -1886 1873 876 -847
3141 -847 -65 -2569 -2364 1567 1897 -1523 -1469 299 -1430 -447 2066 -449 -2812 -247 1489 -169 461
3158 461 -229 -3144 -1041 3262 1524 -2238 -1051 -69 -581 1315 2075 -1168 -1835 986 797 90 1334
3175 1334 -428 -3035 632 3982 507 -1933 -1071 -775 900 3884 1419 -3129 -1057 2094 636
$$ packed form
3058a157K827j247l05J825j726k443K867J652k890L05J261j722J16L069j716k664
3074a948J717J280j274J653P42l689j238L733L09j664J291l65k859J986K547k073
3090A48j441J538o05p95L420q70m164P75K838k48r2N74k924j538M258J174k704
3107f56k67O51j413R12K899j765l216K158J101j022J711p8m256%M799J35k622
3124i29Q66r67j817L119K027l001j431J779k84M6K284j490m229K141L759r97j723
3141h47P82k504K05L931L30l420N4J768j729R83K513k515k363K565J736j658O30
3158D61o90k915K103M303j738l762J187R82n12J896P60l243o67K821j89p07J244
3175A334j762k607L667L350l475k440Q62K96J675K984k465m548K072L151j458
$$ plain form
3190 636 189 1603 -1013 -2154 2082 2883 -220 -1076 -996 -1961 1821 4456 -65 -4321 -1313 2146 1465
3207 1465 1229 -319 -3186 -828 3588 1345 -1699 -740 -1092 -1589 2713 3469 -1536 -4196 -892 1097
3223 1097 2285 2758 -2237 -5193 -418 4121 1486 -1641 -1588 -2298 -341 3417 1681 -3129 -2934 -531
3239 -531 397 2657 2471 -2924 -5539 453 4169 1702 -583 -2957 -3310 1064 4481 347 -3743 -1892
3255 -1892 -11 686 3219 1092 -4266 -4477 1236 3271 1747 -358 -4070 -4759 1755 5308 -39 -3831
3271 -3831 -2567 -1257 1575 3548 -268 -5089 -2614 1670 2249 1862 -164 -4842 -3807 2946 4363
3286 4363 63 -3193 -3070 -1653 2916 4161 -1172 -4820 -857 1750 1702 2001 -937 -4936 -2048 3857
3302 3857 3536 189 -2052 -3508 -1672 4530 4743 -1863 -4176 -731 1800 2756 2249 -2138 -4251 604
$$ packed form
3190F36m47J414k616j141M236Q01l103q56Q0r65L782K635m521m256L008L459o81
3207A465k36j548k867K358M416k243l044R59l52m97M302P56n005k660L304J989
3223A097J188M73m995k956M775M539k635l127N3p10J957L758j736m810J95K403
3239e31R28K260j86n395k615N992L716k467k285k374l53M374L417m134m090J851
3255a892J881O97K533k127n358k11N713K035j524k105l712o89O514L553n347l792
3271c831J264J310K832J973l816m821K475M284N79l87k026m678J035O753J417
3286D363m300l256J23J417M569J245n333l648L963K607m8K99k938l999K888N905
3302C857l21l347k241j456J836O202K13o606k313L445K531R56n07m387k113M855
$$ plain form
3318 604 4090 1840 -20 -1581 -3432 -481 5292 3372 -2300 -3435 -1217 1289 3680 2333 -3452
3333 -3452 -3389 2005 3552 655 -466 -1778 -2725 1329 4531 972 -2457 -1981 -711 1372 3999 1599
3349 1599 -4362 -2934 2422 2973 1286 -318 -2913 -2283 2611 3850 -1029 -2583 -1198 -295 1871 3294
3365 3294 -290 -4204 -1821 1843 1595 1360 -369 -3833 -1783 3715 2378 -1948 -2534 -992 -164 2687
3381 2687 2640 -2542 -4087 -218 1877 1283 854 -1665 -4263 -213 3960 1401 -2080 -2017 -1703 193 3460
3398 3460 1561 -3341 -3448 738 1753 1484 750 -2950 -3943 1716 3786 625 -1487 -2037 -2088 1336 4047
3415 4047 652 -3584 -1971 940 1412 2061 783 -3676 -2366 2832 3406 295 -1332 -2338 -1738 2764
3431 2764 4389 -538 -3370 -822 1144 1942 3154 -191 -3813 -784 3420 2702 475 -652 -2638
$$ packed form
3318F04L486k250j860j561j851K951N773j920n672j135K218K506K391j347n785
3333c452O3N394J547k897j121j312r47M054L202l559l429M76J270K083K627k400
3349A599n961J428N356N51j687j604k595O30M894J239m879j554J385R03K166J423
3365C294l584l914K383L664k48k35j729l464K050N498j337m326n86J542Q28K851
3381B687m7n182j545L869K095n94m29k519k598M050M173k559l481O3L14J896L267
3398C460j899m902j07M186J015k69p34l700r93N659K070l161k112n50n1L424K711
3415D047l395m236J613K911M72O49j278m459J310N198N74l111j627j006O00M502
3431B764J625m927k832K548J966P98J212l345l622L029M204p18k227j127j986
$$ plain form
3446 -2638 -1086 4103 4100 -1379 -2854 -578 894 3214 3226 -1477 -3746 441 2908 1525 679 -441
3462 -441 -2594 -121 4533 2604 -1935 -2215 -933 976 3847 2441 -2878 -3227 1352 2496 1019 876
3478 876 -1347 -2955 849 3490 833 -1542 -1639 -1036 964 3640 1141 -3783 -2339 1360 1686 1082
3494 1082 192 -2689 -2604 1296 2364 -773 -1388 -1003 -1890 33 2759 336 -3270 -1321 716 535 1397
3511 1397 -240 -3334 -1468 2477 1207 -1273 -744 -745 -1605 640 1632 -1304 -1922 -78 -65 -42 1432 -1072
3529 -1072 -3168 -239 2283 647 -785 -919 -1402 -221 2233 808 -2012 -685 868 -450 -71 1070
3545 1070 -896 -1691 912 1166 1 -97 -671 -1808 621 2707 16 -2103 90 1006 -131 533 507
3562 507 -1206 -178 2151 454 -1096 302 -139 -1362 1500 2192 -944 -1505 420 368 713 1523 -459
$$ packed form
3446b638J552N189ln479j475K276J472K320J2m703k269M187K467j383q46j120
3462d41k153K473M654j929m539k80J282J909K871j406n319l49M579J144j477j43
3478H76k223j608L804K641k657k375r7O03K000K676k499m924J444L699L26o04
3494A082q90k881Q5L900J068l137o15L85q87J923K726k423l606J949K037j81Q62
3511A397j637l094J866L945j270k480N29jq60K245R92k936o18J844J3K3J474k504
3529a072k096K929K522j636j432j34m83J181K454j425k820J327J553j318L79J141
3545A070j966p95K603K54j165r8n74j137K429K086k691k119K193R16j137O64k6
3562E07j713J028K329j697j550J398m41j223K862O92l136n61J925n2L45Q10j982
$$ plain form
3579 -459 -2103 963 2526 -328 -1026 168 -235 134 1839 628 -1766 -499 612 -61 948 1632
3595 1632 -1267 -1864 1482 1713 -390 -297 -221 -858 1360 2170 -204 -1821 75 457 4 1298 976 -2283
3613 -2283 -949 1568 880 -322 -245 -1078 -996 1574 1767 -1682 -1639 640 158 317 1186 -605 -1807 175
3631 175 1415 191 -97 307 -1500 -686 1847 845 -2022 -1147 280 -167 665 456 -1891 -1745 1322
3648 1322 1161 -874 183 -258 -1702 153 2024 -380 -1471 261 123 -279 1080 248 -2389 -712
3664 -712 1807 446 -681 -265 -1047 -1133 1558 1312 -1435 -1159 483 -320 86 1089 -430 -2005 537
3681 537 1687 -217 -613 144 -1494 -252 2376 616 -1514 -547 683 -252 1163 1089 -1377 -1496 1242
3698 1242 1219 -848 -261 -461 -979 1161 2399 -410 -2132 -263 226 417 1702 75 -2162 -373 1855
$$ packed form
3579d59j644L066J563k854o98J194m03L69J705j211k394J267J111o73J009O84
3595A632k899n97L346K31k103R3P6o37K218Q10k374j617J896L82m53J294l22l259
3613b283J334K517o88j202P7q33Q2K570J93l449M3K279m82J59Q69j791j202J982
3631A75J240j224k88M04j807Q14K533j002k867Q75J427m47Q32k09k347J46L067
3648A322j61k035J057m41j444J855J871k404j091J732j38m02J359q32k637J677
3664g12K519j361j127M16p82q6K691k46k747K76J642q03M06J003j519j575K542
3681E37J150j904l96P57j638J242K628j760k130R67J230r35J415p4k466j19K738
3698A242k3k067N87k00n18K140J238k809j722J869M89J91J285j627k237J789K228
$$ plain form
3715 1855 1059 -350 -197 -1177 -475 2386 1890 -1489 -1698 -104 496 1291 2174 -1607 -2808 192 2091
3732 2091 796 134 -150 -2053 122 2866 1119 -2447 -1396 -311 660 2077 1227 -2672 -2842 1174
3748 1174 1941 938 212 -2086 -2489 640 2977 81 -2125 -1436 -880 626 2503 -14 -3778 -1990
3764 -1990 1210 1633 991 -366 -3249 -2448 1898 2872 -526 -2081 -1643 -1263 1387 2657 -765 -3739
3780 -3739 -1191 1239 1451 1572 -645 -3543 -1689 2674 2369 -505 -1661 -2280 -1018 2371 2622 -1701
3796 -1701 -3326 -285 1147 1584 1333 -1739 -3594 -280 3132 1543 -625 -1901 -2484 -507 3204 1798
3812 1798 -2165 -2350 -257 1037 1872 1510 -2106 -3347 909 2752 1045 -665 -2116 -2293 1083 3767
3828 3767 830 -2281 -1789 -488 931 2744 1101 -2861 -2407 1814 2390 883 -214 -2144 -1752 2256
$$ packed form
3715A855p96j409J53r80P02K861m96l379k09J594O00P95Q83l781j201L000J899
3732B091j295o62k84j903K175K744j747l566J051J085R71J417q50l899j70M016
3748A174P67j003p26k298m03L129K337k896k206O89N56J506J877k517l764J788
3764a990L200M23o42j357k883Q01M346R74l398j555M38L80K650J270l422k974
3780c739K548K430K12J21k217k898J854M363l05k874j156o19J262L389K51m323
3796a701j625L041J432M37k51l072j855L314L412j589k168j276n83J977L711j406
3812A798l963j85K093J294Q35l62l616j241M256J843j707j710j451j77L376K684
3828C767k937l111M92J301J419J813j643l962M54M221N76j507j097j930L92M008
$$ plain form
3844 2256 3612 -215 -2461 -1484 -194 1709 3018 29 -3308 -1233 1911 1579 895 -299 -2846 -1127
3860 -1127 3061 2712 -1129 -2531 -964 -106 2823 2866 -1514 -3398 -366 2145 1671 1080 -1129 -3112
3876 -3112 -82 3120 1714 -1400 -1850 -1302 461 3238 1758 -2765 -3184 207 1883 2019 703 -2561
3892 -2561 -3294 611 3478 750 -1704 -1625 -1591 907 3188 456 -3447 -2377 957 2534 2233 -140
3908 -140 -3483 -2993 2291 3463 469 -1297 -1931 -1457 2073 3771 -283 -3374 -1380 1269 2476 2612
3924 2612 -724 -3886 -1520 3110 3151 187 -1787 -2944 -1068 3260 3311 -902 -2847 -790 779 2252
3940 2252 2186 -1431 -4161 -601 3497 2169 118 -1965 -3252 134 4261 2584 -2278 -2632 -673 659
3956 659 2542 1950 -2257 -3323 763 2599 1527 162 -2574 -3335 1463 4469 1260 -2467 -2712 -1230
$$ packed form
3844B256J356l827k246R77J290J903J309k989l337K075L144l32o84j194k547J719
3860a127M188l49l841j402J567Q58K929M3m380j884L032K511m74n91k209j983
3876c112L030L202j406l114m50N48J763K777j480m523m19L391J676J36j316l264
3892b561p33L905K867k728k454P9L4K498K281k732l903J070L334J577l01k373
3908a40l343M90N284J172k994j766o34M74L530J698m054l091J994K649J207J36
3924B612l336l162K366M630M1k964j974j157J876M328N1m213j945K057J569J473
3940B252o6l617k730L560M098j328k051k083j287L386M127j677m862l54J959J332
3956F59J883n92m207j066M086J836j072j365k736p61M798L006l209l727k45J482
$$ plain form
3972 -1230 1339 3591 1273 -3078 -2526 991 1968 1280 -68 -3109 -2347 2261 3488 274 -2226 -1979
3988 -1979 -850 2048 3713 -154 -3680 -1723 1431 1858 1703 -138 -3341 -1680 2712 2581 -696 -1743
4004 -1743 -1737 -634 2866 2968 -1740 -3558 -988 1142 1944 1863 -1419 -3407 -736 2711 1882 -549 -1584
4021 -1584 -2199 -157 3263 1966 -2342 -2751 4 1237 2103 1548 -2477 -3152 809 2621 856 -558
4037 -558 -1611 -1805 639 3258 964 -2441 -1673 356 1545 2409 343 -3238 -2317 1808 2478 363
4053 363 -362 -1931 -1367 1852 2808 -318 -2155 -907 436 1681 2510 -235 -3455 -1352 2311 1928
4069 1928 639 -518 -2476 -1093 2747 2554 -980 -1486 -492 320 1695 1775 -1104 -2641 127 2334
4085 2334 1516 179 -1525 -2655 172 3051 1625 -1740 -1326 -203 236 2081 1037 -2277 -2249 1029
$$ packed form
3972a230K569K252k318m351N52L517R77o88j348l041P62M608J227l214k500K47
3988a979J129K898J665l867l526J957L154M27j55j841l203J661M392j31l277j047
4004a743OJ103L500J02m708j818K570K130Q02q1l282j988K671L447q29k431j035
4021a584o15K042L420j297m308m09K755J233Q66n55m025o75L961J812j765j414
4037e58j053j94K444K619k294l405P68K029J189Q64k066l581R21M125O70k115
4053C63p25j569N64L219R56l126j837J248J343J245Q29k745l220K103L663l83
4069A928j289j157j958J383L840j93l534n06R94Q12J375Q0k879j537K768K207
4085B334q18j337j704j130K827K879j426l365M14J123M39J845j044l314K8L278
$$ plain form
4101 1029 1519 911 69 -2164 -2767 1180 3140 353 -2067 -1659 -1285 673 2494 412 -2839 -1455
4117 -1455 785 625 636 -156 -2460 -2045 1745 2140 -610 -2110 -2090 -1190 1584 2885 -984 -3157 -720
4134 -720 709 548 419 -512 -2528 -794 2025 641 -1177 -1566 -1517 -793 2360 2390 -2064 -3042 -421 948
4152 948 1169 1020 -1383 -2620 373 1933 -115 -1279 -707 -907 44 2213 541 -2308 -2125 226 1118
4169 1118 1941 1087 -2201 -1955 1378 2324 265 -622 -746 -968 893 1907 -586 -1896 -76 675 1223
4186 1223 1442 254 -2580 -857 1997 1489 101 -93 -911 -691 2088 2090 -1110 -1428 952 953 1195 893
4204 893 -1223 -1825 673 2020 1124 158 -686 -1678 -392 2651 1460 -1445 -926 762 359 790 310
4221 310 -1789 -1432 1845 1658 -413 -616 -1232 -1185 901 2569 332 -2065 -1011 160 362 1312 -84
$$ packed form
4101A029M90o08q42k233o03L947J960k787k420M08L74J958J821k082l251J384
4117a455K240j60J1p92k304M15L790L95k750j500K0R00K774J301l869k173K437
4134g20J429j61j29r31k016J734K819j384j818l89M9P24L153L0m454r78K621J369
4152I48K21j49k403j237K993J560k048j164N72k00R51K169j672k849J83K351Q92
4169A118Q23q54l288K46L333R46k059q87j24k22J861J014k493j310J820P51N48
4186A223K19j188k834J723K854n08j388j94q18K20K779Kl200l18K380JK42l02
4204H93k116o02K498J347q96r66q44r92J286L043j191k905N19J688m03M31m80
4221C10k099L57L277j87k071k03o16M7K086J668k237k397J054J171K02R50j396
$$ plain form
4238 -84 -2479 -695 2180 613 -767 -1064 -1271 -135 2217 1811 -1541 -1867 -711 303 940 2089 -783
4255 -783 -2567 -191 1275 373 -712 -800 -1382 421 2612 484 -2433 -1725 338 811 1904 999 -1963
4272 -1963 -2241 805 1371 177 -29 -1060 -1703 994 2412 -462 -2392 -1088 354 1552 2443 -477
4288 -477 -3145 -1268 1735 1536 556 -83 -1655 -1623 1753 1955 -750 -1648 -341 -68 1549 1694 -1477
4305 -1477 -2731 362 2693 1648 254 -1178 -2566 -484 2643 1698 -1556 -976 -635 100 1928 1458
4321 1458 -1802 -2206 1028 2211 1134 54 -1861 -2373 1330 3675 1201 -1743 -1454 -751 770 2454
4337 2454 588 -2714 -1253 1315 1633 1078 -374 -2462 -1579 2476 3085 -406 -1769 -1673 -1063 1649 3296
4354 3296 -77 -2895 -828 1315 1107 986 -553 -2824 -680 3165 2022 -1344 -1814 -1696 -270 2761
$$ packed form
4238h4k395J784K875j567j380k97k07J136K352m06l352l26J156J014O37J149k872
4255g83j784K376J466r02j085q8n82J803K191k128k917P08K063M73J093r05k962
4272a963k78L046N66j194k06j031o43K697J418k874j930J304J442J198Q91k920
4288d77k668J877L003j99r80o39j572L2L376K02k705q98J307K73J617J45l171
4305a477j254L093K331j045j394j432j388K082L127r45l254N80L41P35J828m70
4321A458l260m04L234J183j077j080j915n12L703K345k474k944K89P03J521J684
4337B454j866l302J461K568L18n55j452k088Q83M055O09l491j363R6O10K712J647
4354C296l373k818K067K143k08j21j539k271K144L845j143l366m70J18J426L031
$$ plain form
4370 2761 2263 -1886 -3163 -442 1181 1771 1277 -1569 -3239 -248 2820 1113 -1372 -1923 -1713 769
4386 769 3171 697 -3030 -2792 -149 1121 1939 556 -2895 -3289 1001 2475 730 -833 -2210 -1701
4402 -1701 1351 2966 -243 -3595 -2000 618 1665 2098 -175 -3705 -2272 1693 2586 433 -1096
4417 -1096 -2482 -1637 2221 3035 -983 -3190 -1551 505 1813 2379 -1534 -4106 -585 2666 2156 440
4433 440 -1292 -2814 -743 3208 2637 -1439 -2446 -628 784 2866 1906 -2221 -3308 993 3415 1706
4449 1706 6 -1749 -2684 1009 3926 1835 -1761 -1818 -723 1304 3167 1409 -2975 -2716 1322 2823
4465 2823 1909 -367 -2478 -2023 2515 4164 404 -1881 -1322 -342 1806 3565 433 -3253 -1944 1270
4481 1270 2539 1771 -493 -3550 -1204 3360 3264 -507 -2322 -1755 -224 3042 3055 -945 -3007 -515
$$ packed form
4370B761m98m149j277K721J623N90m94k846j670K991L068j707k485n51K10K482
4386G69K402k474l727K38K643J270Q18j383l451l94M290J474j745j563j377N09
4402a701L052J615l209l352J595K618J047M33k273l530J433L965Q93k153j529
4417a096j386Q45L858Q14m018k207J639K056J308N66l913k572L521L251n10j716
4433D40j732j522K071L951n71m076j007J818J412K082r60m127j087M301K422j709
4449A706j700j755r35L693K917k091l596n7J095K027J863j758m384K59M038J501
4465B823r14k276k111M55M538J649l760k285N59R80K148J759l132l686J309L214
4481A270J269p68k264l057K346M564r6l771j815N67J531L266J3m000k062K492
$$ plain form
4497 -515 1319 2039 1577 -1333 -3588 -379 3217 2348 -1208 -2263 -2355 110 3499 2240 -2671 -3158 -296
4514 -296 1653 1760 970 -1998 -3249 590 2711 1192 -1434 -2456 -2290 930 3497 936 -3332 -2937
4530 -2937 3 1775 2219 785 -3351 -2919 1320 2526 658 -1296 -2229 -1778 1630 3316 -285 -3381
4546 -3381 -1574 397 1926 2639 -379 -3722 -1865 1860 2549 279 -1339 -2723 -1400 2820 2630 -1370
4562 -1370 -2511 -1226 453 2513 2396 -1321 -3585 -385 2523 1943 241 -1651 -2791 -320 3181
4577 3181 1867 -1706 -2086 -642 1047 2767 1722 -2253 -2719 757 2317 1562 343 -1872 -2749 1273
4593 1273 3600 899 -1643 -1471 -774 1417 2930 818 -2901 -1802 1352 2166 1355 -237 -2732 -1682
4609 -1682 1647 3255 278 -1817 -1527 -581 1916 3167 -348 -2906 -1087 1585 1726 1062 -651 -2492
$$ packed form
4497e15J834P20m62k910k255L209L596q69l556j055r2K465L389j259m911m87K862
4514b96J949J07p90k968j251L839K121j519k626j022J66L220K567k561m268L95
4530b937K940J772M44j434m136M32M239J206j868j954r33M51L408J686l601l096
4546c381J807J971J529P13l018l343J857L725O89k270j618j384J323M220j90m000
4562a370j141J285J679K060j17l717k264L200K908n80j702j892j140K471L501
4577C181j314l573l80J444J689J720j045l975m66L476J560p55j219k215q77M022
4593A273K327k701k542J72O97K191J513k112l719J099L154Q14q11j592k495J050
4609a682L329J608k977k095K90R46K497J251l515k558J819K672J41o64j713j841
$$ plain form
4625 -2492 -797 2623 2399 -649 -1761 -2053 -610 2319 2371 -1465 -2980 -898 1196 1389 1105 -1509
4641 -1509 -2851 -348 2873 1290 -1101 -1866 -1701 92 2585 929 -2203 -2314 -178 968 1648 810
4657 810 -2092 -2554 885 2551 364 -1006 -1473 -1224 1401 2811 -31 -2757 -1440 359 1021 1565
4673 1565 231 -2581 -1893 1284 1886 293 -722 -1688 -1199 1758 2291 -1027 -2656 -1010 467 1631
4689 1631 1618 -826 -3017 -771 2200 1233 59 -910 -1943 -701 1951 1428 -1448 -1819 -238 593 1849
4706 1849 1240 -1798 -2463 385 2049 1133 -116 -1173 -2127 242 2228 735 -1378 -1251 -166 441
4722 441 1900 774 -2157 -1808 1348 1328 427 -336 -1883 -1641 1575 2310 -16 -1733 -688 -690 812 1864
4740 1864 260 -2286 -710 1326 1018 552 -649 -1768 -725 2547 1918 -741 -1374 -607 -85 1590
$$ packed form
4625b492J695L420k24l048j112k92J443K929N2l836j515K082K094J93k84k614
4641a509j342K503L221j583k391p65J65J793K493j656l132j11K136J146O80q38
4657H10k902m62L439J666k187j370m67K49K625J410k842k726J317J799O62N44
4673A565j334k812O88L177O02j593j015r66M89K957N33l318j629J646J477J164
4689A631j3k444k191K246K971r67j174r69j033J242K652n23k876l71J581Q31J256
4706A849o09l038o65K848J664r16j249j057r54K369J986j493k113J27J085O07
4722D41J459j126k931L49L156k0r01p63j547K42L216P35k326j717J045kJ502J052
4740A864j604k546J576K036l08m66j201j119J043L272o29k659o33P67N22J675
$$ plain form
4756 1590 1756 -1196 -2040 -68 964 506 302 -849 -1768 -15 2239 666 -1497 -1345 -1036 404 2069
4773 2069 1024 -2110 -1927 668 902 919 301 -1368 -1696 476 1806 50 -1045 -633 -550 533 2025
4790 2025 57 -2312 -921 1050 794 1084 12 -1709 -823 1312 1258 -639 -756 -575 -238 1275 1488
4807 1488 -1068 -1917 -127 908 929 1016 -888 -2361 -509 1857 837 -745 -543 -1042 -32 1694 1102
4824 1102 -1744 -1628 818 952 902 387 -1416 -1972 829 2102 504 -596 -1162 -894 735 2219 118
4841 118 -2212 -685 432 1130 1179 126 -1940 -995 1554 1697 -15 -698 -1002 -287 1506 1965 -622
4858 -622 -1637 -197 558 1113 1261 -455 -2305 -241 1922 985 -421 -955 -993 -129 2191 1851 -1436
4875 -1436 -1506 -52 588 1396 985 -1186 -1531 657 1912 661 -376 -1191 -1510 518 2368 850 -1657
$$ packed form
4756A590J66k952q44J972J032m58k04j151r19J753K254j573k163J52L09J440J665
4773B069j045l134J83K595K34J7o18j669l28K172J330j756j095M12Q3J083J492
4790B025j968k369J391J971k56K90j072j721Q86K135n4j897j17J81L37J513K13
4807A488k556q49J790J035K1Q7j904j473J852K366j020j582K02m99J010J726n92
4824A102k846J16K446J34n0n15j803n56K801J273j598j100n66K68J629J484k101
4841A18k330J527J117O98M9j053k066R45K549J43j712o83l04P15J793M59k587
4858f22j015J440P55N55J48j716j850K064K163r37j406n34l8Q64K320l40l287
4875a436p0J454O40Q08m11k171l45K188J255j251j037q15l19K028J850j518k507
$$ plain form
4892 -1657 -1293 -24 845 1587 446 -1857 -1991 1446 1722 324 -354 -1300 -1273 1130 2358 59 -1846
4909 -1846 -801 28 1113 1911 -283 -2415 -1006 1529 1252 446 -791 -1778 -652 2145 1806 -928
4925 -928 -1360 -557 236 1534 1533 -1031 -2815 -301 1532 1274 343 -951 -1940 -29 2190 1097 -1082
4942 -1082 -1592 -553 365 1997 1188 -2166 -2161 399 1375 1077 5 -1468 -1705 803 2305 297 -1681
4959 -1681 -1019 -296 926 2202 -20 -2132 -1435 912 1241 785 -66 -2100 -1608 1482 1919 -301 -1560
4976 -1560 -1355 -586 1475 1703 -683 -2298 -771 1314 1241 822 -818 -2815 -750 2069 1516 -391 -1371
4993 -1371 -1380 -346 2332 1540 -1339 -2219 -279 1377 1463 710 -1515 -2464 431 2328 1238 -501 -1212
5010 -1212 -1366 73 2505 1108 -1812 -1674 36 1150 1536 496 -2066 -1933 1473 2200 507 -990
$$ packed form
4892a657L64J269Q69P42j141k303j34L437K76j398o78r46K7K403J228k299j905
4909a846J045Q29J085P98k194k132J409K535k77q06j237r87J126K797l39k734
4925i28m32Q03P93J298jk564j784K514J833k58r31j294r89J911K219j093k179
4942a082n10J039R18J632q09l354NK560R76k98j072j473k37K508J502k008j978
4959a681O62P23J222J276k222k112O97K347L29m56q51k034M92L090M37k220j259
4976a560K05P69K061K28k386j615J527K085p3m19j640j997K065K819n53j907r80
4993a371rJ034K678p92k879q80J940J656Q6p53k225r49K895J897j090j739p11
5010a212j54J439K432j397k920J38J710J114L86j040k562J33L406P27j693j497
$$ plain form
5026 -990 -1485 -1194 1192 2787 498 -2163 -1316 -66 1289 1779 -68 -2413 -1418 1442 1717 357 -1100
5043 -1100 -1883 -1002 1915 2502 -436 -2113 -1233 165 1673 1957 -620 -2726 -712 1561 1376 252
5059 252 -1142 -2006 -134 2391 1875 -1046 -1881 -660 463 2243 1470 -1546 -2800 32 1572 1359
5075 1359 453 -1384 -2132 131 2611 911 -1247 -1334 -654 906 2414 859 -2385 -1820 839 1958
5091 1958 1348 484 -1958 -1930 1354 2346 733 -1042 -1325 -764 1456 2324 -47 -2367 -1259 1081 1647
5108 1647 1094 -385 -2313 -1019 1590 2215 -181 -1096 -1068 -922 1757 2085 -720 -2194 -781 1121 1578
5125 1578 913 -1055 -2115 -506 2246 1616 -471 -1467 -1874 -117 2201 1842 -1653 -2129 -560 607
5141 607 1081 805 -1630 -2007 357 1930 548 -696 -1634 -1644 389 2698 827 -2034 -1916 -417 1033
$$ packed form
5026i90m95K91K386J595k289k661Q47J250J355M90j847k345R95K860K75j360j457
5043a100p83Q81K917N87k938j677Q80J398J508K84k577k106K014K273j85j124
5059B52j394q64J872K525n16k921q35J221J123J780p73l016j254K832J540k13
5075A359r06j837p48K263K480j700k158q7O80J560J508j555l244N65K659J119
5091A958o10q64k442K8L284R92j613j775k83N61K220Q68k371k320J108K340N66
5108A647n53j479j928J294K609O25k396r15K8J46K679L28k805j474J413J902M57
5125A578o65j968j060J609K752o30k087r96m07J757K318l59l495m76J569J167
5141F07M74k76k435l77K364J573j382j244r38j0K033K309j871k861J18J499J450
$$ plain form
5158 1033 1860 383 -2243 -1754 845 1546 434 -1007 -1718 -1145 1233 2523 -496 -1952 -1523 -210
5174 -210 1196 1831 -234 -2519 -1250 1240 1348 584 -687 -1622 -693 1774 1792 -1010 -1332 -1102 173
5191 173 1372 1500 -1063 -2278 -687 1764 1546 658 -898 -2247 -150 1875 990 -852 -1331 -708 630
5208 630 2184 819 -1661 -1783 214 1598 1127 299 -1692 -1649 785 2392 912 -851 -1045 -1016 1006
5225 1006 2055 804 -1652 -1252 440 1289 1055 -108 -1873 -1346 1295 1951 22 -663 -1336 -1052 1010
5242 1010 1936 239 -2141 -704 474 1182 1015 -552 -2125 -936 1416 1504 -301 -1078 -1437 -589 1276
5259 1276 1808 -783 -1777 -422 478 1043 854 -839 -1882 -272 1684 946 -360 -951 -1443 -212 1477
5276 1477 1150 -1232 -1601 -519 491 911 604 -1322 -1870 592 1419 280 -161 -895 -1138 108 1512
$$ packed form
5158A033Q27j477k626M89K599P01j112j441p11N73K378J290l019j456M29J313
5174b10J406O35k065k285J269K490J08p64j271r35R29K467J8k802l22K30J275
5191A73J199J28k563j215J591K451k18q88j556j349K097K025q85j842m79O23J338
5208F30J554j365k480j22J997J384m71q28j991M3K434J607j480j763j94K9K022
5225A006J049j251k456M00J692Q49k34j163j765N27K641O56j929o85o73K84K062
5242A010R26j697k380J437J178P08j67j567j573J189K352Q8j805p77l59Q48J865
5259A276N32k591r94J355R00N65j89j693j043J610J956p38j306n91m92J231J689
5276A477l27k382l69J082J010M20l07j926n48K462Q27j139m41p34k43J246J404
$$ plain form
5293 1512 -11 -1712 -705 -211 513 1482 272 -1890 -1389 827 1179 183 -216 -1223 -753 1283 1642
5310 1642 -275 -1310 -554 613 812 957 -535 -1477 -445 1051 909 177 -229 -1515 -236 1669 1039
5327 1039 -953 -1256 -376 427 1299 804 -1312 -1455 429 1425 459 -415 -1102 -1355 137 1731 468 -793
5345 -793 -939 -240 216 1516 611 -1622 -1159 728 1033 245 -347 -1044 -1174 1100 1654 -21 -1159 -728
5363 -728 -60 564 1322 99 -1286 -610 752 938 546 -428 -1211 -477 1197 1105 -456 -948 -953 102 1226
5382 1226 1226 -1004 -1544 -189 720 607 547 -1007 -1374 25 1519 795 -573 -1004 -523 201 1562 691
5400 691 -1300 -1227 443 934 914 414 -1222 -1384 729 1628 70 -743 -897 -550 688 1343 210 -1366
5418 -1366 -1033 516 619 706 -113 -1457 -1028 1162 1255 -89 -989 -1088 -707 1086 1209 -441 -1695 -274
$$ packed form
5293A512j523j701J007M94P24R69j210k162N01K216L52r96l99j007M70K036L59
5310A642j917j035P56J167J99J45j492r42J032J496j42p32m06j286J279J905o30
5327A039j992l03Q80Q03Q72m95k116j43J884R96r66q74o87k53J492J594j263j261
5345g93j46O99M56J300r05k233M63J887L05p88n92o97j30K274N54j675j138M31
5363g28O68O24P58j223j385O76J362J86l92r74p83P34J674r2j561m92nJ055J124
5382A226%k230n40J355R09j13o0j554l67J399J494p24j368m31M81P24J361q71
5400F91j991P3J670M91k0n00j636j62K113Q99j558q13j54L47J238O55j133j576
5418a366L33J549J03Q7q19j344M29K190R3j344r00r9L81J793J23j650j254J421
$$ plain form
5436 -274 345 812 764 -729 -1679 -157 1377 559 -326 -358 -903 -201 1224 895 -853 -1128 -154 502 992
5455 992 620 -884 -1099 856 1325 336 -496 -686 -910 706 1688 288 -1387 -972 246 687 1007 291
5473 291 -1294 -1017 1215 1390 106 -390 -682 -618 1150 1661 80 -1343 -384 419 991 1276 -129 -1643
5491 -1643 -532 1439 1217 -63 -473 -1032 -66 1369 1221 -800 -1089 -199 367 1220 928 -748 -1556 377
5509 377 1415 771 -80 -965 -1323 364 1934 576 -909 -893 -241 627 1272 388 -1309 -1186 723 1002
5527 1002 721 -159 -1249 -1403 1079 1964 218 -1177 -1098 -399 780 1551 -111 -1614 -979 828 954
5544 954 473 -515 -1532 -872 1245 1663 -535 -1693 -1166 -245 1289 1345 -631 -1859 -519 1214 933
5561 933 434 -626 -1770 -172 1734 1078 -853 -1415 -879 -75 1789 915 -1313 -1593 -40 1273 882
$$ packed form
5436b74O19M67m8j493r50J522J534q18q85l2n45P02J425l29j748k75R74O56M90
5455I92l72j504k15J955M69r89q32j90k24J616R82j400j675M15J218M41L20p16
5473B91j585K77K232J75j284m96k92O4J768N11j581j423R59Q03N72K85j405j514
5491a643J111J971k22j280m10n59R66J435j48k021k89Q90N66Q53k92j676q08J933
5509C77J038o44q51q85l58J687J570j358j485J6O52Q68O45q84j697J23J909K79
5527A002k81q80j090j54K482Q85j746j395P9O99J179P71j662j503O35J807J26
5544I54m81r88j017O60K117M18k198j158N27R21J534N6j976j228J340J733k81
5561I33m99j060j144J598J906o56j931n62N36Q04J864q74k228k80J553J313l91
$$ plain form
5578 882 607 -708 -1419 79 1809 877 -543 -678 -877 548 1790 128 -1863 -1257 289 1363 1369
5595 1369 -246 -1859 -1325 559 1783 416 -621 -1128 -766 1048 1568 -216 -1792 -756 470 1162
5611 1162 1398 -327 -1978 -914 1788 1440 174 -913 -1303 -571 1684 1336 -635 -1275 -512 435 964
5628 964 968 -1211 -1959 -64 1616 1030 146 -1003 -1294 146 1791 1185 -940 -1165 -16 752 1200 442
5646 442 -1395 -1429 757 1318 609 -222 -1410 -1229 1044 1908 324 -1300 -1077 -241 827 1600 -114 -1815
5664 -1815 -849 570 1307 195 -409 -1392 -403 1443 1495 -215 -1553 -853 -167 1172 1284 -555 -1827
5681 -1827 -763 691 1189 308 -1049 -1658 -448 1371 736 -581 -1351 -665 248 1793 1145 -897 -1859
5698 -1859 -13 886 1248 445 -1084 -1521 -3 2044 902 -605 -1191 -588 647 1399 558 -1728 -1411
$$ packed form
5578H82k75j315p11J498J730r32j420j35j99J425J242j662j991O06J546J074O
5595A369j615j613N34J884J224j367j037n07L62J814N20j784j576J036J226O92
5611A162K36j725j651J064K702l48j266j087l90P32K255l48j971o40P63R47N29
5628I64Mk179p48J895J680n86q84j149k91J440J645o06k125k25J149P68M48p58
5646D42j837l4K186N61p09q31j188J81K273Q64j584j624K23Q36J068P73j714j701
5664a815R66J419P37j112o04r83R89J846N2j710j338P00O86J339J12j839j272
5681a827J064J454M98q81j357o09J210J819o35j317p70O86R13J545o48k042r62
5698a859J846Q99L62q03j529m37J518K047j142j507n86O03J235P52q41k286L17
$$ plain form
5715 -1411 481 1450 1119 192 -1636 -1716 568 1761 381 -869 -906 -658 712 1579 -39 -1656 -818
5732 -818 838 1309 1083 -50 -1631 -846 1319 1580 128 -775 -1211 -390 1185 1919 -419 -1345 -246
5749 -246 754 1040 858 -444 -1679 -80 1256 1314 21 -855 -1423 -222 1794 1166 -831 -1312 -450
5766 -450 401 1420 793 -768 -1344 82 1277 857 4 -879 -1229 591 1882 613 -966 -1150 -303
5783 -303 702 1436 322 -1377 -1384 616 1331 343 -368 -788 -922 1152 1873 -60 -1109 -370 -290 725
5801 725 1390 -336 -1662 -749 824 895 -69 -339 -1223 -663 938 814 -422 -835 -705 -112 760 1141 -499
5820 -499 -1542 -43 1017 788 168 -601 -1431 133 1567 749 -584 -830 -477 303 1287 870 -1252 -1292
5838 -1292 264 1064 799 88 -1061 -1346 111 1075 396 -1020 -800 -411 643 1308 21 -1249 -681
$$ packed form
5715a411J892R69l31r27j828q0K284J193j380j250l7K48J370Q67j618j617Q38
5732h18J656M71k26j133j581P85K165K61j452r03m36Q21J575P34k338r26J099
5749b46J000K86j82j302j235J599J336N8j293q76n68J201K016o28j997m81Q62
5766d50Q51J019o27j561n76J426J195m20q53q83l50J820J291j269j579j84Q47
5783c03J005P34j114j699pK000P15r88p11m20j34K074P21j933j049P39Q0J015
5801G25O65j726j326R13J573P1r64k70q84N60J601j24j236m13J30N93Q72L81j640
5820d99j043J499J060k29o20p69q30J564J434q18j333k46L53P80R84m17k122m0
5838a292J556Q00k65p11j149k85J457R64o79j416K20L89J054O65j287j270N68
$$ plain form
5855 -681 518 690 465 -222 -1457 -803 905 970 -260 -1040 -613 -417 1121 1043 -503 -1486 -461 468
5873 468 708 702 -343 -1174 -341 1018 983 -125 -501 -602 23 1004 925 -745 -1336 48 426 796 640 -698
5893 -698 -1009 214 1212 309 -441 -680 -799 204 1118 681 -878 -1041 296 355 526 255 -1103 -763 766
5912 766 1207 -23 -508 -1024 -867 623 1335 214 -1004 -421 112 173 934 -65 -1179 -555 1040 683
5930 683 -257 -754 -842 -360 1019 1065 -588 -825 -69 -28 532 927 -583 -1163 -63 880 174 -53 -291 -843
5950 -843 138 970 525 -1151 -779 -324 418 646 843 -907 -717 45 837 213 354 -312 -588 369 1086
5969 1086 229 -1018 -574 -126 599 774 -303 -1238 -321 456 557 252 -89 -505 -627 560 697 -349
5987 -349 -773 -325 -175 651 625 -799 -1430 -158 803 409 106 -129 -905 -251 1004 684 -348 -583 -154
$$ packed form
5855f81J199J72k25o87j235O54J708O5j230p80M27J96J538p8j546r83J025R29
5873D68K40oj045q31Q33J359l5j108l76j01O25R81p9j670n91J384L78L70j56j338
5893f98l11J223R98r03p50k39j19J003R14m37j559j63J337N9J71k71j358L40J529
5912G66M41j230m85n16J57J490P12j121j218N83N33O1P61r99j114O24J595l57
5930F83r40m97q8M82J379M6j653k37P56M1N60L95j510n80J100R43p06k27k38n52
5950h43R81Q32m45j676L72M55P42K28J97j750J90P62P92o24J41o66k76R57P17
5969A086q57j247M44M48P25J75j077r35R17P77J01l05l41m16j22J187J37j046
5987c49m24M48J50Q26k6j424o31J272R61l94l03k35p76O54J255l20j032k35M29
$$ plain form
6006 -154 -181 602 658 -677 -1079 286 780 416 183 -520 -758 54 1249 539 -604 -415 -89 33 1027
6025 1027 49 -1009 -446 856 578 -9 -106 -701 -599 640 1227 -24 -631 -856 -258 674 1099 -146
6043 -146 -1352 -115 850 412 389 -444 -1157 -289 1238 708 -413 -490 -652 -51 673 1165 -607 -1098 -141
6062 -141 698 211 480 -473 -1042 175 1100 438 -712 -606 -657 11 1128 731 -750 -1018 -129 966 681
6081 681 325 -788 -1184 423 1098 -36 -319 -596 -355 358 909 79 -1112 -621 157 250 959 221 -872
6100 -872 -549 751 1066 149 -455 -490 -257 584 1195 -522 -830 -158 605 600 739 -317 -1053 -273 1077 797
6120 797 12 -281 -541 31 1223 778 -673 -659 -418 521 687 335 -747 -798 265 484 386 -200 -483 -709
6140 -709 -30 1253 487 -497 -715 20 210 1225 198 -756 -625 396 691 418 44 -1071 -667 805
$$ packed form
6006a54k7P83N6j335m02J365M94l64k33p03k38Q12J195p10j143J89L26J22R94
6025A027r78j058N63J302k78n87r7n95J02J239N87j251o07k25N98R32M25j245
6043a46j206J237R65m38k3q33p13Q68J527n30j121p7j62O01P24M92j772m91R57
6062a41Q39m87K69r53n69J217R25o62j150J06n1O68J117l97j481k68Q89J095k85
6081F81l56j113l96J607O75j134k83k77K41P13N51q30j191M91P78R3P09p38j093
6100h72L23J300L15r17o04l5K33Q41O11j717l08O72P63nJ39j056p36P80J350k80
6120G97p85k93k60N72J192m45j451J4K41R39J66l52j082n1J063K19r8n86k83k26
6140g09O79J283p66r84k18P35J90J015j027r54J31J021K95k73l74j115M04J472
$$ plain form
6158 805 1063 161 -661 -483 -23 634 752 -170 -830 -253 554 810 266 -275 -1131 -366 917 641 -405
6177 -405 -995 -171 226 546 734 -773 -1162 -18 615 640 424 -505 -972 -9 1401 408 -759 -801 -334
6196 -334 27 1060 370 -946 -1036 88 448 517 94 -712 -878 377 1053 199 -914 -646 -557 326 1199
6215 1199 -12 -1119 -923 140 481 380 62 -1130 -679 917 940 -224 -456 -706 -134 524 1175 -381
6233 -381 -985 -435 470 699 508 -378 -925 -495 1101 1038 -198 -398 -727 -200 792 865 -463 -889 -430 449
6253 449 594 464 -862 -1188 -31 1056 615 -245 -906 -845 115 1277 662 -789 -473 -153 93 647 473
6272 473 -540 -983 198 974 326 212 -751 -915 402 1324 175 -763 -235 -207 189 1004 5 -1109 -684
6291 -684 484 597 82 -79 -878 -769 907 896 -349 -557 -597 -16 711 628 -309 -858 -276 644 552 226
$$ packed form
6158H05K58r02q22J78M60O57J18r22o60N77Q07K56n44n41q56P65J283k76j046
6177d05n90Q24L97L20J88j507l89J144O33K5k16r29m67R63J410r93j167m2M67
6196c34L61J033o90j316r0J124L60O9m23q06j66J255O76q54j113K68Q9Q83Q73
6215A199j211j107J96J063L41j01l18j192M51J596K3j164k32k50N72O58O51j556
6233c81o04N50R05K29j91q86n47M30J596o3j236k00l29N27R92P3j328m26M59Q79
6253D49J45j30j326l26J157J087m41q60o61O1R60J162o15j451L16L20K46N54j74
6272D73j013m43J181P76o48j14r63j64J317R22j149r38N28K8L96Q15r99j114M25
6291f84J168J13n15j61p99J09J676j1j245k08m0N81P27q3r37n49N82R20r2l26
$$ plain form
6311 226 -465 -993 -78 991 650 -648 -582 -266 183 664 293 -718 -991 -227 328 458 295 -512 -876
6330 -876 -10 911 137 -323 -569 -524 283 756 701 -957 -544 219 681 552 54 -874 -834 683 609 -49 -561
6351 -561 -507 -707 247 940 -84 -711 -344 415 733 421 -130 -1195 -154 354 390 -15 -367 -617 -42 786
6371 786 779 -493 -620 -87 120 716 507 -261 -881 -52 960 328 130 -403 -311 -301 828 405 -496 -474 -77
6392 -77 201 358 482 -617 -610 108 1125 606 235 -263 -361 460 932 401 -806 -432 92 340 798 -75
6412 -75 -839 -604 673 837 538 -32 -384 -421 655 851 -72 -501 -460 194 174 601 69 -931 -43 563
6432 563 217 271 -114 -979 -200 730 539 -560 -564 -376 -268 384 795 -273 -976 -225 500 225 335 -577
6452 -577 -810 -68 863 492 -521 -442 -128 -98 731 235 -950 -657 568 301 122 7 -480 -388 32 504
$$ packed form
6311B26o91n28R15J069l41j298O6L16M49M81l71j011k73P64N55J30j63q07l64
6330h76Q66R21p74m60k46M5Q07M73n5j658M13P63M62j29m98r28M0J517p4o58n12
6351e61N4k00R54O93j024o27L67P59L18l12n51j065J041N08L6m05l52k50N75Q28
6371G86pj272j27N33K07N96k09p68o20Q29J012o32j98n33R2J0J129m23r01K2L97
6392g7K78J57J24j099PP18J017n19l71m98r8Q21M72n31j207L74N24K48M58q73
6412g5p64K35J277J64k99n70l52l7J076J96r23m29M1O54k0M27n32j000Q88O06
6432E63l46N4l85q65P79R30j91j099mJ88J08O52M11j068p03P51P25k75J10r12
6452e77k33P42R31l71j013P9L14L0Q29m96j185K93J225k67j79j15m87R2M20M72
$$ plain form
6472 504 -157 -560 -441 -384 93 496 157 -817 -631 410 117 271 66 -747 -354 822 433 -92 49 127
6492 127 193 500 310 -155 -694 -51 648 313 218 51 -882 -153 587 -25 -69 5 -442 -311 627 469 -207
6513 -207 -339 345 487 330 427 -537 -380 364 734 212 -117 -155 -144 -63 587 109 -348 -258 96 193 117 52 -777
6536 -777 -514 618 625 -25 -515 -469 -239 394 877 -69 -666 370 12 216 216 -220 -749 -344 405 394 -277
6557 -277 -195 -601 -90 593 752 -306 -601 -245 145 362 239 -572 -658 256 359 114 -325 -247 -517 117 955
6578 955 -24 -297 -368 -81 -86 639 454 -631 -730 154 640 -87 -166 -391 -665 343 502 -380 -661 -430 12
6599 12 248 521 8 -783 -560 419 -2 -12 -156 -354 -307 346 297 -316 -472 140 -74 382 556 -546 -825
6620 -825 -33 294 394 293 -101 -706 52 542 463 -261 -136 -161 72 284 617 -269 -305 249 268 226 12 -305
$$ packed form
6472E04o61m03J19N7M77M03l39r74J86J041k93J54k05q13L93J176l89n25J41P8
6492A27O6L07j90m65n39O43O99l35r5j67r33P29P40o12m4P4m47J31R38j58o76
6513b07j32O84J42j57R7r64J57P44L70n22l29l8J1Q1O50m78m57R0L54R7p6o5q29
6536g77K63J132Po50m90M6K30O33M83r46n97J036l58K04%m36n29M05P49j1o71
6557b77Q2m06N11O83J59j058k95L56L90K17j23q11q6R14J03k45m39P8k70O34Q38
6578I55r79k73p1K87nP25j85j085r9Q84M86p27p9k25k74J008J59q82k81K31M42
6599A2K36K73n13p91K23R79m21j0j44j98M7O53m9o13j56O12k14M56J74j102k79
6620h25P92L27J00j01l94o05P58M90p9p24J25k5K33K12L33q86l6N54J9m2k14l17
$$ plain form
6642 -305 -250 445 473 123 -323 -427 -80 235 501 298 -548 -472 397 -159 395 186 -608 -359 377 698 314
6663 314 -109 -92 -244 442 718 -126 -480 -65 217 306 517 -169 -461 -130 731 419 -199 -164 -279 152 771
6684 771 631 -251 -550 240 287 470 100 -471 -742 -169 647 139 -433 -352 -213 226 830 355 -488 -729 110
6705 110 287 392 -91 -595 -415 273 585 -88 -156 -295 -631 275 471 -240 -619 -397 254 284 124 -296 -889
6726 -889 -363 542 475 160 -203 -486 -211 781 858 -644 -708 27 84 209 629 -149 -1016 -58 544 413 -177
6747 -177 -260 -683 -30 720 265 -445 -605 174 218 532 96 -183 -679 111 485 477 -281 -248 -718 92 600 329
6769 329 -623 -313 91 278 511 111 -570 -760 289 450 293 52 -807 -193 263 767 -178 -276 -341 -161
6789 -161 359 561 -105 -870 -32 303 462 180 -21 -944 -228 441 716 -64 -391 -471 -191 631 539 -85 -668
$$ packed form
6642c05N5O95K8l50m46j04L47L15K66k03q46P6Q69n56N54k09p94K49P36L21l84
6663C14m23J7j52O86K76q44l54M15K82Q9K11o86k92L31Q61l12o18L5j15M31O19
6684G71j40q82k99P90M7J83l70n71k71N73Q16n08n72Q1J39M39O04m75q43k41Q39
6705A10J77J05m83n04J80O88L12o73o8j39l36R06J96p11l79K22O51L0j60m20n93
6726h89N26R05o7l15l63k83K75R92P7j502o4P35N7J25M20p78q67R58O02j31n90
6747a77q3m23O53P50m55p10j60P79M4L14m36k79m96P90L74qp58L3m70Q10N08k71
6769C29r52L10M04J87K33m00o81j90J049J61j57k41q59O14M56N04r45r8o5J80
6789a61N20K02o66p65Q38L35J59k82k01r23P16O69K75p80l27q0K80Q22r2o24n83
$$ plain form
6810 -668 60 319 250 167 -503 -1045 -190 674 235 -354 -722 -492 13 354 185 -712 -580 -173 448 55 214
6831 214 -445 -646 435 692 271 -236 -169 -297 402 889 50 -742 -330 260 135 388 304 -757 -248 762
6851 762 517 -173 -528 -455 -438 686 783 19 -928 -255 274 83 478 -412 -703 -13 566 303 81 -285 -551
6872 -551 48 647 415 -302 -549 313 266 647 303 -302 -454 316 573 331 -115 -685 -259 -137 735 247
6892 247 -405 -328 86 172 762 -35 -691 -259 309 676 307 149 -340 -478 110 789 -12 -255 -283 -6 321
6913 321 714 -114 -607 -201 558 387 313 -67 -676 -317 582 565 171 -397 -403 28 475 441 -306 -605 -87 66
6935 66 351 132 -370 -498 -143 658 246 -255 -169 -325 -209 499 331 -442 -275 -156 240 -65 68 -428 -525
6956 -525 -110 209 398 -223 -60 -308 160 672 220 -623 -425 -252 124 514 -90 -404 -447 468 344 -79
$$ packed form
6810f68P28K59o9q3o70n42Q55Q64m39n89l68K30N05L41j69q97J32M07O21l93J59
6831B14o59k01J081K57m21n07O7j28O99M87q39p92M12N90j25K53q4j061N09J010
6851G62k45o90l55P3J7J124R7p64r47O73N29j91L95q90k91O90N79k63k22l66k66
6872e51N99N99k32p17k47Q62m7L81l44o05j52P70K57k42m46n70M26J22Q72m88
6892B47o52P7M14Q6N90p97o56M32N68L67l69j58m89j38N88O79q01k43k8K77L27
6913C21L93q28m93M06P59j71p4l80o09L59Q99j7l94n68oM31M47l4p47k99N18J53
6935F6K85k19n02j28L55Q01m12n01Q6j56J16P08j68p73J67J19L96l05J33m96r7
6956e25M15L19J89o21J63k48M68N12m52q43J98J73L76L90o04l14m3R15j24m23
$$ plain form
6976 -79 -169 -562 -113 476 351 120 -373 -153 78 445 320 170 -289 -296 234 75 69 -147 -490 46 674 393
6998 393 -480 -711 33 422 445 327 -354 -410 -75 556 170 217 -122 -335 -54 405 45 -300 -242 175 84 567
7020 567 172 -494 -568 376 577 84 33 201 -173 260 532 115 -709 -370 101 -142 460 77 -426 62 509
7041 509 321 184 -122 -143 -482 496 411 -331 -227 29 -140 144 578 -86 -164 -122 464 84 -65 -26 -494 120
7063 120 462 311 -160 -159 -404 -110 275 313 -202 -611 262 324 53 1 -95 -542 276 664 -110 -338 -249 237
7085 237 -56 465 165 -165 -192 114 275 125 77 -419 -302 480 496 -429 -185 -182 -210 -7 327 -146 -572 -71
7107 -71 419 163 34 -156 -467 87 390 360 -143 -134 -207 -138 173 318 -420 -148 -3 300 200 129 70 -538 -74
7130 -74 555 -81 -208 -118 -123 -46 510 369 -221 -92 213 -58 275 62 -174 -393 267 315 -45 -82 201 -232
$$ packed form
6976g9r0l93M49N89j25k31m93K20K31L67j25j50m59pN30j59ok16l43N36O28k81
6998C93q73k31P44L89K3j18o81n6L35O31l86M7l39k13K81M59l60l45N8M17r1M83
7020E67l95o66p4R44K01m93n1J68l74M33K72m17q24L39M71k43O02l83n03M88M47
7041E09j88j37l06k1l39R78q5p42J04K56j69K84M34o64p8M2N86l80j49L9m68O14
7063A20L42j51m71Jk45K94L85L8n15m09Q73O2k71n2r6m47Q18L88p74k28Q9M86
7085B37k93N21l00l30k7L06J61j50m8m96J17P82J6r25K44Lk8K03L34m73m26N01
7107g1M90k56j29j90l11N54L03l0n03Rp3O9L11J45p38K72J45L03j00p1n9o08M64
7130g4O29o36j27R0nP7N56j41n90J29L05k71L33k13k36k19O60M8l60l7K83m33
$$ plain form
7152 -232 102 863 -10 -367 -250 73 118 266 115 -510 -239 105 110 -180 -234 25 -17 488 181 -215 -734 4
7174 4 30 -63 36 -121 -444 -18 420 203 -381 -69 -319 137 395 100 -353 -217 171 285 109 31 -226 -653
7196 -653 145 394 261 68 -22 -237 -66 363 -199 -450 -204 115 71 549 -160 -658 -438 352 198 -422 73
7217 73 -346 -195 58 384 -148 -756 -162 169 -120 322 -221 -648 36 383 383 -548 -199 -347 -78 522 163
7238 163 -368 -306 -285 -261 492 337 152 -172 47 368 384 -141 -63 -91 699 506 279 -242 -60 112 -131 321
7260 321 -46 -470 -370 -45 284 226 -63 -539 -66 472 356 -152 -332 20 105 227 414 -153 -195 -65 105
7281 105 525 373 68 -337 63 510 395 -233 -547 -205 44 409 421 -323 -479 55 493 240 -29 -239
7301 -239 -504 216 710 -36 94 -150 -217 6 172 271 -133 103 219 476 67 -59 -411 -507 438 459 279
$$ packed form
7152b32L34P61q73l57J17L23M5J48j51o25K71L44Nk90n4K59m2N05l07l96n19P38
7174DK6r3R9j57l23M26M38k17n84L12k50M56K58k95m53J36L88J14j76p8k57m27
7196f53P98K49j33j93r0k15J71M29n62k51K46L19m4M78p09m98K20P90j54o20M95
7217G3m19J51K53L26n32o08N94L31k89M42n43m27O84L47%r31L49j48K69O00l59
7238A63n31O2K1K4P53j55j85l24K19L21J6n25P8k8P90j93k27n21J82J72k43M52
7260C21l67m24J00L25L29n8k89m76M73N38j16n08j80L52Q5J22J87n67m2J30J70
7281A05M20j52l05m05M00M47j15o28l14L42K49L65J2p44j56N34M38k53k69k10
7301b39k65P20M94p46J30k44o7K23J66R9m04K36J16K57m09j26l52r6R45K1j80
$$ plain form
7322 279 -22 -332 -444 112 481 -93 -713 -60 370 -132 207 -97 -117 -212 351 338 -80 -334 -71 -458 -63
7343 -63 608 -15 -428 113 -93 162 164 2 -418 20 238 76 211 -384 -138 -34 298 179 -75 -390 -183
7364 -183 218 403 180 -175 -557 16 289 102 -47 30 -194 255 777 286 -537 -355 51 188 318 294 -404
7385 -404 -446 301 296 -122 114 -140 -316 491 110 10 -169 46 -55 493 508 -16 -296 -111 244 293 178 -338
7407 -338 -367 -435 398 409 -265 -348 34 69 364 333 -443 -630 435 181 270 88 -145 -345 -120 694 319 -107
7429 -107 -168 -255 -143 336 10 -369 -456 262 587 272 -327 -148 -519 298 593 297 -10 -253 -339 81 583
7450 583 33 -131 -143 51 375 144 93 -537 -461 95 349 -312 -147 -115 -298 96 209 16 -151 -48 74
7471 74 77 -59 -240 -376 -221 159 171 -3 -404 -162 -18 329 368 -468 -359 97 -136 250 13 73 -297 29
$$ packed form
7322B79l01l10j12N56L69n74o20O53M30n02L39l04k0r5N63j3m18k54K63l87L95
7343f3O71o23m13N41k06K55Kj62m20M38K18j62J35n95K46J04L32j19k54l15K07
7364a83M01J85k23l55l82N73K73j87j49P7k24M49N22m91q23J82M06J37J30k4o98
7385d04m2P47nm18K36k54j76Q07l81j00j79K15j01N48J5n24k80J85L55M9j15n16
7407c38k9o8Q33J1o74q3L82L5K95l1p76j87J065k54Q9j82k33k00K25Q14l75m26
7429a07o1q7J12M79l26l79q7P18L25l15n99J79l71Q17K95k96l07k43q6M20N02
7450E83n50j64j2J94L24k31n1o30P6N56K54o61J65L2j83L94J13j93j67J03J22
7471G4Lj36j81j36J55L80J2j74m01K42J44L47L9q36J09M56k33L86k37O0l70L26
$$ plain form
7493 29 196 166 -60 -118 -77 222 411 390 -388 -114 -86 105 566 413 -119 -268 173 330 192 -166 -154 -276
7515 -276 388 429 250 -392 15 134 154 446 235 -100 31 273 206 112 -132 -182 -200 168 43 -114 -202 -158 -87
7538 -87 154 345 -2 -562 -31 390 264 -128 -165 -332 43 130 72 -283 -282 -214 303 255 -68 -108 -175 -29 197
7561 197 -98 -102 -93 -264 30 441 273 -149 -105 -139 265 159 255 -120 -107 64 321 243 85 -59 -480 -21 410
7584 410 61 -81 -61 15 -118 405 -75 -543 -29 212 -94 143 93 -488 -406 167 193 -329 -19 11 -141 -48
7606 -48 342 -365 -292 -322 38 -250 39 103 -202 -34 431 90 217 -103 87 68 251 14 -506 40 75 33
7628 33 263 286 -324 -175 87 289 -164 271 200 168 162 570 -54 -81 168 173 189 85 179 -24 -101 250 71 246
7652 246 74 -128 35 199 152 -123 -242 297 -123 222 372 220 -119 -123 123 13 188 -230 -14 -151 -62
$$ packed form
7493B9J67l0k26n8M1K99J89k1p78K74K8J91M61j53n32j49M41J57j38l58J2j22
7515b76O64M1j79o42M07J19K0K92k11l35J31K42o7r4k44n0j8L68j25j57q8M4P1
7538h7K41J91l47n60N31M21j26l92l7j67L75Q7n8l55JO8N17m8l23m0o7J46K26
7561A97k95mRj71K94M11j68m22M4l4M04j06R6l75J3J71K57p8j58j44m21M59M31
7584D10l49j42K0P6j33N23m80m68N14K41l06K37n0n81Q2N73K6n22L10L0j52R3
7606d8L90p07P3l0L60k88K89O4l05J68M65l41J27l20J90j9J83k37n20N46L5m2
7628C3K30K3o10J49K62K02m53M35p1l2oM08o24k7K49NJ6j04R4k03p7L51j79J75
7652B46j72k02J63J64m7k75j19N39m20L45J50j52l39mK46j10J75m18K16j37Q9
$$ plain form
7673 -62 43 34 -182 305 75 9 75 38 -215 -19 28 75 -156 129 -149 -117 378 203 -52 -63 236 -74 274
7696 274 139 -321 -343 332 118 -87 -170 -114 -248 110 276 8 -141 167 -256 -43 239 27 -381 158 154 72
7718 72 0 11 -83 -205 220 151 222 -279 124 -4 7 227 -37 -478 -318 131 108 -46 28 -466 16 81 -85
7741 -85 -478 -178 129 -254 84 253 -564 -204 211 270 213 99 -177 -54 194 111 -276 -325 51 -156 -380 -59
7763 -59 142 -461 -385 195 -27 -173 312 -330 124 198 291 -85 60 25 98 -132 154 -173 -188 -13 109 112 306
7786 306 -21 -287 -262 337 -1 -125 -195 -192 152 441 89 -485 -8 90 369 364 126 -42 -188 -235 365 -152 -240
7809 -240 359 -146 56 210 155 -435 -210 71 -189 67 195 -99 -204 169 54 -103 -78 147 -222 -8 232
7830 232 -218 -266 -31 205 -33 5 -7 -242 -162 543 56 -74 -16 -115 -364 232 344 -206 -379 -24 -67 -203
$$ packed form
7673f2J05rk16M87k30o6O6l7k53J96M7M7k31K85k78L2M95j75k55j1K99l10L48
7696B74j35m60k2O75k14k05q3N6j34L58J66k68j49L08m23K13K82k12m08N39mq2
7718G2p2J1r4j22M25o9P1n01M03j28J1K20k64m41J60M49k3j54P4m94M82O5j66
7741h5l93L00L07l83L38J69q17L60M15N9n7j14k76J23K48q3l87m9L76k07k24L21
7763e9K01o03P6N80k22j46M85o42M54P4R3l76J45l5P3k30K86l27j5J75J22LJ94
7786C06l27k66K5N99l38j24p0LL44K89l52n74M77R8K79nk38j68j46m7O00n17q8
7809b40N99n05K02J54n5n90K25K81k60K56J28k94j05L73j15j57K5K25l69K14K40
7830B32m50m8K35K36k38L8j2k35Q0P05m87j30N8r9k49N96J12n50j73L55m3j36
$$ plain form
7852 -203 -219 41 -324 -11 423 -50 -300 -251 -106 -235 65 162 -264 -217 -74 98 275 143 -465 -131 167
7873 167 288 -164 96 -231 -311 151 230 85 -95 104 188 40 213 105 -98 -186 231 161 -87 110 -122 -48
7895 -48 212 169 -106 -3 -152 141 295 262 131 -171 -179 142 -18 -205 -154 -364 -32 424 83 -195 49 21
7917 21 163 365 128 -86 -199 301 243 200 -13 -201 -602 55 135 114 -204 -496 -26 -109 461 -179 134 -101
7939 -101 60 203 250 127 -159 -169 116 299 -142 145 -151 -120 83 -30 15 -190 80 282 10 630 46
7960 46 -132 -193 134 133 -122 -59 -187 -164 229 121 -60 -228 273 -42 106 233 94 -312 195 292 -45 -146
7982 -146 -79 -222 -56 215 38 -238 -79 335 36 508 85 -330 -151 80 -49 171 -79 -153 -244 -48 309
8003 309 -198 -409 -229 160 92 348 39 -111 -122 201 290 68 -101 -117 -147 229 364 -97 -48 -87 116 123 297
$$ packed form
7852b03j6K60l65L13M34m73k50M9J45j29L00R7m26M7J43J72J77j32o08L34K98
7873A67J21m52K60l27q0M62P9j45j80J99Q4j48J73j08k03q8M17p0k48J97k32P4
7895d8K60m3k75J03j49K93J54l3j31l02qL21j60j87N1k10L32M56l41k78K44k8
7917B1J42K02k37k14j13N00n8m3k13j88m01O57Q0k1l18k92M70q3N70o40L13k35
7939a01J61J43M7j23k86j0K85J83m41K87k96L1K03j13M5k05K70K02k72O20n84
7960D6j78o1L27jk55O3j28K3L93j08j81j68N01l15J48J27j39m06N07R7l37j01
7982a46O7j43J66K71j77k76J59M14k99M72m23m15J79K31j29K20k50p4r1J96L57
8003C09n07k11J80L89o8K56l09j50j1L23Q9k22j69j6l0L76J35m61M9l9K03PJ74
$$ plain form
8026 297 198 -457 13 -26 402 102 -69 -338 -180 356 -33 -55 -20 57 69 160 317 -20 -264 173 -130 -10
8048 -10 248 -58 -73 9 232 22 23 275 320 74 121 -186 -64 -134 -58 55 189 156 -150 -408 35 222 -62
8071 -62 -335 -134 -168 37 83 -234 -360 -19 155 -117 87 -18 -193 78 249 -208 124 -34 -216 -364 512
8092 512 113 -146 -320 -50 137 66 241 113 -173 49 368 -13 -289 141 -228 -359 418 -7 -462 -130
8112 -130 117 194 258 42 -124 -305 38 294 4 -47 39 -27 -55 356 -113 -365 -82 -51 160 27 157 -61
8134 -61 -149 -154 44 -76 -147 -133 -153 77 147 -135 -41 165 -139 -223 576 152 -111 26 346 -205 80 -94 -94 165
8158 165 75 487 -304 -372 153 66 76 106 -17 -248 393 220 -178 -184 -144 -221 -17 132 175 186 -73 278 -40 -39
8182 -39 134 -2 -351 213 -61 32 -146 -12 -164
$$ packed form
8026B97r9o55M70l9M28l00j71k69J58N36l89k2L5P7J2R1J57l37k44M37l03J20
8048a0K58l06j5Q2K23k10JK52M5k46M7l07J22p0P6J13J34l3l06k58M43J87k84
8071f2k73K01l4K05M6l17j26L41J74k72K04j05j75K71J71m57L32j58j82j48Q76
8092E12l99k59j74K70J87p1J75j28k86K22L19l81k76M30l69j31P77m25m55L32
8112a30K47P7O4k16j66j81L43K56k90n1Q6o6k8M11m69k52K83L1K11j33J30k18
8134f1q8nJ98j20p1J4k0K30P0k82R4K06l04q4P99m24k63J37L20n51K85j74%K59
8158A65r0M12p91o8N25q7J0L0j23k31O41j73l98oM0p7K04J49M3J1k59L51l18J
8182c9J73j36l49N64k74R3j78J34j52
8191a64
$$ Imaginary data points
##PAGE= N=2
##DATA TABLE= (X++(I..I)), XYDATA
$$ plain form
0 0 0 0 0 -8 8 -8 16 -16 24 -28 40 -48 56 -68 88 -104 122 -146 172 -204 237 -275 324 -368 423 -488 553
27 553 -626 714 -803 903 -1015 1137 -1274 1421 -1581 1759 -1953 2168 -2400 2660 -2944 3258
43 3258 -3609 4002 -4437 4934 -5501 6149 -6906 7807 -8885 10217 -11908 14134 -17210
56 -17210 21760 -29196 43467 -80923 383137 919501 118812 -319415 -182033 238406 293959
67 293959 179762 129185 281279 266557 51715 -64839 106383 144296 -6084 51107 405150
78 405150 479542 60372 -404031 -333396 210275 601509 365474 -96974 -167728 61989 104053
89 104053 1445 43084 173837 184902 107875 56922 50582 -8096 -151151 -143136 217909 533295
101 533295 264341 -315608 -456333 -63686 297923 267740 14464 -112494 -22331 31031
$$ packed form
0@%%%qJ6j6K4l2M0n2O8q8J04j24J56j92K26k68L18l76M41n12N99o92P91r11J041
27E53j179J340j517J706j918K152k411K695l002L340l712M121m568N060n604O202
43C258o867P611q439R371j0435J1650j3055J4713j6692J9102k2125K6042l1344
56a7210L8970n0956P2663j24390M64060N36364q00689m38227J37382M20439N5553
67B93959j14197n0577J52094j4722k14842j16554J71222L7913j50380N7191L54043
78D05150P4392m19170m64403P0635N43671L91234k36035m62448p0754K29717M2064
89A04053j02608M1639J30753J1065p7027n0953o340n8678j43055Q015L61045L15386
101E33295k68954n79949j40725L92647L61609l0183k53276j26958R0163N3362
$$ plain form
111 31031 -98427 -163947 -18888 78554 10676 2801 73502 -20723 -256177 -325947 -85969
122 -85969 258004 318084 -35847 -384321 -287982 37892 127420 -2164 -62411 -11044 34191
133 34191 7394 -86530 -144390 -81381 18294 87356 161998 131340 -117210 -316002 -156333
144 -156333 169098 271245 98404 -122235 -174843 -34013 80883 9405 -76347 -12704 60995
155 60995 32222 -8450 -47080 -131299 -149786 -21609 130084 157667 15691 -211827 -272810
166 -272810 -48189 174229 113684 -71266 -116531 -36147 35618 20693 -78130 -122763 -4794
177 -4794 129022 110920 7803 -83759 -143651 -83748 102892 199589 90200 -69791 -125693
188 -125693 -60490 71489 124909 21065 -76153 -19105 73991 72012 5015 -80592 -118920 -11621
$$ packed form
111C1031j29458o5520J45059R7442o7878p875P0701r4225k35454o9770K39978
122h5969L43973O0080l53931l48474R6339L25874Q9528j29584o0247N1367M5235
133C4191k6797r3924n7860O3009R9675O9062P4642l0658k48550j98792J59669
144a56333L25431J02147j72841k20639n2608J40830J14896p1478q5752O3643P3699
155F0995k8773m0672l8630q4219j8487J28177J51693K7583j41976k27518o0983
166b72810K24621K22418o0545j84950m5265Q0384P1765j4925r8823m4633J17969
177d794J33816j8102j03117r1562n9892N9903J86640R6697j09389j59991n5902
188a25693O5203J31979N3420j03844r7218N7048R3096j979o6997q5607l8328J07299
$$ plain form
200 -11621 148292 141794 -18663 -142327 -139410 -21674 128270 134162 -29347 -133350 -61868
211 -61868 44246 69076 19328 -65778 -77707 42787 133420 55752 -68168 -96504 -38566
222 -38566 71730 155706 91608 -57098 -94572 -11115 70044 103923 68270 -32746 -69328
233 -69328 24826 103235 63879 -24000 -84244 -60083 71651 157211 40076 -134312 -136624 -6519
245 -6519 90001 81885 -21399 -118612 -82538 24871 42304 -14176 -50111 -69088 -54836 24029
257 24029 64439 -12737 -95634 -84547 -15987 60134 78125 -18832 -116430 -62891 54571 73331
269 73331 15532 -36421 -56507 -11578 65976 61641 -17605 -56235 -36000 9721 75229 79213
281 79213 -34733 -115180 -37495 72258 72764 -2872 -69893 -66533 16908 65446 -1900 -66787
$$ packed form
200a1621J59913o498j60457j23664K917J17736J49944N892j63509j04003P1482
211f1868J06114K4830m9748q5106j1929J20494R0633p7668j23920k8336N7938
222c8566J10296Q3976o4098j48706l7474Q3457Q1159L3879l5653j01016l6582
233f9328R4154P8409l9356q7879o0244K4161J31734Q5560j17135j74388k312J30105
245f519R6520q116j03284r7213L6074J07409J7433n6480l5935j8977J4252P8865
257B4029M0410p7176q2897J1087O8560P6121J7991r6957r7598N3539J17462J8760
269G3331n7799n1953k0086M4929P7554m335p9246l8630K0235M5721O5508L984
281G9213j13946q0447P7685J09753N06p5636o7021L360Q3441M8538o7346o4887
$$ plain form
293 -66787 -34837 6411 7092 18174 14252 -37477 -58864 -17775 27057 51830 38525 -34715 -71713
306 -71713 10107 83965 34765 -35803 -23293 30747 71024 60584 -13198 -55808 6864 74241
318 74241 59883 28231 8619 -26371 -20601 47172 68842 12145 -28375 -18497 13583 47045
330 47045 25398 -51615 -61020 22425 58807 8734 -31035 -39554 -40651 -7803 31352 17986 -15120
343 -15120 -26431 -37686 -19763 39107 38869 -39501 -58095 18458 66406 33470 -30890 -67030
355 -67030 -16457 83930 91726 -7831 -59175 -17629 21938 37788 45815 13409 -28634 -11967
367 -11967 26455 30000 13832 -18744 -51500 -12772 66894 53216 -38728 -74307 -38031 7515
379 7515 42030 31673 -33864 -66817 -26999 9923 16569 14207 -21777 -62018 -18232 58728 43090
$$ packed form
293f6787L1950M1248O81J1082l922n1729k1387M1089M4832K4773j3305p3240l6998
306g1713Q1820P3858m9200p0568J2510N4040M0277j0440p3782m2610O2672O7377
318G4241j4358l1652j9612l4990N770O7773K1670n6697m0520R878L2080L3462
330D7045k1647p7013r405Q3445L6382n0073l9769q519j097L2848L9155j3366l3106
343a5120j1311j1255J7923N8870k38p8370j8594P6553M7948l2936o4360l6140
355f7030N0573J00387P796r9557n1344M1546L9567J5850Q027l2406m2043J6667
367a1967L8422L545j6168l2576l2756L8728P9666j3678r1944l5579L6276M5546
379G515L4515j0357o5537l2953L9818L6922O646k362l5984m0241M3786P6960j5638
$$ plain form
392 43090 -34381 -65341 -28550 45851 89631 26099 -75250 -60974 36896 70775 35577 984
404 984 -24499 -23028 21956 45458 17153 -8814 -16634 -17295 22491 62773 12933 -70094 -60790
417 -60790 11994 51448 39351 -18281 -79763 -58371 25635 47203 -5107 -42644 -47198 -26294
429 -26294 23599 38451 -24650 -68893 -28603 29034 46436 22779 -38748 -72676 -9675 68416
441 68416 50156 -11024 -29195 -15815 12023 47349 35448 -15004 -24750 5891 25473 37944
453 37944 31558 -22237 -52297 6294 64388 39780 -17650 -51323 -42667 19912 70563 22548
465 22548 -57252 -56038 -328 32301 30406 -10773 -61127 -37127 39056 52597 -1062 -40119
477 -40119 -43879 -13720 46829 62441 -4366 -52663 -21688 24272 43447 38534 -4842 -45293
$$ packed form
392D3090p7471l0960L6791P4401M3780o3532j01349J4276R7870L3879l5198l4593
404I84k5483J471M4984K3502k8305k5967p820o61L9786M0282m9840q3027R304
417f0790P2784L9454j2097n7632o1482K1392Q4006K1568n2310l7537m554K0904
429b6294M9893J4852o3101m4243M0290N7637J7402k3657o1527l3928O3001P8091
441F8416j8260o1180j8171J3380K7838L5326j1901n0452r746L0641J9582J2471
453C7944o386n3795l0060N8591N8094k4608n7430l3673Q656O2579N0651m8015
465B2548p9800J214N5710L2629j895m1179n0354K4000P6183J3541n3659l9057
477d0119l760L0159O0549J5612o6807m8297L0975M5960J9175m913m3376m0451
$$ plain form
489 -45293 -11895 50061 52493 13232 -24580 -44915 -7332 67292 65465 -24170 -72618 -32473
501 -32473 29087 59144 25971 -58119 -85971 -10271 55631 29374 -31728 -68546 -59796 3671
513 3671 53135 8557 -66774 -70759 -23289 19325 38557 1881 -69357 -73059 3181 51226 29341
526 29341 -19809 -63088 -53821 24374 74238 22592 -50289 -57814 -13654 46584 71489 4779
538 4779 -81294 -60721 33943 74625 35595 -34879 -79296 -37479 55000 69445 -12802 -72987
550 -72987 -56794 -1371 53468 51013 -29793 -87255 -44002 26139 46273 21539 -33471 -74621
562 -74621 -30838 55709 65332 -4434 -59959 -58938 1876 79335 71878 -26965 -80508 -23404 54722
575 54722 78042 35133 -45729 -71502 8781 88513 60114 -19129 -56727 -35967 28074 76730
$$ packed form
489d5293L3398O1956K432l9261l7812k0335L7583P4624j827q9635m8448M0145
501c2473O1560L0057l3173q4090k7852P5700O5902k6257o1102l6818Q750O3467
513C671M9464m4578p5331l985M7470M2614J9232l6676p1238l702P6240M8045k1885
526B9341m9150m3279R267P8195M9864n1646p2881p525M4160O0238K4905o6710
538D779q6073K0573R4664M0682l9030p0474m4417M1817R2479J4445q2247o0185
550g2987J6193N5423N4839k455q0806n7462M3253P0141K0134k4734n5010m1150
562g4621M3783Q6547R623o9766n5525J021O0814P7459p457r8843n3543N7104P8126
575E4722K3320m2909q0862k5773Q0283P9732k8399p9243l7598K0760O4041M8656
$$ plain form
587 76730 35429 -51487 -68296 -13548 37100 51359 11524 -63083 -77403 -2887 54746 29450
599 29450 -28647 -68573 -59198 12382 65676 17259 -66041 -74546 -15582 44182 57850 -3557
611 -3557 -81297 -62127 32154 73717 31312 -30685 -61372 -26331 54693 76019 3848 -53733
623 -53733 -31292 21680 57675 50011 -12578 -60812 -21965 47791 61762 26983 -23379 -56823
635 -56823 -21180 56917 66781 -3541 -52247 -35979 15713 63981 51045 -29871 -71225 -11933
647 -11933 60873 65298 16645 -40919 -49495 22030 88343 55718 -19465 -38734 -3742 46056
659 46056 77374 45330 -23358 -29631 29580 67974 56192 19127 -24399 -23609 41152 85192 47672
672 47672 -11981 -33924 -12176 45893 82931 31788 -48755 -45913 22160 64076 49886 -6506
$$ packed form
587G6730m1301q6916j6809N4748N0648J4259l9835p4607j4320P4516N7633k5296
599B9450n8097l9926R375P1580N3294m8417q3300q505N8964N9764J3668o1407
611c557p7740J9170R4281M1563m2405o1997l0687L5041Q1024K1326p2171n7581
623e3733K2441N2972L5995p664o2589m8234L8847O9756J3971l4779n0362l3444
635e6823L5643P8097R864p0322m8706J6268N1692M8268j2936q0916m1354N9292
647a1933P2806M425m8653n7564q576P1525O6313l2625p5183j9269L4992M9798
659D6056L1318l2044o8688o273N9211L8394j1782l7065m3526P90O4761M4040l7520
672D7672n9653k1943K1748N8069L7038n1143q0543K842O8073M1916j4190n6392
$$ plain form
684 -6506 -57120 -30729 49428 70860 12448 -41250 -43060 -509 59987 68079 -2687 -55491 -22424
697 -22424 37203 60115 42725 -7402 -43526 -5337 62656 68758 20335 -20703 -28970 10433
709 10433 72180 71534 -1453 -45203 -14435 40230 71045 47826 -26266 -64296 -3713 69627
721 69627 60648 -1766 -48733 -45469 13515 65142 31683 -41837 -54900 -12006 29007 42915
733 42915 8832 -53458 -60508 2885 47623 30063 -12620 -49502 -48805 9673 56789 23891 -37859
746 -37859 -52545 -22074 26265 52916 10498 -58650 -55518 12558 48832 24373 -27060 -65655
758 -65655 -40611 34311 57306 -4036 -60318 -55786 -15570 27177 32776 -19382 -64997 -40528
770 -40528 7690 20280 3703 -29088 -56877 -31535 27984 35265 -14096 -49938 -45654 -8101
$$ packed form
684f506n0614K6391Q0157K1432n8412n3698j810M2551O0496Q092p0766n2804L3067
697b2424N9627K2912j7390n0127l6124L8189O7993O102m8423m1038q267L9403
709A0433O1747o46p2987m3750L0768N4665L0815k3219p4092l8030O0583P3340
721F9627q979o2414m6967L264N8984N1627l3459p3520j3063M2894M1013J3908
733D2915l4083o2290p050O3393M4738j7560m2683l6882O97N8478M7116l2898o1750
746c7859j4686L0471M8339K6651m2418o9148L132O8076L6274k4459n1433l8595
758f5655K5044P4922K2995o1342n6282M532M0216M2747N599n2158m5615K4469
770d0528M8218J2590j6577l2791k7789K5342N9519P281m9361l5842M284L7553
$$ plain form
782 -8101 42900 46811 -14917 -57379 -28092 21345 43457 29651 -14841 -40665 1158 54079
794 54079 41682 -6337 -28096 -15210 25487 61628 36899 -25231 -36630 5726 37527 40424
806 40424 20371 -17723 -29163 7217 33654 18661 -1312 -12274 -15986 9957 37953 12966
818 12966 -33604 -32978 3084 32890 39339 6071 -45300 -41377 15198 43024 21740 -7333 -24570
831 -24570 -15824 21800 33246 -5634 -30427 -6220 21705 27803 17138 -16013 -41054 -13724
843 -13724 28420 28909 4972 -15545 -31083 -21451 13080 18709 -11693 -25803 -16391 -6297 5416
856 5416 2874 -32271 -49853 -11005 26299 15623 -18012 -45971 -48788 -8865 32103 15521 -26529
869 -26529 -34041 -17347 -630 13299 2298 -27056 -21764 15219 23864 992 -16258 -24424 -14431
$$ packed form
782h101N1001L911o1728m2462K9287M9437K2112j3806m4492k5824M1823N2921
794E4079j2397m8019k1759J2886M0697L6141k4729o2130j1399M2356L1801K897
806D0424k0053l8094j1440L6380K6437j4993j9973j0962l712K5943K7996k4987
818A2966m6570O26L6062K9806O449l3268n1371L923N6575K7826k1284k9073j7237
831b4570Q746L7624J1446l8880k4793K4207K7925O098j0665l3151k5041K7330
843a3724M2144M89k3937k0517j5538R632L4531N629l0402j4110R412J0094J1713
856E416k542l5145j7582L8848L7304j0676l3635k7959k817L9923M0968j6582m2050
869b6529p512J6694J6717J3929j1001k9354N292L6983Q645k2872j7250q166R993
$$ plain form
882 -14431 21817 39362 9234 -21384 -21674 -10670 8288 28453 14095 -18123 -15464 7442 10295
895 10295 1158 -10705 -25809 -12375 29740 32652 -13003 -42306 -29940 386 29389 27006 -14740
908 -14740 -38402 -11517 13529 8738 896 -5783 -13308 2209 23882 10051 -15798 -14279 -955
921 -955 12849 31183 23286 -13849 -26542 -1332 19702 23897 18181 -5046 -20205 2288 23894
934 23894 8344 -10141 -8230 -751 13620 24829 406 -35130 -25008 12029 25475 15723 -5680
947 -5680 -29031 -21378 11916 17855 -4436 -8872 -505 -173 6066 10932 -5418 -15852 1570 16768
961 16768 16298 15104 1105 -19711 -7397 25582 28155 7832 -2616 -5758 1501 22219 21289 -7352
975 -7352 -12361 10942 20123 12048 2669 -13820 -17812 10135 28736 7495 -15337 -16482 -9046 7063
$$ packed form
882a4431L6248J7545l0128l0618k90J1004J8958K0165j4358l2218K659K2906K853
895A0295r137j1863j5104J3434M2115K912m5655k9303J2366L0326K9003k383m1746
908a4740k3662K6885K5046m791p842o679p525J5517K1673j3831k5849J519J3324
921i55J3804J8334p897l7135j2693K5210K1034M195n716k3227j5159K2493K1606
934B3894j5550j8485J911P479J4371J1209k4423l5536J0122L7037J3446r752k1403
947e680k3351P653L3294N939k2291m436Q367L32O239M866j6350j0434J7422J5198
961A6768m70j194j3999k0816J2314L2979K573k0323j0448l142P259K0718r30k8641
975g352n009K3303R181q075r379j6489l992K7947J8601k1241k2832j145P436J6109
$$ plain form
989 7063 19273 -243 -23790 -10788 9698 4248 -3280 -5073 -13602 -9786 11848 14907 -2958
1002 -2958 -10589 -12189 -10168 11414 26537 1781 -23453 -10350 11575 17143 10703 -9681 -24284
1015 -24284 455 30762 15599 -15713 -19382 -7880 6197 20323 9055 -20995 -23824 -621
1027 -621 10073 6819 -1892 -22179 -27327 3221 22634 1733 -20612 -21780 -14333 4035 20060
1040 20060 2829 -25454 -20990 1009 12580 15738 2243 -25660 -23511 15800 31908 8832
1052 8832 -14617 -21381 -6354 27372 36014 -3316 -32049 -11123 18815 25180 14838 -8740 -24979
1065 -24979 -4078 25690 18820 -3642 -14363 -17047 -3373 25460 24270 -12671 -30662 -12488
1077 -12488 9594 23278 17354 -16009 -35299 -6392 26676 21643 -1002 -19034 -22065 6216
$$ packed form
989G063J2210j9516k3547J3002K0486n450p528j793q529L816K1634L059j7865
1002b958p631j600K021K1582J5123k4756k5234J3103K1925N568o440k0384j4603
1015b4284K4739L0307j5163l1312l669J1502J4077J4126j1268l0050k829K3203
1027f21J0694l254q711k0287n148L0548J9413k0901k2345j168P447J8368J6025
1040B0060j7231k8283M464K1999J1571L158j3495k7903K149L9311J6108k3076
1052H832k3449o764J5027L3726Q642l9330k8733K0926K9938O365j0342k3578j6239
1065b4979K0901K9768o870k2462j0721k684J3674K8833j190l6941j7991J8174
1077a2488K2082J3684n924l3363j9290K8907L3068n033k2645j8032l031K8281
$$ plain form
1089 6216 37766 20623 -21023 -26387 -427 23306 33253 13899 -23285 -24626 14121 33228 16781
1102 16781 -3362 -15132 -11006 17019 32593 7376 -19705 -16497 9 17204 27672 5044
1114 5044 -32046 -27325 10467 27093 14534 -10612 -33170 -22855 19183 32804 -1809 -30636
1126 -30636 -25245 -1905 23685 24572 -13649 -40681 -14010 22933 25792 6181 -19205 -32264 -8032
1139 -8032 29586 26444 -6880 -22307 -15332 2574 24077 19238 -16947 -32322 -6117 19044 21121
1152 21121 5814 -24340 -37904 -5100 31908 19835 -16705 -34346 -25082 4943 30729 9919
1164 9919 -34717 -38375 -2561 20566 16436 -8309 -37523 -31102 13328 32801 5465 -22687 -26777
1177 -26777 -13777 14567 30409 4524 -28131 -22339 4419 21867 24084 -311 -32053 -21965
$$ packed form
1089F216L1550j7143m1646n364K5960K3733R947j9354l7184j341L8747J9107j6447
1102A6781k0143j1770M126K8025J5574k5217k7081L208J6506J7195J0468k2628
1114E044l7090M721L7792J6626j2559k5146k2558J0315M2038J3621l4613k8827
1126c0636N391K3340K5590Q87l8221k7032K6671L6943K859j9611k5386j3059K4232
1139h032L7618l142l3324j5427O975J7906K1503m839l6185j5375K6205K5161K077
1152B1121j5307l0154j3564L2804L7008j2073l6540j7641R264L0025K5786k0810
1164I919m4636l658L5814K3127m130k4745k9214O421M4430J9473k7336k8152m090
1177b6777J3000K8344J5842k5885l2655N792K6758J7448K217k4395l1742J0088
$$ plain form
1189 -21965 21400 34535 7888 -19485 -27837 -7869 30748 36162 -7593 -39154 -21300 11944
1201 11944 29277 19233 -16937 -39645 -11634 28011 24967 -4986 -26934 -28712 -958 33480
1213 33480 23887 -19244 -34305 -12045 13005 26735 16067 -19254 -33494 -2418 28919 25203
1225 25203 1972 -22614 -27806 6733 42325 24817 -19360 -30671 -8460 21354 36355 11385
1237 11385 -32130 -32242 10737 34045 18601 -9178 -30410 -22084 16417 33983 4615 -25823
1249 -25823 -25194 -6211 17797 28074 588 -35098 -26214 10750 26318 16443 -8163 -31499 -19923
1262 -19923 22210 36389 6376 -22305 -24160 -2921 30081 35673 -4693 -35174 -12764 24005
1274 24005 33757 16851 -14199 -31332 -4241 34805 30514 -3326 -20930 -15557 6897 31592
$$ packed form
1189b1965M3365J3135k6647k7373q352J9968L8617N414m3755l1561J7854L3244
1201A1944J7333j0044l6170k2708K8011L9645l044k9953k1948j778K7754L4438
1213C3480r593m3131j5061K2260K5050J3730j0668l5321j4240L1076L1337l716
1225B5203k3231k4586n192L4539L5592j7508m4177j1311K2211K9814J5001k4970
1237A1385m3515j12M2979K3308j5444k7779k1232Q326L8501J7566k9368l0438
1249b5823O29J8983K4008J0277k7486l5686Q884L6964J5568r875k4606k3336J1576
1262a9923M2133J4179l0013k8681j855K1239L3002N592m0366l0481K2410L6769
1274B4005R752j6906l1050j7133K7091L9046m291l3840j7604N373K2454K4695
$$ plain form
1286 31592 22935 -15534 -30348 -6116 18040 25162 13277 -17686 -32574 -2554 30866 22358
1298 22358 -6454 -24057 -21147 7918 36298 19617 -20770 -28230 -2251 21492 27882 8241
1310 8241 -25315 -24803 15234 35943 15438 -10688 -20645 -11030 19581 34754 8164 -21170 -16188
1323 -16188 3905 18922 23402 2663 -25200 -17461 15089 24431 8946 -9316 -22858 -13903 19337
1336 19337 30325 -141 -25622 -19279 2122 22694 23195 -8106 -32049 -10904 21910 23192 4445
1349 4445 -13916 -20827 201 29383 21989 -9147 -18043 -4642 10328 22903 17857 -8939 -20039
1362 -20039 1292 20074 19446 8459 -10204 -20752 1719 28532 17948 -8827 -16700 -7829 9640
1375 9640 24126 9445 -22175 -22960 4559 19149 14220 -707 -20710 -20699 7860 23053 3986
$$ packed form
1286C1592q657l8469j4814K4232K4156P122j1885l0963j4888L0020L3420q508
1298B2358k8812j7603K910K9065K8380j6681m0387p460K5979K3743O390j9641
1310H241l3556N12M0037K0709k0505k6126r957R615L0611J5173k6590k9334M982
1323a6188K0093J5017M480k0739k7863P739L2550R342j5485j8262j3542Q955L3240
1336A9337J0988l0466k5481O343K1401K0572N01l1301k3943K1145L2814J282j8747
1349D445j8361o911K1028K9182p394l1136q896J3401J4970J2575n046k6796j1100
1362b0039K1331J8782o28j0987j8663j0548K2471K6813j0584k6775p873Q871J7469
1375I640J4486j4681l1620p85K7519J4590m929j4927k0003J1K8559J5193j9067
$$ plain form
1388 3986 -15094 -15821 -6550 11064 20540 -131 -23491 -12710 9161 13191 7969 -3056 -17418
1401 -17418 -11000 13258 18354 2565 -9115 -14463 -9182 13545 23697 -1209 -22916 -11949 7912
1414 7912 15418 9806 -11263 -24899 -4542 21248 12217 -9214 -15397 -11880 133 16340 10238
1427 10238 -12555 -17438 -4330 4843 10293 8745 -10092 -19547 702 17717 8342 -5132 -9909
1440 -9909 -8868 6162 20726 8880 -11238 -10357 576 7577 16201 10345 -12500 -16305 7063
1453 7063 18476 7611 -4844 -12586 -8176 12022 18322 -4555 -17954 -5181 6019 6740 4573
1466 4573 -5899 -17147 -7712 6505 5423 534 -2663 -13375 -13951 5691 12236 -5691 -14709 -6946
1480 -6946 1424 8496 6078 -11835 -18577 -615 11326 4504 -1390 -5795 -12753 -4604 12203 8675
$$ packed form
1388C986j9080p27R271J7614R476k0671k3360J0781K1871M030n222j1025j4362
1401a7418O418K4258N096j5789j1680n348N281K2727J0152k4906k1707J0967J9861
1414G912P506n612k1069j3636K0357K5790r031k1431o183L517J2013J6207o102
1427A0238k2793m883J3108R173N450j548j8837r455K0249J7015r375j3474m777
1440i909J041J5030J4564j1846k0118Q81J0933P001Q624n856k2845l805K3368
1453G063J1413j0865j2455p742M410K0198O300k2877j3399J2773J1200P21k167
1466D573j0472j1248R435J4217j082m889l197j0712n76J9642O545j7927r018P763
1480f946Q370P072k418j7913o742J7962J1941o822n894m405o958Q149J6807l528
$$ plain form
1494 8675 -8077 -10627 -4826 1392 8672 2734 -14467 -12007 7874 9530 -3994 -8354 -8253 -7302
1508 -7302 2935 7063 -3058 -7280 -3531 -6805 -5596 7662 6042 -10840 -11031 2811 6216 2569
1522 2569 -3723 -11390 -3994 14742 12132 -8082 -10059 1553 3813 5558 9040 708 -5606 1988
1536 1988 5954 2015 3185 2326 -3821 3158 14811 5176 -9914 -5493 3612 6143 8481 4321 -7739
1551 -7739 -5618 5413 3745 -760 3941 352 -7279 994 10160 1869 -7189 -4756 81 8305 13251
1566 13251 -1811 -17103 -3877 13958 9777 -284 -1934 -3504 -235 9136 5620 -5075 -1487
1579 -1487 5069 3180 5293 6955 -5687 -11365 2997 12191 6834 784 -4854 -9719 23 11167
1593 11167 3578 -6803 -2909 303 -381 5687 3914 -10139 -10445 4683 10948 5754 -2422 -13229
$$ packed form
1494H675j6752k550N801O218P280n938j7201K460J9881J656j3524m360J01R51
1508g302J0237M128j0121m222L749l274J209J3258j620j6882j91J3842L405l647
1522B569o292p667P396J8736k610k0214j977J1612K260J745L482q332o314P594
1536A988L966l939J170q59o147O979J1653r635j5090M421R105K531K338m160j2060
1551g739K121J1031j668m505M701l589p631Q273R166q291r058K433M837Q224M946
1566A3251j5062j5292J3226J7835m181j0061j650j570L269R371l516j0695L588
1579a487O556j889K113J662j2642n678J4362R194n357o050n638m865R742J1144
1593A1167p589j0381L894L212o84O068j773j4053l06J5128O265n194q176j0807
$$ plain form
1607 -13229 -11503 9614 17589 -149 -10954 -2963 3272 5853 6943 -1531 -8665 752 10202 6295
1621 6295 2679 -190 -8515 -5294 12892 14669 -1173 -8618 -5120 72 10006 11629 -4559 -12555
1635 -12555 137 8777 4334 285 -6143 -12230 50 15664 8261 -8556 -12912 -8544 2107
1648 2107 15164 7807 -12670 -13191 3682 7756 1595 -1970 -7061 -6856 5914 11846 615 -6983
1662 -6983 -7440 -6520 3816 16835 6992 -13755 -12413 1158 7096 7505 1029 -11922 -8856 8558
1676 8558 10328 -3462 -9718 -8424 -4742 9232 14052 -3946 -19153 -9922 3978 9581 7946 -5242
1690 -5242 -17341 -5590 11346 6287 -6016 -6276 -4555 -655 9303 8163 -6473 -12180 -4558 3995
1704 3995 13101 13533 -6604 -20654 -4034 16002 12454 -799 -7751 -7567 4313 15225 3426
$$ packed form
1607a3229J726K1117P975j7738j0805P991O235K581J090q474p134R417R450l907
1621F295l616k869q325L221J8186J777j5842p445L498N192R934J623j6188p996
1635a2555J2692Q640m443m049o428o087J2280J5614p403j6817m356M368J0651
1648B107J3057p357k0477n21J6873M074o161l565n091K05J2770N932j1231p598
1662f983m57R20J0336J3019r843k0747J342J3571N938M09o476j2951L066J7414
1676H558J770j3790o256J294L682J3974M820j7998j5207R231J3900N603j635j3188
1690e242j2099J1751J6936n059j2303k60J721L900R958j140j4636n707P622Q553
1704C995R106M32k0137j4050J6620K0036l548j3253o952J84J1880J0912j1799
$$ plain form
1717 3426 -12342 -8126 4099 8398 10614 3912 -14047 -16658 3036 15082 9632 -1615 -12485
1730 -12485 -12705 5312 16312 97 -13679 -5860 3382 6511 6920 -1756 -14374 -9137 6640 11557
1744 11557 8349 -1143 -17025 -15758 10377 21788 2818 -14339 -10879 1198 12458 10079 -8913
1757 -8913 -17023 273 13485 7199 -1319 -7677 -13772 -5250 12835 13592 -2106 -12313 -13278 -4382
1771 -4382 12198 12742 -9348 -18123 -1932 10204 6006 -2995 -12688 -13670 2326 16167 7722 -6698
1785 -6698 -12572 -12745 -489 18067 13615 -11561 -17846 -1578 11197 10638 -85 -14069 -9694 10399
1799 10399 15387 -669 -9783 -7641 -4070 5982 15015 4934 -11624 -12947 -3863 6584 14347
1812 14347 4547 -16413 -14684 8304 14298 1008 -10222 -11681 -2845 12428 13349 -5450 -15725
$$ packed form
1717C426j5768M216J2225M299K216o702j7959k611J9694J2046n450j1247j0870
1730a2485k20J8017J1000j6215j3776P819R242L129M09q676j2618N237J5777M917
1744A1557l208r492j5882J267K6135J1411j8970j7157L460J2077J1260k379j8992
1757h913q110J7296J3212o286q518o358o095Q522J8085P57j5698j0207r65Q896
1771d382J6580N44k2090q775J6191J2136m198r001r693r82J5996J3841q445j4420
1785f698n874j73J2256J8556m452k5176o285J6268J2775n59j0723j3984M375K0093
1799A0399M988j6056r114K142L571J0052R033j0081j6558j323R084J0447P763
1812A4347r800k0960J729K2988N994j3290j1230j459Q836J5273R21j8799j0275
$$ plain form
1825 -15725 -8169 1769 9769 14050 115 -18329 -11471 8804 13801 4575 -6226 -11807 -1542
1838 -1542 15225 10562 -9013 -11839 -1130 5341 10182 9429 -4814 -14974 -5962 7464 11294 8340
1852 8340 -5482 -17391 -5476 15780 11855 -7966 -13799 -4823 6640 13083 2915 -14600 -12491
1865 -12491 4440 10133 5263 700 -8710 -13424 530 14228 8353 -4396 -9311 -7517 3632
1878 3632 13191 3809 -12295 -7970 6145 9033 5577 -589 -11128 -10411 6218 13531 4548 -4524
1892 -4524 -9618 -8481 5481 15300 1535 -13636 -8005 4253 7718 4963 -4842 -13094 -3193 11543
1906 11543 7690 -3358 -6408 -7204 -4515 7718 11680 -1681 -10219 -5058 1150 6937 8175 -3525
1920 -3525 -12449 -1470 10855 6696 -1130 -5103 -7223 85 12899 9063 -6594 -10117 -3006 3781
$$ packed form
1825a5725P556R938Q000M281j3935j8444O858K0275M997r226j0801n581J0265
1838a542J6767m663j9575k826J0709O471M841p53j4243j0160R012J3426L830k954
1852H340j3822j1909J1915K1256l925j9821n833Q976J1463O443j0168j7515K109
1865a2491J6931N693m870m563r410m714J3954J3698n875j2749m915J794J1149
1878C632R559r382j6104M325J4115K888l456o166j0539P17J6629P313q983r072
1892d524n094J137J3962R819j3765j5171N631J2258L465k755r805q252R901J4736
1906A1543l853j1048l050p96K689J2233L962j3361q538N161O208N787J238j1700
1920c525q924J0979J2325m159p826l973k120P308J2814l836j5657l523P111O787
$$ plain form
1934 3781 10476 8266 -7367 -12489 1466 9437 3929 -1525 -5113 -5952 3477 10257 1030 -8136 -5771
1949 -5771 -1327 2148 8801 5611 -8884 -10894 299 6558 6116 1097 -8077 -8750 5191 11709 23
1964 23 -7572 -4728 -531 5243 9512 224 -11095 -5808 5282 7048 5013 -815 -9761 -6508 7060
1979 7060 8753 -1002 -4401 -3092 -1446 4876 7342 -3197 -8696 -1239 4305 4292 4887 -1337 -10546
1994 -10546 -4121 8885 8485 110 -4163 -6400 -1469 9054 8370 -4505 -6837 1980 5137 5056 4009
2009 4009 -4343 -7807 3156 11047 5570 -352 -2637 -4966 793 9936 6111 -3622 -2794 1446 1912
2024 1912 5429 5525 -3796 -6147 2716 6493 3172 1011 -3518 -6542 2320 10499 3149 -6419 -4553
2039 -4553 -905 2264 6697 1974 -6959 -3285 4206 2348 -1104 281 -2699 -3903 3632 6010 -1089
$$ packed form
1934C781O695k210j5633n122J3955P971n508n454l588q39R429O780r227r166K365
1949e771M444L475O653l190j4495k010J1193O259m42n019r174o73J3941O518j1686
1964B3p595K844M197N774M269r288j1319N287J1090J766k035n828q946L253J3568
1979G060J693r755l399J309J646O322K466j0539n499P457N544j3N95o224r209
1994a0546O425J3006m00q375m273k237M931J0523o84j2875k332Q817L157q1j047
2009D009q352l464J0963P891n477n922k285k329N759R143l825r733Q28M240M66
2024A912L517R6r321k351Q863L777l321k161m529l024Q862Q179p350r568J866
2039d553L648L169M433m723q933L674P491j858l452J385k980j204P535K378p099
$$ plain form
2054 -1089 -4120 -2472 -2997 1310 6824 1198 -6613 -2661 1682 432 1454 1487 -5069 -4327 3749 3081
2070 3081 -2930 -2530 -2105 -3435 2150 4903 -3012 -7244 -1266 1056 -184 2447 -1022 -5671 -1433
2085 -1433 3602 -1200 -3132 1262 -440 -2764 1789 2581 -2709 -2042 929 -876 378 4270 -907
2100 -907 -5057 230 3228 259 967 1163 -3307 -1413 4425 1031 -3506 424 2837 23 756 1027
2116 1027 -3449 -2491 3145 882 -2402 1630 1876 -2502 -942 1317 -1939 -1336 2776 434 -2572 1275
2132 1275 1361 -2625 74 2968 -503 -1430 2066 -251 -1918 2277 2296 -2523 -239 2861 -1087 -1409
2148 -1409 2352 66 -1700 2820 2414 -2764 -1448 1628 -587 280 2961 -1624 -3692 2244 2952 -2146
2164 -2146 -1591 952 -969 56 3278 -1347 -3793 914 1955 -1099 680 2373 -2349 -1923 2616
$$ packed form
2054a089l031J648n25M307N514n626p811L952M343j250J022L3o556P42Q076o68
2070C081o011M00M25j330N585K753p915m232N978K322j240K631l469m649M238
2085a433N035m802j932M394j702k324M553P92n290O67K971j805J254L892n177
2100i07m150N287K998k969P08J96m470J894N838l394m537L930K413k814P33K71
2116A027m476R58N636k263l284M032K46m378J560K259l256O03M112k342l006L847
2132A275Q6l986K699K894l471r27L496k317j667M195J9m819K284L100l948l22
2148a409L761k286j766M520m06n178J316L076k215Q67K681m585k068N936P08n098
2164b146N55K543j921J025L222m625k446M707J041l054J779J693m722M26M539
$$ plain form
2179 2616 954 -1066 1631 683 -2313 2071 4324 -1538 -2979 1401 884 514 3482 333 -4135 65
2195 65 4472 264 -1110 305 -1579 -468 4571 1903 -4023 -1316 2472 -213 -410 1933 -1524 -2554
2211 -2554 2779 2426 -1560 -230 655 -2451 -469 4740 884 -3179 63 1006 268 2529 1087 -4290
2227 -4290 -1842 4677 2776 -651 512 -527 -2256 2307 3968 -1841 -2724 1084 1207 1086 3688 -1079
2243 -1079 -5724 63 5091 733 -1292 -58 -2139 -1254 4173 2111 -3391 -1786 719 -997 1270
2258 1270 3467 -2870 -5287 1190 4115 1805 606 -2536 -5912 480 7496 2440 -4395 -2347 -164
2273 -164 962 4570 1984 -5414 -3579 3260 2877 396 416 -3252 -5111 2415 6454 -48 -3659 -2453
2289 -2453 -2464 1127 5930 1241 -6294 -3475 1492 1441 1904 40 -5889 -4392 5324 5490 -2025 -4712
$$ packed form
2179B616j662k020K697r48k996M384K253n862j441M380n17l70K968l149m468M200
2195F5M407m208j374J415j884J111N039k668n926K707L788k685j97K343l457j030
2211b554N333l53l986J330Q85l106J982N209l856m063L242R43p38K261j442n377
2227d290K448O519j901l427J163j039j729M563J661n809q83L808J23j21K602m767
2243a079m645N787N028m358k025J234k081Q85N427k062n502J605K505j716K267
2258A270K197o337k417O477K925k310j199l142l376O392P016n056o835K048K183
2273a64J126L608k586p398J835O839l83k481K0l668j859P526M039o502l611J206
2289b453j1L591M803m689p535K819M967n1M63j864n929J497R716J66p515k687
$$ plain form
2305 -4712 -4599 -2753 4860 7321 -2133 -8049 -2844 1674 2122 3285 -1313 -7091 -2259 5053 2779
2320 2779 -1704 -2649 -4452 -2807 5767 5971 -4123 -7668 -2664 1095 3657 4733 -3129 -8529 -1828
2335 -1828 4246 2165 -723 -2840 -5786 -1417 6941 2899 -6326 -6184 -1591 1791 5609 2976 -6987
2350 -6987 -8462 756 4835 2051 28 -3689 -6521 174 5698 1018 -3814 -2972 -2284 1006 6795
2365 6795 2511 -7795 -7590 1003 4809 4257 1104 -6245 -7142 2175 6304 96 -3217 -2447 -1997 1907
2381 1907 5715 -663 -7342 -3454 2837 3636 3462 -446 -7373 -4941 4874 6251 438 -1714 -3813
2396 -3813 -2475 3524 6148 -1209 -5111 -677 2035 3499 4855 -1318 -7921 -2214 7075 5933 711
2411 711 -2567 -4945 -1640 6326 5766 -2450 -3277 276 1244 3011 3372 -2769 -5838 1709 6684 2943
$$ packed form
2305d712J13J846P613K461r454n916N205M518M48J163m598n778M832P312k274
2320B779m483r45j803J645Q574K04j0094l545N004L759K562J076p862n400O701
2335a828O074k081k888k117k946M369Q358m042r225J42M593L382L818k633r963
2350f987j475R218M079k784k023l717k832O695N524m680m832Q42O88L290N789
2365F795m284j0306K05Q593L806n52l153p349q97R317M129o208l313P70M50L904
2381A907L808o378o679L888O291P99j74l908o927K432R815J377n813k152k099
2396c813J338N999K624p357l902M434K712J464J356o173o603N707R289j142n222
2411G11l278k378L305P966n60q216q27L553R68J767L61o141l069P547M975l741
$$ plain form
2427 2943 -528 -3317 -4832 539 7926 4058 -3560 -2691 -481 257 3856 2906 -3874 -3855 2862 4616
2443 4616 1964 -367 -4769 -5358 4340 9636 1529 -5994 -3910 -452 3245 5506 523 -5182 -1396
2458 -1396 3250 1433 80 622 -3405 -3640 4278 6455 -342 -4791 -4110 -1658 4881 7113 -1522 -7567
2474 -7567 -1917 2941 1684 842 -280 -3677 -968 5072 2510 -2359 -2981 -3366 -933 6607 6757 -4023
2490 -4023 -8688 -2153 3206 4135 2517 -2941 -5591 544 4525 -383 -2368 -674 -2119 -710 4860
2505 4860 3893 -4323 -6212 -2096 1622 5657 4068 -5271 -8240 628 5002 768 -1561 -2112 -2965 789
2521 789 4536 18 -4571 -2304 -368 1442 5208 1929 -7115 -7377 1993 5379 2627 -155 -4360
2536 -4360 -4843 1924 4325 -1339 -2701 -94 -1035 203 4318 716 -6709 -5020 1694 4414 4334 -273
$$ packed form
2427B943l471k789j515N371P387l868p618Q69K210P38L599r50o780J9O717J754
2443D616k652k331m402n89R698N296q107p523K084L458L697K261m983n705L786
2458a396M646j817j353N42m027k35P918K177o797m449O81K452O539K232q635o045
2474g567N650M858j257q42j122l397K709O040k562m869o22l85K433P540J50j0780
2490d023m665O535N359R29j618n458k650O135L981m908j985J694j445J409N570
2505D860r67q216j889M116L718M035j589r339k969Q868M374m234k329n51q53L754
2521G89L747m518m589K267J936J810L766l279r044k62R370L386k752k782m205
2536d360m83O767K401n664j362K607r41J238M115l602p425J689O714K720q0m607
$$ plain form
2552 -273 -7634 -6131 3898 5214 -1086 -2286 -1345 -2114 502 2245 -1589 -4018 -149 1063 841 2694
2568 2694 -799 -7548 -4341 4467 4687 -203 -2828 -4194 -3230 2699 2843 -2823 -2667 933 -847 -737
2584 -737 2128 -801 -5303 -1392 3591 2663 191 -2861 -5917 -2104 5391 3418 -2880 -2362 -307 -1538
2600 -1538 143 2035 -587 -1670 1041 451 -1242 1096 -303 -4466 -566 5301 2585 -2017 -2057 -2264
2616 -2264 -1320 3278 2943 -2118 -1173 2032 -333 -1319 1627 123 -2511 1405 3589 123 -1297 -631
2632 -631 -1630 837 4665 1470 -3080 -1005 892 -1033 690 3259 4 -1754 1415 876 -831 1058
2648 1058 536 -2128 1316 4631 -121 -3171 40 857 457 2723 1349 -1743 -513 1936 -539 -590
2664 -590 2866 673 -1824 1405 3004 -1441 -1822 768 701 1676 3231 -680 -3776 580 1615 -788
$$ packed form
2552b73p361J503J0029J316o300j200R41p69K616J743l834k429L869J212k22J853
2568B694l493o749L207Q808K20m890k625j366R64N929J44n666J56L600j780J10
2584g37K865k929m502L911M983r28k472l052l056L813P495j973o298N18K055j231
2600a538J681J892k622j083K711n90j693K338j399m163L900N867k716m602m0k07
2616b264R44M598l35n061R45L205k365r86K946j504k634L916K184l466j420O66
2632f31r99K467L828l195m550K075J897j925J723K569l255j758L169n39j707J889
2648A058n22k664L444L315m752l050L211Q17m00K266j374l092J230K449k475n1
2664e90L456k193k497L229J599m445l81K590o7R75J555l911l096M356J035k403
$$ plain form
2680 -788 900 2628 -939 -2104 1077 1284 -777 395 -559 -1958 1538 3575 -2186 -3923 1424 2054
2696 2054 161 1103 -473 -2648 -125 2218 -675 -388 2593 -481 -2775 1158 2803 -1374 -1609 589
2712 589 382 1797 2500 -1690 -4050 1373 3291 -49 73 1092 -2517 -1310 2844 1903 -1337 11
2728 11 -631 -1257 2528 3108 -2692 -3502 1987 2873 462 648 -1017 -3243 712 3732 506 -1085 377
2745 377 -2010 -1699 3301 3400 -2508 -2447 620 1205 2262 1991 -3003 -4216 2072 3833 97 -1166 -808
2762 -808 -2250 297 4638 2131 -3110 -2120 -481 410 3823 2250 -4062 -3224 2588 2865 -315 -465
2778 -465 -2296 -3018 2033 4746 394 -2298 -1245 -1803 93 4837 1885 -4372 -3001 1660 2619 1865
2794 1865 282 -3976 -3063 3963 4088 -1171 -2018 -908 -1185 1665 4318 210 -3890 -1655 471 1079
$$ packed form
2680g88J688J728l567j165L181K07k061J172r54j399L496K037n761j737N347O30
2696B054j893R42j576k175K523K343k893K87K981l074k294L933J645m177k35K198
2712E89k07J415P03m190k360N423J918l340J22J019l609J207M154r41l240J348
2728A1o42o26L785N80n800q10N489Q86k411J86j665k226L955L020l226j591J462
2745C77k387L11N000R9n908O1L067N85J057k71m994j213O288J761l736j263L58
2762h08j442K547M341k507n241R90J639Q91L413j573o312Q38N812K77l180j50
2778d65j831p22N051K713m352k692J053n58J896M744k952o257J371M661R59p54
2794A865j583m258R13P026J25n259q47J110k77K850K653m108m100K235K126O08
$$ plain form
2810 1079 3328 1365 -4472 -2856 3452 3311 -350 -1466 -1912 -1541 3317 3929 -1837 -3413 -94 328
2826 328 1321 3883 128 -5053 -1314 2901 2037 778 141 -3361 -1851 3870 3045 -2771 -2092 258
2842 258 115 1929 3210 -1748 -4067 157 2091 936 1514 147 -4126 -1093 3534 1815 -1942 -1129
2858 -1129 -1318 -409 3017 2657 -3347 -3172 1145 1381 279 1056 -1583 -3577 996 3509 145 -1273
2874 -1273 -200 -2130 -393 3401 941 -3540 -1133 1620 425 1160 1180 -3184 -3167 2319 3122 -501
2890 -501 -690 -812 -2210 935 3371 -453 -2588 -11 968 -231 1349 158 -3452 -1169 3219 1367
2906 1367 -1219 -760 -1772 -1554 2503 2464 -2202 -2298 866 250 79 1579 -1305 -3488 747 2896 -392
2923 -392 -1061 -450 -2217 -897 3532 1204 -2953 -1552 356 -267 1563 1676 -2779 -2818 1895 1951 -865
$$ packed form
2810A079K249j963n837J616O308j41l661j116m46L71M858O12n766j576L319M22
2826C28R93K562l755n181L739M215q64j259o37l502J510N721q25n816O79K350
2842B58j43J814J281m958k319M224J934j155N78j367m273L033M627j719l757Q13
2858a129j89R09L426l60o004J75M317K36j102P77k639j994M573K513l364j418
2874a273J073j930J737L794k460m481K407K753j195P35K0m364J7N486Q03l623
2890e01j89j22j398L145K436l824k135K577R79j199J580j191l610K283M388j852
2906A367k586M59j012K18M057l9m666r6L164o16j71J500k884k183M235K149l288
2923c92o69O11j767J320M429k328m157J401J908o23J830J13m455l9M713N6k816
$$ plain form
2940 -865 -185 -934 -2211 867 3449 -524 -3411 -743 -8 127 2575 771 -3607 -2226 1760 619
2956 619 -332 367 -1924 -2535 1888 2979 -1776 -2296 -684 -1305 646 3267 -639 -4522 -1178 1724
2972 1724 540 452 18 -3504 -2174 2334 1248 -1850 -965 -871 -2040 719 2696 -1682 -3615 -158
2988 -158 642 335 1633 -702 -4181 -1144 2606 700 -1124 -56 -1692 -1679 2096 2042 -1782 -1576 446
3005 446 -286 904 2718 -860 -3371 370 2876 757 664 336 -2130 -676 2820 1205 -1090 1062
3021 1062 1007 -1269 1396 3048 -586 -1191 1563 1054 748 2642 568 -2403 250 3437 708 -427
3037 -427 1844 -15 -1127 2533 2450 -1030 40 1642 -191 456 2661 817 -1448 1238 1881 -116
3053 -116 1456 1664 -2016 -1024 2462 1406 -159 1302 376 -1684 635 2695 -55 -944 1213 -39
$$ packed form
2940h65O80p49j277L078K582l973k887K668P35J35K448j804m378J381L986j141
2956F19r51O99k291o11M423J091m755n20J612o21J951K621l906l883L344K902
2972A724j184q8m34l522J330M508j086l098Q85R4j169K759J977m378j933L457
2988a58Q00l07J298k335l479L037L750j906j824J068j636J3L775n4l824K06K022
3005D46p32J190J814l578k511L741K506k119r3l28k466J454L496j615k295K152
3021A062n5k276K665J652l634o05K754n09l06J894k074k971K653L187k729j135
3037d27K271j859j112L660q3l480J070J602j833O47K205j844k265K686O43j997
3053a16J572K08l680R92L486j056j565J461r26k060K319K060k750q89K157j252
$$ plain form
3069 -39 -637 2119 941 -2143 -453 1640 225 588 1332 -1812 -2364 1584 2371 -949 -663 370 -1709
3086 -1709 -277 2729 -20 -2052 240 572 -669 1350 1229 -2776 -2242 2103 1219 -366 -78 -1016
3102 -1016 -2835 1192 3020 -896 -1961 16 -524 -658 2105 805 -2483 -590 1698 -233 149 694
3118 694 -2544 -2178 2607 2517 -892 -1075 -249 -1458 659 2869 -179 -2105 254 848 -402 1291 555
3135 555 -2619 -837 3305 1322 -1309 -682 -1126 -1159 2160 2601 -1571 -1979 745 -60 10 1903 -16
3152 -16 -2724 65 2467 -59 -637 -377 -1994 -222 3648 1114 -3117 -1537 1084 -173 748 1166
3168 1166 -2056 -2202 1317 1274 -825 -65 -238 -2308 385 3240 -544 -3666 -1537 124 879 1855 -6
3185 -6 -3995 -1636 1826 715 -830 -202 -1172 -1904 1248 2235 -1845 -2193 -942 -616 1019 2979 -1483
$$ packed form
3069c9n98K756j178l084J690K093j415L63P44l144n52L948P87l320K86J033k079
3086a709J432L006k749k032K292L32j241K019j21m005N34M345q84j585K88r38
3102a016j819M027J828l916j065J977n40j34K763j300l288J893K288j931L82N45
3118F94l238L66M785r0l409j83Q26j209K117K210l048j926K359N94j250J693p36
3135E55l174J782M142j983k631O27m44l3L319M41m172m08K724q05P0J893j919
3152a6k708K789K402k526n78K60j617J772L870k534m231J580K621j257R21M18
3168A166l222j46L519m3k099P60j73k070K693K855l784l122K129J661P55R76j861
3185fl989K359L462j111j545O28r70p32L152R87m080l48J251L26J635J960m462
$$ plain form
3202 -1483 -5179 -896 3254 1048 -807 -1595 -3060 -723 2868 838 -2668 -1956 -241 -281 1696 2416
3218 2416 -2844 -4514 -38 2740 1764 413 -3011 -4312 507 4701 763 -3165 -2108 -520 455
3233 455 2951 829 -3824 -2793 759 1910 1592 1020 -3399 -4582 1874 5038 774 -2902 -2829 -1679
3249 -1679 2118 4341 -114 -4384 -1381 1708 1824 2088 174 -3944 -2928 3443 4382 742 -1697 -2736
3265 -2736 -2357 3603 5541 -618 -4259 -902 2071 2816 3319 -758 -4435 -887 3826 2988 725 -861
3281 -861 -3337 -1605 4874 5110 -1343 -3786 -1339 1323 3734 3670 -1773 -4348 788 4058 2116 593
3297 593 -940 -3342 -7 5234 3429 -1388 -3033 -1685 874 4863 3817 -3185 -4381 1046 3709
3312 3709 2387 528 -2190 -3026 1783 4878 1581 -1727 -1770 -1440 1152 4962 2687 -3704 -3546 859
$$ packed form
3202a483l696M283M150k206j855p88j465K337L591k030l506P12J715m0J977P20
3218B416n260j670M476K778r76j351l424j301M819M194l938l928J057J588R75
3233D55K496k122m653J031L552J151l18n72m419j183O456L164m264l676P3J150
3249a679L797K223m455m270L003L089J16K64j914m118J016O371R39l640k439j039
3265b736L79N960J938o159l641L357K973P45N03m077l677L548M713q38k263j586
3281h61k476J732O479K36o453k443K447K662K411o4n443k575N136L270j942j523
3297E93j533k402L335N241j805m817j645J348K559L989j046p002j196N427K663
3312C709j322j859k718q36M809L095l297l308m3L30K592L810k275o391J58M405
$$ plain form
3328 859 2396 2975 922 -3386 -3307 2671 4354 -149 -2139 -1632 -1399 1554 3960 -6 -4160 -1770
3344 -1770 856 1672 2587 -82 -4465 -2646 3461 2923 -537 -1953 -2136 -985 3109 2662 -2359 -3890
3360 -3890 -185 1129 1390 2070 -1625 -4706 -1010 3098 1901 -527 -1411 -3446 -976 3358 2204 -3187
3376 -3187 -3106 -21 906 2191 1502 -2765 -3851 1247 3315 831 -778 -1809 -2682 941 4273 919
3392 919 -2975 -1644 55 1326 2725 1011 -3769 -2623 2466 3172 762 -375 -2162 -2157 2795 4413
3408 4413 184 -2631 -1376 153 2295 3906 407 -3631 -861 2790 2344 1001 -182 -2706 -1070
3423 -1070 4373 3916 -837 -2295 -1234 52 3419 3710 -1343 -3897 205 3050 1838 1627 -834 -3049
3439 -3049 335 4478 2249 -1254 -1733 -1621 127 3708 2969 -2729 -3532 666 2518 2068 1243 -2169
$$ packed form
3328H59J537N79k053m308P9N978J683m503j990N07K33K953K406l966m154K390
3344a770K626Q16R15k669m383J819O107n38l460j416j83J151M094m47n021j531
3360c890L705J314K61O80l695l081L696M108j197k428q84k035K470M334j154n391
3376c187Q1L085R27J285o89m267j086N098K068k484j609j031q73L623L332l354
3392I19l894J331J699J271J399j714m780J146N089P06k410j137j787NM952J618
3408D413m229k815J255J529K142J611l499m038K770L651m46j343j183k524J636
3423a070N443m57m753j458J061J286L367K91n053k554M102K845j212k11k461k215
3439c049L384M143k229l503m79J12J748L581p39n698q03M198J852m50q25l412
$$ plain form
3455 -2169 -3880 835 3725 849 -1324 -1495 -1927 357 3713 963 -3279 -2700 519 1386 2329 798
3471 798 -3906 -3590 1758 2803 -33 -1289 -1617 -2412 748 3184 -19 -2731 -1520 45 869 2263
3487 2263 -327 -4619 -2184 2449 2063 -53 -1033 -2821 -2064 1836 2487 -1319 -2302 -682 -618 627 2113
3504 2113 -593 -3748 -1095 1580 892 294 -768 -3041 -782 2810 1302 -2055 -1396 -386 -435 669
3520 669 1515 -1364 -1879 429 655 -152 785 -774 -2739 245 3120 650 -1913 -773 -600 -305 1890
3537 1890 631 -1973 -723 1613 492 -76 699 -372 -1561 1051 1761 -656 -966 62 -837 288
3553 288 2714 -319 -2751 32 1753 65 -182 173 -1302 -244 1561 243 -1806 7 325 -894
3569 -894 1122 1509 -1547 -2195 633 557 -37 309 -813 -1903 529 2059 -589 -1797 124 -6 -563
$$ packed form
3455b169j711M715K890k876k173j71m32K284L356k750m242N79L219Q67R43j531
3471G98m704L16N348J045k836j256l28p95L160K436l203k712J211J565Q24J394
3487B263k590m292K435M633l86k116r80j788P57L900O51l806r83J620O4J245J486
3504B113k706l155K653K675o88n98j062k273K259L592j508l357O59J010m9J104
3520F69Q46k879n15K308K26q07R37j559j965K984K875k470k563J140J73K95K195
3537A890j259k604J250K336j121n68P75j071j189K612P10k417l10J028q99J125
3553B88K426l033k432K783J721j688k47L55j475J058J805j318k049J813L18j219
3569h94K016L87l056o48K828p6n94L46j122j090K432J530k648j208J921j30n57
$$ plain form
3586 -563 978 -12 -2250 -1107 986 265 -167 591 -1718 -2050 876 1759 -1185 -1391 -216 -588 562
3603 562 1467 -1247 -2610 273 1498 -198 236 251 -2139 -1121 1900 1044 -865 -821 -741 -589 1146 1365
3621 1365 -1598 -1919 926 921 -431 -67 -602 -1789 626 1980 -90 -1014 88 -869 -627 1864 1377
3638 1377 -1902 -925 1129 645 166 778 -1175 -1459 2088 1884 -930 -412 365 -594 508 2292 7
3655 7 -1491 270 1046 220 865 722 -1374 -186 2746 1263 -1291 164 4 -118 1422 1752 -1109
3672 -1109 -968 1292 833 -14 1409 -53 -1439 917 2469 390 -768 543 -167 586 2370 569
3688 569 -1683 -290 1566 684 624 1024 -640 -633 2363 1780 -943 -578 461 -64 1389 2257 -896 -2156
3706 -2156 522 1666 645 847 49 -2032 -139 2636 841 -1363 -163 -245 353 1964 1255 -1934
$$ packed form
3586e63J541r90k238J143K093p21m32P58k309l32K926Q83k944k06J175l72J150
3603E62R05k714j363K883J225j696M34J5k390J018L021q56j909M4Q0J52J735K19
3621A365k963l21K845nj352L64n35j187K415J354k070r24J102r57K42K491m87
3638A377l279R77K054m84m79O12j953k84L547k04k814N18P77r59J102J784k285
3655Gj498J761P76q26O45j43k096J188K932j483k554J455j60j22J540L30k861
3672a109J41K260m59q47J423j462j386K356J552k079j158J311p10P53J784j801
3688E69k252J393J856q82o0M00j664PK996n83k723L65J039n25J453Q68l153j260
3706b156K678J144j021K02p98k081J893K775j795k204J200q2N98J611p09l189
$$ plain form
3722 -1934 -2127 770 1346 933 807 -1495 -2306 842 2723 88 -931 -704 -1104 356 2366 702 -2722
3739 -2722 -1279 957 1372 1463 154 -2928 -2210 1884 2591 38 -1199 -1680 -1779 1523 2940 -137 -3211
3756 -3211 -1133 754 1096 1547 -216 -3564 -1954 2446 1814 -77 -1087 -2602 -1524 2244 2930 -1343
3772 -1343 -2676 -1091 188 1282 1861 -1195 -3701 -466 2829 1367 -72 -1703 -2920 -269 3306
3787 3306 2475 -1623 -2320 -1016 466 2326 2183 -2011 -3191 640 2422 1185 115 -1875 -2803 962
3803 962 3771 1146 -2003 -1631 -863 690 3327 1398 -2839 -2531 778 1847 1377 720 -2473 -2609 1725
3820 1725 3235 -48 -1980 -1424 -1050 1821 3354 -67 -3356 -1767 866 1362 1506 98 -3364 -1769
3836 -1769 2365 2339 -504 -1865 -1766 -609 2366 2928 -1452 -3449 -989 958 1919 1845 -983 -3490 -746
$$ packed form
3722a934j93K897N76m13j26k302q11L148J881k635j019K27m00J460K010j664l424
3739b722J443K236M15R1j309l082P18M094P07k553j237m81r9L302J417l077l074
3756c211K078J887L42M51j763l348J610M400o32j891j010j515J078L768O86m273
3772a343j333J585J279J094N79l056k506L235L295j462j439j631j217K651L575
3787C306q31m098o97J304J482J860j43m194j180L831J782j237j070j990r28L765
3803I62K809k625l149L72P68J553K637j929m237L08L309J069m70o57l193j36M334
3820A725J510l283j932N56L74K871J533l421l289J589K633M96J44j408l462J595
3836a769M134k6k843j361R9J157K975N62m380j997K460J947R61p4k828k507K744
$$ plain form
3853 -746 2849 1417 -352 -1303 -1925 -574 3022 2181 -2345 -2980 -183 1195 2026 1349 -2633 -3490 496
3870 496 3181 1023 -189 -1667 -2391 561 3482 1277 -2508 -2049 159 1400 2700 710 -3440 -3058
3886 -3058 1926 2850 1080 -921 -2480 -2246 1902 3990 123 -2629 -1202 -125 1578 2743 -349
3901 -349 -3675 -1439 2343 2587 840 -1213 -3400 -1217 3004 3297 -397 -2415 -1632 -275 2278 3004
3917 3004 -1091 -3620 -455 2279 2266 778 -1508 -3749 -32 4199 2485 -1653 -2435 -1570 441 3368
3933 3368 2647 -2435 -3313 150 2110 1929 986 -2283 -3607 740 3540 1346 -1774 -2674 -1965 1426
3949 1426 4185 1248 -3892 -2841 334 1710 1986 729 -2676 -2677 1557 3337 770 -1334 -2646 -1810
3965 -1810 2356 4198 59 -3921 -2491 829 1885 2701 -57 -4231 -2331 2319 2436 389 -1127
$$ packed form
3853g46L595j432j769r51o22J351L596q41m526o35K797J378Q31o77l982q57L986
3870D96K685k158j212j478p24K952K921k205l785M59K208J241J300j990m150L82
3886c058M984R24j770k001j559K34M148K088l867k752J427J077J703J165l092
3901c49l326K236L782K44j747k053k187K183M221K93l694k018P83J357K553P26
3917C004m095k529L165K734j3j488k286k241L717M231j714m138p82Q65K011K927
3933C368p21n082q78L463J960j81r43l269j324M347K800k194l120r00P09L391
3949A426K759k937n140J051L175J376K76j257l405jM234J780k567k104j312Q36
3965a810M166J842m139l980J430L320J056Q16k758m174J900M650J17k047j516
$$ plain form
3980 -1127 -2474 -1470 2512 3139 -1059 -3503 -1940 711 2377 2616 -1215 -4372 -899 2796 2167 260
3996 260 -1389 -2600 -863 3543 2173 -1901 -2175 -528 847 2586 1930 -2306 -3600 512 2682 1895
4012 1895 437 -1590 -2933 534 3859 1316 -1660 -1573 -793 1258 3098 1210 -2827 -2488 1253 2651
4028 2651 1584 118 -2618 -2126 1666 3425 716 -1480 -826 -717 1731 3064 400 -2962 -1368 1611
4044 1611 1905 1609 -50 -3052 -1405 3152 2929 -667 -1540 -1140 -443 1875 2836 -808 -2463 7 1538
4061 1538 1667 1406 -958 -2731 -28 3205 1764 -1020 -1584 -1516 -132 2679 1962 -2161 -2237 441 640
4078 640 1064 1034 -1803 -2747 702 2885 457 -994 -2040 -1832 953 3645 713 -3088 -1650 284
4094 284 718 1407 368 -2539 -1966 1417 1942 -133 -1053 -1983 -1686 1674 2802 -576 -2933 -1528 256
$$ packed form
3980a127j347J004L982O27m198k444J563K651J666K39l831l157L473L695o29j907
3996B60j649j211J737M406j370m074k74J647J375J739o56m236j294M112K170p87
4012A895j458k027j343L467L325k543k976Q7P80K051J840j888m037L39L741J398
4028B651j067j466k736M92L792J759k709k196O54J09K448J333k664l362J594K979
4044A611K94k96j659l002J647M557k23l596q73M00O97K318R61l644j655K470J531
4061A538J29k61k364j773K703L233j441k784n64O8J384K811p17m123p6K678J99
4078F40M24l0k837r44L449K183k428j451j046K08K785K692k932l801J438J934
4094B84M34O89j039k907N73L383N25k075r20r30K97L360J128l378k357J405J784
$$ plain form
4111 256 1221 1935 -346 -2936 -1094 1774 1060 -17 -688 -1729 -1156 1915 1926 -1547 -2640 -984 413
4128 413 1630 2111 -1773 -3461 -267 2038 955 -16 -913 -1761 -47 2440 766 -1894 -1390 -215
4144 -215 405 2184 1424 -2425 -2700 637 1819 720 186 -1527 -1973 805 2384 -163 -1710 -319
4160 -319 -127 462 1941 20 -2736 -1694 1125 1423 656 112 -2816 -1993 1993 2250 -414 -1539 -539
4177 -539 -235 894 1331 -890 -1985 433 1742 688 189 -688 -1997 -680 2609 1822 -993 -1073 -1001
4194 -1001 -539 1261 1401 -1764 -1704 712 1039 -175 -285 -1389 -1771 981 2343 -42 -1714 -1189 -1251
4211 -1251 -9 2081 659 -2350 -1402 989 338 -42 -194 -1606 -1072 1705 1154 -1310 -1835 -676 -571
4228 -571 1109 2167 -651 -2483 -481 699 648 660 -418 -2342 -255 2279 719 -1639 -1323 -41
$$ packed form
4111B56R65P14k281k590J842K868p14j077o71j041N73L071J1l473j093J656J397
4128D13J217M81l884j688L194K305j083r71q97q48J714K487j674k660N04J175
4144b15O20J779p60l849k75L337J182j099n34j713m46K778J579k547j547J391
4160c19J92N89J479j921k756J042K819K98p67n44k928Q23L986K57k664j125J000
4177e39L04J129M37k221j095K418J309j054m99q77j309J317L289p87k815q0P2
4194a001M62J800J40l165O0K416L27j214j10j104l82K752J362k385j672N25o2
4211a251J242K090j422l009R48K391o51l80j52j412N34K777n51k464n25J159J05
4228e71J680J058k818j832K002J180n1J2j078j924K087K534j560k358L16J282
$$ plain form
4244 -41 340 1912 1281 -2097 -2398 392 1230 1161 967 -1223 -2145 810 2445 530 -1174 -778 -434 977
4262 977 2776 -129 -2474 -933 1845 1744 1432 337 -1901 -1521 1882 2247 401 -123 -307 -454 1734
4279 1734 2631 -577 -2568 98 2081 1766 1149 -678 -2651 -178 3051 2272 -131 -483 -943 -226 2289
4296 2289 2088 -1295 -1470 580 1269 1606 971 -1639 -2335 1156 3210 1185 -763 -1154 -1301 703 3340
$$ packed form
4244d1L81J572o31l378l01K790Q38o9j94k190r22K955J635j915j704L96L44J411
4262I77J799k905k345J541K778j01l12j095k238L80L403L65j846n24j84j47K188
4279A734Q97l208j991K666J983l15o17j827j973K473L229p79k403l52m60P17K515
4296B289k01l383j75K050O89L37o35k610o96L491K054k025j948l91j47K004K637
$$ [...]
8191A26
##END NTUPLES=NMR FID
##END=
