##TITLE=1H_CA-8686
 CDCl3, 24 sc, 
 3.2.2020
##JCAMPDX= 6.0         $$ Bruker NMR JCAMP-DX V2.0
##DATA TYPE= NMR FID
##DATA CLASS= NTUPLES
##ORIGIN= UXNMR, Bruker Analytische Messtechnik GmbH
##OWNER= root
$$ XWIN-NMR		Version 3.5
$$ Mon Feb  3 13:58:43 2020 Russian Standard Time (UT+4h)  she@DPX200
##.OBSERVE FREQUENCY= 200.1315
##.OBSERVE NUCLEUS= ^1H
##.DELAY= (6, 6)
##.ACQUISITION MODE= SIMULTANEOUS
##.ACQUISITION SCHEME= undefined
##.AVERAGES= 8
##.DIGITISER RES= 18
##SPECTROMETER/DATA SYSTEM= spect
##.PULSE SEQUENCE= zg30
##.SOLVENT NAME= CDCl3
##.SHIFT REFERENCE= (INTERNAL, CDCl3, 0, 15.7039)
##AUDIT TRAIL= $$ (NUMBER, WHEN, WHO, WHERE, WHAT)
$$ ##TITLE= Audit trail, XWIN-NMR		Version 3.5
$$ ##JCAMPDX= 5.01
$$ ##ORIGIN= Bruker BioSpin GmbH
$$ ##OWNER= she
$$ F:/spectra/data/she/nmr/H-F/1/audita.txt
$$ ##AUDIT TRAIL=  $$ (NUMBER, WHEN, WHO, WHERE, WHAT)
(   1,<2020-02-03 13:57:37.90 +0400>,<she>,<DPX200>,
      <created by zg, POWCHK disabled, PULCHK disabled
       configuration hash MD5:
       00 E9 B6 7A A2 85 ED C7 34 08 36 98 17 FE 4E 26
       data hash MD5: 16K
       F8 B1 42 E0 71 A8 C3 E2 20 82 69 87 9D E7 E3 83>)
$$ ##END=
$$ 
$$ hash MD5
$$ 3B D3 CF F9 50 43 40 0E 86 DE 8D E0 06 2A 03 75
##$RELAX= 
##$RELAX= 
##$RELAX= 
##$RELAX= 
##$RELAX= 
##$RELAX= 
$$ Bruker specific parameters
$$ --------------------------
##$DU= <F:/spectra>
##$EXPNO= 1
##$NAME= <H-F>
##$PROCNO= 1
##$TYPE= <nmr>
##$USER= <she>
##$AMP= (0..31)
100 100 100 100 100 100 100 100 100 100 100 100 100 100 100 100 100 100 
100 100 100 100 100 100 100 100 100 100 100 100 100 100 
##$AQSEQ= 0
##$AQ_mod= 1
##$AUNM= <au_zg>
##$AUTOPOS= <>
##$BF1= 200.13
##$BF2= 200.13
##$BF3= 200.13
##$BF4= 200.13
##$BF5= 200.13
##$BF6= 200.13
##$BF7= 200.13
##$BF8= 200.13
##$BYTORDA= 1
##$CFDGTYP= 0
##$CFRGTYP= 5
##$CHEMSTR= <none>
##$CNST= (0..31)
1 1 145 1 1 1 1 1 1 1 1 1 1 1 1 1 1 1 1 1 1 1 1 1 1 1 1 1 1 1 1 1 
##$CPDPRG= <>
##$CPDPRG1= <>
##$CPDPRG2= <>
##$CPDPRG3= <>
##$CPDPRG4= <mlev>
##$CPDPRG5= <mlev>
##$CPDPRG6= <mlev>
##$CPDPRG7= <mlev>
##$CPDPRG8= <mlev>
##$CPDPRGB= <>
##$CPDPRGT= <>
##$D= (0..31)
0 1.2 0 0 0 0 0 0 0 0.06 0 0.03 0 0 0 0 0.0002 0 0 0 0 0 0 0 0 0 0 0 0 
0 0 0 
##$DATE= 1580723857
##$DBL= (0..7)
120 120 120 120 120 120 120 120 
##$DBP= (0..7)
150 150 150 150 150 150 150 150 
##$DBP07= 0
##$DBPNAM0= <>
##$DBPNAM1= <>
##$DBPNAM2= <>
##$DBPNAM3= <>
##$DBPNAM4= <>
##$DBPNAM5= <>
##$DBPNAM6= <>
##$DBPNAM7= <>
##$DBPOAL= (0..7)
0.5 0.5 0.5 0.5 0.5 0.5 0.5 0.5 
##$DBPOFFS= (0..7)
0 0 0 0 0 0 0 0 
##$DE= 6
##$DECBNUC= <off>
##$DECIM= 24
##$DECNUC= <off>
##$DECSTAT= 4
##$DIGMOD= 1
##$DIGTYP= 9
##$DL= (0..7)
0 120 120 120 120 120 120 120 
##$DP= (0..7)
150 150 150 150 150 150 150 150 
##$DP07= 0
##$DPNAME0= <>
##$DPNAME1= <>
##$DPNAME2= <>
##$DPNAME3= <>
##$DPNAME4= <>
##$DPNAME5= <>
##$DPNAME6= <>
##$DPNAME7= <>
##$DPOAL= (0..7)
0.5 0.5 0.5 0.5 0.5 0.5 0.5 0.5 
##$DPOFFS= (0..7)
0 0 0 0 0 0 0 0 
##$DQDMODE= 0
##$DR= 18
##$DS= 0
##$DSLIST= <SSSSSSSSSSSSSSS>
$$ [...]
##$SUBNAM2= <"">
##$SUBNAM3= <"">
##$SUBNAM4= <"">
##$SUBNAM5= <"">
##$SUBNAM6= <"">
##$SUBNAM7= <"">
##$SUBNAM8= <"">
##$SUBNAM9= <"">
##$SW= 24.9337058887773
##$SWIBOX= (0..15)
0 0 2 0 0 0 0 0 0 0 0 0 0 0 0 0 
##$SW_h= 4990.01996007984
##$TD= 16384
##$TD0= 1
##$TE= 0
##$TE2= 300
##$TE3= 300
##$TEG= 300
##$TL= (0..7)
0 120 120 120 120 120 120 120 
##$TP= (0..7)
150 150 150 150 150 150 150 150 
##$TP07= 0
##$TPNAME0= <>
##$TPNAME1= <>
##$TPNAME2= <>
##$TPNAME3= <>
##$TPNAME4= <>
##$TPNAME5= <>
##$TPNAME6= <>
##$TPNAME7= <>
##$TPOAL= (0..7)
0.5 0.5 0.5 0.5 0.5 0.5 0.5 0.5 
##$TPOFFS= (0..7)
0 0 0 0 0 0 0 0 
##$TUNHIN= 0
##$TUNHOUT= 0
##$TUNXOUT= 0
##$USERA1= <user>
##$USERA2= <user>
##$USERA3= <user>
##$USERA4= <user>
##$USERA5= <user>
##$V9= 5
##$VALIST= <valist>
##$VCLIST= <CCCCCCCCCCCCCCC>
##$VD= 0
##$VDLIST= <DDDDDDDDDDDDDDD>
##$VPLIST= <PPPPPPPPPPPPPPP>
##$VTLIST= <TTTTTTTTTTTTTTT>
##$WBST= 1024
##$WBSW= 4
##$XGAIN= (0..3)
0 0 0 0 
##$XL= 0
##$YL= 0
##$YMAX_a= 852542
##$YMIN_a= -673327
##$ZGOPTNS= <>
##$ZL1= 120
##$ZL2= 120
##$ZL3= 120
##$ZL4= 120
##$ABSF1= 10
##$ABSF2= 0
##$ABSG= 5
##$ABSL= 3
##$ALPHA= 0
##$AQORDER= 0
##$ASSFAC= 0
##$ASSFACI= 0
##$ASSFACX= 0
##$ASSWID= 0
##$AUNMP= <proc_1d>
##$AZFE= 0.1
##$AZFW= 0.1
##$BCFW= 1
##$BC_mod= 2
##$BYTORDP= 1
##$COROFFS= 0
##$CY= 11.3945322036743
##$DATMOD= 1
##$DC= 2
##$DFILT= <>
##$DTYPP= 0
##$F1P= 16.9975609425685
##$F2P= -3.02152046262296
##$FCOR= 0.5
##$FTSIZE= 0
##$FT_mod= 4
##$GAMMA= 1
##$GB= 0.15
##$INTBC= 1
##$INTSCL= 1
##$ISEN= 128
##$LB= 0.24
##$LEV0= 0
##$LPBIN= 0
##$MAXI= 10000
##$MC2= 0
##$MEAN= 0
##$ME_mod= 0
##$MI= 1.114404
##$NCOEF= 0
##$NC_proc= 0
##$NLEV= 6
##$NOISF1= 3.799351
##$NOISF2= 2.8
##$NSP= 1
##$NTH_PI= 0
##$NZP= 0
##$OFFSET= 15.70392
##$PC= 1
##$PHC0= -9790.351
##$PHC1= 19.00081
##$PH_mod= 1
##$PKNL= yes
##$PPARMOD= 0
##$PSCAL= 0
##$PSIGN= 0
##$REVERSE= no
##$SF= 200.130013532006
##$SI= 16384
##$SIGF1= 3
##$SIGF2= 2
##$SINO= 400
##$SIOLD= 16384
##$SREGLST= <1H.CDCl3>
##$SSB= 0
##$STSI= 0
##$STSR= 0
##$SW_p= 3612.71676300578
##$SYMM= 0
##$S_DEV= 0
##$TDeff= 0
##$TDoff= 0
##$TI= <>
##$TILT= no
##$TM1= 0
##$TM2= 0
##$TOPLEV= 0
##$USERP1= <user>
##$USERP2= <user>
##$USERP3= <user>
##$USERP4= <user>
##$USERP5= <user>
##$WDW= 1
##$XDIM= 8192
##$YMAX_p= 0
##$YMIN_p= 0
$$ End of Bruker specific parameters
$$ ---------------------------------
##NTUPLES= NMR FID
##VAR_NAME=  TIME,          FID/REAL,        FID/IMAG
##SYMBOL=    X,             R,               I
##VAR_TYPE=  INDEPENDENT,   DEPENDENT,       DEPENDENT
##VAR_FORM=  AFFN,          ASDF,            ASDF
##VAR_DIM=   8192,          8192,            8192
##UNITS=     SECONDS,       ARBITRARY UNITS, ARBITRARY UNITS
##FACTOR=    0.0002004,     1,               1
##FIRST=     0,             0,               0
##LAST=      1.6414764,     0,               0
##MIN=       0,             -673327,         0
##MAX=       1.6414764,     852542,          0
$$ Real data points
##PAGE= N=1
##DATA TABLE= (X++(R..R)), XYDATA
$$ [...]
$$ plain form
2812 7164 817 -5654 -628 6360 1012 -6372 317 7379 -1152 -6994 3756 7057 -5625 -4577
2826 -4577 8558 3389 -8017 309 9788 -770 -7557 4539 9028 -3014 -5691 5677 7305
2839 7305 -3212 -4479 5305 6787 -3771 -4882 6614 6450 -6478 -3427 9296 3172 -10112 255
2853 255 11075 -3168 -10939 4764 8977 -7684 -8740 7276 5530 -9278 -5838 6989 3001
2866 3001 -8794 -4578 6081 2224 -8606 -3844 7094 451 -9790 -744 8690 -3174 -10097
2879 -10097 4550 7205 -8309 -6853 8554 3204 -10941 -2394 9610 -885 -10287 822 7896
2892 7896 -2688 -8200 1624 6490 -2962 -7448 2708 6781 -4752 -7281 5695 5874 -8370 -4883
2906 -4883 9757 2661 -10860 -80 10830 -2297 -9685 4804 8853 -5104 -6079 6683 5366
$$ packed form
2812G164o347o471N026O988n348p384O689P062q531n842J0750L301j2682J048
2826d577J3135n169j1406Q326R479j0558o787J2096M489j2042k677J1368J628
2839G305j0517j267R784J482j0558j111J1496j64j2928L051J2723o124j3284J0367
2853B55J0820j4243p771J5703M213j6661j056J6016j746j4808L440J2827l988
2866C001j1795M216J0659l857j0830M762J0938o643j0241R046R434j1864o923
2879a0097J4647K655j5514J456J5407n350j4145Q547J2004j0495r402J1109P074
2892G896j0584n512R824M866r452m486J0156M073j1533k529J2976J79j4244L487
2906d883J4640p096j3521J0780J0910j3127p388J4489M049j3957r75J2762j317
$$ plain form
2919 5366 -5268 -2793 6421 3531 -4874 -1636 6556 2789 -6202 -418 8917 508 -8111 2770
2933 2770 9771 -3814 -7557 7227 7671 -7331 -4309 9328 3404 -8243 -243 8275 -358 -6415
2947 -6415 2296 6691 -1549 -5342 2502 6270 -2458 -5827 3974 6848 -4560 -6194 6895 5815
2961 5815 -7774 -4137 8911 2016 -9549 18 8469 -2070 -7300 3257 5293 -4469 -4857 3553
2975 3553 2677 -4602 -3394 3312 1870 -5720 -4142 4511 2080 -7605 -3806 6299 221 -9200 -730
2990 -730 6858 -3266 -8031 3084 4832 -6022 -4393 5006 1643 -5386 -1323 4080 371 -4114
3004 -4114 -648 4308 1029 -4532 -835 5672 1107 -6766 558 7650 -1209 -6964 3156 6997 -4058
3019 -4058 -4705 5039 3655 -4632 -1100 4458 953 -3095 504 2841 -20 -2410 497 2905 403
$$ packed form
2919E366j0634K475R214k890q405L238Q192l767q991N784R335q409q619J0881
2933B770P001j3585l743J4784M44j5002L022J3637n924j1647Q000Q518q633o057
2947f415Q711M395q240l793P844L768q728l369R801K874j1408j634J3089j080
2961E815j3589L637J3048o895j1565R567Q451j0539n230J0557K036r762l88Q410
2975C553q76p279J208O706j442p590J578Q653k431r685L799J0105o078r421Q470
2990g30P588j0124m765J1115J748j0854J629R399l363p029M063N403l709m485
3004d114L466M956l279n561L697O507m565p873P324P092q859n755J0120L841j1055
3019d058o47R744j384q287L532N558l505m048L599K337k861k390K907K408k502
$$ plain form
3034 403 -3034 459 5101 -798 -5223 2617 6250 -3130 -4427 5165 4245 -4822 -1874 5759 910
3049 910 -4226 467 3796 -1195 -2088 1458 1684 -1381 -1861 953 1888 -1417 -3257 2083 3068 -3639
3065 -3639 -4043 4132 2753 -6199 -2239 6272 207 -6463 928 4903 -1899 -3897 2600 2764 -2306
3080 -2306 -1348 1990 1083 -1444 -396 1817 1419 -1717 -804 3228 921 -4248 -664 5010 -803 -5733
3096 -5733 1992 5460 -3786 -5010 3998 2819 -5026 -1574 3843 -111 -4293 455 2537 -1358 -2657
3111 -2657 1103 2438 -1104 -2851 1263 3904 -1405 -3835 3144 4767 -3594 -3803 6136 3846 -6107
3126 -6107 -1077 6862 242 -5444 2125 5142 -2164 -3065 2689 2149 -2619 -1498 2295 1006 -2901
3141 -2901 -1239 2681 1299 -4075 -2021 4731 1104 -6256 -534 6686 -1067 -6538 2317 5480 -3554
$$ packed form
3034D03l437L493M642n899m425P840L633r380j297R592r20r067K948P633m849
3049I10n136M693L329m991q93L546K26l065m80K814R35l305j840N340R85o707
3065c639m04Q175j379q952L960Q511o065o670P391L975o802j998O497J64n070
3080b306R58L338r07k527J048K213l98l136R13M032k307n169L584N674n813m930
3096e733P725L468r246j224R008j179p845L452N417l954m182M748K082l895j299
3111b657L760J335l542j747M114K641n309k430O979J623q361k09R939k290r953
3126f107N030P939o620n686P569L017p306r01N754n40m768J121L793j289l907
3141b901J662L920j382n374K054O752l627p360N722P220p753n471Q855L163r034
$$ plain form
3156 -3554 -3959 4191 2182 -4398 -905 4020 -560 -3006 1129 2796 -856 -2728 578 2890 -916
3171 -916 -4003 734 4562 -2185 -5559 2296 4080 -4501 -4297 4207 1732 -5754 -668 4125 -1753
3186 -1753 -4115 1848 2331 -3085 -1618 2658 1051 -2253 -719 2323 1372 -1715 -1258 2831 2777 -3044
3202 -3044 -1500 4480 1437 -4064 427 4900 -1359 -3268 3470 2671 -4090 -546 4294 -349 -4004
3217 -4004 1400 3425 -1530 -2439 1360 1597 -901 -1399 640 2036 -379 -1972 1425 2450 -2066 -1732
3233 -1732 3706 1446 -4394 477 5480 -1184 -4516 3211 4746 -3461 -3044 4302 2120 -3669 -1205
3248 -1205 3007 511 -2235 -285 1663 256 -2245 -623 2295 -501 -3735 186 3625 -2121 -4461
3263 -4461 2702 3800 -4732 -3215 4962 1465 -5234 -217 4437 -1020 -3670 1409 2536 -1589 -1916
$$ packed form
3156c554m05Q150k009o580L493M925m580k446M135J667l652j872L306K312l806
3171i16l087M737L828o747l374P855J784q581K04Q504k475p486N086M793n878
3186a753k362N963M83n416J467M276j607l304J534L042r51l087M57M089n4n821
3202c044J544N980l043n501M491M473o259j909O738p99o761L544M840m643l655
3217d004N404K025m955r09L799K37k498m98K039J396k415j593L397J025m516L34
3233a732N438k260n840M871N003o664l332P727J535q207M17P346k182n789K464
3248a205M212k496k746J950J948j407k501J622K918k796l234L921L439n746k340
3263d461P163J098q532J517Q177l497o699N017M654n457k650N079J127m125l27
$$ plain form
3278 -1916 1527 1362 -1207 -1546 1365 1562 -1939 -2343 2709 1806 -4026 -1841 4873 651 -5748 369
3294 369 5178 -2137 -5356 2537 3373 -3402 -2819 2729 828 -2500 -539 1848 513 -1683 -661 1881
3310 1881 955 -2124 -894 3470 482 -3862 495 4390 -1168 -3913 2988 3546 -3283 -1831 4252
3325 4252 1503 -3188 357 3328 7 -1364 771 1408 -267 -289 650 1257 267 -733 844 2114
3341 2114 -948 -2094 3004 2703 -3519 -1356 5052 1232 -4401 130 4439 -973 -3556 1898 2244
3356 2244 -1486 -978 1482 790 -925 -288 1000 943 -1122 -1516 1548 1502 -2234 -1268 3484 758 -4133
3373 -4133 588 4545 -1944 -4009 2889 3654 -3336 -2649 3255 1396 -3068 -937 1866 -174 -1681
3388 -1681 -207 653 67 -1429 -670 1711 -789 -3168 1012 3412 -2311 -4309 3128 3480 -4397 -3039
$$ packed form
3278a916L443j65k569l39K911J97l501m04N052r03n832K185O714m222o399O117
3294C69M809p315l219P893Q36o775N83N548j901l328J961K387j335k196J022K542
3310A881r26l079J230M364k988m344M357L895n558k745O901N58o829J452O083
3325D252k749m691L545K971l321j371K135O37j675k2R39O07r90j000J577J270
3341B114l062j146N098l01o222K163O408l820n633M531M309n412k583N454L46
3356B244l730N08K460o92j715O37J288n7k065l94L064m6l736R66M752k726m891
3373d133M721L957o489k065O898P65o990O87N904j859m464K131K803k040j507
3388a681J474Q60n86j496P59K381k500k379M180K400n723j998P437L52p877J358
$$ plain form
3404 -3039 5166 1419 -4887 -563 4166 -300 -3416 927 2663 -1107 -2535 708 1898 -961 -3076
3419 -3076 768 2821 -2288 -3766 2458 2916 -4838 -3574 4744 1580 -6652 -1277 5317 -1114 -5451
3434 -5451 1348 3913 -2135 -3038 2195 2167 -1577 -1239 1850 2239 -1701 -784 3322 2321 -2905 -1074
3450 -1074 5357 1407 -4711 420 6249 -921 -5057 3077 5397 -3415 -3242 4322 2336 -3946 -904
3465 -904 3857 409 -3231 -191 3580 287 -3516 -326 3894 640 -4303 614 5377 -607 -4334
3480 -4334 3024 4983 -3124 -2696 5162 2573 -4257 246 5069 -423 -3668 1709 3806 -1189 -2910
3495 -2910 1797 2723 -1543 -2855 1046 2358 -2133 -3557 1874 2103 -3922 -2822 3836 441 -5237
3510 -5237 -292 4180 -2358 -4648 2850 3202 -4142 -2789 3960 1411 -3753 -1293 3621 828 -2830
$$ packed form
3404c039Q205l747o306M324M729m466l116M343J736l770j428L243J190k859k115
3419c076L844K053n109j478O224M58p754J264Q318l164q232N375O594o431m337
3434e451O799K565o048r03N233k8l744L38L089L89l940R17M106j001n226J831
3450a074O431l950o118N131N829p170m136Q134K320q812J73P564j986o282L042
3465i04M761l448l640L040L771l293l803L190M220l254m943M917M763n984l727
3480d334P358J959q107M28P858k589o830M503M823n492l245N377K097m995j721
3495b910M707R26m266j312L901J312m491j424N431K29o025J100O658l395n678
3510e237M945M472o538k290P498L52p344J353O749k549n164K460M914k793l658
$$ plain form
3525 -2830 -914 2723 1298 -3136 -1196 3691 293 -4543 80 3866 -2395 -4753 2387 2754 -4939
3540 -4939 -2899 4102 249 -5840 -804 3759 -1639 -4335 508 2544 -1029 -2797 817 2646 -891
3555 -891 -2345 1872 3224 -1327 -2197 3756 3493 -3467 -1491 5877 1784 -4309 1239 5709 -825 -3701
3571 -3701 3120 3944 -2252 -1894 2867 2062 -2333 -1255 2736 1626 -2659 -1616 2600 1937 -3418 -1249
3587 -1249 4287 1056 -4450 612 4949 -1224 -3845 3284 4161 -2585 -1463 4096 1742 -2670 133
3602 133 3418 25 -2148 378 2339 56 -2395 -275 2618 -179 -3870 -16 3000 -1879 -4334
3617 -4334 1657 2475 -3778 -3260 2405 196 -4188 -537 2109 -1988 -3062 1082 1217 -1811 -1630 1416
3633 1416 1573 -998 -1885 1074 2259 -731 -2442 1638 2846 -2089 -1886 3083 978 -3053 -93 2447
$$ packed form
3525b830J916L637j425m434J940M887l398m836M623L786o261k358P140L67p693
3540d939K040P001l853o089N036M563n398k696M843K036l573j768L614J829l537
3555h91j454M217J352m551q70N953k63o960J976P368m093o093N548M470o534k876
3571c701O821Q24o196L58M761q05m395J078L991j110m285J043M216o63n355K169
3587a249N536l231n506N062M337o173k621P129Q77o746J122N559k354m412K803
3602A33L285l393k173K526J961k283k451K120K893k797l691L854L016m879k455
3617d334N991Q18o253N18N665k209m384L651K646m097j074M144J35l028J81L046
3633A416J57k571q87K959J185k990j711M080J208m935K03M969k105m031K960K540
$$ plain form
3649 2447 -1435 -2745 1468 942 -3116 -1389 1972 -52 -2475 -775 1498 -72 -1872 -796 1041
3664 1041 1079 -2002 -1574 2136 1177 -2119 135 2807 95 -2138 2092 2628 -1647 -10 3558 856
3680 856 -2237 1765 3028 -937 -1442 1602 2124 -582 -1355 602 2128 -67 -2225 -74 2420 -944
3696 -944 -3032 1008 1907 -2228 -2066 2373 121 -3173 495 2447 -1831 -2043 2218 1788 -1995 -992
3712 -992 2149 1055 -1368 -490 1193 1790 -919 -1472 1892 2181 -1915 -1503 2419 829 -3097 316
3728 316 2652 -1629 -3031 1741 1539 -3289 -1748 2056 -191 -3272 -734 1384 -369 -2095 -768
3743 -768 1137 202 -1658 -1075 2154 900 -2197 222 2939 -477 -2047 2260 2405 -2026 -836 3143
3759 3143 1009 -2845 1121 3009 -485 -1586 1474 1473 -907 -837 832 846 -451 -1291 316 1295 -739
$$ packed form
3649B447l882j310M213n26m058J727L361k024k423J700K273j570j800J076J837
3664A041L8l081M28L710r59l296K254K672k712k233M230N36m275J637L568k702
3680H56l093M002J263l965n05L044N22k706p73J957J526k195k158K151K494l364
3696i44k088M040Q99m135J62M439k252l294L668J952m278k12M261m30l783J003
3712i92L141j094k423Q78J683N97k709n53L364K89m096M12L922j590l926L413
3728C16K336m281j402M772k02m828J541L804k247l081K538K118j753j726J327
3743g68J905r35j860N83L229j254l097K419K717l416j570M307J45m431J190L979
3759C143k134l854L966J888l494j101L060jk380P0J669J4j297q40J607R79k034
$$ plain form
3776 -739 -1848 1102 1162 -2328 -739 2609 -10 -3048 1065 3056 -1657 -2159 2805 1808 -1864 -362
3792 -362 2332 707 -984 546 1194 197 -129 30 537 437 -1066 -165 1481 -255 -2615 600 1793
3809 1793 -1995 -2670 2059 761 -3316 -1077 2155 -1091 -3285 776 1408 -1913 -1613 946 567 -981
3825 -981 -275 1218 834 -572 -653 1603 1707 -1384 -654 2699 1390 -2420 163 3620 -385 -2703 1300
3842 1300 2555 -1634 -1544 2060 703 -2017 404 1497 -826 -1709 48 797 -838 -1698 62 1498
3858 1498 -119 -2306 256 2730 -782 -2747 1659 2963 -2161 -1400 3136 1348 -2284 380 3039
3873 3039 -357 -1422 1518 2156 -981 -842 1797 769 -782 -1091 743 1366 -965 -1715 1284 1564
3889 1564 -2279 -1946 2128 758 -3379 -499 2750 -625 -3009 1059 1728 -1886 -977 1801 256 -1543
$$ packed form
3776g39j109K950O0l490J589L348k619l038M113J991m713n02M964r97l672J502
3792c62K694j625j691J530O48r97l26J59N07j00j503R01J646j736k360L215J193
3809A793l788o75M729j298m077K239L232l246k194M061O32l321L00K559l79j548
3825i81P06J493l84j406q1K256J04l091P30L353j309l810K583L457m005k318M003
3842A300J255m189R0L604j357k720K421J093k323q83J757P49j635q60J760J436
3858A498j617k187K562K474l512j965M406J304n124P61M536j788l632K664K659
3873C039l396j065K940O38l137J39K639j028j551l09J834O23k331p50K999K80
3889A564l843L33M074j370m137K880L249l375k384M068O69l614R09K778j545j799
$$ plain form
3905 -1543 294 1747 -52 -1170 244 1099 589 -1468 -470 1736 407 -2274 -168 2334 -932 -2533
3921 -2533 1105 1877 -2679 -2100 2019 165 -3191 -436 1380 -1272 -1975 105 278 -1297 -944 200
3937 200 534 -305 -1106 289 1670 -798 -1735 1670 2271 -1429 -1163 3033 1296 -1997 344 2788 -506
3954 -506 -1609 1798 1342 -1487 -145 1912 82 -1397 -45 1225 246 -1065 -697 1415 458 -1844
3970 -1844 -801 2466 344 -2856 445 2867 -740 -2707 1815 2240 -1996 -1021 2618 748 -1758
3985 -1758 451 1921 -69 -1264 681 1023 -232 -856 247 1312 -35 -1544 419 2502 -578
4000 -578 -2491 1441 1850 -2331 -1428 2395 520 -2800 749 2346 -1211 -2027 1464 1492 -1612 -996 1425
4017 1425 1301 -752 -881 786 1778 -586 -1622 1848 2075 -1511 -1455 2595 1326 -2720 -49 2671
$$ packed form
3905a543J837J453j799j118J414Q55n10k057R98K206j329k681K106K502l266j601
3921b533L638P72m556N79M119j854l356K755J816k652p03K080J73j575L53J144
3937B00L34q39q01J395J381k468r37L405O01l700K66M196j737l293K341K444l294
3954e06j103L407m56k829J342K057j830j479J352J270r79j311L68K112r57k302
3970a844J043L267k122l200L301K422l607j967M522M25m236R75L639j870k506
3985a758K209J470j990j195J945L42j255o24J103J065j347j509J963K083l080
4000e78j913L932M09m181R03L823j875l320L549J597l557q16L491K8l104O16K421
4017A425j24k053j29J667R92k364j036L470K27l586N6M050j269m046K671K720
$$ plain form
4033 2671 -804 -2497 1511 1549 -2109 -1357 1499 80 -1961 -610 940 -92 -1467 -993 481 334
4049 334 -1525 -999 1630 674 -2449 -390 2458 -893 -2411 1837 1742 -2236 -1078 2642 406 -2348
4065 -2348 95 2018 -287 -1580 682 1251 -272 -1080 -111 1088 10 -1675 20 1643 -965 -2135
4081 -2135 1214 1727 -1867 -1582 2524 473 -2953 52 2660 -1122 -2117 1282 1769 -1437 -760 1164
4097 1164 890 -494 -259 839 793 -217 -755 957 1116 -1139 -448 2145 478 -2507 567 2660 -1352
4114 -1352 -2350 2222 1598 -2391 -921 2132 542 -1997 352 1641 147 -915 335 1304 286 -880
4130 -880 -98 1621 310 -1362 401 2338 -884 -1739 2191 1868 -2169 -1189 2777 404 -2753 183
4146 183 2344 -1255 -2000 830 1026 -1191 -1042 199 315 -438 -1166 189 711 -1292 -1619 1168 1055
$$ packed form
4033B671l475j693M008L8l658P52K856j419k041J351J550j032j375M74J474j47
4049C34j859N26K629r56l123K059K848l351j518M248r5l978J158L720k236k754
4065b348K443J923k305j293K262N69j523q08R69J199j078j685J695J623k608j170
4081b135L349N13l594K85M106k051l426L005K608l782r95L399M87l206O77J924
4097A164k74j384K35J098m6j010n38J712J59k255O91K593j667k985L074K093m012
4114a352r98M572o24l989J470L053j590k539K349J289j494j062J250R69j018j166
4130h80P82J719j311j672J763J937l222q55L930l23m037R80L966k373l157K936
4146A83K161l599p45K830J96k217J49J241J16p53p28J355N22k003l27K787j13
$$ plain form
4163 1055 -2398 -1067 2227 148 -2916 257 2556 -1298 -2648 1887 1265 -2187 -721 1517 116
4178 116 -1764 -506 809 -34 -1199 -517 641 586 -1450 -775 1518 92 -2270 595 2108 -1335
4194 -1335 -2260 2009 1854 -2184 -959 2382 848 -1510 390 1825 -212 -725 647 897 172 -83
4210 -83 277 1053 287 -981 611 1517 -685 -1427 1332 1526 -1538 -1019 2124 169 -2403 512 2040
4227 2040 -934 -1140 1094 877 -905 -173 1062 277 -259 135 565 788 -115 -134 1222 870 -978 -424
4245 -424 1902 243 -2128 629 1997 -1220 -1582 1349 809 -1850 -451 1208 -419 -1480 -13 171
4261 171 -831 -783 65 -24 -77 -946 -151 609 -262 -1515 361 1437 -1144 -1616 1664 971 -2027 -458
4279 -458 2163 -268 -2096 791 1631 -991 -761 1394 496 -1027 -598 399 62 -532 -850 210 552
$$ packed form
4163A055l453J331L294k079l064L173K299l854j350M535o22l452J466K238j401
4178A16j880J258J315q43j165O82J158n5k036O75K293j426k362K865J513l443
4194a335r25M269j55m038J225L341j534k358J900J435k037n13J372K50p25k55
4210h3L60P76p66j268J592R06k202p42K759J94l064N19L143j955k572K915J528
4227B040k974k06K234k17j782P32J235p85n36L94M30K23r03j9J356l52j848N54
4245d24K326j659k371K757J368l217l62K931n40k659J399J659j627j061J467J84
4261A71j002M8Q48q9n3q69P95P60q71j253J876J076k581m72L280o93k998J569
4279d58K621k431j828K887Q40k622K30K155q98j523M29R97l37n94l18J060L42
$$ plain form
4296 552 -820 -989 904 764 -1473 -668 1803 -217 -2166 812 2029 -1348 -1133 1887 955 -1808
4312 -1808 131 1981 323 -894 343 776 351 -374 -36 885 540 -1010 -420 1580 336 -1957 406
4329 406 1850 -856 -1470 1009 654 -2018 -234 1733 -215 -1361 688 936 -731 -641 809 473 -242
4346 -242 -257 267 1063 -57 -1140 168 1585 -341 -924 1263 1190 -1682 -916 1523 -110 -1948 471
4363 471 1305 -1235 -860 906 124 -1708 82 699 -366 -641 -306 60 40 -791 -920 958 888 -1214
4381 -1214 -461 1623 205 -1663 500 2005 -933 -1041 1840 913 -1533 199 1516 -711 -878 1146
4397 1146 687 -712 -372 446 337 -242 -486 101 910 -126 -1171 438 1579 -963 -1207 1563 772
4414 772 -2093 222 2170 -338 -1424 1013 994 -1241 -678 1649 275 -973 -74 951 200 -531 -307
$$ packed form
4296E52j372j69J893j40k237Q05K471k020j949K978J217l377K15L020r32k763
4312a808J939J850j658j217J237M33m25p25L38R21l45j550N90K000j244k293K363
4329D06J444k706o14K479l55k672J784J967j948j146K049K48j667R0J450l36p15
4346b42j5N24P96j120j083J308J417j926n83K187p3k872P66K439j633j838K419
4363D71Q34k540L75J766p82j832J790O17j065k75L35L66k0q31j29J878p0k102
4381a214P53K084j418j868K163J505k938j08K881r27k446J732J317k227j67K024
4397A146m59j399L40Q18j09n79k44N87Q09j036j045J609J141k542k44K770p91
4414G72k865K315J948k508j086K437j9k235N63K327j374j248Q99J025p51p31K24
$$ plain form
4431 -307 385 277 -683 -896 1132 459 -1706 -304 1957 -535 -2201 790 1379 -1385 -948 1950 192
4448 192 -1734 143 1464 -577 -992 380 641 35 -459 -230 772 399 -997 -181 1411 -181 -1261
4465 -1261 714 1287 -1291 -1032 1761 350 -2165 31 1764 -878 -1735 854 710 -1102 -988 913
4481 913 727 -705 -528 117 459 -213 -801 264 1259 -664 -786 1267 596 -1548 233 2051 -391
4498 -391 -1456 1247 1103 -1323 -390 1560 435 -1149 133 1087 20 -807 -44 668 723 -251 -345 819
4516 819 653 -809 170 1594 33 -1184 1030 1226 -1283 -820 1928 394 -1674 336 1535 -482
4532 -482 -781 713 283 -812 -100 489 -105 -275 -902 -349 490 -589 -1209 250 670 -1219 -962 1366
4550 1366 420 -1749 276 1757 -793 -1375 1269 731 -1301 -284 1521 -74 -798 426 498 22 -82
$$ packed form
4431c07O92j08r60k13K028o73k165J402K261k492j666K991N89k764M37K898j758
4448A92j926J877J321k041m15J372K61o06m94K29J002l73j396Q16J592j592j080
4465a261J975N73k578K59K793j411k515K196J733k642q57K589j44j812J14J901
4481I13j86j432J77O45L42o72n88J065R95j923j22K053o71k144J781J818k442
4498c91j065K703j44k426R33J950j125j584J282R54j067q27P63P12N5r74r4J164
4516H19j66j462R79J424j561j217K214J96k509M63K748j534k068K010J199k017
4532d82k99J494m30j095P12N89n94j70o27N53Q39j079o20J459M20j889K57K328
4550A366r46k169K025J481k550n82K644n38k032J017J805j595p24J224P2m76j04
$$ plain form
4567 -82 169 249 463 -690 -129 1110 283 -1726 67 1701 -847 -1929 1069 863 -1846 -760 1410
4584 1410 195 -1682 -72 822 -576 -775 405 263 -308 -75 257 536 159 -555 75 1050 -247 -1228
4602 -1228 1077 1405 -1340 -816 1923 27 -1537 336 1438 -1069 -1391 736 563 -1040 -560 604
4618 604 103 -307 -349 92 416 -404 -912 199 949 -813 -578 1479 453 -1153 514 1736 -512 -904
4636 -904 1716 1123 -1060 146 1920 236 -900 72 1081 -88 -286 123 68 164 -889 -626 764
4653 764 270 -1517 -661 940 -496 -1474 624 501 -1386 -591 1313 -115 -1348 531 1074 -641 -506
4670 -506 962 431 -255 36 777 741 -16 -37 342 978 -193 -672 719 1186 -1091 -557 1655 -58 -1458
4689 -1458 339 1171 -1031 -1173 1003 429 -1099 -150 454 -283 -708 74 -103 -188 -72 -29 544 68 -538
$$ packed form
4567h2K51Q0K14j153N61J239q27k009J793J634k548j082K998k06k709J086K170
4584A410j215j877J610Q94j398j99J180j42n71K33L32K79l77p14O30R75j297r81
4602a228K305L28k745N24K739j896j564J873J102k507l22K127j73j603M80J164
4618F04n01m10m2M41L24q20n08J111P50j762K35K057j026j606J667J222k248l92
4636i04K620n93k183J206J774j684j136R72J009j169j98M09n5R6j053K63J390
4653G64m94j787Q56J601j436r78K098j23j887P95J904j428j233J879N43j715J35
4670e06J468n31o86K91P41l6p57k1L79O36j171m79J391M67k277N34K212j713j400
4689a458J797Q32k202j42K176n74j528R49O04p37m25P82j77q5J16M3N73m76o06
$$ plain form
4708 -538 6 932 -108 -1271 421 1302 -683 -1291 1181 786 -1553 -367 1064 11 -1174 291
4724 291 340 -860 -470 604 -268 -661 -258 -95 193 -473 -988 225 711 -874 -906 1239 570 -1580 -195
4743 -195 1844 94 -1167 674 1448 -694 -296 1168 683 -454 596 1127 138 214 118 281 405 -312
4761 -312 -697 530 733 -1317 -803 1109 32 -1536 249 1320 -1239 -1268 984 384 -1400 -256 1082
4778 1082 -237 -646 526 817 -187 -413 501 700 458 -86 86 1338 506 -770 125 1323 -514
4795 -514 -743 982 690 -1225 -304 1228 -269 -1422 384 455 -1344 -749 263 -170 -703 -328 -232 -305
4813 -305 -342 -375 -356 622 -625 -675 579 659 -898 -98 1086 -108 -1310 588 1332 -922 -589 1242 192
4832 192 -1052 -42 537 -401 -726 -145 -7 -339 -185 -385 34 12 -1190 -643 632 48 -1040 126
$$ packed form
4708e38N44R26j040j163J692Q81j985o08K472l95k339J186J431j053j185J465
4724B91M9j200L90J074q72l93M03J63K88o66n15J213M86j585l2K145o69k150J385
4743a95K039j750j261J841P74k142L98J464m85j137J050N31r89P6r6J63J24p17
4761c12l85J227K03k050N14J912j077j568J785J071k559k9K252o00j784J144J338
4778A082j319m09J172K91j004k26R14J99k42n44J72J252q32j276Q95J198j837
4795e14k29J725k92j915R21J532j497j153J806P1j799N95J012m33n33L75R6p3
4813c05l7l3J9R78j247n0J254Q0j557Q00J184j194j202J898P44k254L33J831j050
4832A92j244J010N79r38l25N81J38l32J54k00M19k2j202N47J275n84j088J166
$$ plain form
4850 126 889 -865 -508 1246 572 -1402 168 1277 -97 -480 809 912 -399 194 1292 359 286
4867 286 284 606 656 210 -461 396 1137 -313 -688 705 522 -1031 -91 1123 -453 -1143 733 462 -825
4886 -825 -454 1122 -329 -534 671 673 -56 -263 173 316 271 -273 -316 840 746 -777 -106 1225 21
4905 21 -1111 554 1074 -1007 -641 862 100 -1489 98 814 -598 -953 178 303 -615 -390 -133 -99
4923 -99 -88 -481 -518 875 149 -992 408 1119 -158 -624 1142 578 -807 238 994 -221 -641 988
4941 988 479 -689 67 613 -81 -597 -335 69 322 186 -656 -78 535 -126 -552 312 438 -912 -79
4960 -79 911 -201 -805 564 577 -1111 -193 1373 -56 -397 256 628 12 -46 13 43 20 -42 91 199 402
4981 402 -573 -336 552 -20 -1061 249 703 -1020 -679 1005 -217 -1270 264 927 -966 -822 842
$$ packed form
4850A26P63j754L57J754o74j974J570J109j374l83J289J03j311N93J098r33p3
4867B86kL22N0m46o71Q57P41j450l75J393j83j553R40J214j576o90J876k71j287
4886h25L71J576j451k05J205Kp29k07M36J43m5n44m3J156r4j523O71J331j204
4905B1j132J665N20k081L66J503p62j589J587P16j412l55J131J25r18K25K57L4
4923i9J1l93l7J393p26j141J400P11j277m66J766n64j385J045P56j215m20J629
4941I88n09j168P56N46o94n16K62M04K53j36q42N78O13o61m26Q64J26j350Q33
4960g9R90j112o04J369J3j688R18J566j429l41O53L72o16n8N9L0k3o2J33J08K03
4981D02r75K37Q88n72j041J310M54j723L41J684j222j053J534O63j893J44J664
$$ plain form
4998 842 381 -765 -174 314 -26 253 -152 -25 37 246 -185 264 377 -114 -414 1033 258 -1101 266
5017 266 1391 -414 -1018 650 623 -1003 -521 693 160 -339 29 149 -237 -387 26 -224 177 76 -345
5036 -345 459 496 -633 -19 977 -55 -774 921 836 -829 -283 1279 175 -902 236 1000 -218 -430
5054 -430 409 114 -211 -57 7 70 324 129 -409 256 -371 -667 386 429 -1043 -341 1167 20 -1445
5073 -1445 165 1029 -647 -734 735 435 -866 305 337 -13 -134 321 80 -221 -10 -272 326 494 -219
5092 -219 -719 356 18 -1208 6 1037 -673 -1065 707 343 -826 -326 616 -331 -667 -79 143 -307
5110 -307 -233 378 259 -155 215 -34 359 265 -236 263 967 -14 -545 561 737 -759 -322 1322 205
5129 205 -757 373 428 -711 -201 440 79 -587 -38 182 -9 -271 -31 -71 210 209 -166 48 742 -298
$$ packed form
4998H42m61j146N91M88l40K79m05J27O2K09m31M49J13m91l00J447p75j359J367
5017B66J125j805o04J668k7j626M82J214n33m99L68J20l86j50M13k50M01j01m21
5036c45Q04L7j129O14R96j032p19J695q5j665N46J562j104j077J138P64j218k12
5054d30Q39k95l25J54O4O3K54j95n38O65o27k96J053M3j472P02J508j147j465
5073a445J610Q64j676q7J469l00j301J171L2l50j21M55k41l01K11k62N98J68p13
5092b19n00J075l38j226J214J031j710l92J772l64j169N00R42r47l36N88K22m50
5110c07P4O11j19m14L70k49L93r4n01M99P04r81n31J106J76j496M37J644j117
5129B05r62J130N5j139N10O41l61o66N49K20j91k62K40m0K81jl75K14O94j040
$$ plain form
5149 -298 -286 1008 11 -851 276 813 -415 -462 913 282 -837 194 970 -246 -464 337 466 -472
5167 -472 -496 -55 82 -8 -283 -623 159 20 -990 -256 525 -697 -653 710 563 -922 -318 949 1
5186 1 -546 569 805 -389 -20 674 217 -238 214 211 224 172 -118 337 561 -3 -434 431 421 -754 -341
5207 -341 427 -236 -1109 317 526 -843 -526 311 123 -817 -77 233 -224 -220 -120 -87 -14 -113 -434 237 546
5228 546 -417 -266 619 134 -821 179 810 -399 -683 1104 691 -886 -157 1013 -425 -545 395 349
5246 349 -394 -404 149 -107 -171 -318 -357 233 191 -660 -78 439 -222 -589 512 521 -601 -38 899 -140 -516
5267 -516 637 628 -493 -95 617 399 -274 481 239 -358 358 100 66 -33 -215 -384 283 530 -582 -271
5287 -271 789 -286 -699 -45 665 -687 -628 491 -310 -755 446 682 -389 -67 787 496 -294 61
$$ packed form
5149b98J2J294r97q62J127N37j228m7J375o31j119J031P76j216k18Q01J29r38
5167d72k4M41J37r0k75l40P82j39j010P34P81j222M4J363j47j485O04J267r48
5186An47J115K36j194L69O94m57m55M52lJ3n2k90M55K24n64m31Q65j0j175M13
5207c41P68o63q73J426K09j369L17Q37j88r40P40L10m57MJ00L3P3r9l21O71L09
5228E46r63J51Q85m85r55J000O31j209k84J787m13j577P29J170j438j20R40m6
5246C49p43j0N53k56o4j47l9N90m2q51N82N17o61l67J101Rj122N63R37j039l76
5267e16J153rj121L98P12k18o73P55k42n97P16k58l4r9j82j69O67K47j112L11
5287b71J060j075m13O54P10j352N9J119q01m45J201K36j071L22Q54k91p90L55
$$ plain form
5305 61 332 264 277 -56 192 719 57 -432 173 728 -49 -709 800 294 -654 -3 660 -408 -841 166
5325 166 336 -526 -339 122 -318 -346 -128 -29 -351 -58 -546 143 524 -229 -628 823 374 -552 -164 921
5345 921 -383 -898 613 668 -370 -180 544 148 -726 157 393 -269 -28 168 -399 -66 131 -322 46
5364 46 239 -729 -251 396 -265 -728 184 333 -718 -356 1010 58 -560 186 767 -100 -268 647 -39 108
5384 108 -57 385 55 600 194 -109 -92 402 -434 38 519 -143 -327 385 278 -724 202 448 -129 -655
5404 -655 467 410 -874 -470 448 -273 -472 155 389 -107 -113 -280 196 414 281 -31 280 307 -144 -15 659
5425 659 155 -264 326 381 -467 -105 744 -130 -788 75 238 -266 -379 271 -138 -346 71 -122 -58 -175 -416
5446 -416 -372 244 -48 -707 193 437 -537 -596 458 117 -694 299 690 -442 -337 843 18 -771 83 352
$$ packed form
5305F1K71o8J3l33K48N27o62m89O05N55p77o60J509n06r48O51O63j068m33J007
5325A66J70q62J87M61m40k8K18R9l22K93m88O89L81p53l99J451m49r26L88J085
5345I21j304n15J511N5j038J90P24l96q74Q83K36o62K41J96n67L33J97m53L68
5364D6J93r68M78O47o61m63R12J49j051L62J366r52o18P46N81q67j68R15o86J47
5384A08j65M42l30N45m06l03J7M94q36M72M81o62j84P12j07j002R26K46n77n26
5404f55J122n7j284M04R18p21j99O27K34m96oj67M76K18j33l12L11K7m51J29O74
5425F59n04m19N90N5q48L62Q49q74o58Q63J63n04j13O50m09k08M17j93O4j17k41
5446d16M4O16k92o59R00K44r74n9J054l41q11R93L91j132J05J180q25p89Q54K69
$$ plain form
5466 352 -250 -672 -311 -179 83 252 -322 195 -40 -411 -515 254 24 -673 307 667 -402 -590 838
5485 838 690 -633 85 817 -418 -235 317 396 183 240 250 41 253 -117 77 99 415 -446 -51 701 -91
5506 -91 -462 530 526 -676 -376 609 -168 -473 -76 357 -528 -205 554 67 -250 -16 -10 -129 252 -51 -373
5527 -373 637 -24 -215 398 405 -191 -681 571 -88 -595 253 947 -117 -481 509 208 -767 -52 384 -150
5547 -150 -218 409 -145 71 81 148 -270 394 -6 -518 197 247 -326 46 571 -439 -610 893 175 -932
5567 -932 -236 755 43 -897 463 484 -172 39 216 -183 -292 -178 10 9 197 -255 0 212 59 -499 244
5588 244 362 -622 -164 520 9 -861 272 582 -628 -267 451 -16 -551 212 276 -83 258 -103 -96 27
5608 27 170 -472 270 292 -243 -241 752 250 -446 104 561 -216 -178 570 306 -471 409 401 -489 -393 402 -57 -243
$$ packed form
5466C52o02m22L61J32K62J69n74N17k35l71j04P69k30o97R80L60j069j88J428
5485H38j48j323P18P32j235J83N52P9k13N7J0k09K12l70J94K2L16q61L95P52p92
5506i1l71R92mj202L00R85p77l05L97M33q85L23P59m87l17K34Oj19L81l03l22
5527c73J010o61j91O13Pn96m90J252o59n07Q48O94j064l64R90l01r75P15M36n34
5547a50o8O27n54K16J0O7m18O64m00n12P15N0n73L72N25j010j71J503p18j107
5567i32O96R91p12r40J360K1o56K11J77l99j09J14J88jJ88m52K55K12j53n58P43
5588B44J18r84M58O84n11q70J133L10j210L61P18m67n35P63O4l59L41l61PJ23
5608B7J43o42P42K2n35KR93n02o96N50M57p77L8P48k64p77Q80qq90R6P95m59j86
$$ plain form
5631 -243 42 96 -219 -104 120 -379 283 125 -689 156 553 -86 -310 345 532 -604 57 489 -48 -801
5651 -801 79 150 -267 65 393 -168 -275 609 246 -119 -46 -203 -141 125 -26 -196 309 539 -524 -334 312
5672 312 -80 -640 457 554 -332 -345 412 133 -724 0 458 -333 71 443 -351 43 307 -82 5 225 -49
5693 -49 -308 70 149 -573 200 391 -454 -360 407 78 -486 68 531 -86 -547 -137 71 -207 188 550 -245
5714 -245 -97 74 7 -188 -116 -105 -341 404 -76 -425 303 190 -115 -366 823 -318 -616 577 205 -724
5734 -724 -369 561 -464 -538 251 -8 -289 80 -136 -14 156 174 -256 123 343 -83 -41 442 93 -709 77
5755 77 428 -289 -62 669 -76 -638 220 568 -303 -465 415 129 -203 233 296 -192 120 -180 -76 221 349
5776 349 -94 29 331 -39 -417 426 322 -487 -4 659 -264 -152 320 5 -340 -1 422 -34 -135 99
$$ packed form
5631b43K85N4l15J15K24m99O62j58q14Q45L97o39k24O55J87j136O61M32n37p53
5651h01Q80P1m17L32L28n61j07Q84l63l65P3j57O2K66j51j70N05K30j063J90O46
5672C12l92n60J097R7q86j3P57k79q57P24M58p91M04L72p94L94K64l89Q7K20k74
5693d9k59L78P9p22P73J91q45R4P67l29n64N54M63o17m61M10K08k78L95L62p95
5714b45J48J71o7j95P2J1k36P45m80l49P28j13l05k51J189j141k98J193l72r29
5734g24L55R30j025p4P89k59k81L69k16J22J70J8m30L79K20m26M2M83l49q02P86
5755G7L51p17K27P31p45n62Q58L48q71j62Q80k86l32M36O3m88L12l00J04K97J28
5776C49m43J23L02l70l78Q43j04q09M83O63r23J12M72l15l45L39M23m56j01K34
$$ plain form
5796 99 183 -117 103 -219 -25 78 -102 -342 199 300 -647 -335 432 -240 -565 170 196 -262 -209 186 -292
5817 -292 -314 296 378 -213 -45 205 -230 -456 -127 1 -163 -94 -109 -217 466 222 -229 90 515 -268 -456
5838 -456 337 13 -186 -73 253 -547 -468 269 140 -644 324 199 -483 100 341 -304 -67 229 -83 4 -3
5859 -3 -414 -430 482 195 -403 -326 639 41 -390 533 506 -667 -1 530 -141 133 212 -290 -133 152 129 103
5881 103 -165 187 -278 7 246 -55 -220 260 -25 -490 274 346 -735 -109 528 -29 -588 411 249 -143
5901 -143 -159 347 -1 48 207 142 -136 236 162 -426 295 82 -442 -250 26 -53 -140 368 -75 -305 27 401
5923 401 -249 32 650 278 -708 86 326 -190 -262 114 -97 -367 -269 -330 -63 497 -124 -214 247 230 -517 -159
5945 -159 436 -51 -458 261 -23 -370 28 488 -191 -673 350 204 -458 96 501 -245 -229 26 75 -111
$$ packed form
5796I9Q4l00K20l22J94J03j80k40N41J01r47L12P67o72l25P35K6m58N3L95m78
5817b92k2O10Q2n91J68K50m35k26L29J28j64O9j5j08O83k44m51L19M25p83j88
5838d56P93l24j99J13L26q00P9P37j29p84R68j25o82N83K41o45K37K96l12Q7p
5859cm11j6R12k87n98P7R65n98m31R23k7j173O66N31o71K74P9n02J57K85k3k6
5881A03k68L52m65K85K39l01j65M80k85m65P64P2j081O26O37n57n59R99j62l92
5901a43j6N06l48M9J59o5k78L72p4n88P21k13n24J92K76p9q7N08m43k30L32L74
5923D01o50K81O18l72r86P94K40n16p2L76k11k70R8o1K67N60o21r0M61j7p47L58
5945a59N95m87m07P19k84l47L98M60o79m82J023j46o62N54M05p46J6K55M9j86
$$ plain form
5965 -111 202 -442 -605 271 227 -458 300 299 -426 -182 413 67 -321 283 329 -432 -151 214 -106 -362 53
5986 53 52 -429 30 358 -124 134 66 -19 -136 344 -40 -239 385 -181 -316 81 507 -343 -473 488 -27 -502
6008 -502 15 121 -111 -514 83 -61 -166 477 216 84 85 -71 -58 217 358 -275 -114 470 -256 -415 277
6029 277 519 -372 -297 560 -215 -620 475 348 -154 -50 326 -120 -298 183 125 -19 247 -397 -247 82
6049 82 226 -81 128 338 -105 -37 355 125 -166 24 389 -316 -234 833 256 -278 473 352 60 139 183
6070 183 -134 -163 80 -131 -271 46 143 -236 188 139 -461 89 483 -537 -536 227 239 -536 -132 31 -95 -452
6092 -452 359 -9 -271 203 30 -19 -147 33 -244 -89 271 -404 -229 79 32 -722 -69 209 -308 9 193
6113 193 -129 -304 155 292 -485 -4 361 -125 -395 341 -49 -333 249 84 -41 173 107 -472 100 437
$$ packed form
5965a11L13o44j63Q76m4o85P58jp25K44N95l46l88O04M6p61K81L65l20k56M15
5986E3jm81M59L28m82K58o8q5j17M80l84j99O24n66j35L97M26q50j30R61n15m75
6008e02N17J06k32m03N97j44j05O43k61j32Jj56J3K75J41o33J61N84p26j59O92
6029B77K42q91P5Q57p75m05J095j27n02J04L76m46j78M81n8j44K66o44J50L29
6049H2J44l07K09K10m43O8L92k30k91J90L65p05Q2J067n77n34P51j21k92P9M4
6070A83l17k9K43k11j40L17R7l79M24m9o00N50L94j020JP63J2p75M04J63j26l57
6092d52Q11l68k62M74j73m9j28J80k77J55L60o75J75L08m7p54O53K78n17L17J84
6113A93l22j75M59J37p77M81L65m86k70P36l90k84N82j65j25K14o6n79N72L37
$$ plain form
6133 437 -180 -189 519 -94 -366 -62 242 -112 -481 661 150 -184 200 489 -181 151 478 -63 -253 263
6153 263 -311 -97 249 286 -214 -21 82 -225 191 352 -240 -212 139 416 -518 -64 473 -55 -281 346 126
6174 126 -525 81 29 -221 -259 113 36 -284 445 -108 6 217 187 32 240 284 -538 -136 317 -89 -543 124
6196 124 209 -217 -364 316 -119 -275 142 108 -312 2 396 -197 169 145 19 -129 119 -63 29 29 263 -392
6218 -392 270 390 -510 -271 552 46 -200 140 570 -398 -83 429 149 -429 260 112 -171 140 -6 -108
6238 -108 96 153 -150 -41 283 103 -274 269 347 -441 152 602 -255 -137 309 161 -478 425 630 -459
6258 -459 -114 297 202 -380 391 180 -49 78 152 -441 -30 206 29 -131 264 -110 -322 295 269 -378 -362
6279 -362 546 -353 -524 354 385 -257 -19 392 40 -207 154 347 -237 282 -104 -186 288 203 15 -176 221
$$ packed form
6133D37o17rP08o13k72L04L04l54l69J142n11l34L84K89o70L32L27n41j90N16
6153B63n74K14L46L7n00J93J03l07M16J61n92K8L51K77r34M54N37n28k26O27k20
6174A26o51O06n2k50l8L72p7l20P29n53J14K11l0j55K08M4q22M02M53m06m54O67
6196A24Q5m26j47O80m35j56M17l4m20L14L94n93L66k4j26j48K48j82R2%K34o55
6218c92O62J20r00K39Q23n06k46L40M30r68L15N12k80n78O89j48k83L11j46j02
6238a08K04N7l03J09L24j80l77N43P8p88N93M50q57J18M46j48o39R03K05j089
6258d59L45M11r5n82P71k11k29J27P4n93M11K36j77j60L95l74k12O17k6o47J6
6279c62R08q99j71Q78L1o42K38M11l52k47L61J93n84N19l86q2M74q5j88j91L97
$$ plain form
6300 221 -421 -273 250 150 -41 80 437 1 -229 336 87 -204 243 320 -277 -64 408 -179 -408 414
6320 414 54 -162 212 35 -53 244 148 -376 -146 489 -103 -366 602 445 -144 -27 328 -290 -83 242 138
6341 138 -281 114 48 -214 141 79 -295 -294 56 -432 -83 433 35 -386 114 218 -394 -422 70 -251 -407 554
6363 554 -53 -476 46 270 -19 -425 43 456 -193 145 239 -98 -127 23 27 -120 145 -222 -519 -126 159
6384 159 -649 -260 410 -206 -280 238 -24 -598 -154 361 -214 18 268 -92 -62 -131 -139 -136 443 -99 -34 388 298
6407 298 -136 -351 495 -82 136 265 201 -243 57 576 -47 -208 158 -1 -37 -70 382 58 75 113 -110 52
6429 52 124 203 -227 186 -22 -246 281 492 -32 -112 578 118 -557 190 275 -164 10 465 60 -47 377 459
6451 459 -481 -113 303 -162 0 144 11 -254 457 -88 -66 352 71 -340 -290 414 -297 -327 9 -55 -295
$$ packed form
6300B21o42J48N23j00j91J21L57m36k30N65k49k91M47P7n97K13M72n87k29Q22
6320D14l60k16L74j77q8K97r6n24K30O35n92k63R68j57n89J17L55o18K07L25j04
6341A38m19L95o6k62L55o2l74JL50m88L49N16l98m21N00J04o12k8M92l21j56R61
6363E54o07m23N22K24k89m06M68M13o49L38R4l37k9J50Mj47K65l67k97L93K85
6384A59q08L89O70o16p4N18k62n74M44N15n75K32K50l60L0o9qLN79n42O5M22r0
6407B98m34k15Q46n77K18J29o4m44L00N19o23j61L66j59l6l3M52l24J7L8k23J62
6429E2P2P9m30M13k08k24N27K11n24q0O90m60o75P47Q5m39J74M55m05j07M24Q2
6451D59r40L68M16m65J62J44j33k65P11n45K2M18k81m11N0P04p11l0L36o4k40
$$ plain form
6472 -295 144 33 -178 -267 683 -164 -354 112 297 -232 54 374 -129 -161 7 -47 -44 337 6 -49 256 427
6494 427 -281 61 622 -18 -427 283 188 -52 -143 129 -65 -212 22 33 -175 156 136 -478 201 203 51 -258
6516 -258 110 -81 -70 323 236 -214 447 311 -412 -78 537 -143 -165 236 247 58 200 231 96 -55 35 -41
6538 -41 -300 111 -56 -391 -54 -373 -28 -12 251 207 -401 64 -8 -54 243 120 -104 -265 8 509 -181 51
6560 51 473 10 48 258 -110 -137 531 35 -145 230 122 -496 316 158 -321 -94 74 233 -441 39 158
6581 158 -240 -132 137 -319 -100 32 66 -116 244 176 -288 -157 289 -123 -15 291 -6 -124 314 287 -78
6602 -78 -239 201 -244 -190 365 337 -632 -17 263 3 -3 246 -153 -441 82 256 -225 -163 -222 27 -34 -165 8
6625 8 -100 334 -277 -410 286 371 -148 147 460 -100 -215 448 -1 -125 72 221 -254 134 255 -244 -288
$$ packed form
6472b95M39j11k11q9R50q47j90M66J85n29K86L20n03l2J68n4LL81l31n5L05J71
6494D27p08L42N61o40m09P10r5k40r1K72j94j47K34J1k08L31k0o14O79Kj52l09
6516b58L68j91J1L93q7m50O61j36p23L34O15o80k2M01J1j89J42L1j35j51R0p6
6538d1k59M11j67l35L37l19L45J6K63m4o08M65p2m6K97j23k24j61K73N01o90K32
6560E1M22m63L8K10l68k7O68m96j80L75j08o18Q12j58m79K27J68J59o74M80J19
6581A58l98J08K69m56K19J32L4j82L60o8m64J31M46m12J08L06k97j18M38k7l65
6602g8j61M40m45N4N55k8r69O15K80k60oK49l99k88N23J74m81O2n9K49o1j31J73
6625Hj08M34o11j33O96Q5n19K95L13n60j15O63m49j24J97J49m75L88J21m99m4
$$ plain form
6646 -288 180 75 29 66 -3 -207 -27 409 -354 -370 96 -1 -595 172 372 -135 17 612 162 -372 320 5
6668 5 -268 90 363 -36 -123 399 -88 -31 379 145 -301 462 269 -25 -93 401 71 -118 256 -90 -282 223
6690 223 345 -557 -158 337 -29 -236 67 224 -421 -268 144 -20 -234 -202 4 -60 61 344 40 484 302
6711 302 -273 -7 369 9 -190 271 -120 -245 189 300 -221 -114 -34 -8 -42 105 -8 -161 -200 220 -153
6732 -153 -335 140 -14 -113 246 88 -484 -211 -237 -545 155 605 -153 -423 21 242 -126 -305 257 33 -190
6753 -190 -93 160 -155 341 116 -154 203 292 -279 -74 371 -80 -99 321 51 -344 -41 2 -235 -291 120 92
6775 92 -383 239 256 -225 0 -24 7 -82 322 297 -183 66 231 -264 102 261 53 -115 494 -52 -145 19
6797 19 -6 -91 -358 761 29 -115 -24 100 -154 294 147 -183 -159 158 59 -216 198 -4 -96 284 93 -192
$$ packed form
6646b88M68j05m6L7o9k04J80M36p63j6M66r7n94P67K00n07J52N95m50n34O92l15
6668Ek73L58K73l99q7N22m87N7M10k34m46P63j93k94o8M94l30j89L74l46j92N05
6690B23J22r02L99M95l66k07L03J57o45J53M12j64k14L2K06o4J21K83l04M44j82
6711C02n75K66L76l60j99M61l91j25M34J11n21J07Q0K6l4J47j13j53l9M20l73
6732a53j82M75j54r9L59j58n72K73k6l08P00M50p58k70M44K21l68j79N62k24k23
6753a90R7K53l15M96k25k70L57Q9n71K05M45m51j9M20k70l95L03M3k37n6M11k8
6775I2m75O22J7m81K25k4L1q9M04k5m80K49J65m95L66J59k08j68O09n46r3J64
6797A9k5q5k67J119p32j44R1J24k54M48j47l30K4L17r9k75M14k02r2L80j91k85
$$ plain form
6819 -192 -77 460 168 -302 304 111 -389 345 292 -303 -320 250 -104 -290 -94 -71 -559 334 281 -23 -112 314
6841 314 -337 -369 488 -330 -367 322 227 -316 -405 238 -452 -246 30 42 -209 88 -2 -139 -230 342 142 -119
6863 -119 248 -29 28 249 -140 -512 44 325 -256 -194 366 37 -129 302 171 -516 -25 416 -53 -24 299
6884 299 147 -372 69 15 60 52 466 162 -316 26 73 -66 97 257 23 -26 342 -143 4 346 205 -258
6906 -258 255 172 -221 53 291 -148 -62 405 126 -84 132 241 12 -193 191 -54 -103 239 89 -196 323
6927 323 441 -389 159 149 -206 -201 103 36 -428 -168 321 -519 -171 361 28 -266 341 234 -90 -113 59 -26
6949 -26 -298 -36 -44 -159 -12 206 -377 -158 165 -141 30 433 -66 -83 302 115 -86 -6 450 -357 100 -181
6971 -181 -262 -400 136 -307 110 -425 -17 -69 -183 123 -404 -239 199 -79 -549 54 283 -66 -193 303 -14
$$ packed form
6819a92J15N37k92m70O06j93n00P34n3n95j7N70l54j86J96K3m88Q93n3l04q9M26
6841C14o51l2Q57q18l7O89r5n43q9O43o90K06K76J2k51K97r0j37r1N72k00k61
6863a19L67k77N7K21l89l72N56K81n81O2N60l29j66M31j31o87M91M41m69K9L23
6884B99j52n19M41n4M5qM14l04m78L42M7j39J63J60k34m9L68m85J47L42j41m63
6906b58N13q3l93K74K38m39Q6M67k79k10K16J09k29k05L84k45m9L42j50k85N19
6927C23J18q30N48j0l55NL04o7m64K60M89q40L48N32l33k94O07j07l24k3J72q5
6949b6k72K62qj15J47K18n83K19L23l06J71M03m99j7L85j87k01Q0M56q07M57k81
6971a81q1j38N36m43M17n35M08n2j14L06n27J65M38k78m70O03K29l49j27M96l17
$$ plain form
6992 -14 118 561 236 -8 100 587 -170 -314 538 -83 -225 -25 -121 -230 106 79 -132 -123 299 -8 -48 -254
7014 -254 -61 -384 18 129 -35 -347 21 35 -416 -8 129 -312 -62 453 -79 -45 -47 325 -165 276 185 48
7036 48 300 318 77 -131 401 51 -93 355 84 -135 -76 30 -224 -470 246 16 -58 160 30 -234 -167 99
7058 99 -11 -195 89 25 -281 -48 145 -269 -109 304 43 -144 175 157 -274 374 219 -174 -114 109 -278
7079 -278 -245 -74 148 -212 13 254 -221 246 558 -29 -381 192 -153 -397 -84 220 -274 -179 544 -28 -365
7100 -365 210 111 -421 422 393 -253 -127 328 -201 -96 27 -14 -29 -64 101 -150 93 416 -103 14 142 -12
7122 -12 -341 14 300 -152 -257 39 110 -136 120 -82 -202 -210 568 -261 -20 438 480 -222 98 142 -253 195
7144 195 159 -182 7 418 97 -274 118 135 -618 84 380 -57 -108 210 96 -430 -18 187 -275 81 363
$$ packed form
6992a4J32M43l25k44J08M87p57j44Q52o21j42K00r6j09L36k7k11RM22l07m0k06
7014b54J93l23M02J11j64l12L68J4m51M08J37m41K50N15n32L4kL72m90M41r1j37
7036D8K52J8k41k08N32l50j44M48k71k19N9J06k54k46P16k30p4K18j30k64O7K66
7058I9j10j84K84o4l06K33J93m14J60M13k61j87L19j8m31O48j55l93O0K23l87
7079b78L3J71K22l60K25K41m75M67L12n87l52N73l45k44L13L04m94R5P23n72l37
7100c65N75r9n32Q43k9o46J26M55n29J05J23m1j5l5J65k51K43L23n19J17J28j54
7122a2l29L55K86m52j05K96P1k46K56k02j20qP78q29K41M58M2p02L20M4l95M48
7144A95l6l41J89M11l21l71L92J7p53P02K96m37n1L18j14n26M12K05m62L56K82
$$ plain form
7165 363 27 -185 243 -101 -265 240 329 -231 -390 309 62 44 431 -189 -447 316 221 -229 -24 445 -60
7186 -60 -96 -27 264 -230 232 -240 -261 13 220 -291 -131 70 -267 -46 144 114 -150 60 476 -56 -202 242
7208 242 64 -493 -184 72 -231 -73 127 88 -206 116 -9 -308 88 41 -393 216 335 -33 -89 394 25
7229 25 -35 158 207 -179 51 415 -105 -232 144 324 -161 39 236 -135 -118 193 -312 -285 57 -23 -426 -234
7251 -234 30 -159 -30 142 -223 -149 572 118 -65 39 384 -436 -23 182 -75 -282 220 -19 -367 67
7271 67 358 -266 -18 146 -149 -48 199 141 -615 224 125 -260 -343 218 -130 -93 115 -116 -489 16 77 -359
7293 -359 -249 190 -129 -332 289 363 -180 65 173 41 11 321 -167 51 153 295 -114 -10 442 -150 -90
7314 -90 329 372 -161 492 180 -313 298 191 71 -28 215 -138 66 219 1 -40 177 205 -125 -242 443 -122
$$ packed form
7165C63l36k12M28l44j64N05Q9n60j59O99k47j8L87o20k58P63r5m50K05M69n05
7186f0l6O9K91m94M62m72k1K74K07n11J60K01l37K21J90l0k64K10M16n32j46M44
7208B42j78n57L09K56l03J58K00l9k94L22j25k99L96m7m34O09J19l68n6M83l69
7229B5o0J93M9l86K30L64n20j27L76J80m85K00J97l71J7L11n05K7L42q0m03J92
7251b34K64j89J29J72l65P4P21m54j83J04L45q20M13K05k57k07N02k39l48M34
7271F7K91o24K48J64k95J01K47n8p56Q39r9l85q3N61l48L7K08k31l73N05O1m36
7293c59J10M39l19k03O21P4n43K45J08j32l0L10m88K18J02J42m09J04M52n92O0
7314i0M19M3n33O53l12m93O11j07j20r9K43l53K04J53k18m1K17K8l30j17O85n65
$$ plain form
7336 -122 -237 209 -288 -174 91 112 -79 40 536 3 -279 245 62 -309 -54 11 -95 49 113 48 -411
7357 -411 176 162 3 9 157 -175 -48 158 -59 -336 -142 334 -618 48 182 -64 -141 315 49 -526 193
7378 193 26 -256 -215 258 -249 41 138 214 -212 -1 -14 -351 34 279 -298 -123 196 216 -303 216 457 -188
7400 -188 -58 195 -441 -137 445 161 -478 96 216 -233 30 116 -427 -16 132 -436 -244 18 -68 -385 -16
7421 -16 229 -212 -270 194 194 -116 236 352 42 178 397 -164 98 -46 114 166 233 280 -60 -82 499 218 -170
7444 -170 174 -44 -95 396 86 59 79 -9 -307 -240 -141 -134 -249 12 241 -427 -158 162 -119 -300 -46 116 -386
7467 -386 163 132 77 -73 142 -178 -128 165 0 -404 396 82 -314 -408 -154 -174 -199 279 127 -390 -187 -150
7489 -150 -421 -113 441 -86 -286 340 161 -427 231 224 -410 -58 24 137 -76 291 88 -131 79 143 -167
$$ packed form
7336a22j15M46m97J14K65K1j91J19M96n33k82N24j83l71K55O5j06J44O4o5m59
7357d11N87j4j59OJ48l32J27K06k17k77J94M76r52O66J34k46p7M56k66n75P19
7378A93j67k82M1M73n07K90R7P6m26K11j3l37L85K45n77J75L19K0n19N19K41o45
7400a88J30K53o36L04N82k84o39N74J20m49K63Q6n43M11J48n68J92K62q6l17L69
7421a6K45m41n8M64%l10L52J16l10J36K19n61K62j44J60N2O7M7l40k2N81k81l88
7444a70L44k18n1M91l10k7K0q8k98O7R9Pj15K61K29o68K69L20k81j81K54J62n02
7467c86N49l1n5j50K15l20N0K93j65m04Q00l14l96r4K54k0k5M78j52n17K03L7
7489a50k71L08N54n27k00O26j79n88O58po34L52Q2J13k13L67k03k19K10O4l10
$$ plain form
7510 -167 -215 316 190 -67 17 173 -225 -52 199 -158 -90 247 -75 -418 78 69 -287 17 26 -103 -324 338
7532 338 79 -640 -39 -94 -345 206 -133 -471 -70 197 -90 -276 271 348 -251 383 238 -255 69 287 266
7553 266 -125 172 -42 -32 81 520 -244 -290 242 -66 -328 108 289 57 74 505 -215 -212 128 -157 -200 301
7575 301 376 46 3 48 -231 -194 -13 -14 -280 314 264 16 45 82 -230 -13 129 183 -258 163 256 -209 -102 432
7599 432 -537 -351 38 60 13 -174 211 -403 109 201 -162 -255 -74 -15 -72 105 350 -189 -134 263 119 -85
7621 -85 48 -221 -174 458 196 -56 3 337 119 -507 228 -109 -399 -286 117 -11 -383 191 -243 -245 141 279
7643 279 -181 57 240 -296 -416 192 -46 -74 117 -60 -461 -44 184 -427 120 425 39 -42 231 -10 -403
7664 -403 523 206 -139 31 246 -206 -79 185 147 -281 -99 278 -243 -110 254 -326 -392 184 363 -15 -93
$$ packed form
7510a67m8N31j26k57Q4J56l98J73K51l57O8L37l22l43M96rl56L04Rj29k21O62
7532C38k59p19O01n5k51N51l39l38M01K67k87j86N47P7n99O34j45m93L24K18k1
7553B66l91K97k14J0J13M39p64m6N32l08k62M36J81k32J7M31p20LL40k85m3N01
7575C01P5l30m3M5k79L7J81jk66N94n0k48K9L7l12K17J42N4m41M21R3m65J07N34
7599D32r69J86L89K2m7j87L85o14N12R2l63r3J81N9n7J77K45n39N5L97j44k04
7621h5J33k69M7O32k62k52N9L34k18o26P35l37k90J13M03j28l72N74m34kL86J38
7643B79m60K38J83n36j20O08k38k8J91j77m01M17K28o11N47L05l86q1K73k41l93
7664d03R26l17l45J70K15m52J27K64l8m28J82L77n21J33L64n80o6N76J79l78p8
$$ plain form
7685 -93 163 86 -431 17 93 -267 56 232 -166 14 389 129 -141 85 -164 109 399 22 -18 -222 298
7706 298 -191 -109 171 -2 -66 307 35 -85 -210 165 -31 -13 391 -14 -65 176 156 -442 -291 257 -129 -274
7728 -274 511 -121 -219 470 121 -475 -67 364 -294 -132 234 -106 -328 -11 357 45 -92 -170 112 128 67
7749 67 -68 -328 -20 287 -329 84 -16 -402 -387 300 55 -421 125 97 -481 92 -40 -253 -295 150 57 -263
7771 -263 -146 224 -74 -134 -173 -145 16 357 30 -271 284 -4 -406 102 210 -93 -377 15 -204 -225 258
7792 258 63 -42 -79 166 67 -102 178 112 -560 232 36 -255 80 415 -51 -59 100 26 -365 69 297 -234
7814 -234 49 370 -124 -401 76 212 -268 204 347 -218 42 402 147 -315 381 387 -310 43 158 -161 -118
7835 -118 263 -151 -285 220 17 -338 -15 81 -317 191 107 -99 -208 515 100 -390 -220 184 -288 -233 235
$$ packed form
7685i3K56p7n17M48P6l60L23J76l98J80L75k60k70K26k49K73K90l77m0k04N20
7706B98m89Q2K80j73o4L73k72j20j25L75j96J8M04m05n1K41k0n98J51N48l86j45
7728b74P85o32r8O89l49n96M08M31o58J62L66l40k22L17L68l12j37p8K82J6o1
7749F7j35k60L08L07o16M13j00l86J5O87k45m76N46k8n78N73j32k13m2M45r3l20
7771b63J17L70k98o0l9K8J61L41l27l01N55k88m02N08J08l03k84L92k19k1M83
7792B58j95j05l7K45r9j69K80o6o72P92j96k91L35L35m66qJ59p4l91M34K28n31
7814b34K83L21m94k77M77J36m80M72J43n65K60L60k55m62O96Oo97L53J15l19M3
7835a18L81m14j34N05k03l55L23R6l98N08q4k06j09P23m15m90J70M04m72N5M68
$$ plain form
7856 235 -261 86 357 114 -144 93 263 -277 -319 526 39 -364 -37 -90 -119 204 166 -344 -21 17 36 -189
7878 -189 307 11 -197 27 330 64 -82 160 -100 -276 240 106 -114 294 -84 -191 -131 560 -270 -510
7898 -510 270 206 -216 -208 150 -284 185 354 -108 -189 349 -68 0 -49 317 -151 -19 368 105 -22 368 451
7920 451 -290 159 379 -74 -104 436 119 -59 269 48 -363 240 173 -305 -24 372 -273 183 276 183 -152
7941 -152 -59 272 -107 -68 54 20 -546 299 294 -601 163 -151 38 -63 47 99 -242 136 395 -60 72 331
7963 331 -234 -247 315 158 -208 233 197 -355 -64 174 -121 -262 224 82 -371 109 286 -50 -337 277 -197
7984 -197 -170 173 -42 -395 125 224 -363 -42 553 -120 -126 199 112 -341 309 238 -94 5 6 -196 -29 110 -71
8007 -71 -140 211 44 -408 112 256 -69 219 420 -37 -309 -130 241 -240 -134 528 -118 -136 235 50 -432
$$ packed form
7856B35m96L47K71k43k58K37J70n40m2Q45m87m03L27n3k9L23l8n10L23L8J9k25
7878a89M96k96k08K24L03k66j46K42k60j76N16j34k20M08l78j07O0O91q30k40
7898e10P80o4m22QL58m34M69J69m62q1N38m17O8m9L66m68J32L87k63j27L90Q3
7920D51p41M49K20m53l0N40l17j78L28k21m11O03o7m78K81L96o45M56R3r3l35
7941a52R3L31l79L9J22l4n66Q45nq95P64l14J89j01J10N2l41L78K59m55J32K59
7963C31n65j3N62j57l66M41l6n52K91K38k95j41M86j42m53M80J77l36k87O14m74
7984a97K7L43k15l53N20R9n87L21N95o73oL25q7m53O50p1l32R9Jk02J67J39j81
8007g1o9L51j67m52N20J44l25K88K01m57k72J79L71m81J06O62o46j8L71j85m82
$$ plain form
8028 -432 -38 222 -262 29 197 -296 -413 295 -59 -541 439 260 -159 12 172 -317 -571 49 300 -237
8048 -237 -55 383 -244 221 289 -42 -268 22 -114 -78 3 261 -99 44 298 36 -360 423 257 -99 -54
8069 -54 10 -35 -351 375 -44 -21 148 190 -317 83 136 -310 -228 171 -203 -33 73 13 -329 289 103 -457 65
8092 65 168 -195 -109 -62 145 12 -107 407 -2 -253 416 267 -112 413 415 -193 13 120 -102 -55 301 71
8114 71 159 21 -39 -198 -19 293 -398 176 198 -218 -502 55 142 -462 -17 75 -1 -194 181 215 -109 224 4
8137 4 -117 290 45 -130 -138 359 -87 -575 175 273 -295 -29 237 -391 -166 232 26 -263 53 248 43 -29
8159 -29 162 -297 -326 277 121 -162 132 153 -294 -106 342 -228 -99 -18 3 -284 159 179 -278 176 81 -482
8181 -482 -232 330 -173 -239 70 176 -269 204 -69 57
$$ packed form
8028d32L94K60m84K91J68m93j17P08l54m82R80j79m19J71J60m89k54O20K51n37
8048b37J82M38o27M65O8l31k26K90j36L6Q1K58l60J43K54k62l96P83j66l56M5
8069e4O4m5l16P26m19K3J69M2n07M00N3m46Q2L99l74J70J06o0l42O18j86n60N22
8092F5J03l63Q6M7K07j33j19N14m09k51O69j49l79N25Ko08K06J07k22M7L56k30
8114G1Q8j38o0j59J79L12o91N74K2m16k84N57Q7o04M45R2p6j93L75L4l24L33k20
8137Dj21M07k45j75qM97m46m88P50R8n68K66K66o28K25L98k06k89L16J95k05p2
8159b9J91m59k9O03j56k83K94K1m47J88M48n70J29Q1K1k87M43K0m57M54r5n63
8181d82K50N62n03o6L09J06m45M73k73J26
8191E7
$$ Imaginary data points
##PAGE= N=2
##DATA TABLE= (X++(I..I)), XYDATA
$$ plain form
0 0 0 0 0 -8 16 -8 15 -24 32 -32 40 -56 72 -87 104 -127 154 -183 215 -249 295 -344 394 -454 525 -601 682
27 682 -772 877 -993 1114 -1248 1399 -1570 1748 -1944 2160 -2400 2663 -2948 3265 -3617 4005
43 4005 -4433 4910 -5450 6064 -6757 7557 -8494 9605 -10943 12592 -14696 17471 -21314
56 -21314 27002 -36302 54100 -100164 455417 852542 -550517 -385751 698304 597832
66 597832 -383173 -158982 571799 346730 -251889 24465 365406 28039 -195968 223264
76 223264 264143 -261258 -255703 334155 222751 -402549 -240424 371661 106009 -451428 -105295
87 -105295 378967 -39378 -396999 80120 329376 -159846 -263207 232010 237328 -215535
97 -215535 -110327 301912 121258 -237333 21342 333292 -5189 -296702 105198 361140
$$ packed form
0@%%%qK4k4K3l9N6o4P2r6J28j59J91k31K81l37L98m64N44o39P38q48R79j126J283
27F82j454J649j870K107k362K647k969L318l692M104m560N063n611O213o882P622
43D005q438R343j0360J1514j2821J4314j6051J8099k0548K3535k7288L2167l8785
56b1314M8316o3304R0402j54264N55581L97125j403059J64766J084055j00472
66E97832r81005K24191P30781k25069n98619K76354L40941l37367k24007M19232
76B23264M0879n25401N555N89858j11404o25300J62125O12085k65652n57437L46133
87a05295M84262m18345l57621M77119K49256m89222j03361M95217N318m52863
97b15535J05208M12239j80654l58591K58675L11950l38481k91513M01900K55942
$$ plain form
107 361140 -126358 -381343 146277 350010 -238641 -414141 166995 253408 -326343 -341606
117 -341606 178167 91010 -368884 -198414 188766 -47646 -364019 -75244 203210 -88973
127 -88973 -318873 -14848 211675 -54913 -241625 19725 193085 -30590 -139961 80107
137 80107 132106 -66586 -31143 157367 42379 -125999 50817 184122 -39392 -143372
147 -143372 79395 129417 -85182 -102698 66121 35300 -105456 -50234 59486 -24509 -131507
158 -131507 -28271 96594 -18333 -167206 -29013 160825 20883 -176076 -14654 197547
168 197547 50329 -123732 27648 175159 56855 -28358 74014 119230 49595 47418 100933
179 100933 80253 28597 54123 112800 79130 -17850 1160 122401 88993 -81833 -55656
$$ packed form
107C61140m87498k54985N27620K03733n88651j75500N81136Q6413n79751j5263
117c41606N19773q7157m59894J70470L87180k36412l16373K88775K78454k92183
127h8973k29900L04025K26523k66588j86712K61350J73360k23675j09371K20068
137H0107N1999j98692L5443J88510j14988j68378J76816J33305k23514j03980
147a43372K22767N0022k14599j7516J68819l0821j40756N5222J09720q3995j06998
158a31507J03236J24865j14927j48873J38193J89838j39942j96959J61422K12201
168A97547j47218j74061J51380J47511j18304q5213J02372M5216o9635k177N3515
179A00933k0680n1656K5526N8677l3670r6980J9010J21241l3408j70826K6177
$$ plain form
190 -55656 124828 72721 -127738 -74918 98789 25801 -125492 -56500 48841 -21258 -88730
201 -88730 -23539 13786 -47824 -63177 13009 27904 -63881 -72439 58920 75369 -85744 -89494
213 -89494 107853 99474 -112221 -74164 136567 65083 -125329 -22767 126856 -8908 -120238
224 -120238 29318 91995 -75810 -114094 52184 63849 -114484 -121865 61419 57014 -142472
235 -142472 -126873 89522 52998 -175907 -101173 140529 29897 -198039 -35968 178748
245 178748 -9764 -179019 39928 172143 -43160 -117910 95385 129748 -62229 -54388 123595
256 123595 86743 -82272 -23044 141948 57228 -116366 -13949 156440 18676 -151117
266 -151117 10236 151085 -48108 -155863 65136 116188 -125714 -122896 122439 67469 -168690
$$ packed form
190e5656J80484n2107k00459N2820J73707p2988j51293O8992J05341p0099o7472
201h8730O5191L7325o1610j5353P6186J4895r1785q558J31359J6449j61113l750
213h9494J97347q379k11695L8057K10731p1484j90412J02562J49623j35764j11330
224a20238J49556O2677j67805l8284J66278J1665j78333p381J83284m405j99486
235a42472J5599K16395l6524k28905P4734K41702j10632k27936J62071K14716
245A78748j88512j69255K18947J32215k15303p4750K13295L4363j91977P841J77983
256A23595l6852j69015N9228J64992q4720j73594J02417J70389j37764j69793
266a51117J61353J40849j99193j07755K20999N1052k41902K818K45335n4970k36159
$$ plain form
277 -168690 -74939 142797 32767 -150745 -32659 119937 13559 -95083 12763 85622
287 85622 -22431 -49301 84083 72287 -93404 -38035 171855 77021 -172285 -44946 225347
298 225347 72141 -201213 -41332 200122 40544 -154608 -16038 109349 -9841 -70698
308 -70698 21512 17624 -60349 -9749 60932 -23611 -98796 7398 94286 -23916 -119355 12913
320 12913 112626 -28574 -114726 40841 102800 -57622 -78597 81241 59926 -83461 -18567
331 -18567 95833 -2332 -76824 41753 69518 -58267 -44567 82225 31816 -93154 -21690
342 -21690 101246 17208 -110351 -24690 107385 22217 -113189 -27577 101154 11316 -96340
353 -96340 2287 74374 -33478 -55755 59926 28143 -85066 -1809 101615 -19728 -102824
$$ packed form
277a68690R3751K17736j10030j83512J18086J52596j06378j08642J07846P2859
287H5622j08053k6870J33384j1796j65691N5369K09890r4834k49306J27339K70293
298B25347j53206k73354J59881K41454j59578j95152J38570J25387j19190o0857
308g0698R2210l888p7973N0600P0681q4543p5185J06194Q6888j18202r5439J32268
320A2913R9713j41200q6152J55567O1959j60422k0975J59838k1315j43387O4894
331a8567J14400r8165p4492J18577K7765j27785J3700J26792n0409j24970P1464
342b1690J22936q4038j27559Q5661J32075q5168j35406Q5612J28731q9838j07656
353i6340R8627P2087j07852k2277J15681l1783j13209Q3257J03424j21343q3096
$$ plain form
364 -102824 40102 97396 -47646 -76798 55995 59334 -53288 -35584 55534 22503 -53475
375 -53475 -7282 58852 -362 -60158 13313 64649 -26341 -60419 47936 52876 -70566 -35308
387 -35308 96858 12874 -118725 11370 131373 -37299 -137701 51463 124122 -67036
397 -67036 -113450 60795 79406 -67271 -63552 50397 23572 -60641 -11317 49632 -26218 -70681
409 -70681 37788 70665 -71953 -90348 87349 89387 -113482 -88495 129225 74491 -136971
420 -136971 -46662 142568 22676 -126221 17489 117339 -38221 -86347 73049 71162 -85776
431 -85776 -42202 108465 28875 -119861 -13228 133657 130 -150032 8863 156683
441 156683 -31276 -171589 43286 163760 -74688 -162501 90465 135345 -117952 -111452 130003
$$ packed form
364a02824J42926N7294j45042k9152J32793L339j12622J7704R1118l3031p5978
375e3475M6193O6134n9214n9796P3471N1336r0990l4078J08355M940j23442L5258
387c5308J32166q3984j31599J30095J20003j68672j00402J89164P2659j91158
397f7036m6414J74245J8611j46677L719J13949k6825q4213M9324O0949p5850m4463
409g0681J08469L2877j42618j8395J77697K038k02869K4987K17720n4734k11462
420a36971R0309J89230j19892j48897J43710R9850j55560m8126J59396j887j56938
431h5776M3574J50667p9590j48736J06633J46885j33527j50162J58895J47820
441A56683j87959j40313K14875J20474k38448q7813K52966M4880k53297O500K41455
$$ plain form
452 130003 74794 -138753 -38603 141944 10984 -130486 23112 130070 -33607 -109745
462 -109745 61212 112151 -63679 -92873 88156 93413 -95564 -74664 117002 60580 -130595
473 -130595 -37833 138995 4928 -148646 17524 134132 -56862 -134206 68301 103366
483 103366 -97751 -96239 94382 66476 -106484 -59007 99875 43354 -99252 -31985 103919
494 103919 28903 -96034 -3003 113864 3706 -95306 37457 115393 -34224 -83409 76750
505 76750 93742 -65777 -55386 90943 57166 -72032 -29397 74308 27554 -58411 -20823
516 -20823 45653 14369 -44109 -22988 26156 5076 -37920 -14436 15945 -16797 -28816 13436
528 13436 923 -47075 -4072 46662 -22956 -68077 25934 65856 -39775 -70916 38501 69621
$$ packed form
452A30003n5209k13547J00150J80547j30960j41470J53598J06958j63677p6138
462a09745J70957N0939j75830k9194J81029N257j88977K0900J91666n6422j91175
473a30595R2762J76828j34067j53574J66170J16608j90994p7344K02507L5065
483A03366k01117J512J90621k7906j72960M7477J58882n6521j42606O7267J35904
494A03919p5016j24937R3031J16867j10158r9012J32763P7936j49617m9185J60159
505G6750J6992j59519J0391J46329l3777j29198M2635J03705m6754q5965L7588
516b0823O6476l1284n8478K1121M9144k1080m2996K3484L0381l2742j2019M2252
528A3436j2513m7998M3003N0734o9618m5121R4011L9922j05631l1141J09417L1120
$$ plain form
540 69621 -33181 -67417 24770 70404 -10450 -71329 2962 75171 1490 -79269 -3441 73061
552 73061 -10449 -75316 10294 52331 -34889 -53187 27843 21910 -51928 -28508 37779 5352
564 5352 -56250 -18623 47096 10853 -61296 -20989 66434 23913 -73229 -16774 89252 21701
576 21701 -79675 3963 93781 1467 -64864 30284 68317 -21132 -31148 44183 25908 -33989
588 -33989 2981 45292 -10636 -44063 23863 49633 -36743 -62649 40262 65019 -60397 -82180
600 -82180 65874 77766 -89226 -81342 100443 68121 -113228 -47093 126822 32719 -117821
611 -117821 7117 133554 -10691 -105712 56197 126661 -45242 -93873 88491 121266 -71793
622 -71793 -92774 109981 115100 -100612 -89971 128643 91379 -128928 -66760 136241 40387
$$ packed form
540F9621j02802l4236R2187M5634q0854o0879P4291P2209p3681q0759P5828P6502
552G3061q3510o4867Q5610M2037q7220j8298Q1030n933p3838K3420O6287l2427
564E352o1602L7627O5719l6243p2149M0307Q7423m2521r7142N6455J06026o7551
576B1701j01376Q3638Q9818r2314o6331R5148L8033q9449j0016P5331j8275n9897
588c3989L6970M2311n5928l3427O7926K5770q6376k5906J02911K4757j25416k1783
600h2180J48054J1892j66992P884J81785l2322j81349O6135J73915r4103j50540
611a17821J24938J26437j44245r5021J61909P0464j71903m8631J82364L2775j93059
622g1793k0981K02755N119k15712J0641K18614l7264k20307O2168K03001r5854
$$ plain form
633 40387 -139944 -19378 119829 -24737 -121513 34790 81893 -80505 -82994 77078 40500
644 40500 -115239 -45291 107573 10766 -138862 -16412 133977 -10980 -158167 13117
654 13117 153822 -41059 -163452 52907 147945 -82777 -138580 95479 105478 -122370 -84110
665 -84110 125611 40438 -144674 -21374 135377 -20557 -150849 28249 135464 -62218
675 -62218 -150253 62630 134209 -90715 -142720 93945 123726 -117324 -115284 126676 91177
686 91177 -137159 -61328 146002 35646 -136196 6352 138489 -22551 -109186 62848
696 62848 107362 -64262 -70717 95524 70427 -88259 -38300 111431 37463 -105140 -10059
707 -10059 121431 1974 -118146 24251 123337 -43207 -115701 68270 104569 -90142 -87523
$$ packed form
633D0387j80331J20566J39207j44566r6776J56303M7103j62398k489J60072l6578
644D0500j55739O9948J52864r6807j49628J22450J50389j44957j47187J71284
654A3117J40705j94881j22393K16359R5038k30722n5803K34059R999k27848L8260
665h4110K09721q5173j85112J23300J56751j55934j30292J79098J07215j97682
675f2218q8035K12883P1579k24924n2005K36665K9781k41050K040K41960l5499
686I1177k28336P5831K07330j10356j71842J42548J32137j61040q6635J72034
696F2848M4514j71624o455J66241k5097j58686M9959J49731p3968j42603R5081
707a0059J31490j19457j20120J42397R9086j66544p2494J83971L6299j94711K619
$$ plain form
718 -87523 107866 64937 -119571 -41002 125885 20512 -121644 2607 121400 -10098
728 -10098 -105554 30796 108178 -25917 -86685 49806 94936 -41664 -67711 70401 73940
739 73940 -63067 -40241 89164 36206 -79506 -1138 90644 -10884 -77195 34221 68829
750 68829 -47296 -57414 50618 35884 -62099 -34360 47465 9512 -61521 -18620 41117 -7701
762 -7701 -59810 -3292 40838 -25958 -59701 20920 41496 -50102 -51868 49558 31815 -70481
774 -70481 -31457 66548 13039 -72858 -10293 61178 -377 -56659 -2158 42082 -1025 -38007
786 -38007 -7293 25326 3648 -28099 -10410 18329 -1102 -25294 -739 14575 -14969 -19033
798 -19033 13573 8599 -22203 -9450 17236 6165 -11807 -6271 6228 15975 8741 -14712 -6578
$$ packed form
718h7523J95389m2929j84508P8569J66887j05373j42156J24251J18793j31498
728a0098r5456J36350P7382j34095o0768J36491M5130j36600k6047J38112L539
739G3940j37007K2826J29405n2958j15712P8368R1782j01528o6311J11416L4608
750F8829j16125j0118J08032j4734r7983K7739Q1825l7953p1033M2901N9737m8818
762g701n2109N6518M4130o6796l3743Q0621K0576r1598j766J01426j7743j02296
774g0481L9024R8005n3509q5897O2565P1471o1555n6282N4501M4240m3107l6982
786c8007L0714L2619k1678l1747J7689K8739j9431k4192K4555J5314k9544m064
798a9033L2606m974l0802J2753K6686j1071j7972N536J2499R747p234k3453Q134
$$ plain form
811 -6578 32740 22158 -24150 -7012 39336 18702 -19621 1729 26189 7564 -1307 9203
823 9203 1848 -806 16009 9853 -15076 -7600 19437 12737 -18984 -19116 16754 23402 -20475 -33983
837 -33983 20658 35391 -30261 -39116 35852 34017 -43544 -24652 49724 15609 -46540 3064
849 3064 50399 -7400 -37038 26454 40593 -23027 -26043 37320 33185 -31498 -24270 43121 31977
862 31977 -42843 -28347 51374 27890 -57378 -24616 57813 11903 -63954 -8662 50168 -11562
874 -11562 -50106 9734 25094 -27273 -21663 19294 -3741 -30720 5551 21896 -21764 -30066
886 -30066 19804 27521 -26562 -35147 25620 37846 -28353 -40541 31542 39958 -33809 -33023 36830
899 36830 22310 -36611 -7182 33369 -10496 -29624 24130 19975 -39218 -16740 41806 7277
$$ packed form
811f578L9318j0582m6308J7138M6348k0634l8323K1350K4460j8625q871J0510
823I203p355k654J6815o156k4929P476K7037o700l1721j32L5870O648m3877j3508
837c3983N4641J4733o5652q855P4968j835p7561J8892P4376l4115o2149M9604
849C064M7335n7799k9638O3492J4139o3620l016O3363m135o4683P228O7391j1144
862C1977p4820J4496P9721k3484q5268L2762Q2429m5910p5857N5292N8830o1730
874a1562l8544N9840J5360n2367N610M0957k3035k6979L6271J6345m3660q302
886c0066M9870P717n4083q585O0767J2226o6199j2188P2083Q416p3767P86O9853
899C6830j4520n8921K9429M0551m3865j9128N3754m155n9193K2478N8546l4529
$$ plain form
911 7277 -49412 -10546 42522 6271 -44344 -13670 35250 11846 -34536 -15020 28041 9804
923 9804 -23455 -1784 17875 -7003 -6476 22707 -295 -28155 16275 39690 -20587 -35132 33888
936 33888 37455 -30904 -24717 35468 20229 -27936 -8344 25487 1647 -21486 4093 19119
948 19119 -10906 -22616 13122 22465 -22498 -30202 24988 27554 -36192 -29425 39226 19719 -46086
961 -46086 -12389 45240 35 -42114 11662 37262 -17622 -25727 26257 21443 -22694 -8575
973 -8575 27058 8351 -18634 2275 23223 -803 -17535 11603 24457 -14158 -22327 27633
985 27633 26463 -35854 -22577 48018 18828 -54840 -10477 58849 27 -57362 10151 50651
997 50651 -20446 -41184 27302 30160 -32472 -19511 37422 12694 -39719 -5111 45807 3632
$$ packed form
911G277n6689L8866N3068l6251n0615L0674M8920k3404m6382J9516M3061j8237
923I804l3259K1671J9659k4878N27K9183k3002k7860M4430K3415o0277j4545O9020
936C3888L567o8359O187O0185j5239m8165J9592L3831k3840k3133K5579J5026
948A9119l0025j1710L5738R343m4963p704N5190K566o3746O767O8651j9507o5805
961d6086L3697N7629m5205m2149N3776K5600n4884q105N1984m814m4137J4119
973h575L5633j8707k6985K0909K0948k4026j6732K9138J2854l8615q169M9960
985B7633j170o2317J3277P0595k9190p3668M4363O9326n8822n7389O7513M0500
997E0651p1097k0738O8486K858o2632J2961N6933k4728n2413L4608N0918m2175
$$ plain form
1009 3632 -48701 2812 56583 -4553 -57249 14115 60525 -20448 -53912 32001 45662 -41210
1021 -41210 -31014 48066 13101 -55083 2246 54176 -20985 -58387 28018 50922 -41455 -55004
1033 -55004 38644 45299 -47879 -49580 42457 37958 -52322 -37149 50465 19993 -60971 -9638
1045 -9638 61534 -12246 -67299 29684 66192 -48648 -63119 63902 58331 -71947 -48974 77744
1057 77744 43192 -73700 -32516 71686 26895 -63439 -15918 60208 6657 -55179 6882
1068 6882 52399 -23138 -50979 39802 47042 -58842 -43811 71604 34599 -82989 -26326 84539
1080 84539 14015 -82586 -2587 73883 -7603 -61818 18741 52649 -24138 -39653 35633 36885
1092 36885 -38631 -26575 50751 27432 -52726 -16708 63701 13368 -63195 1533 67119 -12057
$$ packed form
1009C632n2333N1513N3771o1136n2696P1364M6410q0973l3464Q5913J3661q6872
1021d1210J0196P9080l4965o8184N7329N1930p5161l7402Q6405K2904r2377j3549
1033e5004R3648O655r3178j701R2037m499r0280J5173Q7614l0472q0964N1333
1045i638P1172p3780n5053R6983L6508j14840j4471J27021n571j30278K2973J26718
1057G7744l4552j16892M1184J04202m4791r0334M7521P6126n3551o1836O2061
1068F882M5517p5537k7841R0781P240j05884J5031J15415l7005j17588N6663J10865
1080H4539p0524r6601P9999P6470q1486n4215Q0559L3908p6787j5515P5286J252
1092C6885p5516J2056P7326k3319q0158L6018Q0409n0333p6563O4728O5586p9176
$$ plain form
1104 -12057 -62102 27985 56587 -40159 -49017 48112 38148 -54964 -32181 52159 22003 -52187
1116 -52187 -20341 44352 12796 -43631 -10974 38581 3674 -38598 4064 39064 -12843 -37551
1128 -37551 24967 38647 -31348 -31548 41523 29198 -40099 -18714 41646 14841 -34285 -7484
1140 -7484 28343 5063 -21727 -5167 14281 2901 -13319 -6435 6175 -1127 -10273 1004 2896
1153 2896 -15069 -5285 19782 -3220 -33831 3459 38562 -8190 -43360 8205 43838 -3897
1165 -3897 -37413 2423 35001 8003 -23063 -6917 23333 14598 -13144 -5340 17478 2444
1177 2444 -13151 13588 17945 -23984 -17738 36314 18540 -44459 -20651 44690 17444 -46684
1189 -46684 -21213 36674 14708 -36209 -19435 25622 11483 -29128 -12441 25322 1891 -31615
$$ packed form
1104a2057n0045R0087K8602r6746q858R7129r964r3112K2783Q4340l0156p4190
1116e2187L1846O4693l1556n6427L2657M9555l4907m2272M2662L5000n1907k4708
1128c7551O2518J3680o9995k00P3071j2325o9297K1385O0360k6805m9126K6801
1140g484L5827k3280k6790J6560J9448j1380j6220O884J2610p302r146J1277J892
1153B896j7965R784K5067k3002l0611L7290L5103m6752l5170N1565L5633m7735
1165c897l3516L9836L2578k6998l1066J6146L0250q735k7742P804K2818j5034
1177B444j5595K6739M357m1929O246N4052j7774o2999K3808O5341k7246o4128
1189d6684K5471N7887k1966n0917J6774M5057j4139m0611J6687L7763k3431l3506
$$ plain form
1201 -31615 2935 31491 -14460 -33683 22653 29920 -31445 -23040 37855 12987 -41939 -2233
1213 -2233 43417 -9677 -44468 17542 42186 -26381 -45061 27137 41755 -34449 -47145 33546
1225 33546 42244 -43293 -45541 45306 35956 -56241 -31031 59862 17591 -64920 -3383 67026
1237 67026 -8536 -60127 26665 60232 -31387 -45098 48756 46887 -45078 -30694 60257 37452
1249 37452 -52585 -23310 66205 30242 -58470 -15396 67374 14147 -58648 3922 59434 -14769
1261 -14769 -47965 33730 39441 -47513 -26567 60590 14899 -68940 -5063 72898 -2123 -73630
1273 -73630 7424 71401 -9842 -66757 14860 64204 -17548 -56770 27243 53509 -33889 -43526
1285 -43526 47324 37060 -56496 -25192 65331 13544 -70859 -4544 67554 -9139 -67413 10696
$$ packed form
1201c1615L4550K8556m5951j9223N6336P267o1365Q405O0895k4868n4926L9706
1213b233M5650n3094l4791O2010K4644o8567j8680P2198J4618p6204j2696Q0691
1225C3546Q698q5537k248R0847r350r2197K5210R0893m2271q2511O1537P0409
1237F7026p5562n1591Q6792L3567r1619j3711R3854j869r1965J4384R0951k2805
1249C7452r0037K9275Q9515l5963q8712M3074Q2770n3227p2795O2570N5512p4203
1261a4769l3196Q1695N711q6954K0946Q7157m5691q3839O3877P7961p5021p1507
1273g3630Q1054O3977q1243n6915Q1617M9344q1752l9222Q4013K6266q7398r637
1285d3526R0850j0264r3556L1304R0523n1787q4403O6315P2098p6693n8274P8109
$$ plain form
1297 10696 53072 -23063 -50969 16633 30800 -28729 -31219 20271 11459 -35568 -13510 30997
1309 30997 -5331 -48002 4200 45667 -21928 -58224 24501 52439 -38246 -54026 39910 41857
1321 41857 -46598 -34134 43968 19441 -44216 -10158 39319 -2131 -38455 7432 33963 -15384
1333 -15384 -35765 17620 33461 -25564 -36236 28875 32722 -36835 -30840 41970 25258 -46226
1345 -46226 -16443 49632 11153 -43282 1618 43386 -926 -27129 13425 26612 -5767 -6570
1357 -6570 19114 10394 -9514 7297 25513 1958 -18701 11706 35603 -2637 -31326 13852
1369 13852 42436 -9730 -36005 18904 36550 -18977 -26222 23623 18365 -23316 -8662 22108
1381 22108 -279 -20520 4974 16701 -9657 -15972 9711 14542 -11287 -17221 11389 19021 -14076
$$ packed form
1297A0696M2376p6135k7906O7602J4167n9529k490N1490q812m7027K2058M4507
1309C0997l6328m2671N2202M1467o7595l6296Q2725K7938r0685j5780R3936J947
1321D1857q8455J2464P8102k4527o3657L4058M9477m1450l6324M5887K6531m9347
1333a5384k0381N3385J5841n9025j0672O5111L847o9557N995P2810j6712p1484
1345d6226K9783O6075l8479n4435M4900M1768m4312k6203M0554J3187l2379q03
1357f570K5684q720j9908J6811J8216k3555k0659L0407K3897l8240k8689M5178
1369A3852K8584n2166k6275N4909J7646n5527p245M9845n258m1681J4654L0770
1381B2108k2387k0241K5494J1727k6358o315K5683M831k5829n934K8610P632l3097
$$ plain form
1394 -14076 -22740 15316 23497 -18822 -24921 17244 20533 -17373 -18731 8789 8391 -6031 -7472
1407 -7472 -8132 -4895 8402 1694 -20394 -12663 12178 5297 -17313 -14886 1702 6408 -2143 -14241
1421 -14241 -11666 6116 9394 -9678 -14728 2292 8850 -73 -6642 -6766 1876 11565 494 -15395
1435 -15395 -63 17302 -451 -14893 3952 11776 -5301 -5178 7032 -694 -5505 6376 3261
1448 3261 -10474 297 12785 -2742 -13329 4494 14338 -2669 -13503 2643 17386 3241
1460 3241 -16827 -1959 23520 7235 -20621 67 26704 2427 -18695 9133 21100 -7471
1472 -7471 -8780 17609 8397 -13040 2024 17713 -1555 -12086 6141 12525 -3316 -9125 3110
1485 3110 9115 -2466 -9666 2434 9734 -5761 -11521 7993 8693 -12664 -7083 13742 1112
$$ packed form
1394a4076q664L8056Q181m2319o099M2165L289l7906j358K7520l98j4422j441
1407g472o60L237J3297o708k2088P731K4841o881k2610K427J6588M706q551j2098
1421a4241K575J7782L278j9072n050J7020O558q923o569j24Q642R689j1071j5889
1435a5395J5332J7365j7753j4442J8845P824j7077J23J2210p726m811J1881l115
1448C261j3735J0771J2488j5527j0587J7823R844j7007j0834J6146J4743j4145
1460C241k0068J4868K5479j6285k7856K0688K6637k4277k1122K7828J1967k8571
1472g471j309K6389r212k1437J5064J5689j9268j0531J8227O384j5841n809J2235
1485C110O005j1581p200J2100P300j5495n760J9514P00k1357N581K0825j2630
$$ plain form
1498 1112 -14549 3401 11867 -8804 -7660 12564 2912 -14278 1747 13822 -4618 -11583 5504
1511 5504 8960 -5349 -7954 2144 5381 -1839 -7106 -761 4913 -3550 -7409 3343 3405 -9724
1525 -9724 -3687 9754 -2682 -13434 4565 9992 -9359 -7924 10012 2371 -9944 2899 7784
1538 7784 -6185 -3068 10423 894 -9213 3671 10939 -2924 -8217 4239 9134 -1882 -8480
1551 -8480 1589 9994 -1580 -12181 2138 11959 -6930 -12964 9226 7967 -15136 -5488 15299
1564 15299 -3386 -17498 7407 13713 -14460 -11492 16235 6277 -17987 -2796 17309 171
1576 171 -15631 1241 14844 -708 -14185 1508 14687 -2836 -15646 4800 15266 -10134
1588 -10134 -14567 13507 9299 -20651 -5859 21680 -3842 -25765 8302 22139 -16986 -21326
$$ packed form
1498A112j5661J7950Q466k0671J144K0224r652j7190J6025J2075j8440o965J7087
1511E504L456j4309k605J0098L237p220n267O345N674q463l859J0752O2j3129
1525i724O037J3441j2436j0752J7999N427j9351J435J7936p641j2315J2843M885
1538G784j3969L117J3491r529j0107J2884P268j3863n293J2456M895j1016o598
1551h480J0069Q405j1574j0601J4319R821j8889o034K2190j259k3103R648K0787
1564A5299j8685j4112K4905O306k8173K968K7727r958k4264J5191K0105j7138
1576A71j5802J6872J3603j5552j3477J5693J3179j7523j2810K0446J0466k5400
1588a0134m433K8074m208k9950J4792K7539k5522k1923L4067J3837l9125m340
$$ plain form
1600 -21326 19088 14833 -22435 -11811 21987 7151 -21006 -3191 21983 2069 -20747 3883
1612 3883 25146 -4658 -23915 13705 29343 -16566 -26740 27373 28603 -30805 -21580 38609
1624 38609 18158 -38713 -9242 40307 2843 -36244 4379 32434 -9242 -28099 13175 24097
1636 24097 -16796 -20711 20844 18996 -24635 -16189 30486 14975 -34072 -8815 40868 4849
1648 4849 -40808 5471 43248 -10095 -36809 20550 33556 -23632 -23472 29654 16845 -30705
1660 -30705 -8556 32095 1901 -33265 2315 33610 -8797 -38664 10221 38467 -17962 -44550
1672 -44550 20219 42216 -28956 -44458 31183 37056 -37113 -32350 37211 21753 -37885 -13543
1684 -13543 34675 4348 -31534 2783 28016 -8184 -25129 12980 24051 -16461 -23118 19848
$$ packed form
1600b1326M0414m255l7268J0624L3798j4836k8157J7815K5174j9914k2816K4630
1612C883K1263k9804j9257L7620J5638m5909j0174N4113J230n9408R225O0189
1624C8609k0451n6871K9471M9549l7464l9087M0623K8055m1676j8857M1274J0922
1636B4097m0893l915M1555j848m3631Q446M6675j5511m9047K5257M9683l6019
1648D849m5657M6279L7777n3343k6714N7359J3006n7188J60N3126j2809m7550
1660c0705K2149M0651l0194l5166L5580L1295m2407k9867M8885K8246n6429k6588
1672d4550O4769K1997p1172j5502P5641N873p4169M763O9561j5458n9638K4342
1684a3543M8218l0327l5882L4317K5233l6200j6945L8109J1071m0512o657M2966
$$ plain form
1696 19848 22131 -24988 -21765 28097 17394 -34492 -14385 34875 5561 -38689 -1424 33678
1708 33678 -8651 -32020 12124 23645 -18478 -18791 20080 11215 -22525 -5968 24996 3525
1720 3525 -25913 922 31518 -68 -32416 5462 39547 -3766 -37532 11003 40838 -11135
1732 -11135 -33921 17986 30569 -18342 -20730 21001 13831 -20244 -6356 19489 540 -19164
1744 -19164 2369 17192 -5322 -18093 5570 17990 -8040 -19599 10407 20026 -14037 -18777
1756 -18777 18907 17619 -21125 -11842 25584 9249 -23428 -1669 24162 -449 -18509 6358
1768 6358 16916 -6665 -12230 9133 11121 -9922 -10575 11048 11017 -14582 -13731 16127 12527 -20986
1782 -20986 -14163 21558 9103 -25332 -7006 23021 804 -22919 2430 18866 -6540 -15925
$$ packed form
1696A9848K283m7119L223M9862j0703n1886K0107M9260k9314m4250L7265L5102
1708C3678m2329k3369M4144J1521m2123l13L8871q865l3740J6557L0964k1471
1720C525k9438K6835L0596l1586l2348L7878L4085m3313l3766M8535K9835n1973
1732a1135k2786N1907J2583m8911k388M1731p170l4075J3888K5845j8949j9704
1744a9164K1533J4823k2514j2771K3663J2420k6030j1559L0006R619l4063m740
1756a8777L7684j288l8744R283L7426j6335l2677K1759K5831k4611j8060K4867
1768F358J0558k3581n565K1363J988k1043o53K1623l1k5599Q51K9858l600l3513
1782b0986O823L5721j2455l4435J8326L0027k2217k3723K5349J6436k5406r385
$$ plain form
1794 -15925 8524 14035 -8001 -11397 9857 12950 -8121 -11502 11365 14006 -11918 -12103 16518
1807 16518 11514 -19474 -7656 22503 2631 -25045 982 23315 -7298 -24225 8149 19121
1819 19121 -12855 -19897 9759 14675 -13675 -16592 11352 13069 -15926 -15315 16482 12291 -22324
1832 -22324 -10982 25843 6783 -29051 -1186 30964 -3632 -29796 9897 28436 -12760 -23669
1844 -23669 16603 20587 -17275 -16484 18448 13536 -19794 -12094 19969 8940 -24089 -8162 25039
1857 25039 2202 -30252 -260 29180 -8015 -31251 12141 26676 -19141 -23591 23033 17010
1869 17010 -25849 -10303 27708 5852 -26154 639 28110 -2070 -25111 7725 27834 -6757
1881 -6757 -25368 13021 28015 -14405 -24672 21050 24148 -24331 -17761 29841 13098 -30661
$$ packed form
1794a5925K4449N511k2036l396K1254L093k1071l381K2867K641k5924j85K8621
1807A6518n004l0988J1818L0159j9872k7676K6027K2333l0613j6927L2374J0972
1819A9121l1976p042K9656M916k8350k917K7944J717k8995O11L1797m191l4615
1832b2324J1342L6825j9060l5834K7865L2150l4596k6164L9693J8539m1196j0909
1844b3669M0272L984l7862P91L4932m912l3330P700L2063j1029l3029J5927L3201
1857B5039k2837l2454K9992K9440l7195k3236M3392J4535m5817m450M6624o023
1869A7010m2859J5546L8011k1856l2006K6793K7471l0180k3041L2836K0109l4591
1881f757j8611L8389J4994m2420j0267M5722L098m8479O570M7602j6743m3759
$$ plain form
1893 -30661 -5244 31748 -1318 -29214 8354 25879 -13075 -21123 17272 18062 -19306 -13152 23070
1906 23070 12998 -23713 -9344 28348 11087 -28046 -5439 32865 5784 -29187 2178 30482
1918 30482 -5116 -23270 13800 19717 -17922 -11492 23079 5413 -25271 -68 25536 -5001
1930 -5001 -26720 5391 23414 -9395 -25151 7222 21502 -11848 -23589 11167 18866 -17560
1942 -17560 -19457 18514 12939 -23693 -9716 23771 2208 -24635 2862 21185 -9762 -18782
1954 -18782 13551 13657 -17727 -11091 18798 7794 -20350 -8511 19365 6958 -20547 -9035
1966 -9035 18306 5999 -20016 -5894 16642 -706 -17576 3380 12606 -11269 -11140 13755 5356
1979 5356 -18349 -3290 18204 -561 -18159 2482 15861 -2805 -12387 3921 12087 -1803
$$ packed form
1893c0661K5417L6992l3066k7896L7568J7525l8954q048L8395P90l7368O154L6222
1906B3070j0072l6711J4369L7692j7261l9133K2607L8304k7081l4971L1365K8304
1918C0482l5598j8154L7070N917l7639O430L4571j7666l0684K5203K5604l0537
1930e001k1719L2111J8023l2809j5756L2373J4280l3350j1741L4756P699l6426
1942a7560j897L7971n575l6632J3977L3487k1563k6843K7497J8323l0947r020
1954a8782L2333J06l1384O636K9889j1004k8144J1839K7876j2407k7505J1512
1966i035K7341j2307k6015J4122K2536j7348j6870K0956R226k3875J29K4895q399
1979E356k3705J5059K1494j8765j7598K0641J3379j8666r582J6308Q166j3890
$$ plain form
1991 -1803 -9328 3620 11445 -1775 -9053 5694 11226 -4969 -7251 8803 6688 -7413 -105
2004 -105 9376 -2066 -6767 7946 6510 -9369 -3290 11260 3410 -9109 -1587 8159 3483 -3943
2018 -3943 -2839 2606 5530 626 -3548 875 4209 885 311 2007 -1592 124 6752 1713 -6750
2033 -6750 1320 9154 -975 -7003 3765 5521 -4026 -1981 4046 -1616 -3821 2331 883 -4264
2047 -4264 -959 1819 -2417 -3046 316 -313 -2770 -2311 -994 296 -1073 -4984 -2318 4534 -1012 -8864
2063 -8864 -236 7349 -3310 -8321 3439 4555 -6011 -3120 4516 -969 -5306 2351 2905 -4334
2077 -4334 -2752 3398 1001 -2900 -2005 747 2342 -1049 -4610 351 4976 -2322 -6273 3368 4851
2092 4851 -5835 -4262 5850 1436 -6472 648 4936 -2801 -2687 3155 657 -2617 1031 2445 -680
$$ packed form
1991a803p525J2948P825j3220p278J4747N532j6195k282J6054k115j4101P308
2004a05R481j1442m701J4713j436j5879O079J4550p850j2519P522R746m676p426
2018c943J104N445K924m904m174M423L334l324n74J696l599J716O628n039q463
2033f750Q070P834j0129o028J0768J756r547K045O027n662k205O152j448n147
2047d264L305K778m236o29L362o29k457M59J317J290j369l911K666O852n546p852
2063h864Q628P585j0659n011J1760J116j0566K891P636n485m337P657N54p239
2077d334J582O150k397l901Q95K752J595l391l561M961M625p298l951R641J483
2092D851j0686J573J0112m414p908P120M288p737J14N842k498l274L648J414l125
$$ plain form
2107 -680 -350 1028 727 2168 377 -2066 1866 4973 -1367 -3216 4265 3839 -3107 -432 4759 -44
2123 -44 -1551 3212 1048 -2596 1318 3178 -1627 -1198 2380 470 -466 1080 -838 -1165 3463 901
2139 901 -4519 509 5425 -1491 -4444 3054 3079 -2378 -387 2390 -581 -443 2707 435 -2278 897
2155 897 2867 457 -409 -1421 508 4757 275 -6861 393 8609 -1785 -9197 2550 7427 -4641
2170 -4641 -5631 4079 914 -5198 682 3211 -4142 -3666 3943 1767 -5708 -2836 4114 2911 -4371
2185 -4371 -5072 4702 6110 -5612 -6382 7908 5964 -9398 -3699 11753 1688 -11752 2657 11302
2199 11302 -5111 -8670 8261 6601 -9571 -3530 10715 1273 -11494 -660 11115 -784 -12718
2212 -12718 -252 13152 -623 -15661 638 15475 -3923 -16952 5580 14415 -9668 -13192
$$ packed form
2107f80L30J378l01J441j791k443L932L107o340j849P481m26o946K675N191m803
2123d4j507M763k164l644L914J860m805M29L578j910r36J546j918l27M628k562
2139I01n420N028M916o916k953P498K5n457J991K777k971J38L150k272k713L175
2155H97J970k410q66j012J929M249m482p136P254Q216j0394p412J1747M877j2068
2170d641r90R710l165o112N880K529p353M76P609k176p475K872O950j203p282
2185d371p01R774J408j1722p70J4290j944j5362N699J5452j0065j3440J4409Q645
2199A1302j6413l559J6931j660j6172O041J4245r442j2767J0834J1775j1899j1934
2212a2718J2466J3404j3775j5038J6299J4837j9398j3029K2532Q835k4083l524
$$ plain form
2224 -13192 12000 8942 -15421 -4529 16301 306 -16464 3490 15541 -6393 -14360 8361
2236 8361 13457 -9825 -12812 11008 12767 -13184 -12825 14866 11741 -18339 -11517 19900 7767
2249 7767 -22659 -4930 21599 -943 -21900 4566 17950 -10454 -15844 13246 11537 -16260
2261 -16260 -8140 18140 6928 -18248 -4458 20011 4866 -19433 -2157 21777 2009 -19698
2273 -19698 3246 21770 -4990 -18076 11500 17649 -14111 -11973 18994 8849 -19810 -3086
2285 -3086 21005 -301 -19830 4146 18874 -6329 -17467 7940 16277 -9864 -15747 10809
2297 10809 15359 -12654 -14079 15077 13010 -17109 -9446 19237 6625 -19216 -1245 19744 -2629
2310 -2629 -17370 7939 15743 -9860 -11713 12556 9269 -13106 -6756 13282 5096 -13898 -4673
$$ packed form
2224a3192K5192l058k4363J0892K0830j5995j6770J9954J2051k1934p967K2721
2236H361N096k3282k987K3820J759k5951L59K7691l125l0080O822L1417j2133
2249G767l0426J7729K6529k2542k0957K6466J3384k8404n390K9090j709k7797
2261a6260Q120K6280j1212k5176J3790K4469j5145k4299J7276K3934j9768k1707
2273a9698K2944J8524k6760j3086K9576O149l1760K138L0967j0145k8659J6724
2285c086K4091k1306j9529K3976J4728k5203j1138K5407Q337k6141n883K6556
2297A0809M550k8013j425K9156k067l0119P663K8683j2612k5841J7971K0989k2373
2310b629j4741K5309P804k5603j853K4269l287k2375O350K0038q186j8994R225
$$ plain form
2323 -4673 13315 2782 -15713 -2787 14877 -951 -16979 2095 14763 -7355 -15130 8937
2335 8937 10869 -13337 -8677 13683 3484 -15571 -506 15037 -2241 -14576 3879 13830 -4450
2348 -4450 -13255 4962 13491 -4728 -13469 5530 13835 -6790 -13034 8692 10869 -11287 -8696
2361 -8696 12036 4280 -13379 -1428 12274 -3163 -12376 4821 9914 -7207 -8674 6791 7682
2374 7682 -7081 -7154 6865 7390 -6387 -6607 8490 7628 -8546 -4849 11866 4478 -10967 327
2388 327 13883 -1542 -11746 6174 12184 -6866 -8863 8969 8391 -8107 -6523 8109 5847
2401 5847 -7414 -6131 7253 5763 -8180 -5930 9327 4433 -11188 -2638 11960 -28 -12993
2414 -12993 2664 12816 -5213 -11070 7124 9615 -7640 -7044 8412 6124 -7298 -4267 7070
$$ packed form
2323d673J7988j0533j8495J2926J7664j5828j6028J9074J2668k2118p775K4067
2335H937J932k4206M660K2360j0199j9055J5065J5543j7278j2335J8455R951j8280
2348d450q805J8217Q529j8219q741J8999Q305k0625o244K1726K177k2156K591
2361h696K0732p756j7659J1951J3702j5437r213J7197N093j7121j467J5465Q91
2374G682j4763p3J4019N25j3777k20J5097q62j6174L697J6715p388j5445J1294
2388C27J3556j5425j0204J7920O010j9050j997J7832n78j6498J584J4632k262
2401E847j3261J283J3384j490j3943K250J5257m894j5621Q550J4598j1988j2965
2414a2993J5657J0152j8029n857J8194K491j7255N96J5456k288j3422L031J1337
$$ plain form
2427 7070 4091 -6521 -3997 7518 3558 -7944 -2368 9617 798 -10784 2195 10670 -5423
2440 -5423 -10326 8079 8938 -10384 -6742 11486 4643 -11384 -2974 11228 1929 -10381 -1219 10095
2454 10095 1677 -9183 -1215 10242 800 -10099 1366 11160 -3290 -10456 6270 9286 -8991
2467 -8991 -6892 11210 4177 -12779 -2088 12041 -1273 -12522 1336 10080 -3730 -10415 1992
2480 1992 8215 -3618 -9225 1907 7417 -4216 -8887 4419 6025 -8199 -5504 8818 1034
2493 1034 -11789 1282 11467 -5386 -11634 7368 9862 -10114 -9094 9770 6847 -9909 -6294
2506 -6294 8433 4505 -8328 -4900 7564 3362 -8452 -2661 8682 -6 -10226 2919 10051
2519 10051 -6613 -9577 9677 8555 -11935 -5882 14062 4098 -13289 -518 13967 222 -11023
$$ packed form
2427G070k979j0612K524J1515l960j1502N576J1985q819j1582J2979Q475j6093
2440e423m903J8405Q59j9322L642J8228o843j6027Q410J4202r299j2310R162J1314
2454A0095q418j0860P968J1457r442j0899J1465R794j4450p166J6726L016j8277
2467h991K099J8102p033j6956J0691J4129j3314j1249J3858Q744j3810o685J2407
2480A992O223j1833n607J1132N510j1633m671J3306J606j4224K695J4322p784
2493A034j2823J3071J0185j6853o248J9002K494j9976J020J8864k923j6756L615
2506f294J4727l928j2833L428J2464m202j1814N791J1343q688j0220J3145P132
2519A0051j6664k964J9254j122k0490O053J9944r964j7387J2771J4485j3745j1245
$$ plain form
2532 -11023 2123 10701 -1396 -7865 3253 8590 -2538 -6416 5126 7358 -5464 -5051 9419
2545 9419 4601 -10587 -1244 13257 -834 -13096 4744 14025 -6234 -11354 9177 10566 -8539
2558 -8539 -6982 10013 6508 -7674 -3245 8597 3915 -7354 -1843 8347 1859 -8073 913 9628
2572 9628 -2356 -9749 5422 9511 -8271 -8459 9838 5793 -12261 -4434 11051 367 -11417
2585 -11417 -289 7980 -3071 -8017 1164 3971 -3694 -4940 1870 2645 -4311 -4233 3809 2252 -7156
2600 -7156 -3017 7472 44 -9794 599 9177 -3996 -9606 4686 6885 -7302 -5286 6380
2613 6380 2120 -7147 -1247 4918 -1094 -5103 951 2758 -2362 -3673 1379 3072 -2082 -4239 3057
2628 3057 4484 -4212 -4137 5792 4127 -6398 -1162 8092 655 -6017 3269 6754 -3498 -2502 6754
$$ packed form
2532a1023J3146Q578j2097o469J1118N337j1128l878J1542K232j2822M13J4470
2545I419m818j5188R343J4501j4091j2262J7840R281k0259n120K0531J389j9105
2558h539J557J6995l505j4182M429J1842m682j1269N511J0190o488r932Q986Q715
2572I628j1984p393J5171M089j7782j88J8297m045j8054P827J5485j0684j1784
2585a1417J1128Q269j1051m946R181K807p665j246O810P75o956P8Q042j557r408
2600g156M139J0489p428r838J0393Q578j3173n610J4292K199j4187K016J1666
2613F380m260r267N900O165o012m009O054J807n120j311N052J693n154k157P296
2628C057J427q696P5R929j665j0525N236R254p437o672R286L485j0252R96R256
$$ plain form
2643 6754 2821 -4430 894 6229 -195 -3631 1846 4514 127 -3548 719 4936 455 -4947 922
2658 922 5511 -1947 -5286 3639 4346 -5128 -2694 6485 820 -6545 1526 6671 -3222 -4971 4559
2673 4559 4443 -3880 -2518 4159 2954 -2541 -1795 2663 2907 -2068 -2437 3280 2904 -4330 -2218 5246
2689 5246 156 -6751 1239 5938 -3918 -6497 4479 4261 -6247 -4141 4747 1816 -5102 -2529 2359
2704 2359 1618 -2508 -2552 1216 2853 -1483 -3069 2369 2517 -2966 -1003 3990 -329 -3501 3173 3582
2720 3582 -4036 -2084 5197 673 -5104 -3 4374 -1245 -3695 398 1761 -919 -2548 -1449 721
2735 721 342 -3063 -1608 2087 -899 -4242 1296 2764 -4630 -3139 5709 1322 -7205 -241 7321
2750 7321 -841 -6686 1528 5949 -1198 -4271 862 4025 169 -3139 -603 4049 1052 -3921 129
$$ packed form
2643F754l933p251N324N335o424l436N477K668m387l675M267M217m481n402N869
2658I22M589p458l339Q925P07r474K434R179n665p365Q071N145r893j749R530
2673D559j16q323J362O677j205n495P46M458K44m975l69N717l76p234K112P464
2689E246n090o907P990M699r856k579J0976k18j0508K106Q888k931o918K573M888
2704B359p41m126m4L768J637m336j586N438J48n483J963M993m319l172O674M09
2720C582p618J952P281m524n777N101M377n619k450M093J363k680j629J099K170
2735G21l79l405J455L695k986l343N538J468p394J491Q848m387q527O964P562
2750G321q162n845Q214M421p147l073N133L163l856l308K536M652k997m973M050
$$ plain form
2765 129 4280 -1290 -4156 2737 2848 -4621 -1692 5084 -728 -5688 2472 4279 -3999 -3588 4312 2406
2781 2406 -3937 -1366 3872 1567 -2482 -936 3106 2476 -2545 -650 5228 1979 -4779 1243 7470
2796 7470 -1308 -6037 5003 7798 -5645 -5369 8837 5183 -7833 -2298 8940 2123 -7357 -581
2810 -581 7144 1132 -6079 -211 6298 1354 -5941 -136 7676 -361 -6789 2965 7645 -4586 -5481
2825 -5481 7189 4761 -8105 -1503 9353 -154 -9039 2714 8395 -3897 -7165 4163 6321
2838 6321 -4876 -6315 3455 4903 -5255 -6392 4326 4697 -7523 -5898 6855 2098 -11502 -2826
2852 -2826 9488 -2620 -12382 2740 8974 -7430 -10178 6527 6207 -9113 -6776 7445 3914
2865 3914 -8212 -4278 6901 3103 -7469 -3140 7650 2309 -8972 -781 9294 -1244 -9162
$$ packed form
2765A29M151n570k866O893J11p469K929O776n812m960Q160J807q278M11P900j906
2781B406o343K571N238k305m049J546M042o30n021J895N878l249o758O022O227
2796G470q778m729J1040K795j3443K76J4206l654j3016N535J1238o817r480O776
2810e81P725o012p211N868O509m944p295N805P812q037o428R754M680j2231q95
2825e481J2670k428j2866O602J0856r507q885J1753N681j2292l268J1328K158
2838F321j1197j439R770J448j0158j137J0718L71j2220J625J2753m757j3600Q676
2852b826J2314j2108r762J5122O234j6404k748J6705l20j5320K337J4221l531
2865C914j2126L934J1179l798j0572M329J0790n341j1281Q191J0075j0538p918
$$ plain form
2878 -9162 4149 8984 -5994 -6920 8966 5378 -9738 -2536 10449 1276 -9501 1056 9249
2891 9249 -1104 -7322 2562 8076 -1600 -6271 3421 7753 -2964 -6194 5951 7217 -6349 -4503
2905 -4503 9923 4131 -9435 -379 11746 -232 -9512 4013 10185 -4638 -6615 6702 6296
2918 6296 -5400 -3503 6440 3667 -5177 -2064 6167 2483 -5995 -1299 7382 699 -8296 1124 9040
2933 9040 -3335 -9047 5251 7412 -7691 -6342 8225 3570 -8960 -1976 8195 -681 -8116
2946 -8116 752 5982 -2548 -6702 1493 5270 -3078 -6998 2512 5750 -4757 -7194 5083 5375 -7959
2961 -7959 -5705 7723 2188 -9832 -1975 7839 -1875 -8498 2067 5388 -4741 -5510 3496 2821
2975 2821 -5162 -3439 3176 2029 -4873 -3329 4555 2931 -6305 -3072 6913 2143 -7862 -216 8580
$$ packed form
2878i162J3311M835j4978r26J5886l588j5116P202J2985r173j0777J0557Q193
2891I249j0353o218R884N514r676m671R692M332j0717l230J2145J266j3566J846
2905d503J4426n792j3566R056J2125j1978r280J3525O172j4823j977J3317m06
2918F296j1696J897R943k773q844L113Q231l684q478M696Q681o683q995R420P916
2933I040j2375n712J4298K161j5103J349J4567m655j2530O984J0171q876p435
2946h116Q868N230q530m154Q195L777q348l920R510L238j0507k437J2277K92j3334
2961g959K254J3428n535j2020P857R814r714o623J0565L321j0129p69R006o75
2975B821p983J723O615j147o902J544P884j624r236L233R985m770j0005P646Q796
$$ plain form
2990 8580 -898 -7611 3462 6840 -3801 -3989 5934 3865 -4564 -479 5774 1140 -3625 221 4840
3005 4840 1519 -3296 -523 5737 1626 -5791 98 7020 -55 -7030 2342 7022 -3340 -5456 4827
3020 4827 4304 -4535 -2011 4581 1222 -3468 122 2947 -159 -2304 60 2505 273 -3093 313
3035 313 4222 -1032 -4916 1674 5610 -2979 -5361 4460 4185 -5480 -3148 5153 1221 -5352 -352
3050 -352 3278 -1583 -3217 745 1584 -1810 -2106 873 1315 -1545 -2480 1350 2855 -3120 -3426 3774
3066 3774 3473 -5330 -2604 6284 1546 -6555 313 6269 -1459 -4559 2774 3436 -2114 -2082 2476 1080
3082 1080 -1913 -686 973 586 -1806 -1524 2099 1308 -4129 -1349 4433 -434 -5824 1310 5936 -3164
3098 -3164 -5181 4158 3844 -4969 -2401 4775 1133 -4056 665 3516 -770 -2299 1556 2694 -663
$$ packed form
2990H580r478o713J1073L378j0641j88R923k069q429M085O253m634m765L846M619
3005D840l321m815K773O260m111p417N889O922p075o975R372M680j0362k116J0283
3020D827n23q839K524O592l359m690L590K825l106k145K364K445k232l366L406
3035C13L909n254l884O590L936q589k382R821k75r665K332Q301l932o573N000
3050c52L630m861j634L962Q39l394k96K979M42k860r35L830J505n975l06P200
3066C774l01q803K726Q888m738q101O868N956p728l100P333O62n550L2M558j396
3082A080k993J227J659l87k392K82L623p91n437K780N782m867n390P134M626r100
3098c164k017R339l14q813K568P176l642n189M721K851m286j529L855J138l357
$$ plain form
3113 -663 -2213 1210 3747 -962 -3416 2725 4704 -3310 -4263 5065 3588 -6298 -2316 6248 414
3128 414 -6449 628 4919 -2782 -4282 2334 2045 -3083 -1822 2088 358 -2966 -1688 2586 998
3143 998 -3671 -1909 4471 1231 -5629 -918 6127 -676 -6741 1698 6251 -3180 -4999 3910 2784
3158 2784 -4335 -1700 4082 -282 -3316 753 2615 -1107 -2994 362 2538 -1079 -3669 427 3920
3173 3920 -1622 -4933 2273 4756 -3230 -3905 4733 2832 -4936 -1140 5374 -143 -3813 2303 3698
3188 3698 -2114 -1546 3665 1946 -2324 -439 2944 1852 -1622 -1066 2804 2482 -2671 -1322 3934 1503
3204 1503 -3878 -489 4336 -1082 -4143 2512 3111 -3717 -1918 4109 129 -4523 658 3241 -1629
3219 -1629 -2919 1311 2203 -1217 -1757 672 1750 -436 -1939 734 2418 -1365 -2059 2957 1594 -4047
$$ packed form
3113f63j550L423K537m709k454O141J979q014r53R328j477r886L982Q564n834
3128D14o863P077M291p701j500O616k89n128J261L910j730l324J278M274j588
3143I98m669J762O380l240o860M711P045o803o065Q439M553r431j819Q909j126
3158B784p119K635N782m364l034M069J862l722j887L356K176l617k590M096L493
3173C920n542l311P206K483p986o75Q638j901p768L796O514n517l670O116J395
3188C698n812N68N211j719m270J885L383j092l474N56L870l22n153J349N256k431
3204A503n381L389M825n418l061O655N99o828J799O027l980m652N181K583m870
3219a629j290M230Q92l420n40K429J078k186j503K673J684l783o94N016j363n641
$$ plain form
3235 -4047 -603 4987 -987 -5499 2397 4467 -3841 -4153 3496 2442 -4277 -2125 2926 -219 -3044
3250 -3044 -934 1617 120 -2474 -824 1498 100 -3355 65 3304 -1130 -4448 2255 4127 -3809
3265 -3809 -3538 4762 2351 -4831 -647 5139 -303 -4190 1294 2971 -1672 -2080 1785 1463 -1274 -1632
3281 -1632 874 1267 -1437 -2225 1953 2032 -3647 -2071 4713 1411 -5757 -24 5714 -1119 -5594 2420
3297 2420 4498 -2955 -2869 3322 2085 -2667 -420 2743 787 -1617 -65 1962 1298 -1438 -680 3356
3313 3356 1086 -2959 -20 4594 -531 -4096 2373 3848 -3125 -2671 4019 1992 -3753 -261 3325
3328 3325 -242 -2249 591 1474 -559 -890 451 501 -192 -934 -90 1526 -871 -2250 1980 2031 -3442
3345 -3442 -2365 3853 923 -4976 -493 4535 -1043 -4432 1462 2328 -2119 -1757 1511 746 -1852 -905
$$ packed form
3235d047L444N590n974m512P896K070q308l12P649j054o719K152N051l145k825
3250c044K110K551j497k594J650K322j398l455L420L239m434l318O703J872p936
3265c809K71Q300k411p182M184N786n442l887N484J677m643m08L865l22k737l58
3281a632K506L93k704p88M178P9n679J576O784l302p168N733N738o833m475Q014
3297B420K078p453Q6O191j237m752K247L163j956k404J552K027o64k736P58M036
3313C356k270m045K939M614n125l565O469J475o973M54O690k027n745L492L586
3328C325l567k007K840Q83k033l31J341N0o93p42Q44J616k397j379M230N1n473
3345c442J077O218k930n899M483N028n578l389N894Q66m447L62L268p65k598R47
$$ plain form
3361 -905 699 457 -939 -1223 1091 1364 -2088 -1917 2441 1132 -3946 -472 4124 -1444 -4613 2082
3377 2082 3215 -3696 -3054 3191 1491 -3607 -1245 2081 11 -1833 -397 678 -120 -1332 -364 1508
3393 1508 -38 -2855 689 3168 -1726 -3857 3119 4081 -3974 -3430 4701 2489 -5080 -1538 4706
3408 4706 122 -3923 407 3094 -993 -2646 554 1991 -1167 -2751 914 2938 -1741 -3706 2487
3423 2487 3572 -3501 -3319 4996 2877 -5374 -1162 6233 669 -4788 1622 5383 -1121 -2859 2924
3438 2924 3165 -1160 -862 2341 2354 -1249 -1006 2774 2376 -2698 -1281 4509 1775 -4871 -424 5776
3454 5776 -657 -5954 2044 5282 -3086 -4257 3601 2735 -4514 -1897 3600 351 -4021 -203 3383
3469 3383 174 -3622 -134 3717 246 -4175 99 4472 -441 -4556 2316 4883 -2923 -3869 3912
$$ packed form
3361i05J604k42j396k84K314K73l452J71M358j309n078L474M596n568l169O695
3377B082J133o911O42O245j700n098K362L326k070j844J436J075p98j212R68J872
3393A508j546k817L544K479m894k131O976R62q055N44Q131k212p569L542O244
3408D706m584m045M330K687m087j653L200J437l158j584L665K024m679j965O193
3423B487J085p073J82Q315k119q251M212P395n564n457O410L761o504j738N783
3438B924K41m325K98L203J3l603K43L780l98n074J417N790k734o646M447O200
3454E776o433n297P998L238q368j171P858q66p249K617N497l249m372L818L586
3469C383l209l796L488L851l471m421M274M373m913m115O872K567p806r46P781
$$ plain form
3484 3912 2599 -5046 -1606 4475 -584 -5220 285 3064 -2681 -3953 918 1542 -2351 -2969 439
3499 439 1971 -2068 -3612 1424 2337 -3219 -2576 3335 1463 -4623 -541 5324 -924 -4441 2742 4471
3515 4471 -3142 -2744 4508 2280 -3695 -939 3594 954 -3320 -961 2973 910 -3541 -1153 3044
3530 3044 469 -4211 -537 4021 -1537 -4511 1909 3857 -3828 -3081 4766 1752 -4773 81 5322
3545 5322 209 -3392 1900 4206 -31 -1531 2125 3591 84 -1454 2313 4028 -767 -2016 3282
3560 3282 3486 -3120 -2035 4908 1719 -5289 -151 5248 -1298 -4716 1825 3303 -3148 -3000 2541
3575 2541 1727 -3100 -2217 2217 1053 -2646 -1992 2533 1810 -2973 -1855 4158 1523 -4262 -187 4678
3591 4678 -772 -4419 2044 3847 -2975 -2910 3143 1423 -3937 -851 2516 -750 -3311 -622 1680
$$ packed form
3484C912j313p645L440O081n059m636N505K779n745j272M871O24l893o18L408
3499D39J532m039j544N036R13n556O43N911j872o086M082N865o248l517P183J729
3515D471p613L98P252k228n975K756M533k640m274K359L934k063m451K388M197
3530C044k575m680L674M558n558k974O420J948p685P47P847l014o525M854N241
3545E322n113l601N292K306m237j500L656J466l507j538L767J715m795j249N298
3560C282K04o606J085O943l189p008N138N399o546l418O541J478o451J48N541
3575B541q14m827Q83M434j164l699O54M525p23m783J118O013k635n785M075M865
3591D678n450l647O463J803o822O5O053j720n360L086L367l266k561K689K302
$$ plain form
3606 1680 -643 -3309 -1104 1498 -662 -3723 -897 2558 -1431 -4438 746 3115 -2921 -3197 3012
3621 3012 1248 -3360 -297 3411 -321 -2612 2004 2515 -1140 -1118 1908 1945 -630 -1007 1303 2347
3637 2347 -619 -2283 1428 2857 -1609 -2122 1872 1447 -3138 -810 2704 -554 -2989 1291 1939 -2404
3653 -2404 -1468 2472 373 -2174 224 2129 447 -1157 -301 2071 1624 -846 -593 2883 1970 -1816
3669 -1816 -50 3647 502 -1952 1676 2644 -1630 -776 2903 460 -2903 608 2412 -1669 -2412 1207
3685 1207 1144 -1345 -2223 -210 1139 -718 -2868 -769 1474 -707 -2875 601 1996 -1903 -1809 2224
3701 2224 666 -2779 496 3157 -999 -1790 2061 2092 -1948 -1119 2230 687 -1710 -869 1169 932
3717 932 -1348 -1635 1116 1431 -1693 -1859 2094 797 -3302 -654 2296 -1200 -3158 1436 1956 -2850
$$ packed form
3606A680k323k666K205K602k160l061K826L455l989l007N184K369o036k76O209
3621C012j764m608L063L708l732k291M616N11l655K2L026L7k575l77K310J044
3637B347k966j664L711J429m466n13L994m25m585K328L514l258k435M280O48m343
3653b404R36L940k099k547K398J905j682j604Q56K372m47k470K53L476r13l786
3669a816J766L697l145k454L628R68m274Q54L679k443l363L511J804m081p43L619
3685A207o3k489q78K013J349j857k150K099K243k181k168L476J395l899R4M033
3701B224j558l445L275K661m156p91L851L1m040Q29L349j543k397Q41K038k37
3717I32k280k87K751L15l124j66L953j297m099K648K950l496j958M594N20m806
$$ plain form
3733 -2850 -1909 2819 921 -2753 -263 2710 566 -1506 412 1838 1353 -657 -120 2423 1660 -1409
3749 -1409 85 2864 19 -2083 1260 2743 -2126 -1516 2775 819 -3414 -168 2488 -1187 -2718
3764 -2718 1025 1552 -1173 -1303 156 734 -815 -1489 57 930 -557 -1194 1135 1401 -1598 -849 2475
3781 2475 787 -2892 923 3305 -1042 -2751 2085 2189 -2249 -1109 1767 394 -2003 -16 850
3796 850 -339 -1254 -695 274 -311 -1367 -949 702 -690 -2514 123 1509 -1761 -2491 1715 1582 -2817
3813 -2817 -891 2737 231 -2269 1084 2398 -871 -882 1848 1366 -896 34 1677 1259 -66 -261
3829 -261 1385 1695 -1171 -902 2059 1398 -2726 -889 2656 -104 -3244 670 2517 -2075 -2701 1532
3845 1532 463 -2239 -213 1518 -702 -1613 571 1479 -784 -875 712 1658 12 -1599 606 3014
$$ packed form
3733b850R41M728j898l674K490K973k144k072J918J426m85k010N37K543p63l069
3749a409J494K779k845k102L343J483m869O10M291j956m233L246K656l675j531
3764b718L743N27k725j30J459N78j549o74J546Q73j487o37K329K66k999P49L324
3781B475j688l679L815K382m347j709M836J04m438J140K876j373k397J987Q66
3796H50j189r15N59R69n85j056M18J651j392j824K637J386l270p30M206j33m399
3813b817J926L628k506k500L353J314l269j1K730m82k262R30J643m18j325j95
3829b61J646L10k866K69K961o61m124J837L545k760l140L914J847m592o26M233
3845A532j069k702K026J731k220r11K184R08k263r1J587R46j646j611K205K408
$$ plain form
3861 3014 -146 -2534 1616 3219 -1632 -2162 3038 1619 -2686 -688 2976 -550 -2908 861 1473
3876 1473 -1754 -1803 1205 626 -1449 -1367 227 589 -1034 -1946 465 1394 -1650 -2117 2098 1267 -2766
3893 -2766 -1034 2875 220 -2786 1089 2407 -1387 -1047 1918 799 -1644 131 1526 -364 -1230
3908 -1230 355 666 65 -1531 -838 1513 379 -2403 -492 1921 -1026 -3252 767 2119 -2318 -2425
3924 -2425 2240 818 -2545 -454 2473 60 -1544 1015 1463 -507 -447 608 1144 444 -139 754 1734
3941 1734 72 -1466 1525 2305 -1208 -1507 2684 1445 -2379 -47 2548 -814 -1867 1483 1200 -2179
$$ packed form
3861C014l160k388M150J603m851n30N200j419m305J998L664l526k358L769O12
3876A473l227m9L008n79k075Q2J594L62j623r12K411R29l044m67M215q31m033
3893b766J732L909k655l006L875J318l794L40K965j119k443J775J395j890q66
3908a230J585L11o01j596O93K351j134k782J911K413k947k226M019J352m437j07
3924b425M665j422l363K091K927k413j604K559M48j970O0J055N36p00n83Q93R80
3941A734j662j538K991P80l513k99M191j239l824K332K595l362j053L350k83l379
$$ [...]
8191c33
##END NTUPLES=NMR FID
##END=
