##TITLE=1H_CA-8684
 CDCl3, 8 sc, 
 31.1.2020
##JCAMPDX= 6.0         $$ Bruker NMR JCAMP-DX V2.0
##DATA TYPE= NMR FID
##DATA CLASS= NTUPLES
##ORIGIN= UXNMR, Bruker Analytische Messtechnik GmbH
##OWNER= root
$$ XWIN-NMR		Version 3.5
$$ Fri Jan 31 15:54:50 2020 Russian Standard Time (UT+4h)  she@DPX200
##.OBSERVE FREQUENCY= 200.1315
##.OBSERVE NUCLEUS= ^1H
##.DELAY= (6, 6)
##.ACQUISITION MODE= SIMULTANEOUS
##.ACQUISITION SCHEME= undefined
##.AVERAGES= 8
##.DIGITISER RES= 18
##SPECTROMETER/DATA SYSTEM= spect
##.PULSE SEQUENCE= zg30
##.SOLVENT NAME= D2O
##.SHIFT REFERENCE= (INTERNAL, D2O, 0, 15.7039)
##AUDIT TRAIL= $$ (NUMBER, WHEN, WHO, WHERE, WHAT)
$$ ##TITLE= Audit trail, XWIN-NMR		Version 3.5
$$ ##JCAMPDX= 5.01
$$ ##ORIGIN= Bruker BioSpin GmbH
$$ ##OWNER= she
$$ F:/spectra/data/she/nmr/H-F/1/audita.txt
$$ ##AUDIT TRAIL=  $$ (NUMBER, WHEN, WHO, WHERE, WHAT)
(   1,<2020-01-31 15:53:32.10 +0400>,<she>,<DPX200>,
      <created by zg, POWCHK disabled, PULCHK disabled
       configuration hash MD5:
       00 E9 B6 7A A2 85 ED C7 34 08 36 98 17 FE 4E 26
       data hash MD5: 16K
       4B 3E D7 76 EB B8 B5 70 0D 3E E7 5D F6 C1 5B 37>)
$$ ##END=
$$ 
$$ hash MD5
$$ DB 8E 35 27 9E 0D D0 A5 35 72 FA CD BB B3 E4 82
##$RELAX= 
##$RELAX= 
##$RELAX= 
##$RELAX= 
##$RELAX= 
##$RELAX= 
$$ Bruker specific parameters
$$ --------------------------
##$DU= <F:/spectra>
##$EXPNO= 1
##$NAME= <H-F>
##$PROCNO= 1
##$TYPE= <nmr>
##$USER= <she>
##$AMP= (0..31)
100 100 100 100 100 100 100 100 100 100 100 100 100 100 100 100 100 100 
100 100 100 100 100 100 100 100 100 100 100 100 100 100 
##$AQSEQ= 0
##$AQ_mod= 1
##$AUNM= <au_zg>
##$AUTOPOS= <>
##$BF1= 200.13
##$BF2= 200.13
##$BF3= 200.13
##$BF4= 200.13
##$BF5= 200.13
##$BF6= 200.13
##$BF7= 200.13
##$BF8= 200.13
##$BYTORDA= 1
##$CFDGTYP= 0
##$CFRGTYP= 5
##$CHEMSTR= <none>
##$CNST= (0..31)
1 1 145 1 1 1 1 1 1 1 1 1 1 1 1 1 1 1 1 1 1 1 1 1 1 1 1 1 1 1 1 1 
##$CPDPRG= <>
##$CPDPRG1= <>
##$CPDPRG2= <>
##$CPDPRG3= <>
##$CPDPRG4= <mlev>
##$CPDPRG5= <mlev>
##$CPDPRG6= <mlev>
##$CPDPRG7= <mlev>
##$CPDPRG8= <mlev>
##$CPDPRGB= <>
##$CPDPRGT= <>
##$D= (0..31)
0 1.2 0 0 0 0 0 0 0 0.06 0 0.03 0 0 0 0 0.0002 0 0 0 0 0 0 0 0 0 0 0 0 
0 0 0 
##$DATE= 1580471611
##$DBL= (0..7)
120 120 120 120 120 120 120 120 
##$DBP= (0..7)
150 150 150 150 150 150 150 150 
##$DBP07= 0
##$DBPNAM0= <>
##$DBPNAM1= <>
##$DBPNAM2= <>
##$DBPNAM3= <>
##$DBPNAM4= <>
##$DBPNAM5= <>
##$DBPNAM6= <>
##$DBPNAM7= <>
##$DBPOAL= (0..7)
0.5 0.5 0.5 0.5 0.5 0.5 0.5 0.5 
##$DBPOFFS= (0..7)
0 0 0 0 0 0 0 0 
##$DE= 6
##$DECBNUC= <off>
##$DECIM= 24
##$DECNUC= <off>
##$DECSTAT= 4
##$DIGMOD= 1
##$DIGTYP= 9
##$DL= (0..7)
0 120 120 120 120 120 120 120 
##$DP= (0..7)
150 150 150 150 150 150 150 150 
##$DP07= 0
##$DPNAME0= <>
##$DPNAME1= <>
##$DPNAME2= <>
##$DPNAME3= <>
##$DPNAME4= <>
##$DPNAME5= <>
##$DPNAME6= <>
##$DPNAME7= <>
##$DPOAL= (0..7)
0.5 0.5 0.5 0.5 0.5 0.5 0.5 0.5 
##$DPOFFS= (0..7)
0 0 0 0 0 0 0 0 
##$DQDMODE= 0
##$DR= 18
##$DS= 0
##$DSLIST= <SSSSSSSSSSSSSSS>
##$DSPFIRM= 0
$$ [...]
##$SUBNAM2= <"">
##$SUBNAM3= <"">
##$SUBNAM4= <"">
##$SUBNAM5= <"">
##$SUBNAM6= <"">
##$SUBNAM7= <"">
##$SUBNAM8= <"">
##$SUBNAM9= <"">
##$SW= 24.9337058887773
##$SWIBOX= (0..15)
0 0 2 0 0 0 0 0 0 0 0 0 0 0 0 0 
##$SW_h= 4990.01996007984
##$TD= 16384
##$TD0= 1
##$TE= 0
##$TE2= 300
##$TE3= 300
##$TEG= 300
##$TL= (0..7)
0 120 120 120 120 120 120 120 
##$TP= (0..7)
150 150 150 150 150 150 150 150 
##$TP07= 0
##$TPNAME0= <>
##$TPNAME1= <>
##$TPNAME2= <>
##$TPNAME3= <>
##$TPNAME4= <>
##$TPNAME5= <>
##$TPNAME6= <>
##$TPNAME7= <>
##$TPOAL= (0..7)
0.5 0.5 0.5 0.5 0.5 0.5 0.5 0.5 
##$TPOFFS= (0..7)
0 0 0 0 0 0 0 0 
##$TUNHIN= 0
##$TUNHOUT= 0
##$TUNXOUT= 0
##$USERA1= <user>
##$USERA2= <user>
##$USERA3= <user>
##$USERA4= <user>
##$USERA5= <user>
##$V9= 5
##$VALIST= <valist>
##$VCLIST= <CCCCCCCCCCCCCCC>
##$VD= 0
##$VDLIST= <DDDDDDDDDDDDDDD>
##$VPLIST= <PPPPPPPPPPPPPPP>
##$VTLIST= <TTTTTTTTTTTTTTT>
##$WBST= 1024
##$WBSW= 4
##$XGAIN= (0..3)
0 0 0 0 
##$XL= 0
##$YL= 0
##$YMAX_a= 136143
##$YMIN_a= -81403
##$ZGOPTNS= <>
##$ZL1= 120
##$ZL2= 120
##$ZL3= 120
##$ZL4= 120
##$ABSF1= 10
##$ABSF2= 0
##$ABSG= 5
##$ABSL= 3
##$ALPHA= 0
##$AQORDER= 0
##$ASSFAC= 0
##$ASSFACI= 0
##$ASSFACX= 0
##$ASSWID= 0
##$AUNMP= <proc_1d>
##$AZFE= 0.1
##$AZFW= 0.1
##$BCFW= 1
##$BC_mod= 2
##$BYTORDP= 1
##$COROFFS= 0
##$CY= 11.3945322036743
##$DATMOD= 1
##$DC= 2
##$DFILT= <>
##$DTYPP= 0
##$F1P= 16.9975609425685
##$F2P= -3.02152046262296
##$FCOR= 0.5
##$FTSIZE= 0
##$FT_mod= 4
##$GAMMA= 1
##$GB= 0.15
##$INTBC= 1
##$INTSCL= 1
##$ISEN= 128
##$LB= 0.24
##$LEV0= 0
##$LPBIN= 0
##$MAXI= 10000
##$MC2= 0
##$MEAN= 0
##$ME_mod= 0
##$MI= 1.114404
##$NCOEF= 0
##$NC_proc= 0
##$NLEV= 6
##$NOISF1= 3.799351
##$NOISF2= 2.8
##$NSP= 1
##$NTH_PI= 0
##$NZP= 0
##$OFFSET= 15.70392
##$PC= 1
##$PHC0= -9790.304
##$PHC1= 20.80081
##$PH_mod= 1
##$PKNL= yes
##$PPARMOD= 0
##$PSCAL= 0
##$PSIGN= 0
##$REVERSE= no
##$SF= 200.130013532006
##$SI= 16384
##$SIGF1= 3
##$SIGF2= 2
##$SINO= 400
##$SIOLD= 16384
##$SREGLST= <1H.CDCl3>
##$SSB= 0
##$STSI= 0
##$STSR= 0
##$SW_p= 3612.71676300578
##$SYMM= 0
##$S_DEV= 0
##$TDeff= 0
##$TDoff= 0
##$TI= <>
##$TILT= no
##$TM1= 0
##$TM2= 0
##$TOPLEV= 0
##$USERP1= <user>
##$USERP2= <user>
##$USERP3= <user>
##$USERP4= <user>
##$USERP5= <user>
##$WDW= 1
##$XDIM= 8192
##$YMAX_p= 0
##$YMIN_p= 0
$$ End of Bruker specific parameters
$$ ---------------------------------
##NTUPLES= NMR FID
##VAR_NAME=  TIME,          FID/REAL,        FID/IMAG
##SYMBOL=    X,             R,               I
##VAR_TYPE=  INDEPENDENT,   DEPENDENT,       DEPENDENT
##VAR_FORM=  AFFN,          ASDF,            ASDF
##VAR_DIM=   8192,          8192,            8192
##UNITS=     SECONDS,       ARBITRARY UNITS, ARBITRARY UNITS
##FACTOR=    0.0002004,     1,               1
##FIRST=     0,             0,               0
##LAST=      1.6414764,     0,               0
##MIN=       0,             -81403,          0
##MAX=       1.6414764,     136143,          0
$$ Real data points
##PAGE= N=1
##DATA TABLE= (X++(R..R)), XYDATA
$$ [...]
$$ plain form
2069 -396 151 400 -224 133 807 -361 -1130 479 615 339 845 655 -1476 -1121 782 310 -473 225 -341
2088 -341 -545 1468 1471 -955 -1499 -162 35 -74 692 -208 -1108 382 1085 3 -571 155 -837 -698 863
2107 863 1425 -162 -19 139 -674 -247 943 -97 -1501 -164 487 393 1067 640 -1455 -1059 1148 250
2125 250 -690 21 34 -496 1225 1451 -341 -1248 148 -108 -465 1028 238 -895 -14 1073 147 -104
2143 -104 165 -945 -840 1203 1417 15 -71 447 -291 299 1231 -262 -1496 -113 1288 478 1183 796
2161 796 -773 -725 1033 530 -701 -86 -129 -40 881 1604 -177 -803 408 70 -382 773 813 -558 65
2180 65 1117 732 380 306 -697 -1032 1098 1775 -52 -293 713 -142 308 1166 118 -1322 53 1006
2198 1006 638 903 963 -506 -669 921 513 -693 199 119 -356 656 1568 336 -935 -52 -199 -468
$$ packed form
2069c96N47K49o24L57O74j168p69J609J36k76N06j90k131L55J903m72p83O98n66
2088c41k04K013Lk426n44J337J97j09P66r00r00J490P03j082n74P26r92J39J561
2107H63N62j587J43J58q13M27J190j040j404J337O51r4O74m27k095L96K207q98
2125B50r40P11J3n30J721K26j792r07J396k56l57J493p90j133Q81J087r26k51
2143a04K69j110J05K043K14j402q6N18p38N90R32j493j234J383J401q10P05l87
2161G96j569M8J758n03j231O15m3Q9R21P23j781o26J211l38m52J155M0j371O23
2180F5J052l85l52p4j003l35K130O77j827k41J006q55M50Q58j048j440J375R53
2198A006l68K65O0j469j63J590m08j206Q92q0m75J012R12j232j271Q83j47k69
$$ plain form
2216 -468 858 1009 -962 -720 1089 695 -229 -29 -436 -1243 418 1278 -109 -492 561 -147 -159 522
2234 522 -10 -1502 -628 700 -124 309 840 -418 -783 315 361 -439 -427 -88 -847 504 1301 19 -741
2253 -741 -396 17 -412 792 314 -1258 -565 1059 818 -140 -223 -711 -913 231 986 -634 -360 494 -276
2272 -276 -75 872 140 -1225 -309 331 325 309 966 -180 -748 576 751 -426 -654 -80 -327 347 1490
2291 1490 258 -876 -138 362 -429 445 491 -719 -297 1032 674 -210 -40 -232 -885 137 1251 192
2309 192 -117 728 175 14 833 379 -1081 -799 509 623 627 475 -30 -632 655 928 -455 -519 99 -217
2329 -217 459 1038 418 -709 -80 208 -314 -208 335 -323 -851 773 1009 -44 239 -274 -1247 -347 1370
2348 1370 181 -439 4 10 51 673 460 -1393 -703 377 -73 -119 366 57 -715 499 1077 -514 -816
$$ packed form
2216d68J326J51j971K42J809l94r24K00m07q07J661Q60j387l83J053p08j2O81
2234E22n32j492Q74J328q24M33N31j258l65J098M6q00J2L39p59J351P97j282p60
2253g41L45M13m29J204m78j572O93J624k41r58q3m88k02J144P55j620K74Q54p70
2272b76K01R47p32j365R16O40oj6O57j146n68J324J75j177k28N74k47O74J143
2291A490j232j134P38N00p91Q74M6j210M22J329l58q84J70j92o53J022J114j059
2309A92l09Q45n53j61Q19m54j460K82J308J14Mj52n05o02J287K73j383o4O18l16
2329b17O76N79o20j127O29K88n22J06N43o58n28J624K36j053K83n13r73R00J717
2348A370j189o20M43OM1O22k13j853O90J080m50m6M85l09p72J214N78j591l02
$$ plain form
2367 -816 -179 -678 -115 1120 363 -800 -80 283 -326 -50 542 -388 -951 561 1152 327 272 -39 -993
2386 -993 -360 977 164 -741 179 530 -376 667 437 -1173 -762 458 169 -160 779 69 -652 75 760
2405 760 33 -240 230 -600 -456 849 823 -315 -284 330 -296 66 596 -246 -866 608 1129 102 7 -6
2425 -6 -937 -113 812 347 -869 382 359 -70 682 906 -446 -743 549 362 38 725 195 -822 -27
2444 -27 1091 238 -443 -204 -334 -540 910 721 -611 -283 557 -294 -294 290 -338 -1047 312 1089 -83
2463 -83 183 250 -503 -531 481 166 -852 80 461 -342 476 451 -408 -793 -1 365 203 564 282 -980
2483 -980 -230 840 93 -565 -458 -435 -521 570 693 -592 -513 32 -399 -381 158 -425 -1140 -221 480 202
2503 202 -256 136 -972 -947 430 3 -693 -387 -155 -512 335 622 -329 -1313 -9 453 -120 -80 94 -736
$$ packed form
2367h16O37m99N63J235p57j163P20L63o09K76N92r30n63J512N91q25n5l11r54
2386i93O33J337q13r05R20L51r06J043k30j610M11J220k89l29R39p10p21P27O85
2405G60p27k73M70q30J44J305k6j138L1O14o26L62N30q42o20J474N21j027r5j3
2425fr31Q24R25m65j216J251k3m29P52K24j352k97J292j87l24O87n30j017P95
2444b7J118q53o81K39j30k06J450j89j332L28Q40q51%N84o28p09J359P77j172
2463h3K66O7p53k8J012l15j018R32L81q03Q18k5q59l85P92L66j62L61k82j262
2483i80P50J070p47o58J07K3q6J091J23j285P9N45m31J8N39n83p15R19P01k78
2503B02m58L92j108K5J377m27o96L06K32l57Q47K87r51r84J304M62n73M0J74q30
$$ plain form
2523 -736 -402 818 137 -678 -93 -270 -330 416 845 -257 -569 113 -11 -295 445 31 -890 -14 584 420
2543 420 -10 134 -698 -336 399 680 -769 -338 450 99 284 751 -100 -748 239 231 -277 446 122 -361
2563 -361 -272 1158 689 -470 45 -239 -677 311 917 249 -286 393 332 -181 874 192 -971 -227 1039
2582 1039 258 -75 56 -101 -543 356 572 -660 -407 446 55 197 883 83 -768 51 409 -441 240
2601 240 473 -598 -125 920 359 -662 -163 -118 -612 333 940 -210 -376 283 5 -247 242 118 -1183
2620 -1183 -318 641 211 -354 98 -242 -834 358 417 -432 -625 301 -203 16 360 152 -1045 -563 229
2639 229 -166 68 104 -449 -327 677 560 -290 -541 -260 -648 1 844 -272 -586 -112 -40 -290 234 205
2659 205 -738 -466 451 607 25 212 -19 -738 159 569 -272 -384 22 150 22 528 98 -938 -128 264
$$ packed form
2523g36L34J220o81q15N85j77o0P46M29j102l12O82j24k84P40m14r21Q76N98j64
2543D20m30J44q32L62P35K81j449M31P88l51J85M67q51o48R87qn08P23l24m83
2563c61Q9J430m69j159N15k84m38R88O06o68n35O79o1n13J055o82j163P44J266
2582A039p81l33J31j57m42Q99K16j232K53Q53l91J42O86q00q51Q19L58q50O81
2601B40K33j071M73J045n61j021M99M5m94R45O07j150j66O59k78k52M89j24j301
2620a183Q65R59m30n65M52l40n92J192N9q49j93R26n04K19L44k08j197M82P92
2639B29l95K34L6n53J22J004j17q50k51K81l88O49Q43j116l14M74P2k50N24k9
2659B05r43K72R17J56n82J87k31p19Q97M10q41j12M06J28j28N06m30j036Q10L92
$$ plain form
2679 264 -98 108 237 -598 -425 531 611 -428 -428 90 -528 215 794 -115 -627 -188 180 -291 141 392 -885
2700 -885 -675 577 615 -89 183 -176 -705 106 487 -258 -589 44 -201 -170 564 423 -845 -307 513 -119
2720 -119 -317 95 -107 -627 530 755 -486 -112 10 -415 -119 513 -113 -541 324 287 -401 120 149 -314
2740 -314 -383 589 283 -173 -15 -294 -630 141 826 -190 -518 -3 -116 -176 598 276 -427 -213 344 -113
2760 -113 -337 387 -89 -584 181 456 -326 -289 -51 -404 -89 357 184 -456 152 99 -76 -258 294 -569 -552
2781 -552 167 471 25 139 -59 -667 130 504 2 -543 -137 -362 44 345 499 -633 -219 429 233 8
2801 8 354 -95 -283 337 667 -105 -440 229 -100 -147 420 350 -559 -97 326 -215 35 190 -478 -713 356
2822 356 783 -142 65 117 -558 -43 769 273 -269 249 525 -115 522 332 -500 -458 307 31 -60 342 -14
$$ packed form
2679B64l62K06J29q35J73R56Q0j039%N18o18P43N79r09n12M39L68m71M32K51j277
2700h85K10J252L8p04K72l59n29Q11L81p45l31O33k45L1P34j41j268N38Q20o32
2720a19j98M12k02n20J157K25j241L74J22m25K96O32o26m28Q65l7o88N21K9m63
2740c14o9R72l06m56J58k79l36P71O85j016l28N15j13o0P74l22p03K14N57m57
2760a13k24P24m76m95P65K75p82L7K38l53L15M46j73o40O08n3j75j82N52q63J7
2781e52P19L04m46J14j98o08P97L74n02n45M06k25M06L01J54j132M14O48j96k25
2801HL46m49j88O20L30p72l35O69l29m7N67p0r09M62M23n41K50J55o68k35J069
2822C56M27r25K07N2o75N15Q12m96n42N18K76o40O37j90q32M2P65k76r1M02l56
$$ plain form
2843 -14 -425 167 610 -174 -634 473 -136 -154 465 236 -505 -390 334 17 248 454 -252 -716 131 460
2863 460 -100 0 256 -620 -183 368 287 -422 -169 172 -80 484 447 -505 -417 191 169 -224 -36 145 -611
2884 -611 -192 682 50 -354 38 -149 -441 696 436 -379 -354 401 27 107 282 -182 -483 166 463 -73
2904 -73 -197 205 -339 -378 519 193 -276 -10 167 -471 68 405 -116 -555 484 388 -84 -28 84 -633 -80
2925 -80 334 111 -341 -46 -64 -16 520 739 -291 -300 -3 101 342 341 264 -911 9 392 -130 -315 195 -19
2947 -19 -412 524 264 -448 138 455 94 93 254 -238 -514 210 69 -17 476 392 -236 -221 565 228 -367 -68
2969 -68 -65 12 358 419 -66 -451 481 269 73 451 174 -529 -85 657 -8 -58 -59 -314 -289 645 -21 -351 -190
2992 -190 377 -57 -19 601 -293 -567 -14 386 -387 -98 273 -419 -439 501 364 -153 -40 268 -396 294 377
$$ packed form
2843a4m11N92M43p84m60J107o09j8O19k29p41J15P24l17K31K06p06m64Q47L29
2863D60n60J00K56q76M37N51q1p09K53L41k52N64l7r52Q8O08k2l93J88J81p56
2884f11M19Q74o32m04L92j87k92J137k60q15K5P55l74Q0J75m64l01O49K97n36
2904g3j24M02n44l9Q97l26m69K66J77o38N39L37n21m39J039r6m72N6J12p17N53
2925h0M14k23m52K95j8M8N36K19j030rK97J04K41jp7j175R20L83n22j85N10k14
2947a9l93R36k60p12N86L17l61jJ61m92k76P24j41q6M93q4o28J5P86l37n95K99
2969f8LP7L46O1m85l85R32k12j96L78k77p03M44P42o65n0jk55K5R34o66l30J61
2992a90N67m34L8O20q94k74N53M00p73K89L71o92k0R40j37n17J13L08o64O90Q3
$$ plain form
3013 377 -424 -319 -30 9 -66 -20 213 -380 -81 296 -169 83 273 -346 -548 297 59 -645 -104 306 -25
3034 -25 -8 223 -203 -545 214 157 -253 117 288 -493 -372 604 263 -237 -33 68 6 368 605 -85 -222
3055 -222 197 215 45 504 141 -226 -28 428 223 140 -82 41 -204 298 392 -152 -256 197 87 -79 396
3076 396 74 -398 -88 406 -117 -153 141 -386 -243 557 564 -275 -49 220 -108 113 570 -90 -187 308 262 -140
3098 -140 291 414 -447 -184 253 425 -329 248 -34 -88 431 704 -103 -312 401 63 -208 263 77 -456
3118 -456 -409 169 75 -68 99 -279 -214 129 13 -446 -117 -203 -232 135 469 40 -447 -43 306 -210 174 123
3140 123 -629 -97 330 23 -193 -151 -3 -575 353 197 -186 -248 118 216 -398 -90 -82 -411 -446 598 123 24
3162 24 -53 83 -307 -1 240 -191 -372 325 -377 137 456 -115 -446 -30 295 37 -80 -66 -340 -330 383
$$ packed form
3013C77q01J05K89L9p5M6K33n93K99L77m65K52J90o19k02Q45k38p04N41M10l31
3034b5J7K31m26l42P59n7m10L70J71p81J21R76l41n00K04J01o2L62K37o90j37
3055b22M19J8j70M59l63l67J98M56k05q3k22J23k45N02R4n44j04M53j10j66M75
3076C96l22m72L10M94n23l6K94n27J43Q00Pq39K26K69l28K21M57o60r7M95m6m02
3098a40M31J23q61K63M37J72p54N77k82n4N19K73q07k09P13l38k71M71j86n33
3118d56M7N78r4j43J67l78O5L43j16m59L29q6k9L67L34m29m87M04L49n16L84n1
3140A23p52N32M27l07k16M2J48n72R28j56l83o2L66R8o14L08Ql29l5J044m75r9
3162B4p7J36l90L06K41m31j81O97p02N14L19n71l31M16L25k58j17J4k74J0P13
$$ plain form
3183 383 176 -151 6 -37 -170 122 342 -179 -46 167 133 108 345 64 -374 -120 90 30 -154 385 134
3204 134 -409 259 470 -129 -293 262 -98 129 302 23 -239 137 367 -223 190 288 -364 -254 362 271 16
3225 16 11 291 -695 202 470 -129 -243 -173 103 -38 416 -53 -481 -265 328 350 -137 47 132 -86 507 516 -181
3248 -181 -344 186 -99 -79 688 13 -168 -31 497 -205 127 313 -186 -170 231 223 -32 228 -83 -291 -267 412
3270 412 -92 -425 -344 366 54 368 34 -315 -327 -219 105 163 5 -181 -173 208 361 262 -380 12 -331 -189
3292 -189 403 412 -108 -235 -92 -194 314 133 -86 -200 368 305 77 55 436 -121 298 364 94 -346 -38 16
3314 16 -28 162 225 -188 -214 66 122 -3 165 -66 -357 640 349 64 -157 268 78 -105 191 145 -458 -380
3336 -380 71 277 -8 201 -171 -324 156 407 -47 -49 203 -287 -170 237 169 -92 68 322 309 326 156 -456
$$ packed form
3183C83k07l27J57m3j33K92K20n21J33K13l4k5K37k81m38K54K10o0j84N39k51
3204A34n43O68K11n99j64N55l60K27J73k79k62L76K30n90M13R8o52J10O16r1k55
3225A6nK80r86Q97K68n99j14P0K76j41M54m69m28K16N93K2m87J84Q5k18N93Ro97
3248a81j63N30k85K0P67o75j81J37N28p02L32J86m99J6M01qk55K60l11k08K4O79
3270D12n04l33Q1P10l12L14l34l49j2J08L24N8j58j86QL81J53r9o42L92l43J42
3292a89N92Rn20j27J43j02N08j81k19j14N68o3k28k2L81n57M19O6k70m40L08N4
3314A6m4J90O3m13k6K80N6j25J68k31k91R97k91k85k21M25j90j83K96m6o03P8
3336c80M51K06k85K09l72j53M80K51m54kK52m90J17M07o8k61J60K54j3J7j70o12
$$ plain form
3358 -456 -391 146 257 -211 316 138 -389 231 542 464 -215 -269 -268 -120 57 151 -421 -159 235 289 102 239
3380 239 256 -351 25 227 -200 -176 -117 -1 -54 220 284 -312 -165 31 -58 34 148 -504 -136 347 145 -134
3402 -134 -217 96 -171 -101 270 30 -91 210 -150 -359 130 -114 -146 -138 359 144 60 -40 146 -316 -118 114
3424 114 -65 -62 -11 -86 -416 287 171 -224 -104 219 -153 194 238 -264 -61 -121 251 -56 44 -215 -70 -27
3446 -27 365 -64 -81 108 118 -96 124 490 80 -69 131 288 107 146 -145 -200 99 428 49 242 108 138
3468 138 47 427 230 36 -71 39 132 -124 364 68 -279 -107 90 -110 132 96 -162 -135 585 130 -132
3489 -132 -269 8 -230 300 302 189 -243 216 338 13 273 202 -430 -256 403 -129 118 -84 -32 -203 228
3510 228 145 -352 -283 182 -272 -258 110 8 -184 -84 193 -224 -44 82 -53 -307 319 215 77 107 203 -297
$$ packed form
3358d56O5N37J11m68N27j78n27O20L11p8o79n4JJ48J77R4n72K62L94N4j87J37
3380B39J7o07L76K02m27K4N9J16n3K74O4n96J47J96q9R2J14o52L68M83k02k79
3402a34q3L13k67P0L71k40j21L01l60k09M89k44l2QM97k15q4j00J86m62J98K32
3424A14j79LN1p5l30P03j16l95J20L23l72L47M4n02K03o0L72l07J00k59J45M3
3446b7L92m29j7J89J0k14K20L66m10j49K00J57j81L9k91n5K99L29l79J93j34L0
3468A38r1L80j97j94j07J10R3k56M88k96l47J72J97k00K42l6k58K7P20m55k62
3489a32j37K77k38N30Kj13m32M59J22l25K60p1o32J74O59n32K47k02N2j71M31
3510B28q3m97O9M65m54J4L68j02j92J00K77m17J80J26j35k54O26j04j38L0R6n00
$$ plain form
3532 -297 -198 108 -253 -223 232 -29 -199 139 64 -155 -233 119 -134 -12 -183 -11 -324 -197 189 -190 -420
3553 -420 -85 -19 85 47 244 -477 -53 405 -54 37 161 -30 -258 467 203 -76 -113 161 188 -6 233 -14
3575 -14 -215 14 -233 -122 -51 9 -154 201 77 -8 -60 -55 203 3 -187 344 -168 -149 438 345 -122 257 65
3598 65 -297 -24 531 -195 -229 -259 87 -270 71 367 -238 -174 -243 414 -50 65 42 46 14 131 -192 -2 143
3621 143 -424 -153 257 161 -185 54 206 -125 139 495 -240 -393 -197 -169 41 159 404 -142 -92 -28 -75 -208
3643 -208 253 -296 -107 0 36 -92 -210 460 -14 -56 291 143 -5 -163 109 -81 118 507 -111 -200 -72
3664 -72 271 -62 43 136 -43 -47 72 38 -223 -34 224 -546 179 108 -114 -157 -47 178 -770 218 51 -37 346
3687 346 378 -34 -237 194 -235 -66 57 -11 -184 -171 367 166 284 343 -343 -75 238 478 -157 50 -54
$$ packed form
3532b97R9L06l61L0M55k61j70L38p5k19p8L52k53J22j71J72l13J27L86l79k30
3553d20L35O6J04l8J97p21M24M58m59R1J24j91k28P25k64k79l7K74K7j94K39k47
3575a4k01K29k47J11P1O0j63L55j24q5n2NK58k00j90N31n12J9N87r3m67L79j92
3598F5l62K73N55p26l4l0L46l57L41K96o05O4o9O57m64J15k3Ml2J17l23J90J45
3621A43n67K71M10r6l46K39J52l31K64L56p35j53J96K8K10J18K45n46N0O4m7j33
3643b08M61n49J89J07L6j28j18O70m74m2L47j48j48j58K72j90J99L89o18q9J28
3664g2L43l33J05R3j79mJ19l4k61J89K58p70P25p1k22m3J10K25r48R88j67q8L83
3687C46L2m12k03M31m29J69J23o8j73J3N38k01J18N9o86K68L13K40o35K07j04
$$ plain form
3708 -54 -18 68 136 219 -281 58 -159 -37 189 268 -288 -146 128 18 32 -127 82 -140 54 324 -117 -389
3730 -389 163 -97 -245 82 -84 84 108 348 -143 -376 283 -246 -181 -77 37 203 -65 194 246 -102 205
3751 205 -196 -518 -320 -54 -401 -83 263 -221 165 68 339 -156 -29 -24 -258 -146 171 162 -310 235 -85 -73
3773 -73 33 -103 -36 19 129 93 108 184 57 -218 82 -29 -117 -116 -161 -86 -87 454 85 -159 -57 -43 -124 -33 88
3798 88 -160 -223 123 -64 -155 -247 -23 -225 -52 57 124 -341 115 -132 -57 -106 83 -10 -67 222 47 149 293
3821 293 260 -261 -235 248 -136 68 39 74 69 325 174 -87 -73 10 -274 -64 508 -68 -79 122 276 -85 -126
3844 -126 51 -93 15 300 107 -108 -159 -163 63 150 106 -93 -52 200 20 127 28 149 -118 -210 -76 -390 -141
3867 -141 46 162 78 -95 -44 62 -101 154 133 -94 98 -10 -246 -22 341 21 -111 -244 3 110 77
$$ packed form
3708e4L6Q6O8Q3n00L39k17J22K26P9n56J42K74j10J4j59K09k22J94K70m41k72
3730c89N52k60j48L27j66J68K4K40m91k33O59n29O5J04J14J66k68K59N2l48L07
3751B05m01l22J98K66l47L18L46m84L86r7K71m95J27Nk34J12L17rm72N45l20J2
3773g3J06j36O7N5J10l6J5P6j27k75L00j11q8Jm5P5jN41l69k44J02J4q1R1J21
3798H8k48o3L46j87r1r2K24k02J73J09O7m65M56k47P5m9J89r3n7K89j75J02J44
3821B93l3n21K6M83l84K04k9L5nK56j51k61J4Q3k84K10N72n76j1K01J54l61m1
3844a26J77j44J08K85j93k15n1mK26Q7m4j99M1K52j80J07r9J21k67r2J34l14K49
3867a41J87J16q4j73N1J06j63K55k1k27J92j08k36K24L63l20j32j33K47J07l3
$$ plain form
3888 77 302 -51 -123 8 -116 346 75 -408 -272 -122 6 62 -204 102 -62 -62 65 -8 26 -154 30 12 323
3911 323 180 -204 -199 -172 62 -317 -72 -291 -99 0 265 -94 65 -152 -60 177 224 316 -300 -167 64 -73
3933 -73 55 354 -127 -90 110 189 -117 157 -150 15 36 298 182 -60 123 -164 -89 240 -89 9 -3 42 -11
3956 -11 -84 249 -91 -337 -175 328 85 -132 89 -91 -199 -31 271 64 115 11 39 -53 150 161 -298 17
3978 17 291 -26 22 314 307 -60 55 387 -167 -33 -22 -213 165 169 18 -359 -144 124 283 327 74 8 -275
4001 -275 70 -159 -223 -277 64 -39 27 -211 94 -241 -148 -122 -79 275 -223 -223 -278 165 109 151 40 36 -251 168
4025 168 2 -92 -59 69 54 -122 -100 -222 -323 27 -194 -13 -116 -165 140 284 189 217 -138 -136 -272 -318 -68
4048 -68 72 -195 -272 -25 42 214 366 -151 -198 -36 107 -76 -102 -43 -217 -257 411 228 84 157 76 -364 115
$$ packed form
3888G7K25l53p2J31j24M62k71m83J36J50J28N6k66L06j64%J27p3L4j80J84j8L11
3911C23j43l84NK7K34l79K45k19J92R9K65l59J59k17R2K37M7R2o16J33K31j37
3933g3J28K99m81L7K00P9l06K74l07J65K1K62j16k42J83k87P5L29l29R8j2M5n3
3956a1p3L33l40k46J62N03k43k17K21j80j08J68L02k07N1j04K8r2K03J1m59L15
3978A7K74l17M8K92pl67J15L32n54J34J1j91L78Mj51l77K15K68J59M4k53o6k83
4001b75L45k29o4n4L41j03O6k38L05l35R3K6M3L54m98%n5M43n6M2j11mk87M19
4025A68j66r4L3J28j5j76K2j22j01L50k21J81j03m9L05J44r5K8l55Kj36m6K50
4048f8J40k67p7K47O7J72J52n17m7J62J43j83k6N9j74m0O68j83j44P3q1m40M79
$$ plain form
4071 115 93 29 -195 96 185 -75 -23 -6 -274 -160 -203 -93 128 20 -161 -293 -141 258 -170 -23 364 -76
4093 -76 28 218 178 -133 -317 539 149 404 -167 266 -160 -48 372 -78 -17 -82 -142 75 337 157 38 -72
4115 -72 49 -304 191 -59 -222 51 36 154 -34 -17 -220 35 -41 195 -175 -226 68 39 -55 52 -44 -132 109
4138 109 36 140 196 281 60 -173 63 118 -192 -44 32 -179 -218 84 -144 116 -132 69 130 55 220 -22 -258
4161 -258 64 160 130 63 -37 -274 172 117 121 -334 -85 198 22 -112 -88 -117 -353 13 133 -188 232 -68 -76
4184 -76 83 -42 -43 -174 -6 -265 -217 5 88 -253 289 194 -140 89 -71 -31 -289 345 50 113 117 -8 46 -97
4208 -97 201 -169 -119 -195 -65 175 224 136 30 -338 -204 -102 -166 76 -44 55 391 102 -81 103 165 -31 -67
4231 -67 176 276 -187 -17 462 -42 -372 206 -29 -170 315 125 153 -83 104 23 -104 330 -209 -93 45
$$ packed form
4071A15k2o4k24K91Q9k60N2J7k68J14m3J10K21j08j81j32J52L99m28J47L87m40
4093g6J04J90m0l11j84Q56l90K55n71M33m26J12M20m50O1o5o0K17K62j80j19j10
4115g2J21l53M95k50j63K73j5J18j88J7k03K55p6K36l70n1K94k9r4J07r6q8K41
4138A09p3J04N6Q5k21k33K36N5l10J48P6k11l9L02k28K60k48K01O1p5J65k42k36
4161b58L22R6l0o7j00k37M46n5Mm55K49K83j76j34K4k9k36L66J20l21M20l00q
4184g6J59j25jj31J68k59M8K22Q3l41N42r5l34K29j60M0k58O34k95O3Mj25N4j43
4208i7K98l70N0p6J30K40M9q8j06l68J34J02o4K42j20R9L36k89j83J84O2j96l6
4231f7K43J00m63J70M79n04l30N78k35j41M85j90K8k36J87q1j27M34n39J16J38
$$ plain form
4252 45 -55 -24 -45 336 -379 -146 187 335 -9 180 -15 75 -124 -11 109 -135 7 -137 27 477 -45
4273 -45 -136 -4 135 71 71 161 -34 -213 -127 4 -8 -364 276 -197 56 -43 114 -81 -115 101 -65 30 -3 -86
4297 -86 -190 95 182 249 22 280 -162 181 239 -105 168 -83 -247 -24 -46 332 61 -216 113 -202 -57 -146
4319 -146 90 -326 268 231 -138 -351 120 -81 153 158 13 -214 8 -263 291 -15 217 -241 -128 79 34
4340 34 -79 -201 305 51 -112 -52 149 -237 261 -78 -66 192 139 -55 -1 297 99 82 221 27 -15 16 159
4363 159 -91 -24 49 234 -3 205 408 -281 -123 209 85 166 59 -283 -80 46 361 11 -26 76 170 118
4385 118 276 -140 -170 12 -33 -312 332 182 186 289 198 -89 -133 190 151 -103 -87 326 -53 7 95 42 -283 -2
4409 -2 -28 -91 -104 52 -328 -70 109 -57 -23 38 199 -256 112 -67 -37 82 -75 -21 -247 -93 -239 15 3
$$ packed form
4252D5j00L1k1L81p15K33L33J48l44J89j95R0j99J13J20k44J42j44J64M50n22
4273d5r1J32J39o4%R0j95j79Q6J31j2l56O40m73K53r9J57j95l4K16j66R5l3q3
4297h6j04K85Q7O7k27K58m42L43N8l44K73k51j64K23k2L78k71k77L29l15J45q9
4319a46K36m16N94l7l69k13M71k01K34Nj45k27K22k71N54l06K32m58J13K07m5
4340C4j13j22N06k54j63O0K01l86M98l39J2K58n3j94N4K98j98j7J39j94m2L1J43
4363A59k50O7P3J85k37K08K03o89J58L32j24Q1j07l42K03J26L15l50l7J02R4n2
4385A18J58m16l0J82m5k79O44j50MJ03r1k87m4L23l9k54J6M13l79O0Q8n3l25K81
4409bk6o3j3J56l80K58J79j66L4O1J61m55L68j79L0J19j57N4k26J54j46K54j2
$$ plain form
4432 3 165 47 -108 -124 -198 -138 220 122 89 -51 -301 299 -16 17 34 -65 129 15 34 -111 95 -160 -68 23
4456 23 424 126 -78 303 -303 -124 47 128 -181 20 -46 -33 174 -62 -215 -47 0 221 22 -14 31 169
4478 169 223 168 -87 -67 44 117 12 81 542 14 21 31 5 -39 303 98 -333 173 327 101 -20 42 62 95
4502 95 -64 276 66 202 189 -357 196 -14 -10 -109 -47 -175 -530 134 232 190 -85 122 -59 -159 4 -214 -79
4525 -79 147 127 -121 -68 -36 -237 -30 61 -191 -30 -90 110 -457 173 405 146 -196 47 -173 63 10 389
4547 389 -79 -260 -141 167 -61 432 -333 -250 -22 39 -31 -84 -42 -107 55 53 4 -89 68 -312 33 99 295 158
4571 158 177 -218 104 -218 16 51 -114 -35 292 231 -265 -159 17 -13 -97 65 -46 -190 -127 -99 -215 230 124
4594 124 -248 111 123 226 -46 -11 -105 -237 329 237 4 67 343 -106 -5 -73 -399 -133 133 -31 37 -18 233
$$ packed form
4432CJ62j18j55j6p4O0L58r8l3j40k50O00l15L3J7r9J94j14J9j45K06k55R2R1
4456B3M01k98k04L81o06J79J71Q1l09K01o6J3K07k36j53J68M7K21j99l6M5J38
4478A69N4n5k55K0J11P3j05O9M61n28PJ0k6m4L42k05m31N06J54k26j21O2K0L3
4502I5j59L40k10J36j3n46N53k10Mr9O2j28l55O64R8m2k75K07j81j00J63k18J35
4525g9K26k0k48N3L2k01K07R1k52J61o0K00n67O30K32k59l42K43k20K36n3L79
4547C89m68j81J19L08k28M93p65Q3K28O1p0n3M2o5J62km9r3J57l80L45O6J96j37
4571A58J9l95L22l22K34L5j65P9L27o1m96J06J76l0q4J62j11j44O3K8j16M45j06
4594A24l72L59J2J03k72L5r4j32N66r2k33O3K76m49J01o8l26K66K66j64O8n5K51
$$ plain form
4617 233 -81 -322 -72 84 42 -304 -102 -37 -6 -179 -110 37 37 174 89 186 -281 -408 -301 189 64 20 -73
4640 -73 -115 67 223 -22 -12 -131 196 129 -73 -58 180 -103 -57 -175 -47 12 86 -233 -91 5 -275 46 154
4663 154 233 -362 73 46 80 -45 165 -107 -49 55 194 -191 48 245 145 -72 174 68 -117 -210 278 -100
4685 -100 -66 -263 -56 -66 -208 83 -352 85 2 -106 -263 40 -77 -139 -23 131 -3 225 187 -144 -175 230
4707 230 -136 -173 68 141 -266 48 145 -73 -21 89 -354 -236 13 71 -15 -18 55 119 171 -16 29 -138 164 -78
4731 -78 37 14 -151 -260 -161 -90 18 209 -80 239 38 -193 100 -38 -47 -274 286 -133 -179 9 19 -352 492
4754 492 -227 -107 33 -197 -56 127 94 -546 -9 -63 48 -302 52 52 204 -192 65 -115 235 -84 -134 124
4776 124 166 42 -69 81 134 -100 -62 84 29 262 376 -55 224 250 -146 -109 163 244 -169 -29 226 -4
$$ packed form
4617B33l14k41K50J56m2l46K02O5L1j73O9J47%J37q5R7m67j27J07M90j25m4r3
4640g3m2J82J56k45J0j19L27o7k02J5K38k83M6j18J28N9P4l19J42R6k80L21J08
4663A54P9n95M35k7L4j25K10k72N8J04J39l85K39J97j00k17K46j06j85r3M88l78
4685a00L4j97K07j0j42K91m35M37q3j08j57L03j17o2J16J54j34K28l8l31l1M05
4707B30l66l7K41P3m07L14R7k18N2J10m43J18K49N8q6lP3O4N2j87M5j67L02k42
4731g8J15k3j65j09R9P1J08J91k89L19k01k31K93j38rk27N60m19m6J88J0l71Q44
4754D92p19J20J40k30J41J83l3o40N37n4J11l50L54%J52l96K57j80L50l19n0K58
4776A24M2j24j11J50N3k34L8J46n5K33J14m31K79K6l96L7K72Q1m13J40K55k30
$$ plain form
4798 -4 164 316 59 -33 55 194 -257 -180 -169 -123 35 202 -156 111 93 -70 -142 220 -186 -41 75 -59 99
4821 99 -116 -11 30 207 -100 67 -129 117 143 -35 -161 347 -58 -98 -2 -186 -156 49 -1 -132 -85 32 99
4844 99 -83 -127 -138 128 -327 -60 -283 -97 -13 345 -124 192 36 -72 35 -142 -64 2 5 82 -77 12 -93
4867 -93 -36 -159 113 86 -108 -147 77 -28 -104 19 178 -141 -191 157 -53 -124 91 90 -54 -57 -62 175 -65 -44 -9
4892 -9 -45 155 108 -187 -142 -3 -64 -108 343 119 0 248 -228 -34 -60 -166 -41 167 96 27 -6 304 -175 -267
4916 -267 119 209 -319 -452 114 17 -7 -55 95 36 -258 35 160 164 149 -39 205 69 -111 31 121 -24 -140
4939 -140 -20 313 132 207 -52 -32 83 -172 167 46 -137 -5 1 83 375 138 -150 302 29 -134 -11 84
4961 84 -64 -270 171 48 -153 -3 0 -83 -250 4 -119 37 128 32 358 105 -210 -107 -63 47 309 -280
$$ packed form
4798dJ68J52k57r2Q8J39m51P7J1M6J58J67l58K67j8j63p2L62m06J45J16j34J58
4821I9k15J05M1J77l07J67j96K46K6j78j26N08m05m0R6j84L0K05n0j31M7J17O7
4844I9j82m4j1K66m55K67k23J86Q4L58m69L16j56j08J07j77P8O6LP7j59Q9j05
4867i3N7j23K72k7j94l9K24j05p6J23J59l19n0L48k10p1K15jj44lnK37k40K1L5
4892il6K00m7k95M5J39o1m4M51k24j19K48m76J94k6j06J25K08p1o9l3L10m79r2
4916b67L86R0n28j33N66r7k4m8J50n9k94K93J25Mj5j88K44j36j80J42R0j45j16
4939a40J20L33j81P5k59K0J15k55L39j21j83J32OQ2K92k37k88M52k73j63J23R5
4961H4j48k06M41j23k01J50Lq3j67K54j23J56R1r6L26k53l15J03M4J10K62n89
$$ plain form
4983 -280 103 211 -56 -209 123 109 -83 9 288 58 192 -155 -158 -121 318 -155 89 208 -196 -182 86 -116
5005 -116 -111 20 219 -126 -166 202 215 -176 -8 419 -331 218 -65 -249 107 252 -98 -74 201 48 155 -171
5027 -171 278 269 -297 -83 30 -138 146 126 307 202 -236 -201 -143 -50 326 34 -170 242 255 -201 11 16 295
5050 295 246 -110 -176 343 95 -23 282 -52 81 -56 32 90 50 -144 -79 -140 -18 254 -284 -63 -187 -212 109
5073 109 204 154 297 5 129 24 88 102 -139 -201 -26 420 123 -77 49 -147 -216 -196 -71 36 -399 -293
5095 -293 34 185 155 -23 -79 -204 91 -108 154 -68 127 275 236 73 -141 15 -80 -203 -160 75 -78 130
5117 130 206 -105 78 -63 -28 -322 -138 16 -61 95 51 7 146 23 27 23 36 327 -94 366 -32 -136 -158 -98
5141 -98 30 -36 -38 -87 188 4 228 397 62 -20 -207 76 -31 -52 26 -233 -87 -53 23 -79 73 -59 -3 239
$$ packed form
4983b80L83J08k67j53L32j4j92R2K79k30J34l47lL7M39m73K44J19m04J4K68k02
5005a16NJ31J99l45m0L68J3l91J68M27p50N49k83j84L56J45l50K4K75j53J07l26
5027a71M49rn66K14J13j68K84k0J81j05m38L5N8R3L76k92k04M12J3m56K12NK79
5050B95m9l56o6N19k48j18L05l34J33j37Q8N8m0j94O5o1J22K72n38K21j24k5L21
5073A09R5n0J43k92J24j05O4J4k41o2J75M46k97k00J26j96o9K0J25J07m35J06
5095b93L27J51l0j78n6j25K95j99K62k22J95J48l9j63k14J56r5j23M3K35j53K08
5117A30P6l11J83j41L5k94J84J54p7J56m4m4J39j23MmJ3K91m21M60l98j04k2O0
5141i8J28o6km9K75j84K24J69l35q2j87K83j07k1P8k59J46L4P6j02J52j32N6K42
$$ plain form
5165 239 175 36 19 -142 -398 322 135 -67 81 -41 -33 232 178 -49 -321 32 215 34 -10 36 83 120 125 -98
5189 -98 67 288 30 -102 24 33 -115 -113 -179 233 -120 -22 -95 -218 -193 63 121 -131 246 -95 -97 10 31 122 216
5214 216 -136 189 181 -109 -247 -163 182 14 -267 -95 149 -252 -280 -118 -28 385 -102 -66 59 -293 104 -60
5236 -60 -161 188 -36 -152 145 -140 84 69 49 143 32 39 95 280 357 160 -217 -62 -58 217 -82 -39 -197 31
5260 31 -179 156 -91 -189 74 -45 40 174 -119 115 -77 -90 69 308 340 -60 -194 -1 23 64 147 87 -32
5283 -32 51 96 -197 330 -74 94 285 287 314 -250 149 -53 226 36 -132 15 -189 -51 -116 -326 -90 4 69
5306 69 -152 10 168 -180 -135 -105 40 -24 -50 -160 -196 -111 -19 21 17 299 -52 -51 6 231 74 -19 80 -120 107
5331 107 45 -124 217 188 44 159 124 97 39 -266 33 -183 -131 205 190 3 -32 104 -124 46 9 -56 -82 125
$$ packed form
5165B39o4j39j7j61k56P20j87k02J48j22QK65n4k27k72L53J83j81m4M6M7L7Nk23
5189i8J65K21k58j32J26Rj48Ko6M12l53R8p3j23K5K56N8k52L77l41kJ07K1R1R4
5214B16l52L25qk90j38Q4L45j68k81J72K44m01k8J62R0M13m87L6J25l52L97j64
5236f0j01L49k24j16K97k85K24j5k0R4j11PN6J85P7j97l77J55MK75k99M3j58K28
5260C1k10L35k47r8K63j19Q5J34k93K34j92j3J59K39L2m00j34J93K4M1Q3o0j19
5283c2Q3M5k93N27m04J68J91KK7n64L99k02K79j90j68J47k04J38o5k10K36R4O5
5306F9k21J62J58l48M5L0J45o4k6j10l6Q5R2M0mK82l51JN7K25j57r3R9k00K27
5331A07o2j69L41k9j44J15l5k7n8l05K99k16N2L36j5j87l5J36k28J70l7o5k6K07
$$ plain form
5355 125 -47 -115 -146 147 118 -47 -38 -228 -14 99 116 -346 -214 -1 98 165 97 -14 -148 -194 237 -177 -30
5378 -30 275 -31 34 -5 105 28 18 -39 143 63 -226 329 -53 51 41 97 122 52 -203 -320 102 173 191 -109
5402 -109 117 -138 112 -17 -168 -37 93 -3 -129 -293 -207 -303 121 -139 -109 183 -258 437 60 3 270 -199
5424 -199 64 -52 106 -81 -114 32 46 -20 -34 148 96 -156 -45 116 -142 37 -133 169 -12 50 46 -51 -233
5447 -233 -45 -266 43 -111 100 -136 -190 -273 -73 134 119 61 86 44 -38 116 -200 38 -155 -86 211 141 315
5470 315 -306 -121 138 -247 180 -45 -65 -29 -23 73 150 -191 23 -248 -71 384 216 -245 29 -92 -30 36 -100
5493 -100 -36 -178 104 17 71 116 42 234 62 -102 -65 183 -232 -287 182 -112 -78 -204 -186 -77 26 139 -10
5516 -10 50 -274 145 119 -61 -192 -51 120 74 162 -48 15 -133 118 118 82 -83 135 92 219 -209 -38 -120 -140
$$ packed form
5355A25j72o8l1K93k9j65Rj90K14J13J7m62J32K13R9O7o8j11j34m6M31m14J47
5378c0L05l06O5l9J10p7j0n7J82q0k89N55l82J04j0N6K5p0k55j17M22P1J8l00
5402a09K26k55K50j29j51J31J30r6j26j64Q6r6M24k60L0K92m41O95l77n7K67m69
5424a99K63j16J58j87l3J46J4o6j4J82n2k52J11J61k58J79j70L02j81O2mr7j82
5447b33J88k21L09j54K11k36n4q3K00K07j5n8K5m2q2J54l16K38j93O9K97p0J74
5470C15o21J85K59l85M27k25k0L6OR6P7l41K14k71J77M55j68m61K74j21O2O6j36
5493a00O4j42K82q7N4M5p4J92j72j64L7K48m15n5M69k94L4j26J8J09J03J13j49
5516a0O0l24M19k6j80j31J41J71m6Q8k10O3j48K51%l6j65K18m3J27m28J71q2k0
$$ plain form
5540 -140 347 38 211 83 67 72 -171 -7 212 301 -219 -142 -127 -31 -39 172 -224 151 301 125 77 -17 190 -264
5564 -264 159 -204 128 260 92 -15 -40 15 -45 292 -131 -5 -102 -86 -218 -78 -254 205 -11 -92 -158 169
5586 169 76 33 -70 -220 -188 121 360 -144 78 317 -353 87 -137 -106 -94 101 137 41 109 -67 -102 -37 -78 239
5610 239 148 29 73 -147 -208 -7 179 133 172 -133 -35 -17 -247 13 190 102 -25 -70 266 -100 -11 209 -288
5633 -288 -74 -34 267 72 -213 -154 194 -102 -93 61 14 119 -100 11 71 209 99 326 394 143 82 -56 86
5656 86 43 -132 259 -185 -79 363 -35 -6 -343 51 -131 97 20 227 8 -174 -47 17 -102 244 -170 -307
5678 -307 8 -182 114 130 -148 26 128 -23 184 -88 -99 91 -159 95 126 -136 -74 136 -524 106 219
5699 219 50 194 -88 -107 64 -276 -47 181 16 84 -143 120 -79 239 252 195 -186 223 -84 -113 67 45
$$ packed form
5540a40M87l09J73j28j6Nk43J64K19Q9n20P7J5R6qK11l96L75J50j76m8r4K07m54
5564b64M23l63L32J32j68j07k5N5o0L37m23J26r7J6j32J40j76M59k16q1o6L27
5586A69r3m3j03j50L2L09K39n04K22K39o70M40k24L1J2J95L6r6O8j76l5O5m1L17
5610B39r1j19M4k20o1K01J86m6L9l05R8J8k30K60J77q8j27m5L36l66Q9K20m97
5633b88K14M0L01j95k85N9L48k96RJ54m7J05k19J11O0J38j10K27O8k51o1j38J42
5656H6m3j75L91m44J06M42l98K9l37L94j82K28p7K07k19j82J27O4j19L46m14j37
5678c07L15j90K96J6k78J74J02j51K07k72j1J90k50K54L1k62O2K10o60O30J13
5699B19j69J44k82j9J71l40K29K28j65O8k27K63j99L18J3n7l81M09l07k9J80k2
$$ plain form
5721 45 -141 129 -4 14 130 4 36 -37 102 -119 -168 176 26 -118 -9 154 -142 15 378 273 204 56
5743 56 74 230 92 15 35 172 -210 168 -23 52 -77 138 -58 -8 -142 -47 -48 171 184 -195 69 81 336 168
5767 168 94 124 164 -236 -219 157 -146 -229 251 15 -76 18 161 -109 179 204 -257 41 -152 58 -271 -293 7
5790 7 -24 100 195 -99 221 -17 -81 4 22 -12 1 -371 -2 -159 -290 174 -55 81 -79 14 244 -56 -135 -237
5814 -237 -131 -142 -124 200 -60 126 154 227 16 -47 -8 23 -29 -96 109 131 -207 27 27 72 -142 -300 -160 11
5838 11 -97 29 -176 -206 0 -46 -62 95 -41 -74 66 -7 61 168 334 282 77 -50 101 164 -26 -144 227
5861 227 -48 125 -154 -174 39 148 -340 -153 9 153 102 -170 146 -33 18 227 100 349 -133 258 263 334
5883 334 -32 -201 15 -142 287 -129 184 44 253 -126 -128 -117 -196 125 0 -62 0 166 -75 -19 -157 -127 170
$$ packed form
5721D5j86K70j33J8J16j26L2p3J39k21m9L44j50j44J09J63k96J57L63j05o9j48
5743E6J8J56j38p7K0J37l82L78j91P5j29K15j96N0j34R5jK19J3l79K64J2K55j68
5767A68p4L0M0m00J7L76l03q3M80k36r1R4J43k70K88K5m61K98j93K10l29k2L00
5790Gl1J24R5k94L20k38o4Q5J8l4J3l72L69j57j31M64k29J36j60R3K30l00p9j02
5814b37J06j1J8L24k60J86K8P3k11o3L9L1n2o7K05K2l38K34%M5k14j58J40J71
5838A1j08J26k05l0K06m6j6J57j36l3J40p3O8J07J66n2k05j27J51O3j90j18L71
5861B27k75J73k79k0K13J09m88J87J62J44n1k72L16j79N1K09j27K49m82L91NP1
5883C34l66j69K16j57M29m16L13j40K09l79kJ1p9L21j25o2O2J66k41N6j38L0K97
$$ plain form
5906 170 -14 146 -331 -15 -1 -15 69 -118 345 49 195 33 -158 105 -400 -119 -173 99 -212 -228 -76 -37
5928 -37 -241 149 -202 167 354 -65 -193 -142 -50 -329 150 -96 -47 49 -347 -58 -263 116 -64 -54 206 207 -100
5951 -100 -347 14 132 55 42 49 -233 -74 208 156 186 25 -155 -240 164 117 56 -65 -50 -158 -256 103 7 -189
5975 -189 -149 -10 177 123 109 197 -148 31 165 -126 51 158 76 65 -91 171 59 -276 -180 -82 44 -150 139
5998 139 2 178 -150 -298 76 -20 -192 16 -37 -260 19 198 130 -103 149 -248 -180 -375 -179 -12 136
6019 136 -8 162 -286 386 109 -420 167 -158 -80 -241 247 288 -114 5 182 19 100 75 34 -102 150 207
6041 207 -79 -265 189 -206 -373 16 389 80 -83 3 -2 -84 -22 -9 -186 335 -234 120 177 168 -1 -202 24
6064 24 370 26 167 152 -259 97 46 -115 -54 221 165 160 151 -42 -201 -44 268 -41 -193 222 59 85 240
$$ packed form
5906A70j84J60m77L16J4j4Q4j87M63k96J46j62j91K63n05K81n4K72l11j6J52L9
5928c7k04L90l51L69J87m19j28N1R2k79M79k46M9R6l96K89k05L79j80J0K60Jl07
5951a00k47L61J18p7j3Pk82J59K82n2L0j61j80q5M04m7o1j21J5j08r8L59r6j96
5975a89M0J39J87n4j4Q8l45J79J34k91J77J07q2j1j56K62j12l35R6R8J26j94K89
5998A39j37J76l28j48L74r6j72K08n3k23K79J79o8k33K52l97O8j95J96J67J48
6019A36j44J70m48O72k77n29N87l25P8j61M88M1m02J19J77j63Q1k5m1j36K52N7
6041B07k86j86M54l95j67L89L73l09j63Q6nq2O2J3j77N21n69L54N7rj69k01K26
6064B4L46l44J41j5m11L56n1j61O1K75n6nrj93j59J57L12l09j52M15j63K6J55
$$ plain form
6087 240 -17 -47 175 58 -69 -138 -253 -67 -199 40 -61 11 117 313 44 122 181 -98 23 101 -8 50
6109 50 227 14 -124 105 -50 73 41 200 96 160 -127 265 102 -54 223 130 -103 68 159 141 64 86 -90
6132 -90 66 112 -233 -89 -43 -104 170 87 -32 -176 158 92 122 16 167 -45 88 90 -152 -192 -18 -31 -14 108
6156 108 128 -131 -18 28 208 -95 162 -114 59 162 100 -108 176 33 91 119 -305 -182 -254 149 287 99
6178 99 141 6 137 -194 11 -24 -48 -145 22 -1 13 -81 -231 129 24 186 53 65 108 -186 66 -84 42
6201 42 182 62 -70 -46 223 134 -8 70 -117 80 132 169 -70 -258 -266 196 319 108 293 121 -9 119 -293
6224 -293 126 278 278 -81 75 65 145 -63 -15 -97 41 380 -83 -14 -469 190 -155 -120 -198 -217 -256 -124 -127 -59 130
6249 130 2 -207 -63 -111 112 239 65 -112 -113 171 -223 118 64 60 60 61 -428 -207 32 -44 346 200 151 11
$$ packed form
6087B40k57l0K22j17j27o9j15J86j32K39j01P2J06J96k69P8N9k79J21P8j09N8
6109E0J77k13j38K29j55J23l2J59j04O4k87L92j63j56K77r3k33J71R1j8p7K2j76
6132i0J56M6l45J44M6o1K74q3j19j44L34o6L0j06J51k12J33Kk42m0J74j3J7J22
6156A08K0k59J13M6J80l03K57k76J73J03o2k08K84j43N8K8m24J23p2M03J38j88
6178I9M2j35J31l31K05l5k4r7J67k3J4r4j50L60j05J62j33J2M3k94K52j50J26
6201D2J40j20j32K4K69q9j42P8j87J97N2L7k39j88qM62J23k11J85j72j30J28m12
6224b93M19J52%l59J56j0Q0k08M8q2J38L39m63O9m55O59l45L5p8j9l9J32lO8J89
6249A30j28k09J44m8K23J27j74j77jK84l94L41n4m%Jm89K21K39p6L90j46m9j40
$$ plain form
6273 11 165 388 -77 122 164 -140 21 -96 -54 -255 117 221 -7 47 -81 -115 -199 23 105 -64 -109 -78 209
6296 209 -26 -66 -98 -321 70 -156 236 55 95 -43 -173 54 -189 59 -118 -121 171 187 51 272 -161 153
6318 153 -76 145 137 107 -7 66 105 -205 215 -138 32 617 86 -77 66 21 -145 -336 118 91 -163 -299
6340 -299 89 32 68 251 296 -46 -309 -145 -20 165 -50 -184 -4 -294 -146 -155 203 61 -8 226 -163 -161 111
6363 111 -148 -123 -290 73 174 -2 -274 120 -41 96 -17 -119 -57 122 -72 -12 26 -6 -142 -164 40 275
6385 275 41 -36 -20 89 -17 -168 -286 -7 36 -129 -178 76 -211 208 -167 -122 -100 -149 -166 77 1 158 193
6408 193 -480 179 73 268 69 -54 -179 -190 -166 169 258 -172 327 -161 186 104 -126 73 90 -116 -253 163
6430 163 212 -133 -238 -57 272 -123 -224 16 -186 27 63 -97 116 68 -53 256 83 -17 142 -104 9
$$ packed form
6273A1J54K23m65J99M2l04J61j17M2k01L72J04k28N4j28l4q4K22Q2j69m5L1K87
6296B09k35m0l2k23L91k26L92j81M0j38j30K27k43K48j77lK92J6j36K21m33L14
6318A53k29K21ql0j14P3L9l10M20l53J70N85n31j63J43m5j66j91M54k7k54j36
6340b99L88n7L6J83M5l42k63J64J25J85k15j34J80k90J48rL58j42o9K34l89KK72
6363A11k59K5j67L63J01j76k72L94j61J37j13j02O2J79j94O0L8l2j36k2K04K35
6385B75k34p7J6J09j06j51j18K79M3j65m9K54k87M19l75M5K2m9j7K43p6J57L5
6408A93o73O59j06J95j99j23j25j1K4L35Q9m30M99m88L47q2k30J99J7k06j37M16
6430A63M9l45j05J81L29l95j01K40k02K13L6j60K13m8j21L09j73j00J59k46J13
$$ plain form
6451 9 -130 -50 101 102 -243 38 207 113 -74 -170 121 -44 -156 119 -158 -148 260 -69 100 33 -105 165 -93
6474 -93 18 -36 229 321 -2 -29 165 -55 214 42 -77 19 195 32 -130 69 -206 54 71 7 -182 -111 316
6497 316 44 119 -63 79 165 -145 168 66 135 -109 -55 266 -135 17 -40 -402 66 148 76 89 38 -315 191
6520 191 47 30 40 -246 348 -119 -121 -88 219 -252 208 -244 70 31 -124 -171 -91 30 -103 -8 160 80 -90
6543 -90 228 -102 5 -200 4 -171 407 -51 -190 118 5 -4 -122 148 9 16 146 -92 259 -121 9 186
6565 186 -130 39 126 -128 38 -296 -130 -268 -97 -22 -157 159 -128 -78 -30 151 97 122 31 90 275 -187 -56
6588 -56 -46 -42 -235 -50 -166 29 -25 -150 94 30 84 194 277 -180 -179 142 -159 134 -72 -239 -213 238 4 -165
6612 -165 -88 246 140 157 -72 173 107 -58 -197 -153 22 76 -236 31 95 -128 78 -151 119 76 -6 192 41
$$ packed form
6451Ij39Q0J51Jl45K81J69r4j87r6K91j65j12K75k77J0M08l29J69o7j38K70k58
6474i3J11n4K65R2l23k7J94k20K69j72j19R6J76j63j62J99k75K60J7o4j89P1M27
6497C16k72P5j82J42Q6l10L13j02O9k44N4L21m01J52n7l62M68Q2p2J3n1l53N06
6520A91j44j7J0k86N94m67kL3L07m71M60m52L14l9j55m7Q0J21j33R5J68q0j70
6543i0L18l30J07k05K04j75N78m58j39L08j13rj18K70j39PJ30k38L51l80J30J77
6565A86l16J69Q7k54J66l34J66j38J71P5j35L16k87N0M8J81n4K5r1N9J85m62J31
6588e6J0Mj93J85j16J95n4j25K44o4N4J10Q3m57JL21l01K93k06j67K6M51k34j69
6612a65P7L34j06J7k29K45o6j65j39M4J75N4l12K67O4k23K06k29K70m3q2J98j51
$$ plain form
6635 41 -68 -6 -300 71 79 -39 71 228 76 -4 -109 -217 228 118 -75 52 -126 46 57 93 100 -30 -201
6658 -201 -111 39 -33 60 -246 -4 47 -132 -272 -121 120 -33 -85 47 54 37 266 -8 -103 14 16 -25 129 40
6682 40 168 -101 -103 30 -118 -145 -199 59 -156 -60 13 -22 45 275 45 31 271 118 -370 -69 3 -210 154 -52
6706 -52 107 13 55 -142 22 -240 -176 -353 184 61 -152 145 -37 -311 -447 232 -87 129 106 108 -70 80
6728 80 -226 -218 -17 52 -47 145 8 -12 60 121 -71 147 -41 -205 107 116 128 -193 25 156 68 -99 -186 50
6752 50 -34 -168 131 -66 -218 -184 -32 28 23 -50 -389 89 272 77 47 118 76 -161 13 203 -32 152 -193
6775 -193 -86 42 173 -73 27 130 97 -113 57 207 -75 49 -137 -105 205 -3 280 -288 63 110 45
6796 45 167 -151 -68 -111 -74 113 114 214 12 -284 62 119 8 -137 -60 27 -26 145 203 -69 -111 -50 -366 -30
$$ packed form
6635D1j09O2k94L71Qj18J10J57j52q0j05j08M45j10j93J27j78J72J1L6Pj30j71
6658b01R0J50p2R3l06K42N1j79j40J51K41j53n2J32Pj7K29k74r5J17Km1J54q9
6682D0J28k69kJ33j48k7n4K58k15R6P3l5O7K30k30j4K40j53m88L01P2k13L64k06
6706e2J59r4M2j97J64k62O4j77N37j23k13K97j82k74j36O79l19K16k3Kj78J50
6728H0l06QK01O9r9J92j37k0P2O1j92K18j88j64L12RJ2l21K18J31q8j67q7K36
6752E0q4j34K99j97j52L4J52O0np3l39M78J83j95l0P1m2k37J74J90k35J84l45
6775a93J07J28J31k46J00J03l3k10J70J50k82J24j86L2L10k08K83n68L51M7o5
6796D5J22l18Q3m3L7J87JJ00k02k96L46N7j11j45P7Q7n3J71N8k72m2O1l16L36
$$ plain form
6820 -30 19 63 -13 92 135 223 106 141 -26 -126 110 -233 -56 72 8 192 86 87 22 237 -113 216 94 65
6844 65 -193 285 -24 36 -175 -360 227 25 -45 315 -243 -325 115 26 -185 -277 172 -231 -198 106 -46 14 -23
6867 -23 112 -41 49 -27 -26 234 -130 -116 23 69 92 146 -200 137 -17 5 165 -17 -90 -24 189 -30 91 -87
6891 -87 204 -154 160 93 92 -43 -202 -69 83 65 -79 -120 -82 86 154 -154 123 -239 -276 -200 49 182 -11
6914 -11 -31 -52 -153 -169 300 323 16 -5 55 -70 217 175 -68 -16 163 242 29 32 -115 52 -38 -143 -59 327 187
6939 187 -254 -87 52 7 -160 -97 -16 -68 46 36 -210 -118 43 26 -91 -131 -139 -130 188 -25 139 79 93 98 -46
6964 -46 -186 -119 -258 94 -112 -211 73 -123 -135 -261 107 201 336 -107 -167 -201 -138 79 333 -74 225 18 45
6987 45 115 -91 100 -193 98 215 107 -74 -231 -114 -314 31 32 255 110 -108 -154 24 51 -139 -45 -211
$$ packed form
6820c0M9M4p6J05M3Q8j17L5j67j00K36l43J77J28o4J84j06Jo5K15l50L29j22k9
6844F5k58M78l09O0k11j85N87k02p0L60n58q2M40q9k11r2M49m03L3L04j52O0l7
6867b3J35j53R0p6JK60l64J4J39M6K3N4l46L37j54K2J60j82p3O6K13k19J21j78
6891h7K91l58L14o7jj35j59J33J52j8j44m1L8J68O8l08K77l62l7P6K49J33j93
6914a1k0k1j01j6M69K3l07k1O0j25K87m2k43N2J79P9k13Lj47J67r0j05Q4L86j40
6939A87m41J67J39m5j67O3Q1n2J14j0k46R2J61j7j17m0qRL18k13J64o0J4Nj44
6964d6j40O7j39L52k06r9K84j96j2j26L68R4J35m43o0l4O3K17K54m07K99k07K7
6987D5P0k06J91k93K91J17j08j81j57J17k00L45JK23j45k18m6J78K7j90R4j66
$$ plain form
7009 -211 50 -127 -114 -118 78 -38 -24 129 -77 -137 -126 9 -37 -55 -59 63 -36 37 6 140 270 23 186 -71
7033 -71 -1 -107 -21 -83 -41 -258 -168 -175 -14 117 335 -82 448 -47 -4 -68 21 -115 80 -6 69 77 120 87 -113 -94
7059 -94 -7 -322 -275 -116 -33 -153 -41 -146 -78 64 -69 34 -129 87 -211 -40 275 -318 -217 -17 188 47
7081 47 -72 -31 -45 -10 -152 -257 -4 86 48 -34 -177 28 -155 54 -42 211 -85 336 -60 -45 52 10 -188 -231
7105 -231 77 -85 40 146 -62 -321 50 141 -211 -246 222 174 69 72 -207 -154 274 -158 130 81 -264 -239 -82
7128 -82 -110 -41 -369 -255 47 12 -27 165 153 -245 -99 -86 -65 -174 24 -428 -180 -97 72 -28 49 76 -125 41
7152 41 104 271 -211 -79 138 34 280 -185 -86 103 177 -166 50 -84 224 129 163 33 98 163 -22 51 230
7175 230 -87 174 83 235 -172 -177 80 146 -167 113 -22 19 -86 165 493 172 -74 10 -169 -29 134 -62
$$ packed form
7009b11K61j77J3mJ96j16J4J53k06o0J1J35m6j8mJ22r9P3l1J34J30k47J63k57
7033g1P0j06Q6o2M2k17R0pJ61J31K18m17N30m95M3o4Q9j36J95q6P5QM3l3k00J9
7059i4Q7l15M7J59Q3j20J12j05O8J42j33J03j63K16k98J71L15n93J01K00K05j41
7081D7j19M1j4L5j42j05K53R0l8q2j43K05j83K09r6K53k96M21l96J5R7m2j98m3
7105b31L08j62J25J06k08k59L71R1l52l5M68m8j05Lk79N3M28m32K88m9l45K5J57
7128h2k8O9l28J14L02l5l9J92j2l98J46J3K1j09J98m52K48Q3J69j00P7K7k01J66
7152D1O3J67m82J32K17j04K46m65R9J89P4l43K16j34L08r5L4j30O5O5j85P3J79
7175B30l17K61r1J52m07nK57O6l13K80j35M1j05K51L28l21k46Q4j79J40J63j96
$$ plain form
7197 -62 -167 202 231 -91 -122 -118 -113 75 -136 167 -212 -144 -55 326 -18 153 69 226 29 -128 143 -75 213
7220 213 -146 111 -246 146 -54 111 -88 -340 -25 -64 155 -246 -165 -89 407 56 -159 353 25 -108 -81
7241 -81 -10 48 -171 -48 -74 60 23 88 21 174 -28 -69 -21 102 15 45 254 -76 -36 -77 -90 -45 120 -132 21
7266 21 -173 -111 101 99 149 2 326 -265 -162 -14 -128 -216 -50 -77 80 -35 -88 -25 62 -27 -14 122 -318 74
7290 74 -355 265 145 -193 49 202 -42 117 -114 -174 -142 12 55 -321 93 -122 -26 -276 -73 -18 -109 65
7312 65 63 -63 -178 -91 -38 -144 59 71 -196 207 -65 25 226 19 245 -7 82 -72 -262 -102 15 -40 193
7335 193 -306 17 134 47 101 -197 86 -83 159 -15 64 32 -32 -224 -152 -48 135 134 -102 -209 -37 -210 -85
7358 -85 -16 -163 -126 -246 230 -112 231 -107 -278 -13 -75 66 -47 -217 166 -119 -123 110 107 234 21 -45 6
$$ packed form
7197f2j05L69K9l22l1MNJ88k11L03l79O8Q9L81l44J71q4J57j97j57K71k18K88
7220B13l59K57l57L92k00J65j99k52L15l9K19m01Q1P6M96l51k15N12l28j33K7
7241h1P1N8k19J23k6J34l7O5o7J53k02m1M8J23q7L0K09l30M0m1j3M5J65k52J53
7266B1j94O2K12kN0j47L24n91J03J48j14q8J66k7J57j15n3O3Q7q9J3J36m40L92
7290G4m29O20j20l38K42J53k44J59k31o0L2J54M3l76M14k15R6k50K03N5r1J74
7312F5kj26j15Q7N3j06K03J2k67M03k72R0K01k07K26k52Q9j54j90J60J17n5K33
7335A93m99L23J17q7N4k98K83j69K42j74P9l2o4j92P2J04J83jk36j07J72j73J25
7358h5O9j47L7j20M76l42L43l38j71K65o2J41j13j70L83k85mK33lJ27k13o6N1
$$ plain form
7381 6 -290 -246 40 3 207 -19 -268 -136 -160 6 124 89 42 -162 82 -227 108 -123 -29 109 54 278 -104
7404 -104 8 350 -29 59 -117 -51 178 168 -49 -56 -189 -66 23 -202 -164 -77 -267 -70 -138 -220 482 -261 53
7427 53 -180 -340 -39 238 215 150 -53 116 -15 144 291 121 32 191 -6 -45 -104 -144 268 -318 171 88 379
7450 379 -217 -17 -86 28 31 59 46 -328 -23 -106 33 411 159 76 280 -197 323 -132 86 40 -47 -29 -81 -229
7474 -229 -44 89 86 -271 -161 -125 169 195 -72 -132 -175 -395 -116 50 128 -122 83 -203 9 431 -94 55
7496 55 -65 6 -133 -92 -26 30 37 133 68 -169 36 105 -86 213 -12 284 155 -191 -17 76 224 217 -137 108
7520 108 53 -81 -253 7 41 -144 48 137 -13 93 141 109 -289 -57 156 -241 -180 9 172 -20 -123 -199
7542 -199 -306 -205 -150 -112 -157 134 -214 -87 158 123 103 1 94 -88 -169 74 258 -68 -36 -46 -21 -109 -15 24
$$ packed form
7381Fk96M4K86l7K04k26k49J32k4J66J18l5m7k04K44l09L35k31R4J38n5K24l82
7404a04J12L42l79Q8j76O6K29j0k17pj33J23Q9k25L8Q7j90J97o8q2P02p43L14
7427E3k33j60L01K77k3o5k03J69j31J59J47j70q9J59j97l9n9m0M12n86M89q3K91
7450C79n96K00o9J14LK8j3l74L05q3J39L78k52q3K04m77N20m55K18m6q7J8n2j48
7474b29J85J33ll57J10L6K94K6k67o0m3k20K79J66P8k50K05k86K12M22n25J49
7496E5j20P1j39M1O6N6PR6o5k37K05O9j91K99k25K96j29l46J74R3J48pl54K45
7520A08n5j34j72K60L4j85J92Q9j50J06M8l2l98K32K13l97O1J89J63j92j03p6
7542a99j07J01N5L8m5K91l48J27K45l5k0j02R3j82q1K43J84l26L2j0K5q8R4L9
$$ plain form
7566 24 -40 -172 109 177 52 -106 149 9 -11 182 -16 135 -185 42 241 -44 -26 -16 -129 53 108 49 114
7589 114 249 38 51 -9 208 331 -83 41 124 -31 -26 61 136 -115 100 -150 190 5 187 -79 -106 -95 203
7612 203 167 -285 182 130 59 248 -62 -238 159 32 10 53 -41 -60 -199 20 -103 126 -9 153 29 62 223
7635 223 -14 39 -181 47 12 256 -70 -279 -162 160 -19 -37 -168 37 -182 -224 30 65 -79 -147 -126 -171 38
7658 38 -56 64 394 98 181 82 186 -43 0 -16 -206 204 316 425 -100 -185 -14 97 220 -206 -60 24 -12
7681 -12 74 272 270 -140 57 -58 -223 218 23 -163 -94 -138 14 170 140 -8 -187 10 -114 -84 -56 -85 -82 -6
7705 -6 149 133 -278 -79 -64 61 44 212 217 -94 66 48 112 -208 50 -183 -145 163 -6 -93 75 -16 28 84 -229
7730 -229 91 74 -80 70 68 120 33 -203 -31 -11 -24 -64 192 -82 -143 27 -82 -31 -5 120 158 -168 21 -316
$$ packed form
7566B4o4j32K81O8j25j58K55j40k0J93j98J51l20K27J99k85J8J0j13J82N5n9O5
7589A14J35k11J3o0K17J23m14J24Q3j55NQ7P5k51K15k50L40j85J82k66k7J1K98
7612B03l6m52M67n2p1J89l10j76L97j27k2M3r4j9j39K19j23K29j35J62j24L3J61
7635B23k37N3k20K28l5K44l26k09J17L22j79j8j31K05k19m2K54L5j44o8K1m5K09
7658C8r4J20L30k96Q3r9J04k29M3j6j90M10J12J09n25q5J71J11J23m26J46Q4l6
7681a2Q6J98km10J97j15j65M41j95j86O9m4J52J56l0j48j79J97j24L0K8k9LP6
7705fJ55j6m11J99J5J25j7J68Nl11J60j8O4l20K58k33L8L08j69q7J68r1M4N6l13
7730b29L20j7j54J50kN2q7k36J72K0j3m0K56k74o1J70j09N1K6J25L8l26J89l37
$$ plain form
7754 -316 -51 110 46 8 437 -16 -34 -75 -105 162 80 84 -124 35 -111 75 -242 256 32 -177 -18 171 430
7777 430 -37 -203 25 -43 143 151 -118 111 76 -249 -68 122 134 82 -117 -76 87 163 -281 85 -267 -105 -7
7800 -7 20 -103 -155 -164 -21 -10 50 390 -29 119 -186 -181 91 -171 -58 -6 -137 96 -238 -119 -109 -170 25 32 -99
7825 -99 -72 -167 251 52 -227 72 11 -26 60 -67 -110 -15 56 -118 36 75 -199 213 127 101 -257 -16 36 -121
7849 -121 219 11 58 217 77 135 -59 -179 91 -61 137 80 241 43 -109 55 183 -78 109 -4 -67
7870 -67 226 32 2 -179 -55 -98 -134 -32 -121 45 -64 336 137 -201 -216 52 45 17 -246 -93 284 -36 85
7893 85 -184 -12 45 295 -139 269 106 136 -46 -17 193 -296 109 99 -40 33 157 267 27 55 91 -37 86
7916 86 103 -62 111 -1 -203 -270 145 -295 194 -235 -56 35 -114 -114 350 346 125 160 52 -112 -205 -121 -86 42
$$ packed form
7754c16K65J61o4l8M29m53j8m1l0K67q2Mk08J59j46J86l17M98k24k09J59J89K59
7777D30m67j66K28o8J86Qk69K29l5l25J81J90J2n2j99M1J63P6m44L66l52J62R8
7800gK7j23n2rJ43J1O0L40m19J48l05NK72k62J13N2j31K33l34J19J0o1J95Pj31
7825i9K7r5M18j99k79K99o1l7Q6j27m3R5P1j74J54L9k74M12q6k6l58K41N2j57
7849a21L40k08M7J59j40N8j94j20K70j52J98n7J61j98j52J64J28k61J87j13o3
7870f7K93j94l0j81J24m3l6J02q9J66j09M00j99l38j5K68pk8k63J53L77l20J21
7893H5k69J72N7K50m34M08j63L0j82K9K10m89M05j0j39P3J24J10k40K8L6j28J23
7916H6J7j65J73j12k02o7M15m40M89m29J79R1j49%M64mk21L5j08j64r3Q4L5J28
$$ plain form
7940 42 -44 81 101 -29 103 -107 -83 244 -134 -231 -66 -56 10 -8 -139 249 92 -268 31 30 37 127 -226 8
7964 8 -179 -17 -154 -207 310 -48 -212 117 -153 -180 218 159 -105 147 -242 -72 240 -72 305 88 56 132
7986 132 -125 11 170 -162 -112 89 150 -90 226 -66 -56 -185 149 179 -93 76 478 362 212 -174 29
8007 29 282 -125 220 128 141 -145 -108 213 -96 29 52 -23 64 370 -310 41 -50 25 -33 -188 -46 -90 18 17
8031 17 -272 212 51 174 156 106 -262 -75 111 94 118 -322 0 154 -64 -232 -34 191 -121 67 -61 66
8053 66 -247 102 282 -26 -76 6 117 87 47 122 -107 -114 -153 -66 -129 4 -23 -27 36 -117 -172 -194 80 -390 -18 -67
8079 -67 -44 177 164 13 -131 227 -178 182 -226 274 82 -251 77 -79 169 -136 -41 -209 -159 117 -67 -86
8101 -86 -114 116 -13 -178 164 117 202 -60 -72 -89 55 -45 93 146 110 21 -97 129 333 1 18 20 119 -97
$$ packed form
7940D2q6J25K0j30J32k10K4L27l78r7J65J0O6j8j31L88j57l60K99jPR0l53K34
7964Hj87J62j37n3N17l58j64L29k70k7L98n9k64K52l89J70L12l12L77k17l2P6
7986A32k57J36J59l32N0K01O1k40L16k92J0j29L34L0k72J69M02j16j50l86K03
8007B9K53m07L45r2J3k86L7L21l09J25K3p5Q7L06o80L51r1P5n8j55J42m4J08j
8031A7k89M84j61J23j8n0l68J87J86j7K4m40L22J54k18j68J98K25l12J88j28J27
8053F6l13L49J80l08n0Q2J11l0m0P5k29pl9Q7o3J33k7mO3j53n5k2K74m70L72m9
8079f7K3K21j3j51j44L58m05L60m08N00j92l33L28j56K48l05R5j68N0K76j84j9
8101h6k8K30j29j65L42m7Q5k62j2j7J44j00J38N3l6q9j18K26K04l32J7KR9k16
$$ plain form
8125 -97 -56 -64 79 -88 36 137 75 -177 94 -26 -121 59 -25 80 205 -99 -41 -15 -60 73 119 206 400 -320
8149 -320 6 -137 22 -291 39 -106 117 78 -248 215 112 -35 161 269 106 -71 54 -151 36 95 29
8170 29 62 264 -76 -49 93 178 13 -138 51 218 197 275 -12 -287 69 97 101 -94 185 -1 -89
$$ packed form
8125i7M1qJ43j67J24J01o2k52K71j20r5J80q4J05J25l04N8K6m5J33M6Q7J94p20
8149c20L26j43J59l13L30j45K23l9l26M63j03j47J96J08j63j77J25k05J87N9o6
8170B9L3K02l40K7J42Q5j65j51J89J67k1P8k87k75L56K8Mj95K79j86q8
8191h9
$$ Imaginary data points
##PAGE= N=2
##DATA TABLE= (X++(I..I)), XYDATA
$$ plain form
0 0 0 0 0 0 0 0 0 0 6 -8 8 -8 8 -16 16 -17 24 -25 32 -39 42 -49 57 -67 78 -89 102 -115 131 -147 166 -186
32 -186 209 -233 259 -289 322 -357 397 -438 487 -540 597 -663 734 -814 904 -1008 1127 -1266
50 -1266 1430 -1627 1869 -2179 2584 -3144 3969 -5306 7855 -14457 67668 136143 14529 14261
64 14261 30638 19764 38589 69586 6195 -11516 61637 85768 50149 67106 46673 -26051
76 -26051 -7356 69294 49716 18635 49296 41551 12584 63352 80703 3441 -25681 12648
88 12648 16000 39002 93740 52701 -26306 13339 71558 33314 -1555 1464 -22362 -1320 80036
101 80036 75386 4357 8050 27449 -6903 3070 42382 1190 -34817 19055 48968 27399 38926
114 38926 27315 -40478 -36204 30612 25162 -4006 17240 8329 -16807 34710 64260 -14090 -61898
$$ packed form
0@%%%%%%%%Oj4J6j6J6k4L2l3M1m9N7p1Q1r1J06j24J45j67J91k17K46k78L13l52
32a86L95m42M92n48O11o79P54q35R25j027J137j260J397j548J718j912K135k393
50a266K696l057L496m048M763n728P113r275J3161k2312Q2125O8475j21614k68
64A4261J6377j0874J8825L0997o3391j7711P3153K4131l5619J6957k0433p2724
76b6051J8695P6650j9578l1081L0661p745k8967N0768J7351p7262k9122L8329
88A2648L352K3002N4738m1039p9007L9645N8219l8244l4869L019k3826K1042Q1356
101H0036m650p1029L693J9399l4352R973L9312m1192l6007N3872K9913k1569J1527
114C8926j1611o7793M274O6816n450k9168K1246q911k5136N1517K9550p8350m7808
$$ plain form
127 -61898 -20720 2874 14017 44843 16014 -36154 2552 46574 964 -28623 -8334 -28153
139 -28153 -35468 29971 50851 602 -7229 4775 -22813 -12723 27386 -7592 -50120 -6917
151 -6917 28904 13928 25692 21492 -42757 -50590 16661 25756 -11884 -6069 -1866 -10175 31742
164 31742 51667 -18325 -54809 -9962 4383 -5889 24132 25822 -15425 -2219 33767 10065
176 10065 -10336 2776 -22640 -38183 22639 56407 12950 -2835 10984 -7343 -3332 34229
188 34229 9438 -38606 -9612 34500 31157 34420 27367 -25576 -31166 29598 33720 -10058 -1390
201 -1390 20666 9814 28445 51783 9958 -24327 -742 4793 -2470 34024 43109 -3663 -2543
214 -2543 41738 32654 6648 11087 -9028 -27460 22270 60576 24748 2874 16545 6138 8644
$$ packed form
127f1898M1178K3594J1143L0826k8829n2168L8706M4022m5610k9587K0289j9819
139b8153p315O5439K0880n0249p831J2004k7588J0090M0109l4978m2528M3203
151f917L5821j4976J1764m200o4249p833O7251R095l7640N815M203q309M1917
164C1742J9925o9992l6484M4847J4345j0272L0021J690m1247J3206L5986k3702
176A0065k0401J3112k5416j5543O0822L3768m3457j5785J3819j8327M011L7561
188C4229k4791m8044K8994M4112l343L263p053n2943n590O0764M122m3778Q668
201a390K2056j0852J8631K3338m1825l4285K3585N535p263L6494R085m6772J120
214b543M4281r084k6006M439k0115j8432M9730L8306l5828k1874J3671j0407K506
$$ plain form
227 8644 40378 16899 -33201 -5792 42844 34763 25802 30024 -1907 -16214 22028 26743 -4386
240 -4386 7815 23822 3205 16816 55294 28015 -18179 -8516 3783 740 27687 36060 -5132
253 -5132 -7179 36652 35196 7462 7006 -9171 -29083 12350 51768 19415 -6992 11274 11770
266 11770 5557 23529 9649 -27888 -9454 27515 18295 15703 32283 4324 -26103 2990 23184
279 23184 140 -2823 6137 -6730 10224 48781 25335 -22355 -15124 1639 -3713 14288 25225
292 25225 -9361 -16083 27009 33109 3207 -1135 -9205 -25730 3497 35858 10869 -8432 13129
305 13129 10224 -5888 13754 16096 -19961 -19937 11256 14676 16804 29833 1825 -28465 1558
318 1558 25885 -1001 -11470 1157 -5126 5764 40350 25498 -18775 -14898 3059 -2403 7481
$$ packed form
227H644L1734k3479n0100K7409M8636q081q961M222l1931j4307L8242M715l1129
240d386J2201J6007k0617J3611L8478k7279m6194R663J2299l043K6947Q373m1192
253e132k047M3831j456k7734m56j6177j9912M1433L9418l2353k6407J8266M96
266A1770o213J7972j3880l7537J8434L6969r220k592J6580k7959l0427K9093K0194
279B3184k3044k963Q960j2867J6954L8557k3446m7690P231J6763n352J8001J0937
292B5225l4586o722M3092O100k9902m342q070j6525K9227L2361k4989j9301K1561
305A3129k905j6112J9642K342l6057K4L1193L420K128J3029k8008l0290L0023
318A558K4327k6886j0469J2627o283J0890L4586j4852m4273L877J7957n462R884
$$ plain form
331 7481 18703 -8457 -14599 23937 29068 361 -522 -455 -21793 -8614 25295 15917 -2741 7625
345 7625 3539 -5837 17121 19768 -21398 -28248 7556 17459 13480 20972 2273 -22743 715 22617
359 22617 -1423 -14868 -2283 -5560 874 32005 23125 -16407 -14047 4659 -4830 -2180 13166
372 13166 -3500 -15801 11130 21250 2468 3225 -166 -26843 -16956 22417 17203 -8804 -2487
385 -2487 3250 -2254 13329 14708 -21699 -29034 3829 12095 5236 14965 4077 -19961 -3343 19195
399 19195 -2151 -18120 -4977 -5590 -5214 21015 20998 -10234 -12276 283 -9497 -4631 14525 -1985
413 -1985 -23015 1962 22863 8591 453 -4628 -24453 -14996 19040 13129 -12591 -4213 6346
426 6346 -1187 8708 14233 -15223 -27148 -176 10084 2839 11047 6157 -15046 -4550 15895
$$ packed form
331G481J1222k7160o142L8536N131k8707q83O7k1338J3179L3909r378j8658J0366
345G625m086r376K2958K647m1166o850L5804R903l979P492j8699k5016K3458K1902
359B2617k4040j3445J2585l277O434L1131q880l9532K360J8706r489K650J5346
372A3166j6666j2301K6931J0120j8782P57l391k6677R887L9373n214k6007O317
385b487N737n504J5583J379l6407p335L2863Q266o859R729j0888k4038J6618K2538
399A9195k1346j5969J3143o13L76K6229j7l1232k042J2559r780M866J9156j6510
413a985k1030K4977K0901j4272q138n081j9825R457L4036n911k5720Q378J0559
426F346p533R895N525k9456j1925K6972J0260p245Q208m890k1203J0496K0445
$$ plain form
439 15895 509 -13792 -2803 -6243 -10477 15848 25723 -4128 -15048 -2632 -4010 -338 12670
452 12670 -3781 -22978 2715 24652 8497 -1877 -805 -16096 -14319 12550 12199 -9559 -3887
465 -3887 6860 -429 6985 15552 -9141 -23841 -1895 7835 529 10194 10658 -12267 -8683 14513
479 14513 6812 -9632 -5774 -8453 -10182 16166 25826 -4637 -16437 466 1246 -2500 6890 -2607
493 -2607 -18913 -110 20317 8273 -482 2190 -12481 -16017 9017 12603 -8443 -5767 5578
506 5578 -854 4127 15763 -3161 -22324 -7202 5271 1468 9600 8867 -13310 -10324 15649 10439
520 10439 -11612 -9528 -6232 -7938 10331 20669 -2205 -12524 1519 795 -5142 5652 955
533 955 -17614 -5376 16320 9259 277 3235 -8695 -15938 4892 12297 -5649 -6889 2968 -1493
$$ packed form
439A5895j5386j4301J0989l440m234K6325R875k9851j0920J2416j378L672J3008
452A2670j6451j9197K5693K1937j6155j0374J072j5291J777K6869l51k1758N672
465c887J0747p289P414Q567k4693j4700K1946R730p306R665M64k2925L584K3196
479A4513p701j6444L858k679j729K6348R660l0463j1800J6903P80l746R390r497
493b607j6306J8803K0427j2044q755K672j4671l536K5034L586k1046K676J1345
506E578o432M981J1636j8924j9163J5122J2473l803Q132p33k2177K986K5973n210
520A0439k2051K084L296j706J8269J0338k2874j0319J4043p24n937J0794m697
533I55j8569J2238K1696p061q982K958j1930p243K0830P405j7946j240R857m461
$$ plain form
547 -1493 3739 17700 841 -21991 -9304 7452 3608 5625 6570 -9443 -7301 14530 9876 -9985
561 -9985 -6954 -3238 -9277 4727 19979 2719 -10907 -11 2579 -3456 5592 2649 -16276 -8714
575 -8714 13509 9512 1456 4682 -6277 -16131 3111 14189 -3917 -10377 125 384 4124 14826
589 14826 634 -19791 -8547 6642 115 756 6197 -5835 -9845 8656 9488 -7492 -8340 -5666
603 -5666 -11718 -605 15867 2607 -12450 -3269 581 -5166 2016 1470 -17208 -14924 7136 7755
617 7755 -1910 -733 -8983 -17203 -695 9700 -7768 -15469 -3490 -2310 -3310 7087 -340 -19846
631 -19846 -14217 -848 -4538 -3804 2397 -9577 -15885 2641 7542 -9130 -12960 -9350 -15527 -7116
645 -7116 9467 184 -15758 -8587 -2027 -6760 -952 -1397 -19518 -18739 3236 5034 -6116 -4578
$$ packed form
547a493N232J3961j6859k2832J2687J6756l844K017R45j6013K142K1831m654j9861
561i985L031L716o039J4004J5252j7260j3626J0896K590o035R048k943j8925P562
575h714K2223l997q056L226j0959r854J9242J1078j8106o460J0502K59L740J0702
589A4826j4192k0425J1244J5189o527O41N441j2032m010J8501Q32j6980q48K674
603e666o052J1113J6472j3260j5057R181L850n747P182n46j8678K284K2060O19
617G755r665J177q250q220J6508J0395j7468p701J1979J180j000J0397p427j9506
631a9846N629J3369l690P34O201j1974o308J8526M901j6672l830L610o177Q411
645g116J6583r283j5942P171O560m733N808m45j8121P79K1975J798j1150J538
$$ plain form
659 -4578 -7293 -16654 -5962 5480 -7260 -14743 -4845 -4375 -6022 5646 2610 -17487 -16292 -1603
673 -1603 -3185 -4438 1081 -7456 -14495 1578 9109 -5238 -10236 -7195 -12296 -6925 9412 3223
687 3223 -13370 -7190 1895 -2189 -166 1372 -12474 -14177 3440 6723 -2118 199 -1551 -12073
701 -12073 -4419 9264 60 -10539 -3575 -529 -1379 8866 7534 -10894 -12019 1948 1651 -1131
715 -1131 4412 -2206 -10599 3369 13697 1043 -6711 -3117 -6674 -3436 10543 6527 -8581 -3652
729 -3652 5188 331 1650 6536 -5704 -12150 2765 9286 1733 1974 1055 -9222 -2836 11091 2859
744 2859 -8986 -2865 1255 -835 7980 9561 -7003 -10767 1417 2894 -936 3407 -1272 -9776
758 -9776 1605 12445 1250 -6163 -1939 -5318 -5896 6760 6850 -7148 -6066 2075 -467 1341 5495
$$ packed form
659d578k715r361J0692J1442j2740p483R898M70j647J1668l036k0097J195J4689
673a603j582j253N519q537p039J6073P531j4347m998L041n101N371J6337o189
687C223j6593O180R085m084K023J538j3846j703J7617L283q841K317j750j0522
701a2073P654J3683r204j0599O964L046q50J0245j332j8428j125J3967k97k782
715a131N543o618q393J3968J0328j2654p754L594l557L238J3979m016j5108M929
729c652Q840m857J319M886j2240o446J4915O521p553K41r19j0277O386J3927q232
744B859j1845O121M120k090Q815J581j6564l764J2184J477l830M343m679q504
758i776J1381J0840j1195p413M224l379n78J2656R0j3998J082Q141k542J808M154
$$ plain form
773 5495 -5604 -14139 -458 8066 -98 -1452 -780 -8948 -5717 6915 1882 -9872 -5977 -1411
787 -1411 -3238 4184 7253 -7374 -12827 -847 1559 -3774 -379 -2458 -11323 -3394 7955 520
801 520 -6439 -3421 -7174 -8889 3422 5392 -8683 -10019 -394 -954 -1843 2704 -5829 -14304 -3435
816 -3435 5196 -1150 -3157 -1338 -9190 -7995 5017 2387 -10521 -7900 -1864 -3808 1260 5699 -5572
831 -5572 -11916 -2308 648 -4098 -798 -1567 -11565 -5814 7358 2541 -6353 -4238 -5343 -7657 2784
846 2784 5684 -7266 -9361 -182 -435 -1495 3456 -2961 -12698 -4285 5703 626 -2209 -799 -6057
861 -6057 -6345 4793 3888 -7661 -6401 -1113 -3545 859 7488 -2281 -10433 -1801 2909 -1089 17
876 17 -661 -8939 -4942 7369 3932 -4722 -2677 -2324 -5713 2367 7245 -3658 -8000 119 1332 -718
$$ packed form
773E495j1099q535J3681Q524q164j354O72q168L231J2632n033j1754L895M566
787a411j827P422L069j4627n453J1980K406n333L395k079q865P929J1349p435
801E20o959L018l753j715J2311J970j4075j336R625n60q89M547q533q475J0869
816c435Q631o346k007J819p852J195J3012k630j2908K621O036j944N068M439j1271
831e572o344R608K956m746L300p69r998N751J3172m817q894K115j105k314J0441
846B784K900j2950k095R179k53j060M951o417r737Q413R988n077k835J410n258
861f057k88J1138r05j1549J260N288k432M404O629r769q152Q632M710l998J106
876A7o78q278L997J2311l437q654K045L53l389Q080M878j0903m342Q119J213k050
$$ plain form
892 -718 4086 -922 -10452 -3995 5924 1268 -2025 966 -3802 -6122 4231 5982 -4923 -6006 -1127
907 -1127 -2662 950 7306 -671 -9245 -1535 4370 -316 134 1018 -6844 -5294 6122 4879 -3390
922 -3390 -2142 -2045 -4944 1712 7735 -2025 -7630 -2 1954 2 3509 997 -8422 -4355 5480 2941
938 2941 -1088 1029 -2844 -5381 4357 7470 -3444 -6076 -593 -1453 365 6498 1078 -7410 -1614
953 -1614 4409 1013 1052 2221 -5310 -5548 5229 6337 -2324 -2190 -383 -3184 1203 7672 34 -6327
969 -6327 -24 2332 190 4049 3027 -6533 -4931 5243 4201 -849 1114 -1427 -4556 3894 7909
984 7909 -1565 -4749 351 -548 -358 6287 2356 -6801 -2546 4522 1845 1010 2978 -3811 -5425 4517
1000 4517 6067 -1570 -2028 72 -3487 395 7368 1198 -6190 -1245 2355 432 2976 2710 -5795
$$ packed form
892g18M804n008r530O457R919m656l293K991m768k320J0353J751j0905j083M879
907a127j535L612O356p977q574P710N905m686M50Q84p862J550J1416j243q269
922c390J248R7k899O656O023r760n605P628J956j952L507k512r419M067R835k539
938B941m029K117l873k537R738L113j0914k632N483q60J818O133n420q488N796
953a614O023l396L9J169p531k38J0777J108q661J34J807k801M387O469p638o361
969f327O303K356k142L859j022r560J602J0174j042n050J963k541l129Q450M015
984G909r474l184N100q99J90O645l931r157M255P068k677q35J968o789j614R942
1000D517J550p637m58K100l559L882O973o170p388M945L600j923K544k66q505
$$ plain form
1015 -5795 -4884 4750 3614 -1590 390 -1186 -5032 1848 7287 -471 -4906 -737 -571 -631 4936 2339
1031 2339 -6446 -3697 3892 1477 106 2256 -3057 -5570 2910 5915 -1483 -2708 -993 -3298 -651
1046 -651 6025 1138 -6334 -2075 2341 -219 1725 3123 -4697 -5484 3142 3741 -1284 5 -1227 -5382
1062 -5382 660 6926 406 -4872 -635 -92 -1334 4002 2951 -5797 -4091 2815 2249 29 2291
1077 2291 -1897 -5906 2250 6093 -770 -2716 296 -2376 -797 5924 2536 -5267 -2042 1930 -86
1092 -86 1837 3862 -3302 -5391 3006 4762 -507 -235 -186 -3986 -343 6238 1603 -3625 -424 695
1108 695 -1057 3636 3835 -4576 -4491 2773 2555 81 2093 -535 -5018 993 5836 80 -2619 -72
1124 -72 -1804 -1366 5519 3773 -4710 -2939 2033 45 588 3080 -2651 -5337 2109 4641 -565 -730
$$ packed form
1015e795R11R634j136n204J980j576l846O880N439p758m435M169J66o0N567k597
1031B339q785K749P589k415j371K150n313k513Q480L005p398j225J715k305K647
1046f51O676m887p472M259M416k560J944J398p820p87Q626N99n025J289j232m155
1062e382O042O266o520n278M237N43j242N336j051q748J706O906n66k220K262
1077B291m188m009Q156L843o863j946L012k672J579O721l388p803L225L972k016
1092h6J923K025p164k089Q397J756n269K72M9l800L643O581m635n228L201J119
1108F95j752M693J99q411Q5P264k18k474K012k628m483O011M843n756k699K547
1124g2j732M38O885j746q483J771M972j988N43K492n731k686P446K532n206j65
$$ plain form
1140 -730 -126 -4491 -1316 5572 1697 -4338 -1633 680 -1042 2626 3275 -4566 -5369 1881 1956 -858
1156 -858 1580 -466 -5096 -673 4952 52 -3361 -885 -2241 -1924 4444 3339 -4392 -3651 1235 -350
1172 -350 -118 2458 -1924 -5966 851 4523 -162 -1073 -486 -4040 -2096 4519 1778 -4335 -1613 614
1188 614 -1035 1794 3536 -3107 -5492 936 2369 69 1609 -27 -4710 -684 4884 691 -3028
1203 -3028 -508 -1002 -2035 3828 4620 -2828 -2854 2000 913 450 3003 -509 -4881 898 5402 979
1219 979 -156 875 -2283 -2195 4698 3220 -2665 -1168 1595 -147 2448 4883 -1327 -4603 1310 3456
1235 3456 610 1785 1667 -2837 -250 5858 2341 -2276 14 -65 -1439 4175 5103 -1455 -2686 2093
1251 2093 1420 314 3177 481 -4346 278 5299 1459 167 1641 -1931 -2277 3728 3709 -2417 -1751
$$ packed form
1140g30O04m365L175O888l875o035K705K313j722L668O49p841q03P250P5k814
1156h58K438k046m630M423N625m900l413K476j356L17O368j105p731P41M886j585
1172c50K32K576m382m042O817L672m685r11N87l554J944O615k741o113K722K227
1188F14j649K829J742o643k385O428J433k300J540j636m683M026N568m193l719
1203c028K520m94j033N863P92p448k6M854j087m63K553l512m372N779M504m423
1219I79j135J031l158Q8O893j478n885J497K763j742K595K435o210l276N913K146
1235C456k846J175j18m504K587O108l517m617K290p9j374N614R28o558j231M779
1251B093o73j106K863k696m827M624N021l840j292J474l572l46O005j9o126O66
$$ plain form
1267 -1751 1376 201 1726 4371 -1274 -4731 232 3154 408 1251 1878 -3400 -974 4351 2398
1282 2398 -2777 -1217 -960 -2020 1808 4320 -1641 -3253 1012 712 -696 1743 -7 -5037 -1159
1297 -1159 3858 1559 -773 367 -2434 -3413 2599 3135 -2652 -3144 628 -161 789 3317 -897 -5386
1313 -5386 -1259 1997 -556 -36 1007 -3103 -2069 3638 2341 -2861 -1623 -890 -2831 800 3955
1328 3955 -798 -3703 404 809 -556 1106 336 -4608 -1852 3817 1691 -1106 134 -1364 -3171
1343 -3171 1770 3153 -2590 -2943 460 174 513 3481 -54 -4713 -1404 2194 -707 -91 1144 -1820
1359 -1820 -2019 3118 2916 -2098 -1762 -966 -2503 537 4103 -118 -3926 75 1764 -330 1050 645
1375 645 -3881 -2350 3589 2268 -837 367 -980 -3015 1255 3104 -1512 -2902 424 325 477 3225
$$ packed form
1267a751L127j175J525K645n645l457M963K922k746Q43O27n278K426N325j953
1282B398n175J560K57j060L828K512n961j612M265l00j408K439j750n030L878
1297a159N017k299k332J140k801r79O012N36n787m92L772p89R50K528m214m489
1313e386M127L256k553N20J043m110J034N707j297n202J238P33j941L631L155
1328C955m753k905M107M05j365J662p70m944K756N669k126k797J240j498j807
1343c171M941J383n743l53L403k86L39K968l535m659L309L598k901O16J235k964
1359a820j99N137k02n014L36P96j537L040L566m221l808M001J689k094J380m05
1375F45m526J531N939j321l105J204j347k035M270J849m616j390L326r9J52K748
$$ plain form
1391 3225 1179 -4138 -1979 1773 15 -246 1231 -1660 -2867 2866 3606 -1376 -2139 -653 -1751 306
1407 306 4055 17 -3752 -85 1665 -507 700 828 -3490 -2651 2927 2440 -832 644 -224 -3041
1423 -3041 491 3298 -1107 -2810 145 412 381 3534 1820 -3696 -2433 1859 464 -508 1077 -1383
1439 -1383 -2603 2855 3776 -1205 -1852 -61 -1723 -695 3279 1131 -2919 -252 1943 -34 193 1124
1455 1124 -2642 -2726 2183 2874 -137 1241 560 -2467 134 3757 -442 -3121 -230 1070 561 3141
1471 3141 2145 -2674 -1845 2149 783 -683 1110 -198 -2187 2030 3887 -301 -1410 297 -1501
1486 -1501 -398 3218 1628 -2428 -348 2008 115 573 1660 -2190 -3401 1962 3137 265 195 520
1502 520 -1837 -193 3307 -158 -3393 -247 766 194 2481 2592 -2178 -2123 1721 747 -1163 677
$$ packed form
1391C225k046n317K159L752j758k61J477k891j207N733P40m982p63J486j098K057
1407C06L749m038l769L667J750k172J207J28m318Q39N578m87l272J476q68k817
1423c041L532K807m405j703K955K67l1L153j714n516J263M292j395r72J585k460
1439a383j220N458R21m981o47J791j662J028L974k148m050K667K195j977K27R31
1455A124l766q4M909O91l011J378o81l027K601L623m199k679K891J300n09K580
1471C141r96m819Q29L994j366j466J793j308j989M217J857m188j109J707j798
1486a501J103L616j590m056K080K356j893M58J087l850j211N363J175k872p0L25
1502E20k357J644L500l465l235L146J013n72K287J11m770N5L844r74j910J840
$$ plain form
1518 677 -274 -2827 913 3555 -44 -2003 -125 -1382 -1589 2836 1774 -2454 -1186 1737 337 168
1534 168 1211 -2750 -4201 852 2831 -537 -379 350 -1541 -530 2475 -616 -3602 -1319 477 -1235
1550 -1235 1357 2028 -2096 -2981 498 553 -1236 346 -689 -3216 93 3472 327 -2300 -1271 -1610
1566 -1610 -2009 2083 1093 -2637 -1805 1745 657 -330 682 -1937 -3871 9 1980 -795 -615 782
1582 782 -1418 -1370 2148 246 -3352 -1601 -196 -1189 1094 2692 -1210 -2684 846 1180 -748 109
1598 109 -158 -2861 -159 3805 948 -1843 -393 -812 -1580 1493 1418 -2053 -1269 2102 1209 -57 1306
1615 1306 -886 -3263 -538 1773 -158 -87 1118 -1281 -731 2506 1260 -2495 -1696 275 -97 1611
1631 1611 2856 -830 -2421 627 1731 -466 -168 -112 -2122 9 3652 1135 -1822 -416 -114 -1680
$$ packed form
1518F77r51k553L740K642l599j959J878j257k07M425j062m228J268K923j400j69
1534A68J043l961j451N053J979l368J58P29j891J011L005l091k986K283J796j712
1550a235K592O71m124q85L479N5j789J582j035k527L309L379l145k627J029l39
1566a610l99M092r90l730Q32L550j088r87J012k619j934L880J971k775J80J397
1582G82k200M8L518j902l598J751J405r93K283J598l902j474L530L34j928Q57
1598A09k67k703K702L964k857k791J450m19p68L073p5l471P84L371q93j266J363
1615A306k192k377K725K311j931P1J205k399N50L237j246l755P99J971l72J708
1631A611J245l686j591L048J104k197K98N6k010K131L643k517k957J406L02j566
$$ plain form
1647 -1680 738 1959 -1463 -1465 1495 1044 122 1588 -626 -3397 -1029 2424 540 -389 616 -1023
1663 -1023 -1101 2235 1280 -2577 -2190 145 -466 903 2432 -904 -2746 832 1492 -971 -536 274 -1977
1680 -1977 -709 2883 1358 -1310 -357 -463 -2043 398 1896 -1299 -1995 1058 1377 643 1376 -381
1696 -381 -3532 -1178 1913 320 -1007 135 -673 -590 2213 1691 -2189 -2078 470 -376 70 1970 164
1713 164 -1847 344 1273 -807 -223 304 -1724 -1312 2654 2194 -714 -432 -194 -1658 741 1940 -1093
1730 -1093 -2085 1165 1515 583 1484 236 -2475 -881 2019 511 -837 664 249 -531 1764 1724 -1280
1747 -1280 -1467 512 -328 -321 2402 921 -1658 -70 1634 -63 -463 265 -1884 -1484 2741 2504 -275
1764 -275 -390 107 -682 311 1704 -1145 -1954 799 2105 417 1391 369 -2009 -1175 1564 416 -1189
$$ packed form
1647a680K418J221l422kK960m51r22J466k214k771K368L453j884r29J005j639
1663a023p8L336r55l857L87K335o11J369J529l336j842L578O60k463M35Q10k251
1680a977J268L592j525k668R53j06j580K441J498l195o96L053L19p34P33j757
1696c81l151K354L091j593j327J142q08Q3K803n22l880J11K548q46M46J900j806
1713A64k011K191R29k080N84N27k028M12L966m60k908K82K38j464K399J199l033
1730a093r92L250L50r32R01j248k711J594K900j508j348J501m15p80K295m0l004
1747a280j87J979q40PK723j481k579J588J704j697m00P28k149M00M225k37k779
1764b75j15M97p89R93J393k849q09K753J306j688R74j022k378Q34K739j148j605
$$ plain form
1781 -1189 815 454 -1118 1120 2289 -935 -1995 -518 -530 -189 1818 769 -1916 -382 1978 132
1797 132 -629 -454 -1738 -1540 2003 2075 -1235 -815 200 -794 -299 1079 -956 -2229 370 1158 -133
1814 -133 727 1242 -1810 -1724 968 264 -1135 -127 -15 -1200 985 2393 -582 -2161 -451 -140 -540
1831 -540 1451 860 -2005 -599 1816 302 -958 -227 -1357 -1624 1151 2050 -590 -402 548 -820 -603
1848 -603 1390 -417 -2085 -285 891 663 1413 1440 -1426 -1823 1332 1105 -825 -312 144 -587 1686
1865 1686 2604 -572 -1745 -207 319 -335 1265 962 -1153 -200 1959 764 -592 652 -415 -1527
1881 -1527 1057 2148 510 80 850 -286 -303 1693 755 -2095 -259 1929 915 815 1466 -1437 -1449
1898 -1449 1492 1443 -594 -342 520 -105 1095 2534 77 -1212 144 398 -663 1010 1339 -615 -573
$$ packed form
1781a189K004l61j572K238J169l224j060J477j2L41K007j049k685J534K360j846
1797A32p61J75j284J98L543P2l310M20J015r94M95J378k035j273K599P88j291
1814a33Q60N15l052Q6K692p04j399J008J12j185K185J408k975j579J710L11m00
1831e40J991n91k865J406K415j514j260P31j130k67K775Q99k640J88R50j368K17
1848f03J993j807j668J800J176k28P50K7k866l97L155k27j930N13M56p31K273
1865A686R18l176j173J538N26o54J600l03k115R53K159j195j356J244j067j112
1881a527K584J091j638m30P70j136j7J996r38k850J836K188j014j00O51k903j2
1898a449K941m9k037K52Q62o25J200J439k457j289J356K54j061J673L29j954M2
$$ plain form
1915 -573 1445 795 -243 520 -606 -1996 548 2377 355 -561 156 -233 -41 1426 308 -2231 -505
1932 -505 1546 979 648 879 -764 -1381 596 822 -1088 -547 375 -75 77 2184 566 -1452 -80
1949 -80 -120 -535 526 1567 -1051 -945 1889 1193 120 -194 -1054 -1935 18 2056 87 -1003 426
1966 426 143 -305 720 31 -1951 -927 874 539 240 1123 -198 -1454 210 1088 -896 -565 284
1983 284 -828 -79 2008 1151 -1305 -607 -299 -236 700 1161 -612 -986 1726 1598 24 -230 -521 -1333
2001 -1333 -192 1527 531 -750 683 650 -331 759 736 -1689 -1027 896 483 595 1948 146 -1261
2018 -1261 365 1377 -218 -611 -59 -565 411 2045 1106 -1170 -690 508 -42 228 639 -848 -967
2035 -967 1432 1784 -128 143 -24 -1606 -509 1264 593 -296 461 284 -273 608 1195 -1766 -1487 389
$$ packed form
1915e73K018o50j038P63j126j390K544J829k022r16P17l89J92J467j118k539J726
1932e05K051n67l31K31j643o17J977K26j910N41R22m50J52K107j618k018J372
1949h0m0m15J061J041k618J06K834o96j073l14q60q81J953K038j969j090J429
1966D26k83m48J025o89j982J024J801l35k99Q83j321j256J664Q78j984L31Q49
1983B84j112P49K087q57k456O98L08O3R36M61j773l74K712j28j574k54k91q12
2001a333J141J719r96j281J433l3r81J090k3k425O62J923m13J12J353j802j407
2018a261J626J012j595l93N52n06R76J634r39k276M80J198n50K70M11j487j19
2035i67K399L52j912K71j67j582J097J773o71q89P57j77n57Q81N87k961K79J876
$$ plain form
2053 389 564 528 1457 17 -1396 -16 1416 -193 -1138 -177 -402 105 1597 981 -1250 -542 332 -178
2071 -178 -262 798 -579 -919 494 996 -266 -25 89 -1734 -962 945 688 -526 158 371 -322 725
2089 725 1153 -1371 -1932 261 631 239 673 175 -1284 369 1313 -315 -1195 -30 -323 -489 1292 1181
2107 1181 -550 -677 226 -559 -100 627 5 -1075 436 1385 472 378 418 -1257 -1136 1398 674 -441
2125 -441 182 416 146 1042 983 -633 -1128 468 664 -100 716 623 -557 -139 1418 -40 -659 -45 -210
2144 -210 -399 1097 1611 -548 -875 66 -295 -56 1087 -523 -1218 217 1749 558 126 -175 -1127 -669
2162 -669 1159 545 -853 -89 629 200 459 1097 -568 -1371 360 342 -94 646 567 -771 -466 1090 247
2181 247 -666 -580 -466 -748 741 1784 -519 -864 238 -115 -272 382 -226 -1275 370 1360 64 -461
$$ packed form
2053C89J75l6R29j440j413J380J432j609r45R61k25N07J492o16k231P08Q74n10
2071a78q4J060j377l40J413N02j262K41J14j823P72J907k57j214O84K13o93J047
2089G25M28k524n61K193L70l92M34m98j459J653R44j628q80J165k93j66J781j11
2107A181j731j27R03p85M59P27o22j080J511R49r13r4M0j675J21K534p24j115
2125d41O23K34k70Q96n9j616m95J596J96p64Q16r3j180M18J557j458o19O14j65
2144b10j89J496N14k159l27R41l61K39J143j610o95J435J532j191m32l01r52M58
2162f69J828o14j398P64P18m29K59O38j665q03J731j8m36P40p9j338L05J556q43
2181B47r13Q6J14k82J489J043k303l45J102l53j57O54o08j049J645R90j296n25
$$ plain form
2199 -461 32 -848 -1415 641 656 -900 -385 571 147 175 1031 -429 -1593 -307 152 -119 242 464 -952
2218 -952 -702 883 220 -529 -645 -464 -682 467 1565 -257 -1128 338 -133 -293 259 36 -1285 -115
2236 -115 911 250 95 377 -615 -1060 342 432 -931 -417 280 17 284 1183 -78 -1558 -388 164
2254 164 -98 588 448 -796 -511 1211 658 -700 -404 15 -555 455 1193 35 -439 286 152 -284
2272 -284 377 46 -1543 -549 972 824 156 479 -507 -1179 428 851 -808 -826 323 247 351 1180 -124
2291 -124 -1252 -376 528 355 44 551 -297 -460 1143 562 -665 -574 -258 -925 49 1164 260 -559 249
2310 249 -56 -321 262 496 -1211 -639 1180 471 -273 506 -628 -968 458 894 -689 -1013 287 -64
2328 -64 -128 732 22 -1175 -600 431 -224 -108 387 -402 -590 777 633 -390 -488 -74 -627 -11 1321
$$ packed form
2199d61M93q80n67K056J5j556N15R56m24K8Q56j460j164J286M59k71L61K22j416
2218i52K50J585o63p49j16J81k18J149J098j822q71J466m71j60N52k23j321J170
2236a15J026o61j55K82r92m45J402R0j363N14O97k63K67Q99j261j480J170N52
2254A64k62O86j40j244K85J722n53j358K96M19n70J010P38j158m74P25j34m36
2272b84O61l31j589R94J521j48o68L23r86o72J607M23j659j8J149p6J04Q29j304
2291a24j128Q76R04j73l11N07q48j63J603n81j227R1L16o67R74J115r04q19Q08
2310B49l05k65N83K34j707N72J819p09p44P79j134l40J426M36j583l24J300l51
2328f4o4Q60p10j197N75J031o55J16M95p89j88J367j44j023r8M14n53O16J332
$$ plain form
2347 1321 236 -687 -166 316 -357 291 30 -1668 -756 993 658 -8 84 -232 -681 125 890 -478 -511
2366 -511 102 -181 77 778 388 -796 -602 365 -234 -19 580 -167 -778 708 1089 -435 -789 -321 -407
2385 -407 -65 1063 246 -620 197 689 -310 24 187 -909 -662 924 476 -63 164 162 -631 -103 481 -411
2405 -411 -509 10 155 -333 595 725 -937 -859 308 41 9 429 -222 -862 700 1152 -292 -508 15 -712
2425 -712 -424 900 -12 -762 -188 592 -339 -6 429 -919 -899 406 477 -340 45 106 -629 -211 613 -130
2445 -130 -1044 -25 -45 -303 645 363 -947 -1054 41 -190 -503 79 -422 -757 458 638 -453 -712 -52
2464 -52 -554 -880 589 35 -820 -393 440 -293 -110 342 -927 -1359 -233 337 -298 -155 -166 -1127 -138 747
2484 747 -104 -881 -390 56 -392 308 734 -942 -876 287 -306 -63 301 -109 -618 220 973 112 -465 -27
$$ packed form
2347A321j085r23N21M82o73O48k61j698R12J749l35o66R2l16m49Q06P65j368l3
2366e11O13k83K58P01l90j184J94R67n99K15N99p47o11J486L81j524l54M68q6
2385d07L42J128q17q66Q17M92r99L34J63j096K47J586m48n39K27kp93N28N84q92
2405d11r8N19J45m88R28J30j662P8J167k67l2M20o51o40J562M52j444k16N23p27
2425g12K88J324r12p50N74P80r31L33M35j348K0J305P1q17L85O1p35M18Q24p43
2445a30r14J019k0k58R48k82j310j07J095k31l13N82n01l35J215J80j091k59O60
2464e2n02l26J469n54q55M27Q33p33J83M52j269m32J126N70o35J43j1r61R89Q85
2484G47q51p77M91M46m48P00M26j676O6J163n93K43L64m10n09Q38P53q61n77M38
$$ plain form
2504 -27 -815 -701 433 490 -750 -353 449 79 131 483 -704 -954 192 750 23 -103 289 -572 -127 884
2524 884 -192 -640 -142 286 205 640 891 -661 -740 141 395 88 312 252 -705 75 812 189 -383 -132
2544 -132 -132 -500 434 574 -501 -297 448 366 85 456 -767 -942 220 887 -53 -24 170 -445 -30 908
2564 908 422 -704 -22 -24 -121 613 619 -228 -776 -11 23 7 150 -333 -587 -213 663 157 -435 -197 -258 -456
2586 -456 227 446 -591 -263 261 28 -107 446 -175 -1224 -167 324 -339 -347 57 -517 -937 680 376
2605 376 -898 -380 -151 -305 62 734 -571 -823 63 300 -383 -152 -77 -704 -358 786 313 -665 -266
2624 -266 -48 -540 79 518 -550 -180 95 311 -173 236 -107 -1002 31 295 92 -140 107 -212 -282 539
2644 539 311 -950 -361 -129 -328 171 678 -339 -1030 17 232 158 14 251 -737 -214 692 263 -90
$$ packed form
2504b7p88J14J134N7j240L97Q02l70N2L52j187k50J146N58p27j26L92q61M45J011
2524H84j076m48M98M28q1M35K51j552p9Q81K54l07K24o0r57P80P37o23n72K51
2544a32%l68R34J40j075K04P45q2k81L71j223j75J162O67r40K9J94o15M15R38
2564I08m86j126O82kr7P34Oq47n48P65L4j6J43m83k54L74Q76n06n92K38o1j98
2586d56O83K19j037L28N24k33j35N53o21j049J057M91o63qM04n74m20J617l04
2605C76j274N18K29j54L67O72j305k52Q86K37o83K31P5o27L46J144m73r78L99
2624b66K18m92O19M39j068L70K75K16m84M09l43q95J033K64k03k32K47l19p0Q21
2644E39k28j261N89K32j99M99N07j017o91J047K15p4j44K37r88N23R06m29l53
$$ plain form
2663 -90 -218 -360 -256 219 455 -294 -319 212 316 -328 481 256 -788 -373 553 216 -223 79 -381 -355 498
2684 498 440 -436 -350 626 -317 236 753 300 -1023 110 495 -170 -111 189 -404 -476 619 546 -220 -122 -69
2705 -69 -462 346 484 -370 -533 38 384 114 317 418 -959 -461 273 41 -345 -108 -204 -393 432 490 -304
2726 -304 -412 -155 105 -255 560 11 -808 -154 415 92 21 417 -430 -663 618 480 -351 -310 38 -514
2746 -514 108 801 -82 -620 38 388 -116 100 509 -737 -726 594 68 -87 82 188 -443 270 811 -186
2766 -186 -674 -101 157 -53 667 415 -583 84 400 -222 56 183 -153 -19 496 367 175 -253 133 -455
2786 -455 29 415 19 -755 92 239 163 65 214 -616 -193 637 188 -188 146 238 -389 23 973 121 -847
2807 -847 274 -5 82 415 139 -479 -160 458 -18 -87 425 -331 -545 337 721 42 -268 40 -247 -129
$$ packed form
2663i0j28j42J04M75K36p49k5N31J04o44Q09k25j044M15R26l37m39L02m60K6Q53
2684D98n8q76Q6R76r43N53N17m53j323J133L85o65N9L00n93p2J095p3p66R8N3
2705f9l93Q08J38q54j63N71L46k70K03J01j377M98P34k32l86K37r6j89Q25N8p94
2726c04j08K57K60l60Q15n49q19O54N69l23p1L96q47k33J281j38q31M1L48n52
2746e14O22O93q83n38O58L50n04K16M09j246J1J320n26j55J69J06o31P13N41r97
2766a86m88N73K58k10P20k52r98O67L16o22K78J27l36J34N15j29j92m28L86n88
2786d55M84L86l96p74Q47J47p6r8J49q30M23Q30m49l76L34R2o27M12R50q52r68
2807h47J121k79Q7L33k76o18L19O18m76o9N12p56k14Q82L84o79l10L08k87J18
$$ plain form
2827 -129 450 260 -592 11 421 78 98 103 -380 -401 267 479 -99 -320 -56 -574 147 363 -425 -781 -136
2848 -136 68 32 278 302 -801 -488 511 -76 -175 118 -383 -575 347 422 86 -339 -59 -127 -4 384 193
2869 193 -638 -480 187 227 -105 504 -113 -574 319 348 -289 161 7 -189 181 571 239 -697 246 -96 86
2890 86 479 415 -748 71 357 315 91 150 151 -416 -216 325 -229 -332 -178 103 -104 369 321 -763 -262 651
2912 651 -13 112 525 -450 -865 182 539 -429 44 229 -320 -176 490 196 -277 -75 125 -121 430 539
2932 539 -460 -438 211 260 -202 283 157 -454 -84 431 183 33 -67 7 -16 416 318 -409 -465 199 84 435
2954 435 232 -194 -428 19 362 -107 91 -145 -212 -50 433 558 -449 -109 196 -127 -12 195 -284 -796
2974 -796 208 339 -284 49 101 -481 -217 663 -78 -331 -6 -229 -426 533 -129 -771 -216 229 -33 -259
$$ packed form
2827a29N79j90q52O03M10l43K0Nm83k1O68K12n78k21K64n18P21K16p88l56O45
2848a36K04l6K46K4j103L13R99n87r9K93n01j92R22P5l36m25K80o8J23L88j91
2869A93q31J58O67M0l32O09o17m61Q93K9o37M50j54j96L70L90l32r36R43l42J82
2890H6L93o4j163Q19K86m2k24N9Jn67K00N41n54j03J54K81k07M73m8j084N01R13
2912F51o64J25M13r75m15J047L57r68M73J85n49J44O66k94m73K02K00k46N51J09
2932E39r99K2O49M9m62M85j26o11L70N15k48j50j00P4k3M32r8p27n6O64j15L51
2954D35k03m26k34M47L43m69J98k36o7J62M83J25j007L40L05l23J15K07m79n12
2974g96J004J31o23L33N2n82K64Q80p41k53L25k23j97R59o62o42N55M45k62k26
$$ plain form
2994 -259 497 -158 -564 106 65 -80 -40 -23 -157 -199 596 285 -187 374 9 -208 211 315 -481 -634 108
3015 108 272 -228 97 255 -659 114 563 156 -248 -188 -15 -297 228 362 -346 -454 364 -21 -110 248 88
3036 88 -532 295 495 -63 -310 177 -274 -253 436 196 -123 -149 234 -1 -119 131 -195 -501 375 230 -109
3057 -109 287 369 -157 -144 495 177 -316 -31 28 -156 280 410 -177 -317 337 333 111 184 -84 -410 -117 333
3079 333 226 78 73 -155 -158 361 341 4 -280 96 -192 -14 341 -36 -265 180 406 -226 -33 12 -362 -287
3101 -287 278 387 -338 -178 240 -81 -88 375 -328 -435 352 238 -107 6 135 -307 -304 -153 132 66 2 -257
3123 -257 -373 294 139 -313 -172 31 -102 -17 489 -195 -410 -189 201 -62 1 213 -98 -249 372 256 -242
3144 -242 -230 44 -331 371 155 -227 -553 310 530 96 29 -108 -417 18 249 307 -311 172 -189 -222 135
$$ packed form
2994b59P56o55m06O70m1j45M0J7j34m2P95l11m72N61l65k17M19J04p96j53P42
3015A08J64n00L25J58r14P73M49m07m04O0J73k82N25J34p08j08Q18l85q9L58j60
3036H8o20Q27K00n58k47M87m51K1O89k40l19k6L83k35j18K50l26l06Q76j45l39
3057a09L96Q2n26J3O39l18m93K85N9j84M36J30n87j40O54mk22P3k68l26K93M50
3079C33j07j48nk28lN19k0l37k84L76k88J78L55l77k29M45K26o32J93M5l74P5
3101b87N65J09p25J60M18l21pM63p03j07P87j14l45J13J29m42LJ51K85o6o4k59
3123b57j16O67j55m52J41K03j33Q5N06o84k15K21L90k63O3K12l11j51O21j16m98
3144b42J2K74l75P02k16l82l26Q63K20m34o7j37l09M35K31N8o18M83l61l3L57
$$ plain form
3165 135 427 -317 -173 308 165 130 351 2 -725 241 496 242 -43 247 -401 197 655 372 -200 -98
3185 -98 214 39 233 399 97 -284 -88 186 31 25 -85 -234 -386 265 278 3 -164 72 -189 41 542
3206 542 -374 -122 52 -50 -280 361 283 -450 -176 494 -25 107 252 -9 -189 253 363 -437 -149 102
3226 102 47 106 363 -1 -230 -87 35 205 242 -60 -401 -183 334 263 172 -131 109 -48 104 543 148 -654
3248 -654 -171 -68 -174 219 244 -440 -238 121 168 -14 46 -147 -334 430 186 -149 -122 74 -312 -240 175 -158
3270 -158 -640 28 416 -30 313 -122 -50 -271 167 147 -220 -46 124 -189 315 428 -245 -470 296 -13 -150
3291 -150 229 215 -213 88 655 43 -148 -77 -180 -231 295 630 -73 -58 344 139 163 373 86 -527 -105 254
3313 254 79 194 27 -308 -375 -94 129 -223 144 177 -181 129 276 -120 -449 -118 -91 -47 188 -71 -426
$$ packed form
3165A35K92p44J44M81j43l5K21l49p27R66K55k54k85K90o48N98M58k83n72J02
3185i8L12j75J94J66l02l81J96K74j55oj10j49j52O51J3k75j67K36k61K30N01
3206E42r16K52J74j02k30O41p8p33K74O70n19J32J45k61j80M42J10q00K88K51
3226A02n5N9K57l64k29J43J22J70L7l02l41K18N17p1r1l03K40j57J52M39l95q02
3248f54M83J03j06L93K5o84K02L59M7j82O0j93j87P64k44l35K7J96l86P2M15l33
3270a58m82O68L88m46L43m35P2k21M38k0l67J74J70l13N04J13o73k25P66l09j37
3291a50L79j4m28L01N67o12j91P1j03n1N26L35p03J5M02k05K4K10k87o13M22L59
3313B54j75J15j67l35o7K81K23l52L67L3l58L10J47l96l29L31K7M4K35k59l55
$$ plain form
3334 -426 -353 333 -9 -69 104 -167 -331 164 385 -31 -32 -125 17 3 247 160 -181 -157 194 0 207 510 -100
3357 -100 -546 78 278 -216 -23 91 -218 -129 513 -145 -155 -219 176 89 223 186 -429 -381 241 219 68 200
3379 200 109 -105 213 343 -264 -106 -7 -193 -55 60 -105 -277 -31 189 174 274 349 -40 -536 193 196 226
3401 226 61 139 -312 -203 499 241 -336 -57 -15 -118 4 146 -126 -329 391 -77 -290 130 95 -73 -176
3422 -176 377 13 -246 105 -82 -113 -76 153 -376 -45 57 145 274 428 -221 -166 -71 172 -180 -323 -79 -147
3444 -147 90 358 184 -235 -277 301 255 301 615 -310 -269 55 10 145 197 -176 -227 -229 487 219 -192 -13 17
3467 17 47 307 -56 -334 -198 151 79 135 -102 -109 -284 264 87 -87 -25 192 -24 170 189 58 -141 -131 47
3490 47 -4 12 427 -38 -233 326 45 -228 10 -48 -353 -277 330 6 -261 -134 74 -111 -91 249 32 -445
$$ packed form
3334d26P3O86l42o0J73k71j64M95K21m16jr3J42j4K44q7l41K4L51j94K07L03o10
3357a00m46O24K00m94J93J14l09Q9O42o58j0o4L95q7J34l7o15M8O22k2j51J32
3379B00r1k14L18J30o07J58R9j86J38J15j65j72K46K20j5J00P5l89m96P29LL0
3401B26j65P8m51J09P02k58n77K79M2j03J22J42k72k03P20m68k13M20l5j68j03
3422a76N53l64k59L51j87l1L7K29n29L31J02Q8J29J54o49N5R5K43l52j43K44o8
3444a47K37K68j74m19m2N78m6M6L14r25M1L24m5J35N2l73n1kP16k68m11J79L0
3467A7L0K60l63k78J36L49p2N6k37pj75N48j77j74O2K17k16J94J9j31j99J0J78
3490D7n1J6M15m65j95N59k81k73K38n8l05P6O07l24k67J27K08j85K0L40k17m77
$$ plain form
3512 -445 -72 61 195 115 -218 -308 -65 -161 -41 -209 -2 182 -153 -6 217 -365 -305 58 -148 62 13 -36
3534 -36 -249 -82 132 -101 192 147 -106 146 -14 91 -482 -26 84 -156 -20 107 -116 -432 286 179 204
3555 204 120 197 -77 -34 145 221 -172 -104 -201 -82 208 204 -501 -295 109 72 -309 465 97 -425 -26 377 -153
3578 -153 -104 131 133 -261 377 281 -31 386 15 -162 -20 94 53 -219 165 289 54 -34 218 -139 250 644
3600 644 -107 -90 -85 -12 -144 289 71 33 -348 -113 137 -140 167 -104 -70 -74 231 -171 -348 -137 -233 129 8
3623 8 379 -151 2 324 -233 -27 214 8 -378 -47 202 26 148 34 -235 -241 189 170 -48 -65 -51 -47 39
3646 39 306 0 -213 218 -5 -79 188 -56 -268 -231 467 208 -529 12 10 -116 391 141 85 263 -4 50
3668 50 74 64 -188 -399 29 431 -61 -108 145 -39 -190 326 -125 -13 225 -167 -124 245 286 99 -274 35
$$ packed form
3512d45L73J33J34q0l33r0K43r6J20j68K07J84l35J47K23n82O0L63k06K10m9m9
3534c6k13J67K14k33K93m5k53K52j60J05n73M56J10k40J36J27k23l16P18j07K5
3555B04q4P7k74M3J79P6l93O8r7J19K90mp05K06M04l7l81P74l68n22L99M03n30
3578a53M9K35Kl94O38r6l12M17l71j77J42J14m1k72L84J24k35q8K52l57L89L94
3600F44p51J7NP3j32M33k18l8l81K35K50k77L07k71L4mL05m02j77K11r6L62j21
3623HL71n30J53L22n57K06K41k06l86L31K49j76J22j14k69oM30j9k18j7J4MQ6
3646C9K67l06k13M31k23p4K67k44k12L7O98k59p37N41kj26N07k50n6J78k67N4
3668E0K4j0k52k11M28M02m92m7K53j84j51N16m51J12K38l92M3L69M1j87l73L09
$$ plain form
3690 35 211 -93 215 98 -203 223 77 0 -208 -421 -144 -385 374 482 63 -181 332 24 138 116 12
3711 12 -279 18 29 -215 83 211 -17 54 74 3 -162 226 79 47 277 374 -5 -309 40 42 176 -27 192
3734 192 -445 3 110 23 -176 92 -2 119 119 434 -58 -264 7 -30 223 23 24 -203 -149 108 -74 73 107
3757 107 -126 -182 32 225 -320 94 -37 59 -70 -77 65 -312 181 -237 30 54 -47 5 -120 15 -57 -87 35
3780 35 101 -103 338 135 227 -72 154 235 -149 210 63 -207 -177 214 -43 -94 164 35 -307 86 216 -464
3802 -464 -70 -130 -157 -64 421 -32 -177 118 -9 28 -55 63 -171 -160 98 327 15 -52 7 -94 -17 455 295
3825 295 -13 371 8 -156 133 -174 -119 -53 174 197 60 98 -27 -58 116 57 -99 -148 16 5 48 459 225
3848 225 -245 240 17 17 94 31 36 -242 -19 281 136 -22 -29 -267 -451 17 -210 -465 -69 62 -202 138 147
$$ packed form
3690C5J76l04L08j17l01M26j46p7k08k13K77k41P59J08m19k44N13l08J14k2j04
3711A2k91K97J1k44K98J28k28P1K0p1j65L88j47l2K30R7l79l04L49KJ34k03K19
3734A92o37M48J07q7j99K68r4J21%L15m92k06K71l7K53k00Jk27N4K57j82J47L4
3757A07k33n6K14J93n45M14j31R6j29pJ42l77M93m18K67K4j01N2j25J35p2l0J22
3780C5O6k04M41k03R2k99K26Q1l84L59j47k70L0L91k57n1K58j29l42L93J30o80
3802d64L94o0k7R3M85m53j45K95j27L7q3J18k34J1K58K29l12o7N9j01P7M72j60
3825B95l08L84l63j64K89l07N5O6K27K3j37L8j25l1J74n9j56m9J64j1M3M11k34
3848B25m70M85k23%P7o3Nk78K23L00j45j58pk38j84M68k27k55L96J31k64L40R
$$ plain form
3871 147 -411 -418 51 181 -33 43 327 -292 76 126 -164 -72 107 -76 206 363 199 -223 -97 1 -91 44
3893 44 219 -137 -204 210 69 64 182 -5 -117 -162 145 -13 -242 314 51 -129 224 201 -355 37 274 197
3915 197 -215 -13 48 -114 -57 173 -196 -115 121 -298 -151 222 107 -191 -99 163 19 -94 338 -86 -113 -138
3937 -138 454 62 -1 5 -174 -137 134 298 -29 -9 -127 -30 -48 277 26 -249 -22 136 -106 231 138 180 73
3960 73 166 214 -86 -197 195 8 422 127 -45 106 132 -194 -290 -157 24 -172 89 214 229 41 -370 31
3982 31 -20 143 -229 29 -176 148 -18 -25 215 43 -316 -18 277 294 -52 31 146 -46 137 89 -333 169
4004 169 57 -217 179 241 -272 -34 79 -40 -268 -173 48 -157 141 120 38 22 -8 -291 -363 -126 -120 -199 -105 141
4028 141 -15 22 -18 226 -159 -11 177 -148 155 -107 88 -98 302 119 42 105 226 -84 305 172 -93
$$ packed form
3871A47n58pM69J30k14P6K84o19L68N0k90R2J79j83K82J57j64m22J26R8r2J35
3893D4J75l56o7M14j41nJ18j87j12m5L07j58k29N56k63j80L53k3n56L92K37p7
3915A97m12K02O1j62N7K30l69Q1K36m19J47L73j15k98R2K62j44j13M32m24k7k5
3937a38N92l92o3Oj79L7K71J64l27K0j18R7j8L25k51k75K27J58k42L37r3M2j07
3960G3R3M8l00j11L92j87M14k95j72J51K6l26r6J33J81j96K61J25J5j88m11M01
3982C1n1J63l72K58k05L24j66pK40j72l59K98K95J7l46Q3J15j92J83m8m22N02
4004A69j12k74L96O2n13K38J13j19k28R5K21k05K98k1q2j6l0k83p2K37Op9R4K46
4028A41j56L7m0K44l85J48J88l25L03k62J95j86M00j83p7O3J21l10L89j33k65
$$ plain form
4049 -93 -158 -3 -59 -118 49 112 -363 -46 325 97 -15 -10 -186 -30 286 107 21 177 210 -229 36 259 -192
4072 -192 -205 346 -176 -133 60 187 -178 -194 -109 177 1 95 -79 -2 -47 22 116 37 229 550 51 83 -90 -422
4096 -422 -42 332 128 -191 76 17 -257 -16 -22 -4 -94 -57 142 -111 272 -304 -129 -169 -41 74 228 234 224
4119 224 66 206 226 -89 -183 -64 -321 253 27 -180 -242 49 349 -149 -362 238 -462 -87 278 121 0
4140 0 81 94 -61 94 -45 -104 22 -125 -152 140 403 196 -520 -201 72 -91 -220 234 -142 -128 240 180 88
4163 88 -4 -188 -152 134 187 65 45 156 79 -158 9 157 -198 -75 -46 223 -167 246 122 -168 27 26 39
4186 39 -239 145 130 -81 140 197 24 -215 254 -39 -31 -172 167 -120 9 -220 201 42 306 10 -105 175
4208 175 8 -33 -33 16 -215 38 -52 -214 184 -62 137 207 338 43 -238 12 110 -14 -34 44 171 170 -49 334
$$ packed form
4049i3o5J55n6n9J67O3m75L17L71k28j12Nj76J56L16j79q6J56L3m39K65K23m51
4072a92j3N51n22M3J93J27l65j6Q5K86j76R4j74P7m5O9R4p9J92L21m99L2j73l32
4096d22L80L74k04l19K67n9k74K41oJ8r0L7J99k53L83n76J75m0J28J15J54Oj0
4119B24j58J40K0l15r4J19k57N74k26k07o2K91L00m98k13O00p00L75L65j57j21
4140@Q1J3j55J55j39n9J26j47k7K92K63k07p16L19K73j63j29M54l76J4L68o0r2
4163H8r2j84L6K86N3j22k0J11p7k37J67J48l55J23K9K69l90M13j24k90J95jJ3
4186C9k78L84j5k11K21N7j73k39M69k93Qj41L39k87J29k29M21j59K64k96j15K80
4208A75j67m1%M9k31K53r0j62L98k46J99P0J31k95k81K50R8j24k0P8J27jk19L83
$$ plain form
4232 334 -142 337 1 -56 -126 124 133 -319 142 121 -344 -396 87 -141 72 97 -16 -277 -4 217 -226 101
4254 101 60 3 -147 68 391 138 -113 -90 36 103 -126 -207 56 69 121 -125 152 150 -178 22 -39 -30 22 231
4278 231 -1 10 151 281 170 -393 -13 -71 163 76 212 -398 -64 130 -6 -24 307 -170 -48 54 68 56
4300 56 94 323 -110 79 97 38 -92 109 -73 16 -118 104 -86 -232 29 -35 -219 286 263 -171 309 294 -318
4323 -318 59 350 -212 72 167 215 -69 -233 20 67 -201 196 126 -151 418 111 91 -120 241 -34 -47 394
4345 394 168 -211 313 -104 -23 -22 278 164 -142 212 18 -249 178 369 -161 78 427 32 -306 99 -104
4366 -104 159 160 -52 -143 -115 -100 267 -41 15 -174 -359 54 38 52 158 100 -159 9 197 -58 -321 63 -13
4389 -13 -121 53 150 -230 -377 -34 42 -88 -68 57 -56 -73 371 -64 128 337 159 -139 116 167 -357 -254
$$ packed form
4232C34m76M79l36n7p0K50Rm52M61k1m65n2M83k28K13K5j13k61K73K21m43L27
4254A01m1n7j50K15L23k53k51K3J26O7k29q1K63J3N2k46K77kl28K00o1RN2K09
4278B31k32J1J41J30j11n63L80n8K34q7J36o10L34J94j36j8L31m77J22J02J4j2
4300E6L8K29m33J89J8n9j30K01j82Q9j34K22j90j46K61o4j84N05k3m34M80j5o12
4323c18L77K91n62K84R5M8k84j64K53M7k68L97p0k77N69l07k0k11L61k75j3M41
4345C94k26l79N24m17Q1JL00j14l06L54j94k67M27J91n30K39L49l95l38M05k03
4366a04K63Jk12r1K8J5L67l08N6j89j85M13j6J4J06n8k59J68J88k55k63L84p6
4389a3j08J74R7l80j47L43P6j30K0J25j13j7M44m35J92K09j78k98K55N1n24J03
$$ plain form
4411 -254 248 28 150 184 64 19 -102 236 88 53 1 -110 -95 189 14 -242 -102 196 -17 142 -40 -261
4433 -261 36 -120 428 -87 87 -14 -102 -108 111 145 -219 39 168 25 39 154 271 -220 150 56 -6 -8 -100
4456 -100 -89 83 232 26 -12 -27 -206 -230 -44 -172 -17 -11 183 175 6 278 85 -78 -361 258 99 165 -130
4479 -130 -33 -163 152 76 141 180 106 -29 -215 459 -303 8 298 -20 -189 143 136 1 17 150 -144 -311 -44
4502 -44 175 -313 29 250 -98 -162 42 120 -84 197 75 -52 189 239 -20 -286 154 -91 206 202 -70 282
4524 282 -87 -67 99 45 142 3 -335 354 200 -123 195 223 -61 -221 124 107 -294 -65 233 -172 105 238
4546 238 9 -117 -69 123 217 192 -135 -190 174 -130 -82 20 -24 -37 -96 52 219 154 -67 156 139 164 290 -108
4570 -108 -203 124 96 54 192 -94 -60 -49 138 208 20 28 13 -492 -120 -33 -246 -99 -63 -214 -224 228 235 -213 10
$$ packed form
4411b54N02k20J22L4j20m5j21L38j48l5n2j11J5K84j75k56J40K98k13J59j82k21
4433b61K97j56N48n15J74j01q8oK19L4l64K58J29j43J4J15J17m91L70r4o2kr2
4456a00J1J72J49k06l8j5j79k4J86j28J55OJ94qj69K72j93j63k83O19j59O6k95
4479a30R7j30L15p6O5L9p4j35j86O74p62L11K90l18j69L32pj35J6J33k94j67K67
4502d4K19m88L42K21l48o4K04P8k04K81j22j27K41N0k59k66M40k45K97mk72L52
4524B82l69K0J66n4R7j39l38O89j54l23L18K8k84j60L45j7m01K29K98m05K77J33
4546B38k29j26M8J92R4k5l27n5L64l04M8J02m4j3n9J48J67o5k21K23j7K5J26l98
4570a08r5L27k8m2J38k86L4J1J87P0j88Qj5n05L72Q7k13J47L6j51j0M52Pm48K23
$$ plain form
4595 10 -14 -196 -3 43 40 -115 225 291 12 282 28 -91 -50 47 105 -297 20 193 -50 14 -38 -157 -207 -38
4619 -38 182 -192 45 24 208 343 -129 -193 123 117 -116 40 188 34 100 221 178 77 -166 175 135 -188 -258
4642 -258 174 -7 -103 -292 -41 -66 19 5 -511 22 328 -89 -120 198 -8 42 287 -147 31 -12 -123 -153 -62
4665 -62 246 -219 -178 161 -188 -260 33 -62 -82 -157 216 -33 -79 152 -191 -180 -168 15 -190 -17 226 60 47
4688 47 70 -72 -115 -72 60 205 -28 1 -71 -109 -97 5 -75 26 41 3 -108 246 40 -310 156 -60 132 3
4712 3 13 -322 -256 74 15 118 -199 166 -213 -186 53 -250 37 115 -101 48 225 221 -435 143 89 67 138 -129
4736 -129 -18 -96 -73 -229 -222 210 173 -233 66 320 -26 -174 61 -279 -106 149 194 191 -233 68 -95 -161 281
4759 281 216 -41 -199 174 214 198 79 60 4 20 96 -144 -207 476 82 -236 -88 -116 -223 141 370 47 -332
$$ packed form
4595A0k4j82J93M6lj55L40O6k79K70k54j19M1R7N8m02L17J73k43O4n2j19n0J69
4619c8K20l74K37k1J84J35m72o4L16ok33J56J48j54O6J21m3j01k43L41m0l23p0
4642b58M32j81r6j89K51k5Q5j4n16N33L06m17l1L18k06N0K45m34J78m3j11l0R1
4665f2L08m65M1L39l49p2K93r5k0p5L73k49m6K31l43J1J2J83k05J73K43j66j3
4688D7K3j42m3M3J32J45k33K9p2l8J2J02q0J01J5l8j11L54k06l50M66k16J92j29
4712CJ0l35O6L30n9J03l17L65l79K7K39l03K87P8k16J49J77mo56N78n4k2P1k67
4736a29J11p8K3j56PM32l7m06K99K54l46j48K35l40J73K55M5lm24L01j63o6M42
4759B81o5k57j58L73M0j6j19j9n6J6P6k40o3O83l94l18J48k8j07L64K29l23l79
$$ plain form
4782 -332 -118 -98 -450 -36 -177 5 -168 -82 16 78 77 -392 -533 146 102 -221 66 -101 121 -131 25 170
4804 170 -125 -218 -280 -404 109 -155 -162 -39 -228 157 57 71 -328 -301 41 -53 -267 -42 240 72 31 -92 87
4827 87 34 -48 26 -8 -60 254 -175 -197 387 -31 -47 -247 -58 -285 -23 271 -40 -14 -105 -108 5 -210 311 -268
4851 -268 -94 -68 194 149 -89 67 -130 202 -321 39 158 -431 69 -56 92 202 -341 207 417 -90 -89
4872 -89 175 -262 -290 -3 316 -60 26 -14 -146 -190 28 338 -416 -207 292 -196 269 26 -62 -203 370 263
4894 263 41 202 98 -165 -72 -450 52 89 110 76 -202 109 -69 94 -101 18 278 -39 -187 54 -30 4
4916 4 14 -74 -141 164 -49 -260 -5 -80 139 142 -118 334 46 121 353 -261 25 102 -77 60 184 -198 -33
4939 -33 42 -60 181 90 107 139 -146 307 -49 -269 231 10 -289 -72 -130 -50 -58 113 -184 -43 251 -217 -288
$$ packed form
4782c32K14K0l52M14j41J82j73Q6R8O2jm69j41O79m4l23K87j67K22k52J56J45
4804A70k95r3o2j24N13k64pJ23j89L85j00J4l99K7L42r4k14K25K82j68m1j23J79
4827H7n3q2P4l4n2L14m29k2N84m18j6k00J89k27K62K94l11K6r1lJ13k15N21n79
4851b68J74K6K62m5k38J56j97L32n23L60J19n89N00j25J48J10n43N48K10n07J
4872h9K64m37k8K87L19l76Q6m0j32m4K18L10p54K09M99m88M65k43q8j41N73j07
4894B63k22J61j04k63R3l78N02L7K1l4k78L11j78J63j95J19K60l17j48K41q4L4
4916DJ0q8o7L05k13k11K55p5K19Lk60M52k88P5K32o14K86P7j79J37J24l82J65
4939c3P5j02K41r1J7L2k85M53l56k20N00k21k99K17n8Q0qJ71k97J41K94m68p1
$$ plain form
4962 -288 71 -110 -278 -38 -22 106 53 -230 85 340 79 217 -179 139 30 -83 187 82 277 88 -30
4983 -30 -116 -374 178 239 225 -80 33 215 37 164 212 -100 -184 -7 -18 -289 14 -102 -282 14 -91 117
5005 117 -118 -69 -30 -336 -29 -13 136 92 137 54 -77 -25 -44 -19 -3 76 -286 -107 77 -120 -278 -13 131 -295
5029 -295 64 114 -312 -112 44 -42 61 -42 -28 -170 253 97 -280 202 277 -141 17 -285 3 -70 230 47
5051 47 -50 -45 -233 29 -303 155 2 23 115 87 -57 4 355 -152 -19 70 -168 6 241 45 -87 278 -118
5074 -118 -186 -80 291 -37 79 -115 -165 140 155 177 -290 -55 -35 -432 0 126 -22 -224 110 273 -233 145
5096 145 -123 70 -30 82 -216 4 -14 41 109 -88 -17 24 -62 170 94 -226 -180 -51 -87 26 76 197 -124
5119 -124 -8 180 -298 47 -107 -163 40 308 68 35 -23 157 -70 23 24 113 -143 -182 156 175 79 215 116 -187
$$ packed form
4962b88L59j81j68K40J6J28n3k83L15K55k61J38l96L18j09j13K70j05J95j89j18
4983c0q6k58N52O1j4l05J13J82j78J27M8l12q4J77j1k71L03j16j80K96j05K08
5005A17k35M9L9l06L07J6J49m4M5q3j31N2j9K5J6P9l62J79J84j97j58K65J44m26
5029b95L59N0m26K00J56q6J03j03J4j42M23j56l77M82P5m18J58l02K88p3L00j83
5051D7r7Nj88K62l32M58j53K1R2k8j44O1L51n07J33Q9k38J74K35j96j32L65l96
5074a18o8J06L71l28J16j94n0L05J5K2m67K35K0l97M32J26j48k02L34J63n06L78
5096A45k68J93j00J12k98K20j8N5O8j97P1M1q6K32p6l20M6J29l6J13N0J21l21
5119a24J16J88m78L45j54n6K03K68k40l3n8J80k27R3JQ9k56l9L38J9r6J36r9l03
$$ plain form
5143 -187 208 31 -281 43 32 -183 -116 179 -24 -229 159 -136 -106 -31 -144 65 -29 67 -111 -180 543 225
5165 225 -358 244 -224 28 20 127 -108 -179 92 121 -145 -79 65 -55 -76 81 537 55 123 -99 111 240
5187 240 -236 25 46 -3 -117 -88 -155 -80 84 -206 102 56 -134 -136 -161 -173 173 -265 -4 197 116 -228 -16 -62
5211 -62 -110 -66 280 127 -378 171 -67 -60 159 113 41 -47 66 -10 364 -163 -35 163 14 34 -190 -166 -231 95
5235 95 132 161 -89 -1 -41 -223 332 -6 -191 55 -241 -20 30 -60 -168 350 35 224 54 69 -319 126 121
5258 121 -189 286 -243 -11 -267 140 -150 168 199 194 -32 -27 48 -199 81 -61 -18 -27 43 63 -160 10 -210 33
5282 33 136 129 72 -264 -208 -18 138 75 -213 115 -230 138 335 -75 55 109 9 -233 -288 -131 -29 -36 155
5305 155 -386 -1 307 181 -126 258 -14 -122 390 -117 -99 344 201 9 -311 -151 110 -27 -113 -29 53
$$ packed form
5143a87L95j77l12L24j1k15O7K95k03k05L88k95L0P5j13K09r4R6j78o9P23l18
5165B25n83O02m68K52qJ07k35p1K71K9k66O6J44j20k1J57M56m82O8k22K10J29
5187B40m76K61K1m9j14K9o7P5J64k90L08m6j90kk5j2L46m38K61K01q1l44K12m6
5211f2m8M4L46j53n05N49k38PK19m6p2q8J13p6L74n27J28J98j49K0k24K4o5L26
5235I5L7K9k50Q8m0j82N55l38j85K46k96K21N0r0j08N18l15J89j70J5l88M45n
5258A21l10M75n29K32k56M07k90L18L1nk26NP5k47K80j42M3rP0K0k23J70k20K43
5282C3J03pn7l36N6J90J56o3k88L28l45L68J97m10J30N4j00k42n5J57J02pJ91
5305A55n41L85L08j26l07L84k72j08N12n07J8M43j43j92l20J60K61j37q6Q4Q2
$$ plain form
5326 53 -156 -73 -26 96 63 1 -161 -243 23 58 -47 101 -161 11 -103 151 -77 140 243 112 -56 -55 68
5349 68 -65 125 -68 334 -39 -23 -21 -33 22 -44 -214 -71 174 80 -152 190 -57 -22 -46 2 95 54 -32 -63 103
5374 103 109 17 -169 121 130 -203 141 29 118 310 74 -102 200 89 -184 -355 57 142 -175 90 -90 89
5396 89 119 171 6 252 -112 -56 -16 -31 198 1 -23 -36 67 107 29 302 -80 -58 -31 -30 382 -36 -186 -31 46
5421 46 -242 -7 312 93 -163 384 162 279 -147 107 49 -103 30 -25 -23 -112 220 153 215 -85 -234 -143 -97
$$ packed form
5326E3k09Q3M7J22l3o2j62q2K66L5j05J48k62J72j14K54k28K17J03j31j68JJ23
5349F8j33J90j93M02l73J6Kj2N5o6j70J43K45r4k32L42k47L5k4M8R3m1q6l1J66
5374A03Or2j86K90Rl33L44j12Q9J92k36j76L02j11k73j71M12Q5l17K65j80J79
5396H9L0N2j65K46l64N6M0j5K29j97k4j3J03M0p8K73l82K2K7JM12m18j50J55P7
5421D6k88K35L19k19k56N47k22J17m26K54n8j52J33n5Kq9L32o7O2l00j49R1M6
$$ [...]
8191I
##END NTUPLES=NMR FID
##END=
