##TITLE=1H_CA-8683
 CDCl3, 8 sc, 
 31.1.2020
##JCAMPDX= 6.0         $$ Bruker NMR JCAMP-DX V2.0
##DATA TYPE= NMR FID
##DATA CLASS= NTUPLES
##ORIGIN= UXNMR, Bruker Analytische Messtechnik GmbH
##OWNER= root
$$ XWIN-NMR		Version 3.5
$$ Fri Jan 31 14:13:57 2020 Russian Standard Time (UT+4h)  she@DPX200
##.OBSERVE FREQUENCY= 200.1315
##.OBSERVE NUCLEUS= ^1H
##.DELAY= (6, 6)
##.ACQUISITION MODE= SIMULTANEOUS
##.ACQUISITION SCHEME= undefined
##.AVERAGES= 8
##.DIGITISER RES= 18
##SPECTROMETER/DATA SYSTEM= spect
##.PULSE SEQUENCE= zg30
##.SOLVENT NAME= CDCl3
##.SHIFT REFERENCE= (INTERNAL, CDCl3, 0, 15.7039)
##AUDIT TRAIL= $$ (NUMBER, WHEN, WHO, WHERE, WHAT)
$$ ##TITLE= Audit trail, XWIN-NMR		Version 3.5
$$ ##JCAMPDX= 5.01
$$ ##ORIGIN= Bruker BioSpin GmbH
$$ ##OWNER= she
$$ F:/spectra/data/she/nmr/H-F/1/audita.txt
$$ ##AUDIT TRAIL=  $$ (NUMBER, WHEN, WHO, WHERE, WHAT)
(   1,<2020-01-31 14:12:42.64 +0400>,<she>,<DPX200>,
      <created by zg, POWCHK disabled, PULCHK disabled
       configuration hash MD5:
       00 E9 B6 7A A2 85 ED C7 34 08 36 98 17 FE 4E 26
       data hash MD5: 16K
       46 DB 53 42 8B 5F D1 D2 4A A7 80 B3 32 F9 91 7E>)
$$ ##END=
$$ 
$$ hash MD5
$$ FA 89 D2 1C 4F E0 21 72 6B 5A 8D 6E BE 21 1C 6F
##$RELAX= 
##$RELAX= 
##$RELAX= 
##$RELAX= 
##$RELAX= 
##$RELAX= 
$$ Bruker specific parameters
$$ --------------------------
##$DU= <F:/spectra>
##$EXPNO= 1
##$NAME= <H-F>
##$PROCNO= 1
##$TYPE= <nmr>
##$USER= <she>
##$AMP= (0..31)
100 100 100 100 100 100 100 100 100 100 100 100 100 100 100 100 100 100 
100 100 100 100 100 100 100 100 100 100 100 100 100 100 
##$AQSEQ= 0
##$AQ_mod= 1
##$AUNM= <au_zg>
##$AUTOPOS= <>
##$BF1= 200.13
##$BF2= 200.13
##$BF3= 200.13
##$BF4= 200.13
##$BF5= 200.13
##$BF6= 200.13
##$BF7= 200.13
##$BF8= 200.13
##$BYTORDA= 1
##$CFDGTYP= 0
##$CFRGTYP= 5
##$CHEMSTR= <none>
##$CNST= (0..31)
1 1 145 1 1 1 1 1 1 1 1 1 1 1 1 1 1 1 1 1 1 1 1 1 1 1 1 1 1 1 1 1 
##$CPDPRG= <>
##$CPDPRG1= <>
##$CPDPRG2= <>
##$CPDPRG3= <>
##$CPDPRG4= <mlev>
##$CPDPRG5= <mlev>
##$CPDPRG6= <mlev>
##$CPDPRG7= <mlev>
##$CPDPRG8= <mlev>
##$CPDPRGB= <>
##$CPDPRGT= <>
##$D= (0..31)
0 1.2 0 0 0 0 0 0 0 0.06 0 0.03 0 0 0 0 0.0002 0 0 0 0 0 0 0 0 0 0 0 0 
0 0 0 
##$DATE= 1580465562
##$DBL= (0..7)
120 120 120 120 120 120 120 120 
##$DBP= (0..7)
150 150 150 150 150 150 150 150 
##$DBP07= 0
##$DBPNAM0= <>
##$DBPNAM1= <>
##$DBPNAM2= <>
##$DBPNAM3= <>
##$DBPNAM4= <>
##$DBPNAM5= <>
##$DBPNAM6= <>
##$DBPNAM7= <>
##$DBPOAL= (0..7)
0.5 0.5 0.5 0.5 0.5 0.5 0.5 0.5 
##$DBPOFFS= (0..7)
0 0 0 0 0 0 0 0 
##$DE= 6
##$DECBNUC= <off>
##$DECIM= 24
##$DECNUC= <off>
##$DECSTAT= 4
##$DIGMOD= 1
##$DIGTYP= 9
##$DL= (0..7)
0 120 120 120 120 120 120 120 
##$DP= (0..7)
150 150 150 150 150 150 150 150 
##$DP07= 0
##$DPNAME0= <>
##$DPNAME1= <>
##$DPNAME2= <>
##$DPNAME3= <>
##$DPNAME4= <>
##$DPNAME5= <>
##$DPNAME6= <>
##$DPNAME7= <>
##$DPOAL= (0..7)
0.5 0.5 0.5 0.5 0.5 0.5 0.5 0.5 
##$DPOFFS= (0..7)
0 0 0 0 0 0 0 0 
##$DQDMODE= 0
##$DR= 18
##$DS= 0
##$DSLIST= <SSSSSSSSSSSSSSS>
$$ [...]
##$SUBNAM2= <"">
##$SUBNAM3= <"">
##$SUBNAM4= <"">
##$SUBNAM5= <"">
##$SUBNAM6= <"">
##$SUBNAM7= <"">
##$SUBNAM8= <"">
##$SUBNAM9= <"">
##$SW= 24.9337058887773
##$SWIBOX= (0..15)
0 0 2 0 0 0 0 0 0 0 0 0 0 0 0 0 
##$SW_h= 4990.01996007984
##$TD= 16384
##$TD0= 1
##$TE= 0
##$TE2= 300
##$TE3= 300
##$TEG= 300
##$TL= (0..7)
0 120 120 120 120 120 120 120 
##$TP= (0..7)
150 150 150 150 150 150 150 150 
##$TP07= 0
##$TPNAME0= <>
##$TPNAME1= <>
##$TPNAME2= <>
##$TPNAME3= <>
##$TPNAME4= <>
##$TPNAME5= <>
##$TPNAME6= <>
##$TPNAME7= <>
##$TPOAL= (0..7)
0.5 0.5 0.5 0.5 0.5 0.5 0.5 0.5 
##$TPOFFS= (0..7)
0 0 0 0 0 0 0 0 
##$TUNHIN= 0
##$TUNHOUT= 0
##$TUNXOUT= 0
##$USERA1= <user>
##$USERA2= <user>
##$USERA3= <user>
##$USERA4= <user>
##$USERA5= <user>
##$V9= 5
##$VALIST= <valist>
##$VCLIST= <CCCCCCCCCCCCCCC>
##$VD= 0
##$VDLIST= <DDDDDDDDDDDDDDD>
##$VPLIST= <PPPPPPPPPPPPPPP>
##$VTLIST= <TTTTTTTTTTTTTTT>
##$WBST= 1024
##$WBSW= 4
##$XGAIN= (0..3)
0 0 0 0 
##$XL= 0
##$YL= 0
##$YMAX_a= 426675
##$YMIN_a= -260360
##$ZGOPTNS= <>
##$ZL1= 120
##$ZL2= 120
##$ZL3= 120
##$ZL4= 120
##$ABSF1= 10
##$ABSF2= 0
##$ABSG= 5
##$ABSL= 3
##$ALPHA= 0
##$AQORDER= 0
##$ASSFAC= 0
##$ASSFACI= 0
##$ASSFACX= 0
##$ASSWID= 0
##$AUNMP= <proc_1d>
##$AZFE= 0.1
##$AZFW= 0.1
##$BCFW= 1
##$BC_mod= 2
##$BYTORDP= 1
##$COROFFS= 0
##$CY= 11.3945322036743
##$DATMOD= 1
##$DC= 2
##$DFILT= <>
##$DTYPP= 0
##$F1P= 16.9975609425685
##$F2P= -3.02152046262296
##$FCOR= 0.5
##$FTSIZE= 0
##$FT_mod= 4
##$GAMMA= 1
##$GB= 0.15
##$INTBC= 1
##$INTSCL= 1
##$ISEN= 128
##$LB= 0.24
##$LEV0= 0
##$LPBIN= 0
##$MAXI= 10000
##$MC2= 0
##$MEAN= 0
##$ME_mod= 0
##$MI= 1.114404
##$NCOEF= 0
##$NC_proc= 0
##$NLEV= 6
##$NOISF1= 3.799351
##$NOISF2= 2.8
##$NSP= 1
##$NTH_PI= 0
##$NZP= 0
##$OFFSET= 15.70392
##$PC= 1
##$PHC0= -9785.434
##$PHC1= 12.00081
##$PH_mod= 1
##$PKNL= yes
##$PPARMOD= 0
##$PSCAL= 0
##$PSIGN= 0
##$REVERSE= no
##$SF= 200.130013532006
##$SI= 16384
##$SIGF1= 3
##$SIGF2= 2
##$SINO= 400
##$SIOLD= 16384
##$SREGLST= <1H.CDCl3>
##$SSB= 0
##$STSI= 0
##$STSR= 0
##$SW_p= 3612.71676300578
##$SYMM= 0
##$S_DEV= 0
##$TDeff= 0
##$TDoff= 0
##$TI= <>
##$TILT= no
##$TM1= 0
##$TM2= 0
##$TOPLEV= 0
##$USERP1= <user>
##$USERP2= <user>
##$USERP3= <user>
##$USERP4= <user>
##$USERP5= <user>
##$WDW= 1
##$XDIM= 8192
##$YMAX_p= 0
##$YMIN_p= 0
$$ End of Bruker specific parameters
$$ ---------------------------------
##NTUPLES= NMR FID
##VAR_NAME=  TIME,          FID/REAL,        FID/IMAG
##SYMBOL=    X,             R,               I
##VAR_TYPE=  INDEPENDENT,   DEPENDENT,       DEPENDENT
##VAR_FORM=  AFFN,          ASDF,            ASDF
##VAR_DIM=   8192,          8192,            8192
##UNITS=     SECONDS,       ARBITRARY UNITS, ARBITRARY UNITS
##FACTOR=    0.0002004,     1,               1
##FIRST=     0,             0,               0
##LAST=      1.6414764,     0,               0
##MIN=       0,             -260360,         0
##MAX=       1.6414764,     426675,          0
$$ Real data points
##PAGE= N=1
##DATA TABLE= (X++(R..R)), XYDATA
0@%%%%%%%Qj6J6k4L2l2M0n6O7p6R3j14J34j56J83k12K44k84L26l70M24m83N46
30B90o19O98p80Q74r79J092j215J350j500J665j845K042k261K505k775L075l413
47a796L795m229M728n314O007o844P882r201J0946j3385J7063k3321L6795j18232
61i5106J38389J73061k44402k01142l1160J97869K19308k980k45727o0650K03282
72E0742J46125q6462j25162l8718J14415J80044k0505k76762j25621K03757K20999
83B42852k0070j75319j77854L365K37719J76039j38145k05673Q834J25411P1831
94A48990q816r9614p8552Q9098J01098j09975j53720L1560J16052M5184m0906
105D0399j35511j15532J01003J98745J231j51950p4677K2980O7019Q8135p263
$$ y = [0, 0, 0, 0, 0, 0, 0, 0, 8, -8, 8, -16, 16, -16, 24, -32, 35, -41, 52, -62, 72, -84, 99, -113, 131, -153, 173, -197, 227, -256, 290, -329, 369, -411, 463, -516, 576, -639, 711, -789, 876, -969, 1073, -1188, 1317, -1458, 1617, -1796, 1999, -2230, 2498, -2816, 3191, -3653, 4229, -4972, 5974, -7411, 9652, -13669, 23126, -95106, 43283, 216344, -28058, -229200, -260360, -62491, 156817, 153837, -91890, -152540, 50742, 196867, 110405, -14757, -53475, 60940, 240984, 220479, -56283, -181904, 21853, 242852, 222782, 47463, -130391, -127026, 110693, 286732, 148587, -57086, -48252, 77159, 148990, 140174, 40560, -37992, 51106, 152204, 42229, -111491, -79931, 36121, 81305, 40399, -95112, -210644, -109641, 89104, 90335, -61615, -136292, -113312, -46293, 41842, 34579]
116C4579j11088k1152P6509j3594o8315K2484M9042Q19k441m2389q3037L9814
128a18769J51043L2079r4657m5928J4239L4486P9523L8175p0615l5275N5242l241
140C6302n3321L2574N9400p179j9882l5028o9483K9690J44251L8709j08888o7165
152b0020K0250M7128P4842K8240r0392o1709O4730L5596n7212j8996K9353M227
164E6037N316k0457r4751k8439J27649Q7358p9292j04368k9138L5507J04040P1451
176A30913r2126j25807K7284Q5345N824k4692k2524l4462K1793M7714n4374p8598
188a13710N8655J01224p881o7091n2881j7662Q3244J27022k1540j37374m0295
199h8289O8003N6438L0761j2800q0137k8163P2132K2784n6439L136N3392J181
$$ y = [34579, -76509, -97661, -21152, -34746, -103061, -80577, -31535, -30716, -33157, -75546, -158583, -118769, 32274, 64353, -30304, -76232, -61993, -27507, 52016, 90191, 19576, -15699, 39543, 36302, -17019, 15555, 74955, 67776, 47894, 12866, -56617, -26927, 117324, 156033, 47145, -20020, 230, 47358, 122200, 150440, 60048, -1661, 63069, 98665, 41453, 22457, 51810, 56037, 61353, 40896, -53855, -82294, 45355, 132713, 53421, -50947, -80085, -44578, 59462, 130913, 38787, -87020, -59736, 25609, 31433, 6741, -15783, -50245, -28452, 19262, -35112, -113710, -55055, 46169, 38288, -28803, -81684, -99346, -16102, 110920, 89380, -47994, -88289, -20286, 36152, 66913, 54113, -26024, -54187, 17945, 40729, -15710, -12574, 40818, 41999]
211D1999j8726j2599l6488J8435J04836L0970r3438n8136K4995L3802M5037K8018
223A08705o5327p3021L0885M0795k0511N977K8328k9426l2475J3325n948p0O3849
236F5086K2688p6063m3246L3328K1050J5071K4397l6882o1338J7753L2118k6807
248a2845J349M4735j2974m7183n822qJ1959P1402L0588q6585o5818M2563N7165
261B8526K3530M241n3355o3205L8538O6282k6543m1895K4375J8306j1964m417
273B419k6423k0731P3225P8116n8437j02993j909O4885O4145L1454o7418j11535
285g5202J3872J10191K6404n8578l4710p272J6351M5262j1684p0910J4085R5326
297F3135Q973q1915m6513J5154O0771Q0168j9546j34337n6096R6256Q4271j3258
$$ y = [41999, 23273, 10674, -25814, -7379, 97457, 128427, 34989, -23147, 1848, 35650, 80687, 108705, 43378, -29643, 1242, 42037, 21526, 27503, 55831, 26405, -6070, 7255, 1307, 1237, 65086, 87774, 11711, -31535, 1793, 22843, 37914, 62311, 25429, -35909, -18156, 13962, -12845, -11496, 33239, 20265, -26918, -32740, -32748, -20789, 50613, 81201, -5384, -71202, -28639, 28526, 52056, 56297, 2942, -60263, -21725, 44557, 18014, -23881, 494, 18800, 6836, 2419, -24004, -44735, 28490, 106606, 48169, -54824, -56733, 8152, 72297, 103751, 36333, -75202, -61330, 48861, 75265, 16687, -18023, -25295, -8944, 36318, 24634, -46276, -32191, 63135, 72108, -9807, -56320, -41166, 19605, 99773, 80227, -54110, -110206, -13950, 70321, 57063]
309E7063n4714o1032j2846P8798N3314o4778n3811N0304M5246k0666l1091k6480
321d0693P979Q2451M6269r4041r7243L8578Q8732L7044j9584p7723o6199N5745
333c8685J01605j1908p2792p628K6996J4550J3025k0379l7743L9918P0420l6224
345D1155r0106m655N7425M7610J6866n4162r2938R239J04894L4336n5994l7210
357b3540l675J1133M0783J0442m9563o311O0275P52o3207j8173L0262L2697L1318
370E3193k1629q9414k5927Q6661N7823l3464m2504k3002k838M8537L9356m2597
382D195l6545M0404K1850l7896j8095J3929J4627L2851N960p3891n0022O3945
394a8688O9861j2329m0348l4817j7984M6385O2320k6512n8615J5582L3164j3859
$$ y = [57063, 2349, -58683, -71529, 7269, 60583, -4195, -58006, -7702, 37544, 16878, -14213, -40693, -32714, 49737, 96006, 1965, -95278, -56700, 32032, 69076, 49492, -28231, -94430, -38685, 62920, 51012, -21780, -29408, -2412, 12138, 25163, 4784, -32959, 6959, 77379, 41155, -48951, -53606, 3819, 51429, 68295, 14133, -78805, -69566, 35328, 69664, 13670, -23540, -27215, -16082, 24701, 35143, -14420, -20731, 39544, 40296, -22911, -41084, -10822, 21875, 53193, 31564, -57850, -83777, 2884, 60707, 27243, -15261, -38263, -41101, 7436, 46792, 4195, -32350, 8054, 29904, -7992, -26087, -12158, 2469, 35320, 41280, -32611, -82633, -18688, 51173, 38844, -1504, -36321, -54305, -7920, 54400, 27888, -30727, -15145, 18019, 4160]
406D160j1672K437m464K5322K9230n1010o5150L4865P2150R701l1740m1619l6171
419f3961L4954Q1275j372o9856j5701L1177R780L759q35k5197O674M4193j8030
432A6860o6521L959N9833K4898j3032l6283n2033J1388Q6991L0717o4130m2399
444c9752J5215K0396K4334J0310l8480k1669M2929J5649n0443j7745L6831K4727
456B2302M963j6527n5508j8166P4743N6163m2233n5168o230J5883L6831L0949
468D8002l6069m8847K5749L7901k3416k4634J4649J2440J1634P652m3414m2126
480f0479M9954O9676j6402n3810k3168K758L7912N1593k0142o7987m08M6272L659
493A9428j7443j075n197O699K6619k1266n2772J9168O6938P443m1040l0944j4894
$$ y = [4160, -7512, -5075, -9539, 15783, 45013, -5997, -71147, -36282, 35868, 45569, 13829, -27790, -63961, -29007, 52268, 50896, -18960, -34661, -3484, 6296, 10055, 9220, -15977, -9303, 34890, 16860, -49661, -45702, 14131, 39029, 25997, -10286, -62319, -50931, 36060, 66777, 2647, -39752, -24537, -4141, 20193, 30503, -7977, -29646, 13283, 28932, -21511, -39256, -2425, 22302, 27265, 10738, -44770, -62936, 11807, 67970, 25737, -29431, -35661, -19778, 17053, 48002, 11933, -36914, -11165, 26736, 3320, -21314, -6665, 5775, 17409, 25061, -18353, -60479, -10525, 59151, 42749, -11061, -34229, -31471, 6441, 58034, 37892, -30095, -30503, 15769, 19428, 1985, 910, -4287, 2412, 29031, 7765, -45007, -25839, 41099, 48542, 7502, -23442, -38336]
506c8336K7230O4698M232p1621l0313L8975K4831j903m859k3016r977L5720P620
519B3281m8620r558N0189K1457k2571k5695k7089O143O4387L0940n9392n1109
531d7637K0373L2911J5806M351l1584l1437K9799L4100k9800k6714K7029K1811
543A9008n525r677k7788j6479N0231N1453l6319n9275q6K8510K7657K0078k7623
556A4165n1507J2290M9762n358k9361N414J1872R17Q131j7073l2759K6681N8250
569E1424j1740n5624j6055J6381K7656L3975j3521o2130j2114N0698J8289k2512
581D727p859l301k423K0117J238l7747J349N1254Q460m2592k2710L626J9184M0434
595C3757N615n9677l3212M0751L4674r075j1921j4216j1981K4911K1545l1336
$$ y = [-38336, -11106, 53592, 57824, -13797, -44110, -5135, 19696, 17793, 12934, -10082, -20059, 15661, 23281, -25339, -34897, 15292, 36749, 14178, -11517, -38606, -32463, 31924, 62864, 3472, -47637, -27264, 5647, 21453, 25804, -5780, -37217, -7418, 26682, -3118, -29832, -2803, 19008, 13483, 3806, -23982, -40461, 9770, 61223, 24904, -34371, -34457, -5947, 21710, 41788, 14165, -37342, -25052, 24710, 19352, -10009, -4595, 7277, 8194, 16325, -748, -33507, -6826, 51424, 39684, -15940, -31995, -15614, 12042, 46017, 32496, -29634, -41748, 8950, 27239, 4727, -3132, -6433, -8856, 11261, 12499, -25248, -23899, 27355, 35815, -6777, -29487, -25861, -6677, 33757, 39372, -20305, -53517, -12766, 21908, 12833, 912, -13304, -25285, -374, 21171, -10165]
607a0165j8605L7052K1748k5667k1202m684P010L9282K4693m7767m8614K5476
619b1443M2834O948r413k2077k4880K2169L9942j6953l4503J7107K6197r096j3349
632C483j0126r684L0092M0087k8863n9440M000M1845K0888K36k5185m1618R142
645b5143N3546M742m0967o692J8559K648K499o849k6364R637M7673l162n4970
658b4843j7854K8721K5683J6553j4208n2003j4056N3482L0227k9119k2622J127
670a8912L571J7093J1457k8737j6072L8146K0150l5039k4169J1140J8253K4235
682B1116O030m4114l4190L7544M3797r400k3057j0765p436J8709K9915j7706l1321
695b0878J9489K6605j6924j9246K928N445J8376J9187k9653m2489J9586M4006
$$ y = [-10165, -28770, 8282, 30030, 4363, -16839, -21523, -14513, 24769, 49462, 1695, -46919, -21443, 21391, 28339, 18926, -3151, -28031, -5862, 34080, 17127, -17376, -269, 25928, 16832, 3483, -6643, -16327, 13765, 53852, 24989, -34451, -30451, 11394, 32282, 32518, 7333, -34285, -25143, 28403, 33145, -7822, -14514, 4045, 6693, 9192, 2343, -24021, -14384, 33289, 30127, -24843, -42697, -13976, 11707, 28260, 14052, -37951, -52007, 1475, 31702, 2583, -20039, -18912, -15341, 1752, 13209, -15528, -31600, 6546, 26696, -8343, -32512, -21372, -3119, 21116, 27146, -16968, -51158, -13614, 30183, 20783, -2274, -13039, -20475, -1766, 28149, 10443, -20878, -1389, 25216, 8292, -10954, -8026, -2581, 15795, 34982, 5329, -37160, -17574, 26432]
707B6432K301j8958j5267j5723J2215L7719n389l8700L460K7367n644j6405q54
720g446k321J1500K5931j7339m7904M443M4813J3216j5816j9769k3256P987M5995
733B0034Q207m4574j4222K7572R995p860n327j4015L513L6113L086m8432j7313
746d3223L7849K8627j390j9197l6645o160N3035L3174l8251l7390J1703K1888
758D020J3043K853k7122k0436L4132L2155l0248l6130J1333K7719J9468r9m0866
771a0178l5214L7494N6249j0773m5276j6504Q397K7068K8111k0064m7965O777
783b1878M4503K861k9493j2785L041J9340K6605j9105n1247K372N2851J8000k5727
796I338k7134j6938J3012M6080R913m9044k5203K8610K1277l778q493j7131l632
$$ y = [26432, 28733, 9775, -5492, -21215, -9000, 28719, 23330, -15370, -11910, 15457, 9813, -6592, -7446, -9767, 1733, 27664, 10325, -37579, -33136, 11677, 24893, 9077, -10692, -33948, -25961, 20034, 28241, -16333, -30555, -2983, 7012, -848, -6175, -20190, -16677, 19436, 22522, -25910, -43223, -5374, 23253, 21863, 2666, -33979, -40139, 12896, 46070, 7819, -29571, -17868, 4020, 17063, 19916, -7206, -27642, 6490, 38645, 8397, -27733, -16400, 11319, 30787, 30688, -10178, -45392, -7898, 48351, 37578, -7698, -24202, -15805, 11263, 39374, 19310, -28655, -21878, 22625, 25486, -4007, -16792, -13751, 5589, 32194, 13089, -38158, -35786, 17065, 35065, 9338, -17796, -34734, -21722, 24358, 34271, -14773, -39976, -11366, 9911, 6133, -2360, -19491, -23123]
809b3123L0632J2827l7158j9103K9077K1751m503j0859k2741j0814L6229L1575
821C3790k7255l2888Q575J4960O780Q511j1319k0871J4057K2856j6554j7535J6023
834h70J1833l761N99j0882j7357J9540L1151j4492k8547M566J0310J300J0441
847A3831k278k1093N140K0905j1096j8118J3823J3854o473k820p962j6495J5729
860c053L2855j1418l4401l17J6383O061P520n692k5228K272K9869k508k6917J569
874a3005J5559M036K550r961k6012O697M2176N635l7516j6717J0749J5151J9481
887A8823j43l7208j4894L4581K0399j9803j3991J182M611J8121O414l1876j7092
900c0876L5368K5773j9715k2596p040M838K8799K1251l1159l6362J6900L1590
$$ y = [-23123, 7509, 20336, -16822, -35925, -6848, 14903, 10400, -459, -23200, -34014, 2215, 33790, 6535, -26353, -17778, -2818, 3962, 12473, 1154, -19717, -5660, 17196, 642, -16893, -870, 10963, 7202, 7801, -3081, -20438, -898, 30253, 15761, -12786, -8220, 2090, 3390, 13831, 11553, -9540, -4400, 16505, 5409, -12709, 1114, 14968, 8495, 5675, -2287, -18782, -3053, 29802, 18384, -16017, -16334, 49, 6110, 13630, 7938, -17290, -15018, 14851, 12343, -14574, -13005, 2554, 6590, 9140, -821, -26833, -20136, 22040, 27675, -9841, -26558, -15809, -658, 18823, 18680, -18528, -33422, 1159, 21558, 1755, -12236, -11054, -6443, 11678, 18092, -13784, -30876, 4492, 30265, 10550, -12046, -19086, -14248, 14551, 35802, 4643, -31719, -14819, 16771]
912A6771J739j0151j2074j2731J5672K7322j4724l0830J1278K4699j321r944j0349
925d643j3415J5523L3806r840l8484l559K2139R828L683o647k4653j727K9888
938A1899M460k4775k576J3508q84q17K93j5853o24K7782L402k9159q313J5154
952f503N571M995K718j9935j0764K2975J0722j8929l473J2061k564k887M706j0396
966a1703m157K4007P442k8033j0525J7809Q643K861J605j7953j2476K4638J7595
979A9753j9902j2685J1825N513L56L703j4598j1003K6438J9499k4926k2748R781
992h994J4740J1621N220k3871k5962K1854L3821r705k4433l488M478J2071J4737
1005B2089j5845k9529J3778L3556o083k6133q600M309J7569K2619j5671m2255
$$ y = [16771, 18510, 8359, -3715, -16446, -774, 26548, 11824, -19006, -7728, 16971, 15650, 5706, -4643, -18058, -2535, 31271, 21431, -17053, -20612, 1527, 11355, 15038, 8391, -16262, -17989, 11899, 16359, -8416, -10992, 2516, 1632, 815, 1108, -14745, -15369, 12413, 15815, -13344, -21657, -6503, -932, 4063, 6781, -13154, -23918, -943, 9779, -9150, -12623, -562, -3126, -6013, -1307, -11703, -15860, 8147, 15589, -12444, -22969, -5160, 3483, 6344, 7949, -10004, -22480, 2158, 19753, -149, -12834, -1009, 4504, 4860, 8563, -6035, -17038, 9400, 28899, 3973, -18775, -8994, 5746, 17367, 22587, -1284, -27246, -5392, 28429, 18724, -5709, -9197, -4719, 7352, 22089, 6244, -23285, -9507, 24049, 17966, -8167, -16767, -12458, 5111, 27730, 12059, -30196]
1017c0196R54L9428J3218j7537j7663j2193Q818L2946K617l7989j2179K8488J4550
1030A3262r041j2209j4297L798L3014J0221l8129k1981K3891K3708K655r770k4801
1043a9679j0763L2310K6748k3085k7116Q428J4229P087L105j6785j7540K1831
1055a230K6524j7475k5636N333J4292R727O365j7836k5613J4613L3059n320k2836
1068f033l558L232O092J4424n360k5405M684K5447l825j8874K95M775L851J1646
1082A1391n267k6709J758K8754K989j7826m638l31Q22J5485L167k2597m564K2459
1096D893K327j6044p56M156P84J1855P66k4354m848K7524R229j6260p422j162
1110i312M37J6995Q726k3271j2434K1657J1071j2586n905J46j77J4561Q908k4491
$$ y = [-30196, -29242, 10186, 23404, 5867, -11796, -23989, -15171, 17775, 20392, -17597, -29776, -1288, 13262, 4221, -7988, -22285, -18487, 14527, 24748, -13381, -35362, -11471, 12237, 14892, 5122, -19679, -30442, 1868, 28616, 5531, -21585, -13157, 1072, 8159, 11264, -5521, -23061, -1230, 25294, 7819, -17817, -12484, 1808, 11535, 17900, 64, -25549, -10936, 22123, 16803, -6033, -9591, -6359, -267, 14157, 8797, -16608, -11924, 13523, 9698, -9176, -8881, -4106, -255, 11391, 6124, -20585, -18827, 9927, 12916, -4910, -9548, -9879, -9057, 6428, 9595, -13002, -17566, 4893, 7220, -8824, -9580, -5424, -4640, 7215, 7981, -16373, -21221, 6303, 15532, -728, -8150, -9312, -8875, 8120, 16846, -6425, -18859, 2798, 13869, 1283, -4622, -4476, -4653, 9908, 18816, -5675]
1124e675j5859K2591J8918r044j1771p750m416J9634J9006k0248k5358J2774J8911
1137A1713k396n936p213r972J4183K1661j5771k6806R133K0978K265n661j1698
1150e520j5936J3180L0674o714l0638k546J6625O793M483o878k0933K923K9027
1163A4540J711k5974m996J3411P457N726m845k3033j841L1461R928k4210j2206
1176a2871O351P452J2983L430k3230j2474K4267J4668j6150j0291L628K513J0142
1189A0418O441k0349j4695K2019J7455j3643j2851n57l8J2099J3548j6981k1168
1202a8302J3390J7991p292p896p66m367O540J4429j1698k0243J1793J8546o859
1215E266r988j986m337P460J8073q123k3765N035J8906j349o053j067p301L210
$$ y = [-5675, -21534, 1057, 19975, 10931, -840, -8590, -13006, 6628, 25634, 5386, -19972, -7198, 11713, 9317, 3381, -3832, -13804, 379, 22040, 6269, -20537, -11404, 9574, 11839, 6178, -5520, -21456, -8276, 22398, 15684, -14954, -17500, -875, 5918, 10401, 3523, -17410, -14487, 14540, 16251, -9723, -14719, -1308, 6149, 11875, 7030, -16003, -17844, 13617, 23545, -665, -12871, -6520, 932, 13915, 17345, -5885, -18359, 5908, 20576, 4426, -5865, -2237, 276, 10418, 16859, -3490, -18185, 3834, 21289, 7646, -5205, -5762, -5800, 6299, 19847, 2866, -18302, -4912, 13079, 5787, -2109, -2875, -7242, -702, 13727, 2029, -18214, -6421, 12125, 5266, -4722, -6708, -11045, -3585, 14488, 6365, -17400, -12365, 6541, 5192, -861, -1928, -9229, -6019]
1229f019J7921m177k1894M350J9656j099q361j796p339M306K1600j255k5542k680
1243a2329J9332M652m093k166j0590j298K0986M675k3255n848J7620N313m099
1256H900k575j1686l153K3268R875k4922j3098J3792R937J775j026j5207j0122
1269a4242K0295J6138j8135j5428Q391P969L167K386j4574j3931J8948K0559j5019
1282F524j9335L494Q290P570P399j3461k1298J1926K4804n892j7374j307L288
1295e372O295J2007q461k2474O839K5040j950j6984l561J021O720J6183l967k6504
1309a5168j263K4920N353j1895n605m296K166J7703K906k3826n663K0439O700
1322A2471r534m721n104n98J7901P564k3601j1717J8236J0418n489l569p941n889
$$ y = [-6019, 11902, 7725, -14169, -9819, 9837, 8738, 377, -1419, -8758, -4452, 17148, 15893, -9649, -12329, 7003, 11655, 7562, 5396, -5194, -6492, 14494, 19169, -4086, -9934, 7686, 12999, 8900, 6325, -5361, -8514, 14754, 24629, -293, -13391, 401, 10338, 12113, 11087, -4120, -14242, 6053, 22191, 4056, -11372, -2981, 4988, 8155, 10541, -4033, -17964, 984, 21543, 6524, -12811, -9317, -1027, 6543, 13942, 481, -20817, -8891, 15913, 10021, -7353, -8660, -5372, 923, 12930, 4469, -18005, -11166, 13874, 11924, -5060, -8621, -7600, -880, 15303, 11336, -15168, -16431, 8489, 13842, 1947, -3658, -7954, -5788, 11915, 14821, -9005, -14668, 5771, 12471, 2937, -1784, -6888, -7486, 10415, 17979, -5622, -17339, 897, 11315, 5826, 2257, -5684, -11573]
1336a1573J6470J2810j8186j3994J3092Q792l551j204o630q353J4605J5071j6012
1349A337j7196J0354J1557q83j84p640j1774J1199J8800j0606j7461N899R590
1362B992q36K588n267j3343Q350J9847q222j8838L438J0509J701L598n396j6479
1376a5358M986K2170j909j8628p59P674J828O418k229j7293R09K2639J146j9215
1390g621k731P475L611P688m18j9926l374K2823P438j5710o485K457K010J0835
1404H072M868j9380r413K0758J0600j3662p175J416P14J1252P907j8798j4391
1417a7232J7479J4870q455q203l401l123J1995J3047j5241j8099J2016J5066n574
1430E145o339l081n826Q895J5931j1042k0901P357J6213q36n396n037r607P101
$$ y = [-11573, 4897, 17707, -479, -14473, -1381, 7411, 3860, 2656, -3974, -12327, 2278, 17349, 1337, -15859, -5505, 6052, 5169, 4985, -2655, -14429, -3230, 15570, 4964, -12497, -6598, 2992, 2156, 4744, -523, -13866, -5516, 14331, 6109, -12729, -9291, 1218, 2919, 6517, 1121, -15358, -10372, 11798, 9889, -8739, -9498, -1824, 4, 6422, 4193, -13100, -12191, 10448, 11594, -7621, -10352, -2877, 734, 8422, 8004, -11922, -15296, 7527, 14965, -745, -7230, -4773, -2763, 8072, 12940, -6440, -15853, 4905, 15505, 1843, -5332, -3916, -3202, 8050, 15957, -2841, -17232, 247, 15117, 6662, -1541, -4942, -8065, 3930, 16977, 1736, -16363, -4347, 10719, 5145, -1194, -4275, -10101, -1206, 14725, 3683, -17218, -9861, 6352, 5516, 120, -4917, -14524, -7423]
1444g423J9328n895k1188K235J4089O49j676k264j1046K843J9348o62k0685j275
1458a3622J3734L742j21k441j3339N1K1157M517j9600m986J0746L432K611J545
1472G426j3348n079J9342P572j6918p357R120M229K979J881j3859q111J8672J1901
1486A8450j5359j0056N590K283N319N945j2639j3705J4488J4771j1708j1102L251
1499d472K380M792P272j2048j5168J1793J6899p730j1445j06k45N691J2023p608
1513B028j9636O428J8645k773j0236l51j644L653J3613m428j9165L086J8663Q10
1527H693q550k308m391L042J6951M92k0898k164J7438M112n936j661n745r73J5771
1542A3873M659j8905n051J4471N034m459k004p539l730J6725P685j8297r991J1692
$$ y = [-7423, 11905, 6010, -15178, -12943, 1146, 1795, 119, -2145, -13191, -10348, 9000, 8338, -12347, -13622, 112, 3854, 3733, 1292, -12047, -11996, 9161, 13678, -5922, -10908, -162, 3270, 5881, 7426, -5922, -11001, 8341, 15913, -1005, -8362, 758, 4987, 7966, 9847, -4012, -12123, 6549, 18450, 3091, -6965, -1375, 908, 6227, 12172, -467, -14172, 316, 15087, 3379, -7723, -4472, -2092, 2700, 9972, -2076, -17244, -5451, 11448, 3718, -7727, -7833, -8078, -2387, 9636, 2028, -17608, -11180, 7465, 4692, -5544, -5895, -7539, -3886, 9727, 5299, -13866, -10780, 7883, 8693, 143, -2165, -6556, -3514, 13437, 13929, -6969, -9133, 8305, 12417, 6481, 4820, -925, -1898, 13873, 18532, -373, -5424, 9047, 14081, 9622, 7618, 79, -3651, 13074, 20759, 2462, -7529, 4163]
1556D163O007k311m2q163q318J3243J1204j4550j1818Q705N904j486Q11q244j0091
1571a4986J2492J4279j2566j4339O362O299O72L856o899j3295Q883J6872p332
1584B98j3477L686N646J635N421n114j4048P633J8771m614j4198J655N088L317
1598A699Q603l214j6457K372K0016P51j3066q58K733K238R884q22j7012q80J9050
1613A5037L345j2564l444N34J279J1575K427j8871p406J7581P703r766n013k851
1627d34j792J1005O482j7040j0658J3545Q628p168m592m143m018J1223J0687j5373
1641c648j4435J0525J0717k929l318m743p542R178J4412r846j5210O856J0367
1654C84j473l68l180r039P003J6512n905j6310M064J0436J440J288k187j1141
$$ y = [4163, 10170, 7859, 7817, -346, -8664, 4579, 15783, 1233, -10585, -1880, 4024, 2538, 3349, -4895, -14986, -2494, 11785, -781, -15120, -8758, -2459, -1787, 2069, -4830, -18125, -9242, 7630, 298, -13179, -9493, -3847, -2212, 3209, -1905, -15953, -8320, 10451, 5837, -8361, -6706, -1618, 1699, 10302, 7088, -9369, -6997, 13019, 13770, 704, -154, 2579, 4817, 14701, 13879, -3133, -4013, 15037, 18382, 5818, 2374, 2908, 4187, 15762, 18189, -682, -8088, 9493, 17196, 7430, 2417, -434, -2226, 8779, 15261, -1779, -12437, 1108, 9736, 2568, -2024, -6167, -10185, 1038, 11725, -3648, -18083, -7558, 3159, 230, -3088, -7831, -15373, -6195, 8217, -1629, -16839, -9983, 384, -1089, -1457, -4637, -13676, -6673, 9839, 3934, -12376, -8312, 2124, 3564, 4852, 2665, -8476]
1668h476L724J7462j150j5271J532P803R39K844m43j1401K73J7384M29j5113j204
1683f68P185J139L402J0j2747l005J6149L870j4134l738M594M60M331J702j2631
1698d081o116J5082N968j3463n627M578M94M426L566j2671r350J4470R687j0794
1712c831p222K154N75N328O744j1061j1737J2219J2095q022p562J415j99O839
1726b265R669j0165j4603R616J4817l655p223j518k504O110J3439o363j6744N083
1740f306J4763q72n577j999m748M209J4948l424j8325O32J4735J666l575l143
1754B984q372R82J6207J976j7930m327J1156L906j475j453r796l016J5719N134
1768A1695j5941p060Q938M484N84K19j0536o659J4496J0093j3235q697N247L386
$$ y = [-8476, -4752, 12710, 11560, -3711, -2179, 5624, 6563, 9407, 8964, -2437, -2164, 15220, 15649, 536, -668, 6517, 7656, 11058, 11068, -1679, -4684, 11465, 15335, 1201, -2537, 2057, 2517, 6848, 8550, -4081, -10197, 4885, 10853, -2610, -8237, -3659, -3165, 1261, 4827, -7844, -17194, -2724, 6963, -3831, -11053, -8899, -8324, -2996, 3748, -7313, -19050, -6831, 5264, -2758, -10320, -8905, -9104, -2265, 7404, -2761, -17364, -7748, 7069, 3414, -3809, -5327, -7831, -1721, 11718, 5355, -11389, -6306, 8457, 7585, 2008, 9, -4739, -530, 14418, 10994, -7331, -6699, 8036, 9702, 6127, 2984, -5388, -4406, 11801, 13777, -4153, -8480, 2676, 6582, 5107, 3654, -6142, -9158, 6561, 11695, -4246, -11306, -2368, 2116, 2700, 2919, -7617, -14276, 220, 10313, -2922, -11619, -6372, -2986]
1782b986K817L900r019r444J1037J2038r484q851M449K768K692N370p426j1350
1796a3489R449J3445o558q798K335R83K168Q186m350j3001N534J3467m202q610
1810c441K189O10J204P919l022j3879L410J4336k691q380P8o19M83R455p44j4154
1826g246l08J3619k95q083m2q31o09Q949O59j4544j912J4021K108p823j718k150
1842f205j050J0921L672j4629n776J2453M944n768j646l080k536J0774O375j3899
1856e450p881J0912P649l903k250m706m305J1265J0387j1883j1854Q116P843n54
1870C386K67n967p655Q808J3333q252j3029M440Q271O63R25m949j0110O292J5554
1885A1977m122j4499O10O285K232M625l368j3100K004J5932j46j2634j309M116
$$ y = [-2986, -169, 3731, -5288, -14732, -3695, 8343, -1141, -9992, -5543, -2775, -83, 5287, -2139, -13489, -4040, 9405, 2847, -5951, -3616, -2633, -465, 7721, 3371, -9630, -4096, 9371, 5169, -3441, -1252, -642, 562, 8481, 5459, -8420, -5010, 9326, 6635, -1745, -1667, -2286, -1803, 7652, 6908, -7246, -7554, 6065, 5770, -2313, -2355, -3186, -3795, 5154, 5813, -8731, -10643, 3378, 5486, -2337, -4055, -6205, -7255, 3666, 7338, -7291, -13067, -614, 4330, -1438, -3084, -6164, -8700, 2074, 8449, -5450, -13331, -2419, 5230, 1327, -923, -5629, -9934, 1331, 11718, -165, -12019, -3903, 3940, 3386, 3653, -2314, -9969, -1161, 12172, 3920, -9109, -4669, 3602, 4265, 5190, 241, -9869, -3577, 11977, 7855, -6644, -6034, 251, 2483, 7108, 3740, -9360, -7356, 8576, 8430, -4204, -5513, -1397]
1899a397J562N420o27j3317j474J5813K718j0973l020J891J127P462K686j3201
1913e330n982J3648N772q261k973O94j116O705N055j1399o675J1412O684p309
1927I25l129q4j788O640P218r728r860R404P425n090k068k18m118N101Q328p826
1943A132r821P678P883m650l015k51l984M635J0039o710j2331N179R462k436k399
1958D11n12n893K943J1158l990j2507L602R282j815k565j122n822K871J2458k086
1973F413j4546M54R802J112q86j008q464J48J3381K043j3477k390Q066K066J88
1988B902n18q381k123J3995M293j3315n749O966L794K935J411j1079o509J3240
2002A862R360j0046p605L442K195M440L622r372q618J0653J0527p633q150J478
$$ y = [-1397, 165, 5585, 4958, -8359, -9833, 5980, 8698, -2275, -5295, -3404, -2277, 5185, 7871, -5330, -11312, 2336, 8108, -153, -3126, -2432, -3548, 3157, 8212, -3187, -9862, 1550, 8234, 925, -2204, -2288, -4076, 2564, 9782, 54, -9806, -402, 7023, 1933, -135, -353, -4471, 630, 8958, 1132, -8689, -1011, 6872, 2222, -793, -1044, -5028, -393, 9646, 2936, -9395, -4216, 5246, 2810, 411, -101, -5994, -3051, 8107, 4117, -8390, -4788, 4494, 2679, 114, -1008, -6830, -3959, 8499, 6413, -8133, -7679, 2123, 3235, 2349, 1341, -7123, -6975, 6406, 8449, -5028, -7418, 648, 2714, 2902, 2384, -5997, -8120, 5875, 10168, -3147, -8896, -1930, 1864, 4799, 6210, -4869, -11378, 1862, 11222, 1176, -6429, -2987, -792, 3648, 7270, -2102, -10720, -67, 10460, 2827, -5323, -3845]
2016c845J541N333O525q155j2965P409J3214l119p559j088j546L954R513m866
2030D346j2787L360J1744j435n252j745k232K573J0618k452j4578L91J2262J430
2044F243m234j522m857r0J0472K314j2541k062R034J184k820M32n072j874J0735
2059E342K901j2375l966Q958L164k048j9n181m348R913O208r745n749P011J589
2074A655j068J753m226m512Q094O470r575o617P085M461j546J393m812o508P710
2089b43R835p109q378M133L305k82L197l810q151O538J0140o177r180L501M609
2104A928J94K963l955j0083M612J3046k749j0130j65K280J868O188k365j1598
2118g966J194J2446m74r470m72J825J145O521q08j2686j457J3768L116q062l243
$$ y = [-3845, -2304, 3029, 9554, 1399, -11566, -4157, 9057, 5938, -1621, -2709, -4255, -301, 9212, 4346, -8441, -5081, 6663, 5228, -24, -1769, -4001, -1428, 9190, 6738, -7840, -7449, 4813, 6243, 2009, 487, -4370, -4460, 6012, 8326, -4215, -6277, 2757, 3941, 1121, 1553, -3519, -5393, 5342, 8243, -4132, -8098, 860, 4024, 1976, 1957, -3224, -7572, 2341, 8549, -1196, -6945, 66, 1655, 587, 2340, -1886, -6398, 1696, 8166, -1409, -8026, -941, 3520, 1974, 3367, -1445, -7953, -243, 9592, 2483, -5895, -1762, 1543, 1261, 4458, 648, -7503, -965, 9175, 2998, -6182, -2681, 1928, 2122, 5085, 1130, -8953, -4341, 8705, 5956, -4174, -4339, -2059, -191, 5997, 3632, -7966, -6772, 5674, 5200, -4270, -4742, -2917, -1772, 4749, 3941, -8745, -10202, 3566, 6682, -1380, -4623]
2133d623j020Q96Q589L063j1829n302J0383M830n295j613j636j320P656N480j0862
2148b603p546R963O930l509k689l376k981Q462Q710q718r325N668O068j353K26
2163C927k295n864N285Q964n970r935M887O445j045m84k615o426L773J0979l551
2178F075j0352J197M645m27K300o93p990N38J0421j913r790J628N043q39R38k88
2194D93p554J82J1062L09r892j171M018J40K752J948q430k595J0590K163q559
2209d544r59M735m97J985J664p458k949J1053M517q820l341K852P23M683L671
2224G315q410o339R499O602o721l740K451j42K900M500p353p417Q545Q171n647
2239D214n824o4j54M314P696p128j1199M978R475k318m228q32l288K334Q230l646
$$ y = [-4623, -5643, -4747, 3842, 6905, -4924, -10226, 157, 4987, -308, -1921, -3557, -4877, 2779, 8259, -2603, -10149, -186, 6744, 3235, 546, -2830, -5811, 2651, 11361, 2643, -6682, -1014, 5054, 3701, 3927, 1632, -4232, 1053, 10017, 4047, -5888, -1001, 5444, 4399, 3915, 1300, -5126, -1353, 9626, 6075, -4277, -3080, 1565, 1138, 3438, 2745, -5245, -4707, 5714, 3801, -5989, -4361, 682, -157, 781, 493, -7061, -6879, 4183, 4492, -5400, -6571, -2553, -2413, 339, 2287, -6143, -8738, 1852, 4015, -4544, -5503, -768, -1265, 720, 2384, -5074, -8023, 3030, 7547, -1273, -4614, -1762, -1039, 3644, 7315, -1095, -7434, 2065, 8667, 1946, -1794, 657, 515, 3415, 7915, 562, -6855, 1690, 9861, 4214, -1610, -1674, -1828, 2486, 10182, 3054, -8145, -3167, 6308, 3990, -238, -1070, -4358, -2024, 6206, 2560]
2255B560j1232K886R359j056m071k232l998K877J0757k259j2497m69Q620J361
2269F06j036o00o257r82J0804K156j0660k029P591J877j052k98n706j081J0700
2284D033M055j0292m521O157K848J549J933o576n415R088O720p402m321M249J240
2299C345M89K597m957n432P924P266p151o560K879K111J814M260n295r206N406
2314e10R027m206o290K272k5j0M639l222q255M054Q967m072p000J091N53J341
2330a646O225l219j0672K051R785n35n789K37q69j63O169L01r812O38R660k53
2346B108n807l93j35O84P898Q66j1287k570J0398L224m004r88k532j699P689M462
2362G914q815m410P934L030l367n98k542j932P857N232r485p053P130N138j250
$$ y = [2560, -8672, -5786, 3573, 2517, -1554, -3786, -7784, -4907, 5850, 3591, -8906, -9375, -755, 606, -430, -1030, -7287, -8269, 2535, 4691, -5969, -7998, -407, 1470, 418, 120, -5586, -6667, 4033, 8088, -2204, -6725, -568, 2280, 3829, 5762, -814, -6229, 2859, 9579, 2177, -2144, 2105, 3345, 3834, 6431, 1474, -3958, 3966, 11232, 4081, -2479, 400, 2511, 4325, 8585, 3290, -5916, -510, 8517, 4311, -1979, 293, 268, 258, 4897, 1675, -6580, -2526, 6441, 2369, -4631, -3540, -2987, -1646, 4579, 1360, -9312, -7261, 2524, 1989, -3800, -3563, -4432, -4595, 1574, 1875, -7937, -7299, 2361, 2108, -3699, -4092, -4227, -3543, 4355, 5221, -6066, -8636, 1762, 4986, 982, -6, -2538, -4237, 3452, 7914, -901, -5311, 2623, 5653, 2286, 1688, -854, -2786, 5071, 10303, 818, -6235, 895, 6033, 4783]
2377D783j67l977n744O308Q821o589p761L538M071j254Q41k738o099N467Q677
2392H177n570r264L007M405O35J924l039q576K435J1380j685q544K67K603j80
2407b025L707j08p939P37R433l10q435M65L146M52M201r0r171j383J0493K622
2423E795o251j309N69r69M871L414p565l326Q320K477o223m87J794r31M116L194
2439G489q156m972Q663N056m937k260l81k457M492O175o714o689O203M443m511
2454A444j199R78k659L470M940o207p639N780O817l044k609j248l962L523Q127
2469F512l963q987K710N943j950j021L62l952J013Q173k646r902K455P644r77
2484A414j153r71n702R09J0099P60r733j177N057M74J301R62n632k109Q942J799
$$ y = [4783, 4616, 639, -5105, 1203, 10024, 3435, -4326, -788, 3283, 2029, 2870, 132, -5967, -500, 8177, 2607, -6657, -3650, 755, 1390, 3314, 275, -8301, -5866, 5514, 3829, -4715, -4448, -1845, -2025, 1682, 1574, -6365, -5628, 3805, 3495, -4940, -4475, -1329, -877, 3324, 3234, -5937, -7320, 3173, 5795, -456, -1765, -1196, -2165, 2706, 6120, -1445, -4771, 3549, 6026, -197, -684, 1110, 179, 4295, 7489, -667, -5639, 3024, 8080, 3143, 883, 502, -1955, 2537, 8712, 1998, -4691, 1512, 5955, 1444, 245, 1223, -1436, 2034, 6974, 767, -6872, -1092, 5725, 2681, 72, -1176, -5138, -1615, 6512, 2549, -6438, -3728, 2215, 265, -756, -394, -4346, -3333, 4840, 2194, -7708, -5253, 2391, 1414, 261, -710, -6412, -5503, 4596, 5356, -4377, -5554, -497, -23, 1278, 2240, -3392, -5501, 3441, 5240]
2500E240q814j177N518P83J137L63o747k860R937M870p800m461L268Q26K366L682
2516F131n918o059P099N381o133l185L117L52J397L472n903o385O856P471n035
2531B658m837O92q08K739N887l871q411L332P202l131l134J680j574P72N113k843
2547A466q067L371Q302k186m781Kj859J269P727p08r956K03P553n92k378J218
2563E84k401j313O197O98q102L52P819j64l682K1k398r42Q045K398r163l291O872
2580A530J784j769J074k888l473O170M147q083k598O467J571k079j05l307k897
2595d456P084N795q021o239M540L210j03J743l370o427M842P638n236o206L883
2610a323K180o33J634k981o353N140Q884m369p511J002K500J614M112k191q929
$$ y = [5240, -3574, -4751, 767, 1550, 2687, 3050, -3697, -6557, 3380, 8250, 450, -4011, -743, 83, 2449, 6131, 213, -5846, 1253, 6634, 501, -2684, 433, 785, 2182, 5654, -249, -6634, 222, 7693, 2658, -2179, -1487, -2295, 444, 6331, 2460, -5951, -2619, 4583, 1452, -1682, -2, -1576, -804, 4309, 1466, -6601, -3230, 5072, 2886, -1895, -1893, -3752, -2483, 5244, 4536, -5420, -5217, 2336, 1744, -634, 584, -1817, -3130, 3067, 3765, -4337, -3985, 3834, 3670, -12, 9, -2389, -3331, 4714, 7112, -2051, -5342, 1530, 3314, 1545, 2619, -269, -3742, 2428, 6575, -1508, -4106, 2361, 3932, 1853, 1748, -1559, -4456, 2628, 8423, 402, -5837, -1297, 1913, 1810, 3553, 183, -6244, -1402, 6236, 1000, -5206, -1323, 857, 224, 1858, -1123, -7476, -2336, 6548, 2179, -5332, -4330, -1830, -216, 3896, 1705, -7224]
2625g224J399R341o10n767P45O81m41M681l42q067R29R270k04o586n12K71Q33
2642a603O429R93r451k880Q554K761m096k50j194k142N012L932p196l694P102
2657B277K494m337j047n58k004N899M295p694o073O258L965k330J71j608m727
2672e019L789O289m568n969M367L305l122J45n19l388L633O836n038q067L771
2687c555M786n87N63r18n744J843P744j323o959K072L817j961J284K54m707J301
2703b090Q125j791q166J047M832L95J315M8p091j088R283J656p196m81K664q85
2719E77J779J708n711j810P996J255p231j916L280M43K596K049p896m465P919
2734E73M956n666k451P71j575K774M475n454n696N948M422m546k616J086j068
$$ y = [-7224, -5825, 3516, 2906, -2861, -2116, -1435, -1876, 2805, 2463, -5604, -4675, 4595, 4391, -2195, -2707, -2436, -1603, 4826, 5819, -3632, -6512, 2042, 4803, 707, 457, -737, -2879, 2133, 6065, -1131, -4825, 2277, 4771, 434, -613, -1171, -3175, 2724, 7019, -675, -6748, -490, 3475, 1145, 1316, -292, -5019, -1230, 5059, 491, -5478, -1111, 2194, -928, -783, -1302, -4690, -1057, 5779, 741, -7326, -3555, 1231, 644, 1207, 289, -5455, -3612, 4132, 2809, -4150, -2078, 1739, -222, 1062, 1316, -3391, -2090, 6035, 4244, -3922, -2875, 1957, 2352, 3667, 3715, -3376, -4464, 4819, 6475, -721, -1202, 1462, 577, 2356, 4064, -1647, -3457, 4539, 5794, -1437, -3353, -73, 370, 2966, 5015, -2881, -7346, 573, 5529, -137, -2588, -1817, -3392, -618, 3857, -1597, -7293, -1345, 3077, -1469, -4085, -2999, -4067]
2749d067K839N290o145p202N034P151k477k218m80l622K162P612k283p655K757
2764c304N319k266j120J078k617Q54P251k106q391J957O537l49j223K61m565o28
2780c312P966J857p528j125M712o12p88K088l500j631N950J384p738q20N749n3
2796B599j078J451m559l244P044L757o598k504L314o90n10L149k581m199N281
2811F32L187o442k305M854M41j207K329l703m727N898O096n397m258K614L70j07
2827a725L877j666n797L643N627l999l802L634N56k13L032k550o476M032Q001
2842F174k778n328R01J33P17N240r49p662J121O936j331m174J960r09l66M590
2858D275k71q010K07Q551p7m656p87j137q07O274K413q007k996N953J096k412
$$ y = [-4067, -1228, 4062, -2083, -9285, -4251, 2900, 423, -1795, -2275, -5897, -3735, 3877, 1594, -6061, -3304, 2015, -251, -1371, -293, -2910, -2056, 5195, 3089, -5302, -3345, 3192, 2843, 1620, 1881, -2684, -3312, 4654, 6511, -1017, -2142, 2570, 1958, 1170, 3258, -242, -1873, 4077, 5461, -2277, -3097, 2652, 2599, 1521, 2972, -1587, -4831, 2213, 5970, -628, -3132, 182, -508, -1018, 2131, -450, -4649, 632, 3819, -2623, -4928, -74, 367, -840, 1489, -2214, -6941, -1043, 5053, -344, -4602, -1988, -1618, -1725, 2152, 486, -5311, -1668, 3959, -40, -3842, -208, 348, 135, 3167, 617, -5859, -1827, 6174, 3396, -1932, -1031, -898, -181, 5059, 4110, -3552, -2431, 4505, 3174, -1000, 960, 51, -315, 4275, 4004, -4006, -3799, 4752, 4675, 19, -768, -1905, -2712, 3562, 5975, -2032, -5028, 925, 2021, -391]
2874c91R79j517k733M675L416p334l096O708K092l174J19k263k667N438N273n760
2890b35n316L512K292o21K015j556m615L279N593m845m465M741K342k135J124
2905A110j237m531L165P821m059o355K282K536p18K858m08n974J032O619k233
2920A908m685K713K252j951J607k16n218J076P882j201o877L78K208J96K767J048
2936C887o908j204P362N32n068P77J808j522J790K197o022j718P850J895o528
2951h72j113J583n97M138K615o584m353O451L552l916n03K14k411K821M439n783
2967c19m578O265L926m432j996K58k128M123N576n323p254L617N117j360k95p04
2983D93m428J433P000k650o673K580M744k035o98j34l864J791P089j451p934L36
$$ y = [-391, 588, -929, -3662, 1013, 4429, -2905, -6001, 707, 2799, -375, -256, -2519, -5186, 252, 5525, -235, -5551, -2039, 253, -368, 1647, 91, -4524, -1245, 4348, -497, -4962, -221, 2121, -14, 1110, -127, -4658, -1493, 6328, 2269, -4086, -1804, 732, 14, 2872, 2464, -3510, -2478, 4141, 1908, -2777, -64, 2188, 237, 1844, 1628, -3590, -2514, 5368, 4167, -2710, -2332, -124, 72, 2839, 3887, -3021, -4225, 3137, 3669, -1399, -622, 1186, -336, 1454, 3651, -2371, -4089, 3761, 5656, -872, -1985, -402, -999, 3139, 5754, -830, -5183, 1268, 4820, 904, 401, 615, -1796, 1025, 5464, -319, -4897, 1368, 5294, 862, -1134, -876, -3004, 1119, 6695, 1372, -5882, -2265, 2852, 1492, 1197, 493, -3935, -2502, 4498, 1848, -4825, -2245, 2499, 464, -234, -368, -4232, -2441, 4648, 3197, -4737, -4401]
2999d401M866K06P76O16n825j406P572J608o396K9L175q89K62J973m103j855P049
3016C257J771o917j238L244L67J936K135n669m362O823M136n073j389K254j765
3031d90O85L218l146l918N317L665n398k471K508j78J489L398m377n895M501N705
3047D613l299k770J751k231N28M777k220n901L639M963l413l265K271q43N33M944
3063D077k315p571K124O694p26k958Q07k436n48N827M89o599P42N214j205k126
3079e10J073j599k87N346K76p354n72N910N86j400K88l066k473O191L749o384
3095b26k588M084R10k107K209k142l374N396K994o300l167M697J527p16J105l232
3111i30m505N136N801m674m195K603L26o97L288j620m955K722N734m129m001K978
$$ y = [-4401, 465, 671, 1447, 2063, -3762, -5168, 2404, 4012, -2384, -2355, 820, -69, 193, 2166, -1937, -3792, 3257, 5028, -1889, -3127, 117, 484, 2420, 4555, -1114, -5476, 1347, 5483, 410, -979, 1275, -490, 195, 3413, 267, -3651, 1666, 5331, -67, -2538, -30, -208, 1281, 4679, 302, -5593, -1092, 4613, 1314, -1456, 295, -1936, -1408, 3369, 1149, -4752, -1113, 3850, 437, -2828, -557, -1400, -867, 4077, 1762, -5809, -3685, 3009, 2283, -675, 132, -2304, -2852, 2975, 3464, -3135, -2393, 2821, 1616, -510, 563, -1036, -1323, 4023, 4299, -3055, -3627, 2283, 2869, 1469, 1757, -1309, -3782, 2409, 6158, -226, -2814, 1270, 2180, 73, 2282, 140, -3234, 2162, 5156, -1144, -4311, 386, 1913, 1197, 2302, -930, -5435, -299, 5502, 828, -3367, -764, -438, -1135, 2153, 533, -4422, -1700, 4034, -95, -4096, -1118]
3127a118J366p03K678j759o006K670P125j933m773J180J40j000M493K29n910O45
3143b676N689j418m371K229J079j434K781M60o172N7O859K96m188M63l61j872
3159b579M188K499n750k204N196L18l356J182R33k232K473K559n972j773N877
3174A359J545l340m64j99k529L802M571n479l926M608J781k750Q68L06k584K212
3190b19L840m174m055M974K808k376j36j007l308K841O299l078n880K448L003
3205A980j092R59K47m425J099N649k319n400K886L358j760L04j30m402N64P486
3221E004j091o280L74K254m86J822J241n175j788O322P41n177K14K605j140J008
3237D48J805m936k206O615K081n434j550J789j077K691L106m936l891N016L143
$$ y = [-1118, 248, -455, 2223, 464, -5542, -2872, 4253, 2320, -2453, -1273, -1133, -2133, 2360, 2589, -3321, -2676, 3013, 1595, -2776, -547, 532, -902, 1879, 2339, -3833, -3776, 3083, 3379, -809, -346, -707, -2579, 1609, 4108, -1642, -3846, 1350, 1668, -1688, -506, 427, -1805, 668, 3227, -2745, -4518, 1359, 2904, -436, -900, -1099, -3628, 174, 4745, -734, -4660, -52, 1729, -1021, -153, 153, -2431, -219, 3621, -553, -4608, 366, 3174, 798, 662, -345, -3653, -812, 5487, 2409, -3471, -1023, 1980, 888, 1847, 2094, -2331, -1232, 4417, 2098, -3302, -416, 2942, 1182, 1486, 1356, -3046, -2482, 5004, 3913, -2367, -1993, 261, -225, 1597, 2838, -2337, -4125, 2197, 2938, -2239, -2025, 580, -560, 448, 2253, -2683, -4889, 1726, 3807, -1627, -3177, -1388, -2465, 226, 3332, -1604, -5495, -479, 2664]
3252B664l816m57J553j805J243L364l706l835M887L807l885j708J192j598J858
3267b42M729k956n896L385M032j981q58R08k539L53M536j738n315L008M176k393
3283A209j577N02k041L61N854j170o821J009M156p86m74J034l245j299N341L50
3299B403n506N78M101j082j433R88k692r69N824J182o565j308M231L79j50J502
3315A483l427k593N150K823m729j364L402p29n73K094k427k758N056L672n257
3330a77k905K857Q54N94K438k792n104M164M978l507k771K200m03k81L126j844
3346A427m403K869M951l040l994K107l7M37L768j895o310J787N713j305k848P02
3362g1r61j200M546J20n569L04N259r76l183J155r22q32M635P53o590r16N328
$$ y = [2664, -1152, -1609, -56, -1861, -618, 2746, -960, -4795, 92, 3899, 14, -1694, -502, -2100, -242, 4487, 1531, -4365, -980, 3052, 1071, 213, 1121, -1418, -1065, 3471, 1733, -3582, -574, 3602, 1209, -368, 134, -1907, -1546, 4308, 3138, -3683, -2674, 1482, 696, 222, 1256, -1989, -3288, 2053, 2403, -3103, -2525, 1576, 494, -939, 49, -2643, -3612, 2212, 3394, -3171, -4479, -248, 131, -19, 1483, -1944, -4537, 613, 3436, -1293, -2657, 745, 16, -557, 1537, -890, -3648, 1408, 5080, -177, -3082, -225, 629, 1223, 3661, 869, -4235, -71, 4907, 1400, -1371, 829, 426, 145, 3271, 1427, -2976, -107, 4844, 1804, -2190, -83, -120, 317, 4085, 2190, -4120, -2333, 3380, 2075, -773, -71, -1032, -2232, 2314, 2434, -3135, -2831, 2428, 1452, -1731, -576, -1498, -2330, 2305, 3058, -3532, -4448, 880]
3379H80P42j994L74j575k362M572K888n470j551M567J87k449J274l52k353L432
3395H10L010n101k675M165J609j648J221j378l589L754L788l324l068L152L99
3410A125j776J549J31l373K544M007l868l649L024J719j081J562j129m241J586
3425a870N488j952m086J632J147j279J468Q61l869N66N218k196m003J695J530
3440C50n48J550J62n190M38O259k07m331N78P58q21K113J425m135j268N187J95
3457B515l970P98J102r00K054J501m860k055N553K159l762n04K53j497K512L152
3473D051l513l553L676K291k950n2N83j847J898L343m033l985M129L272k384p60
3489A66k89k784K241M570k120n397K565K672j693pJ048k942N08M543j799m713
$$ y = [880, 1622, -372, 2, -1573, -3935, 637, 3525, -1945, -3496, 1071, 1258, -1191, 83, -269, -2622, 810, 3820, -1281, -3956, 209, 1818, 170, 1391, 13, -3576, 178, 3966, 642, -2426, 726, 1125, -651, 898, 1029, -2344, 200, 4207, 339, -3310, -286, 1433, 352, 1914, 785, -3456, -1870, 3618, 1666, -2420, -788, 359, -920, 548, 1409, -2460, -1894, 3324, 1128, -2875, -1180, 350, -198, 1352, 1514, -3676, -3238, 3021, 2814, -1517, -939, -181, -1002, 1111, 2536, -1599, -2867, 2320, 2515, -1455, -657, 445, -455, 1599, 3100, -1760, -3815, 1738, 3897, 135, -369, -116, -1613, 899, 4051, 538, -3015, 661, 2952, 2, -50, 533, -1314, 584, 3927, -106, -4091, 38, 3310, 926, 166, -123, -2907, -666, 3904, 1784, -3613, -1048, 1624, -69, -76, 972, -1970, -1462, 3081, 1282, -3431]
3505c431J954L114j070k72J87l368K8N758n7n409L95K313p30J064J354l277j393
3522b840M496M38m601N71K872r37M01P80l167j156M938J248m793l43K173m69M71
3539H2K273k416l152L926J798l640n11K624q92J06J642k423k915M339L027l707
3555A61j846J643m02N08K809k097l874K628L558k466j673J711q09P0K694j675
3571I40m463L080M387k755k465P71o95M44M049j071n327J065M395j135j796O93
3587A17j391k68L916m56n033O47M797j193j812L96j591k77M501R78n460j229L743
3604C85Q01j172J004k260j804M116K218m620j357L697K02j343J193j524k540M402
3620A398K995m678k391K494J310l43J511j592l433K665L739k815k250K017L93
$$ y = [-3431, -1477, 1637, 567, 295, 482, -2886, -2858, 2900, 2843, -2566, -2171, 142, -588, 476, 1830, -1447, -2840, 1656, 2094, -2507, -1936, 936, -1, 400, 1180, -1987, -3143, 1795, 3043, -1750, -2093, 80, -389, 82, 2355, -61, -3213, 713, 2511, -1129, -1640, 984, 92, 198, 1840, -583, -3498, 841, 3868, 161, -1685, -42, -444, 64, 2873, 776, -3098, -470, 3088, 622, -1051, 660, -149, -79, 2615, 940, -3523, -443, 3944, 1189, -1276, -505, -1200, -756, 3293, 2222, -3105, -2040, 2355, 1220, -576, 117, -1274, -1542, 2374, 1918, -3115, -2468, 2329, 1136, -676, -280, -1871, -2148, 2353, 3331, -2129, -3358, 385, 1186, 14, 1018, -1242, -3046, 1070, 3288, -1332, -2689, 1008, 1210, -133, 1060, -464, -3004, 1398, 4393, -285, -2676, -182, 1128, 785, 2296, 704, -2729, -64, 3675, 860, -1390, 627, 1020]
3635A020q79K220j417l320K400M244l059l372J950N64k40K328q04m516J161M375
3651B655j515k780J497k76j205K597j57m046P54M514j322l310J167K27n21K059
3667C38P24m592l61M810o0k718O42K40j340K318J408l913q69M339L62l025Q19
3684h78M18j242K812K077m561j724L987J531k016O27l95j935K220L017l616k289
3700a967L361J238j964M42r3j858J914L594l313l683K788K084j208%l01k995J462
3717d99M271k120m019J903J837j557O82J05l225J060M239j316m571J219J923m04
3733d72Q30K98l998j72N260k3m042O17R87q42J378J543l555q65M115O84l650o5
3751a972K293r24J176J863l571k196M721J586l094j12O38j009J309K642k951k485
$$ y = [1020, 141, 2361, 944, -2376, 24, 4268, 1209, -2163, -213, 351, 111, 2439, 1635, -2881, -1720, 2655, 1140, -1640, -143, -419, -1624, 973, 816, -3230, -2476, 2038, 716, -2594, -1427, -1200, -1721, 338, 1062, -3530, -3891, 919, 859, -1859, -1217, -977, -2317, 1, 1409, -2504, -3373, 966, 1328, -1697, -878, -460, -1702, 1110, 3187, -1374, -3098, 889, 2420, 404, 1031, 636, -1299, 921, 3938, 322, -1967, 1394, 2632, 668, 1110, 1017, -841, 1073, 4667, 1354, -2329, 459, 2543, 1335, 1335, 1034, -1961, -499, 3772, 1652, -2367, -464, 1373, -184, 498, 603, -2622, -1562, 2677, 1361, -3210, -1991, -68, -472, 358, 656, -3342, -3514, 1746, 1723, -2319, -1702, -715, -1557, -179, 1364, -2191, -3056, 1059, 1743, -1907, -1972, 321, -603, 573, 2436, -1135, -3331, 1390, 2976, -118, -230, 408, -601, 708, 3350, 399, -2086]
3767b086L535J672k996j34J278j175N82K892l008l246K989K626k454q31O24j485
3783a217N96L542k093m033K946J953k187p86J560j865J51L675j998l874J863L084
3799A317j695o59L36j781P7L726k90m199J213K356p43o52J186k043k75L535L73
3816A782m293R1L565j95p24R46k364j162M568J261m158r15K814j59l80J717k103
3833B91j994L622J565l391j266K736j75k54J181k238k434L365K799l170k180K007
3849D64l35J36J836j388l738K555K983k452k077J810O9r20K345j531l503K436
3865a310L474j823k341J091j25o36K773Jm269J135L600j621j307J239n75o04K781
3882A483J80m356P53M128q56j668P19q75n68L139P61l967n36L698o9j728Q02l49
$$ y = [-2086, 1449, 3121, 125, -9, 1269, 94, 676, 3568, 560, -2686, 303, 2929, 475, -356, 268, -1217, -621, 2921, 828, -3205, -259, 1694, -493, -1279, 281, -1584, -1433, 2242, 244, -3630, -1767, 1317, -378, -1037, -701, -2482, -2405, 1321, 1031, -3168, -1955, 401, -342, -994, 192, -1851, -2126, 1409, 1782, -2511, -2420, 1145, 950, 226, 1172, -1192, -2354, 2214, 3475, -683, -1598, 1216, 1057, 677, 2394, 291, -1703, 1919, 3484, 93, -1173, 1563, 1388, 1134, 2315, 77, -2357, 1008, 3807, 637, -1543, 464, 129, 265, 2101, 713, -3025, -470, 2513, 61, -2016, -206, -137, -1057, 1288, -243, -3746, -1310, 2164, 341, -2000, -909, -1034, -1670, 1103, 1104, -3165, -2030, 1570, -51, -1358, -119, -694, -1298, 1483, 1663, -2693, -1940, 2188, 1332, -336, 383, -492, -1060, 2079, 2840, -1127, -1663, 2035, 1966, 238, 1040, 691]
3900F91j923K996J355m047q12L652j88j897J159r51j832K925K287m099k088L166
3916C94K2r34J085p29k350J869K791k791k386K451R37j302Q58m87k522J838L395
3933B139k485k834K054J001p40J333m82k908J061L788j381l184K096Q49r28J482
3949H61L30l279Q25L967r50k914M00J612r21J621Q04l576m02M126k76k465O62
3966D25O23j158J434J475l580r03L942M94l122L07P43j012J527J654l370j897
3982b418L539P12k080J62J38j406J403J957k677k280K924J451k424N7P02j512
3998a752J004L117k491l331K522J821j433K59L00j989P48L148j109l563K145J697
4014A093j406K03N40k240O13L730j285l642J775K039j012L58O23k651j69L571
$$ y = [691, -1232, 1764, 3119, -928, -1740, 1912, 1724, -173, 986, 35, -1797, 1128, 3415, -684, -2772, 394, 416, -518, 567, -162, -2512, -643, 2148, -643, -3029, -578, 359, -943, -85, -572, -3094, -1256, 2139, -346, -3180, -1126, -125, -865, 468, -14, -2922, -1861, 1927, 546, -2638, -542, 307, -621, 861, 1191, -2088, -1263, 2704, 1754, -1160, -760, 852, -69, 1552, 2356, -1220, -1622, 2504, 2228, -237, 425, 1048, -110, 1324, 2799, -781, -1684, 2258, 2752, -370, -63, 680, -332, 1195, 2849, -521, -2418, 1121, 1833, -247, -85, 53, -1353, 50, 2007, -670, -2950, -26, 1425, -999, -942, -240, -1752, -748, 2369, -122, -3453, -931, 890, -543, -284, 16, -1973, -1225, 1923, 814, -2749, -604, 1093, -313, -110, 430, -1810, -1197, 2533, 1248, -2394, -619, 1420, 408, 766, 1389, -1262, -1431, 2140]
4030B140J29m077J034K341j431L89J065k331q61L543J98l701K25J942n72L88J361
4047A782k740j669L654J143l170n00K001j164M47J548k085j912K837J631k821
4062a018n76J664q07M81J758j939k759K999K301k463j013J237o58j03K895j703
4078B96k924J999K660j867j025J146r31l4K854j467l257J585L031j224j140R87
4094F89j089m53L039m07l837J119K633r52q82J132j549k38K399P33l890M99K383
4111A329j61j299J185j430j310L015J021l335n79K673m02r24J248j181j769K914
4127I95J540l524p13K318r2q12J393j207k346K583K235k765j840K511k33m96J634
4144A181r56k463J773K463k272j470J732L49p38J467p83k746J835L139k038j931
$$ y = [2140, 2269, -1808, -774, 1567, 136, 525, 1590, -741, -1602, 1941, 2139, -1562, -1337, 605, 33, 421, 1782, -958, -2627, 1027, 2170, -1000, -1500, 501, -663, -216, 1332, -753, -2665, 172, 1803, -1018, -1594, 70, -737, -256, 1502, -437, -3196, -197, 2104, -359, -1372, -135, -793, -896, 1999, 296, -2628, -629, 2031, 164, -861, 285, -646, -680, 2174, 707, -2550, -965, 2066, 842, -298, 689, -400, -853, 2186, 1779, -2058, -939, 1694, 742, -140, 992, -557, -795, 1604, 2337, -1553, -1054, 1329, 1168, -131, 1054, -376, -1686, 1329, 2350, -985, -1564, 1109, 707, -217, 1031, -150, -1919, 995, 2535, -989, -1702, 616, 524, -288, 1105, -102, -2448, 135, 2370, -395, -2235, 276, 43, -453, 1181, 225, -2238, -465, 1998, -274, -1744, -12, 337, -401, 1066, 283, -2463, -628, 2511, 473, -1458]
4160a458J384J55j125K068rl046Q71L181j157k377J459P06j331K022J14l269L01
4177a511L367o40k164R26j45q40J797J214l314n59L297k56k190Q89L0j153J992
4194G40J332l295j168L341L84j872R5m2j114J814K235l136j799K823J004k054
4210g12O71L9j787J663K201k201k235K450J110j735R33j22k242J451L120j878
4226G26l116K201J370j388Q66K39k289N63L154j440k335J523J266j245O06M04
4242A105k233J63L266m19k989P23J307q46P51Q52k439q32L805l54k810O03J191
4259H44r88P46J163k648p17K916N39l049K55J172q08M55J855k485j761L156Q22
4276A467k709K55J153j368O57J863j925k062L099J192k591l28J482j251J81K831
$$ y = [-1458, -74, 81, -1044, 1024, 1015, -2031, -1160, 2021, 864, -1513, -54, 652, -679, 1343, 1457, -1812, -1511, 1856, 1216, -948, -22, -167, -1007, 790, 2004, -1310, -1869, 1428, 1172, -1018, -129, -99, -1252, 740, 2072, -1223, -2391, 950, 1334, -538, -443, -485, -1599, 215, 2450, -686, -2485, 338, 1342, -712, -41, -2, -1789, -126, 2075, -126, -2361, 89, 1199, -536, 397, 275, -1967, -516, 2604, 726, -2390, -189, 1181, -207, 659, 898, -1391, -828, 2326, 886, -1449, 74, 1340, 95, 701, 1105, -1128, -965, 2301, 1882, -1107, -384, 923, 77, 828, 1680, -759, -1591, 2214, 1860, -950, -347, 844, -144, 602, 1765, -883, -1600, 1316, 1855, -1194, -939, 233, -575, -120, 1735, -750, -2511, 645, 1467, -1242, -987, 166, -1202, -545, 1318, -607, -2669, 430, 1622, -969, -1297, 185, -1066, -885, 1946]
4292A946k117k516K427J959k183j65R20j255M82K346j138k919J750K296j980l53
4308e00R62j601N14K844p77l314J238K270j068r53J187j377o23L037j77l487J054
4325g71K266r79l50M70j669k81K869L73l512J28K321o56j94J084k049j368L051
4342G33J039k711p08J918n17l10J800j632j781K414J843k952p52J883o87j42J892
4359A330r84k466K044K449k451j247J752n23j64J785p50k886K152K049j483j579
4375i72J651l19p07K263l75l048Q05L286k164m27J000r36q10K209j79k491N66
4392f48K430j335j378J144o4r80K031L92l410J96L050q53j515J118m42j296J849
4409B89R06k766m92L243p87j650J434m54j433J903J701l392q15K684L3j178R15
$$ y = [1946, -171, -2687, -260, 1699, -484, -649, 271, -984, -502, 1844, 706, -2213, -463, 1833, -147, -500, 462, -1139, -625, 2219, 1442, -1872, -634, 1636, 568, -385, 802, -575, -1198, 1839, 1662, -1825, -771, 1495, 516, 166, 636, -1033, -1314, 1555, 1928, -1584, -1456, 865, 209, 15, 1099, -950, -2318, 733, 1772, -939, -1647, 271, -246, -556, 1244, -388, -2169, 245, 2088, -864, -1616, 267, -420, -562, 1330, 346, -2120, -76, 2373, -78, -1325, 427, -96, -260, 1525, 775, -2111, 41, 2090, 607, -972, 679, 360, -347, 1916, 1541, -1507, -702, 2584, 420, -7, 993, 57, -753, 1456, 1277, -1214, -648, 1782, 447, -931, 213, 149, -831, 1200, 1592, -1818, -1622, 1428, 575, -940, 178, -264, -1560, 289, 1195, -1571, -2063, 1180, 393, -1257, 177, -277, -1710, 193, 1894, -1498, -2313, 371, 404, -774, 141]
4426A41n57j382J985J750k424j290K430j61j182J142l91j839J720K468k374j808
4442a772J866Q41r56J031m17k403J354K717j820j892J651N03j019J223K80k919
4458a732R61L049j466k259R59Q98j031J188N65k820M19K745l13k484J049N94j361
4475a039J257J157k918j96L037l43k062O14R86j452J482R72k562q74K898N53k315
4492h05O55O33j685J531J871k343j571K531P34k072L51R74j891Q71K391j967k149
4509a941K490R92j655P3P47j558O04K398j624k272J919J205j950M70R22j723K86
4526f17K339j320k458J610J582j487%J035j805lK588o04k767J530J488j559l9
4543d87J180j760m51L137n14l097J324J710j200k7J375j895r39K882K00k700K47
$$ y = [141, -416, -1798, 187, 1937, -487, -1777, 653, 492, -690, 452, 61, -1778, -58, 2410, 36, -1772, 94, 935, -21, 1010, 593, -1810, -456, 2261, 441, -1451, 200, 703, -316, 907, 1187, -1732, -771, 2278, 812, -1447, -488, 410, -621, 567, 1132, -1688, -1269, 1476, 1163, -1321, -272, 322, -1039, 218, 1375, -1543, -1739, 1298, 955, -1107, -493, 493, -959, 523, 1495, -1067, -1941, 957, 1510, -805, -150, 483, -1202, 329, 2200, -143, -1714, 817, 1551, -521, -170, 804, -1087, -216, 2175, 208, -1941, 549, 1541, -114, -41, 706, -852, -248, 2150, 526, -1746, 173, 1378, -572, -102, 820, -903, -617, 1722, 402, -2056, -446, 1136, -351, -351, 684, -1121, -1124, 1464, 860, -1907, -377, 1111, -448, -487, 693, -1067, -1518, 1619, 1105, -1992, -668, 1042, -158, -185, 1190, -705, -1644, 1238, 1438, -1262, -1015]
4560a015J539o45Q8J321j817j224K580Q41k596J4J415q97M20J567j800j852K439
4577C78J604k264o58Q91k60k85K464j712k728K118J843j620q77J516j083K91J859
4594A477j329k205J134K511j649n13O30o55m64K555p30k201Q13J894j179p26J340
4611G03r50q46K518Jk756N84K068p82p14Q55r09r11K511M81k965L10K070o44n79
4630D5J005o88j270J986Q18k400o38K392m81j027J387q44j363J612J599k579r15
4647a361K145o20o41J026n15j778J734J672k470o89J774k50j086J735n36k238
4663b098J523K257k060j456J914j88l17J029k87k354J183K256j247j656J112M42
4679E3q71J602J58k446O70K484r87j811R83L97q78J659J69k595K78K735q04j414
$$ y = [-1015, 524, -121, -33, 1288, -529, -1753, 827, 1668, -928, -914, 501, -396, 24, 1591, -209, -2061, 378, 1982, -282, -940, -49, -309, -594, 1870, 158, -2570, -452, 1391, -229, -1106, 410, -673, -382, 1477, 148, -2057, -923, 1588, -61, -574, 56, -599, -1063, 1492, 762, -1439, -626, 1268, 89, -637, 703, -247, -1093, 1425, 1426, -1330, -746, 1322, 540, -174, 681, -228, -1139, 1372, 1853, -1112, -802, 1268, 624, 45, 1050, 362, -908, 1078, 1896, -504, -1142, 1250, 769, -258, 1129, 285, -1078, 534, 2133, -446, -1361, 784, 164, -477, 549, 34, -1744, -10, 1662, -808, -1497, 277, 27, -1059, 676, 140, -2098, -575, 1682, -378, -1834, 80, -108, -425, 604, 317, -2037, -854, 1402, 155, -1501, -389, 53, -818, 784, 942, -1504, -834, 1650, 663, -1148, -165, 232, -646, 1013, 1182, -1413, -1135, 1600, 796, -618]
4697f18P98l1j020J550J105k529o14K660Pj898P56nr65J494J209k768r91K535
4715F75J09j228N86L0j633J442J850k591j087K380L02j195M72M8j699J350K140
4732A951k245j353J892L90j065N60P3j600P25K443j774j390J248R69j227O21Q45
4749A063k014J50K691j247k051J293J127j454Q38P09k158%K565q71j581J098L64
4766E22r45O79J012j783m68K468l77k032O45J111j041K97J258j871r00K221O06
4783A402k348N25J169j091N06J236j801j021K100O28j931L12J079j333N10J466
4799A408j600j666K189P52j559j52J085j185M89J273q75j943J956R32j697k08
4815h01Q56q10R2J994j284j816J218J367r02m80R12j285j4K283q97k073O22J969
$$ y = [-618, 180, 149, -871, 679, 1784, -745, -1359, 1301, 1308, -590, 166, 161, -804, 690, 1899, -869, -1860, 675, 784, -444, 142, 172, -1461, -19, 1831, -760, -1847, 533, 835, -360, 112, 160, -1539, -189, 1951, -294, -1647, 245, 635, -430, 130, 203, -1397, -672, 1771, -3, -1393, -145, 824, -403, 218, 1063, -951, -801, 1890, 643, -1408, -115, 1012, -442, 396, 1105, -1053, -1053, 1512, 641, -940, 158, 522, -423, 256, 1268, -515, -983, 1485, 1108, -924, -279, 832, -209, 88, 1346, -525, -1425, 796, 1402, -946, -421, 748, -343, 163, 1399, -402, -1423, 677, 1305, -626, -314, 765, -568, -58, 1408, -192, -1858, 331, 1083, -476, -628, 457, -728, -239, 1034, 159, -1784, 172, 1104, -593, -801, 55, -755, -663, 1331, 47, -1769, -551, 816, -86, -566, 346, -939, -953, 1330, 433, -1640, -1018, 951]
4833I51j261O6Q22j416m93K053K27k364M73J510o24k30R06j056p97K154M80k200
4851g99m6J462o99L0J090j372q40J894R18k035k80J700q46j46J210j098j563J720
4869C00J323j721p88J639o66l3J047p52j632J427J568j764m62J005n36l74J515
4886A096p37j892J069J944j711o71J116o49k33J586l63k124J012J877j426o55
4902g61Q53m90n30J572n1k050O70J795q32j055Q28j08r54J802N97k548M42J795
4920I75m53j288J260o72p90J761P39k210l28J887j2j330J084n61j045J791P84
4937A592k414j28J595l8j016N38L77j605J291J546k330p47J528L47q54N23m91
4954b86j254J333J544j454j523J625J46m64N66L26k106M68J949p06j535J131M42
$$ y = [951, -310, -244, 578, -838, -1331, 722, 949, -1415, -942, 568, -56, -286, 620, -436, -1233, 921, 1401, -799, -845, 617, -82, -52, 1038, -334, -1174, 720, 1638, -397, -677, 1023, 177, 31, 1241, 143, -1420, 300, 1623, -98, -886, 753, 87, 54, 1101, 349, -1283, 144, 1712, -52, -514, 491, -45, -419, 1096, 359, -1533, -464, 1480, -231, -902, 214, -435, -668, 918, 555, -1569, -557, 1320, -106, -761, 92, -398, -928, 644, 593, -1457, -787, 1008, 176, -879, -51, -159, -1113, 689, 1286, -1262, -820, 975, 522, -766, 494, -178, -968, 793, 1532, -678, -1006, 881, 869, -461, 623, 62, -983, 808, 1592, -822, -950, 645, 607, -409, 129, 506, -1099, 192, 1738, -592, -1339, 189, 536, -318, 205, -286, -1540, -207, 1337, -117, -1640, -15, 131, -333, 233, 559, -1547, -1079, 870, 164, -1371, -240, 202]
4971B02j140J274L80k052K66K367j185j426J119l2j75R43L15j835n4J979n7j546
4989f57R22K00q37J087M03j715l07K035l27j417Q19L26j001J235O90k031n04J814
5007G35M13j679O34P10j477J104J126j895o92J860L07j327K83L55j030N80J607
5024A614j763j393J920M81j355O66J09j264P62J376j251j512J396R58j154L39
5040g1L27j143R5J872p21j948J267J193j426M48P52j573N6J995l96j903Q06R39
5058E69o68J98M32j129j74K133k85j964O37J104r49j16J019j522o09K069K58j728
5076g25J09J135p82K05R24j162j159J960Q12k119K05J248j103K61J473j615j210
5093a543J556J330j796k57R04m04j3Q39m73j633J230J358j668j21J297j119q9
$$ y = [202, -938, 336, 716, -1336, -1070, 1297, 112, -1314, -195, -227, -402, 541, 856, -979, -1033, 946, 889, -657, 265, 465, -372, 715, 1118, -597, -904, 1131, 804, -613, 206, 532, -469, 766, 1456, -575, -1079, 735, 1148, -531, 103, 813, -664, 440, 1566, -329, -1021, 839, 1146, -181, 102, 457, -573, 7, 1614, -149, -1542, 378, 859, -496, 170, 279, -985, -223, 1153, -98, -1610, -214, 744, -410, -71, 256, -887, -792, 1080, 359, -1589, -322, 871, -555, -107, 645, -928, -872, 1123, 727, -1176, -370, 569, -99, 99, 531, -598, -772, 1361, 1076, -888, -251, 853, -96, -212, 807, -715, -1324, 745, 1003, -725, -616, 519, -263, -58, 866, -296, -1455, 505, 1317, -802, -597, 651, -452, -191, 1282, -333, -1543, 13, 1343, -453, -710, 194, -210, -223, 616, 143, -1490, -260, 1098, -570, -691, 606, -513, -602]
5110f02J629p30j921J302J437j186m32Q84q11l51J468m35j327N69J337p53l57
5127b79M40m78p77K061k07j809L24J449p40m56Q67p22m51J539N07k216K93J464
5145H09o78n18R95q70o64J849M18j651n08J940l70o82J026q87j431J731R49j462
5163dl94J172k68o04J009p24j182J131J620j912o27J157R3n83R62q9j713R45J178
5182A167j197j038J380n01l71J153l24j431K81J852r46j012J053k64o36J323L6
5199E25k168L25J924n50j137R66k67n15Q27P53j819j53J691k13r76Q76J07j013
5217h17J023O39j691j7J513j62n43J43Q6j001J258Q15j367p41J573L7j095P05
5235C58M02j355J043J034j591p08J538M22j167O16q0p82K98J358j275j023J193
$$ y = [-602, 1027, 297, -1624, -322, 1115, -71, -503, 381, -430, -781, 687, 252, -1075, -506, 831, 78, -279, 161, -317, -1094, 967, 760, -1049, -725, 724, -16, -472, 395, -327, -778, 761, 1268, -948, -655, 809, 131, -387, 608, -262, -926, 923, 1341, -310, -818, 1122, 752, 70, 1096, 209, -1222, 509, 1458, -4, -398, 774, 506, -98, 911, 187, -995, 136, 1756, -156, -783, 374, 467, -116, 846, 757, -956, -11, 1167, -30, -1068, 312, -189, -560, 593, 269, -1162, -881, 971, 25, -987, 66, -198, -834, 489, 525, -1643, -1318, 606, 56, -1081, -115, -382, -897, -70, 683, -1136, -1289, 402, 189, -787, 89, 196, -817, 206, 845, -846, -863, 650, 488, -55, 88, 174, -827, 431, 1246, -121, -862, 711, 748, -347, 358, 760, -595, 448, 1482, -109, -817, 721, 1143, -24, 592, 512, -270, 28, 1386, 111, -912, 281]
5252B81M00j062O46J07j129K87J570r92j335J158Q79j238M81R1j100J3J729n98
5270A88j604J144J56l98K25Q55j535k04J823j86j490Q19M05m65K49P76j459k17
5288i18J937J50j831Q32K68p50O47O84j124r29J777N53j515R3J225j084M40Q01
5306A256r81j220J649N78j617L31N70p34L59J224j296j468J720P24j276L8N66
5323D23j123Q3J636r70j524J303J059j505L26n9o08J62J505n80j630Q23J101o46
5341b24j90N77j244j52J603O0j776J029O51o37l41J042j039l95J737Kj406P4J169
5360E40m37j08K55n80m53J588N4j595L69J023k43k35O40p98q39J693J38j583J47
5379d24J089l89m25J210j074p27J307O65j486k49J223n43q19J107l86j354J122
$$ y = [281, 681, -381, 265, 372, -757, -470, 1100, 108, -1227, -69, 810, -428, 53, 144, -956, -943, 786, 188, -1416, -272, -116, -514, -289, 566, -969, -1173, 650, 464, -1026, -207, 198, -267, -18, 758, -701, -918, 1019, 1169, -662, 170, 438, -312, 335, 1019, -105, -1034, 743, 1296, -219, -126, 1099, 15, 455, 1256, 275, -945, 704, 1282, -335, -4, 566, -168, 191, 1415, 119, -1349, 371, 1095, -181, -143, 423, -700, -617, 1019, 49, -1475, -172, 887, -618, -292, -351, -959, -797, 708, 128, -1502, -679, 422, -224, -414, 163, -1081, -1233, 370, 430, -1346, -317, 334, -303, -644, 398, -641, -1036, 701, 703, -703, -629, 540, 103, -5, 250, -330, -783, 805, 859, -736, -367, 656, 413, 178, 818, 20, -819, 874, 1012, -571, -424, 665, 276, -149, 1061, -13, -740, 567, 1232, -254, -503, 720, 177, -642, 465, 79, -1275, -153]
5396a53J376j466o87J049k11j46Q71l27j805J516R21r93o72J002k87o67J322j0
5414F33j677M49J703r28o48N96j27m90J419m03j480L58J763q07o95O18j31o58
5432e05J239M4j561L55J129l66o65N94k91q34J406N09j533n24J492J23j215Q15
5450B12k80j235J247R92j464m20J118j12l85K35J55n47N00Q92j125q44J396j61
5468A74q90R99j13j213O97J577j356q85J058J04l91Q52j16j088O8J521q28q36
5486f66J099M8n41N42K68j377K76J333l97j190Q16L43j038P15O66j523n6J707
5504A025l66j276Q36j19m71O40O69j350p12J462K7q00P88l71n69J051L54j324
5522e06l24J254k65q66K14N33p86P66O44r07p32J099Q21j267J39M67j160R94R72
$$ y = [-153, 1223, -243, -930, 119, -92, -238, 633, 306, -1499, 17, 938, -55, -727, 275, -12, -679, 643, 633, -1044, -595, 1108, 180, -468, 128, 1, -489, 930, 527, -953, -595, 1168, 361, -334, 284, 153, -505, 734, 778, -783, -428, 701, 335, -330, 264, -27, -861, 545, 1054, -479, -1003, 489, 612, -603, 212, -68, -1303, -56, 936, -528, -948, 170, 58, -327, -92, 63, -484, 16, 908, -217, -1061, 335, 174, -716, 283, 170, -1043, -346, 1231, -125, -1010, 48, 152, -239, 613, 497, -591, -523, 998, 170, -666, 433, 481, -60, 482, 750, -627, -351, 982, 585, -605, 211, 554, -484, 231, 897, -626, -682, 1025, 659, -617, 219, 100, -371, 269, 938, -412, -1124, 338, 365, -435, 353, -18, -587, 464, 818, -506, -830, 424, 159, -707, -493, 40, -746, 20, 664, -243, -975, 124, 945, -322, -183, 284, -876, 118, 1090]
5541A090q81j445J690L50p46M87j58r98O24J183j103o45Q58L29o38L34L99j032
5559c02l08J444n53r07P27M90p26O28K33j268l1J428k28j401L67R64q19%O80j044
5579f26n81J605J6j085P5Q61o45P6P39q92o04J351L30j519N13O39q36K81P56n33
5599g9r70J150O05j311L24N71m49J6P76l76j103J069L08r17K69Q16q93M3J076
5618I25m87j486J324P10j024l31O84k60m75J235k26j335O06R09n97m34Q19p57
5636b00j48R95j46j418N01J417r67n91O08k32o78J160L25j652N54J095o61o06
5654f44Q88p90o37J704k9j432L71J030k94o33Q20n17o59J102M22j354j34J184
5672C98l06m77J059m83o47O24O84j028o91J161m3n98Q22l64q16R24P96j066o86
$$ y = [1090, 209, -1236, 454, 804, 58, 545, 387, -611, 13, 1196, 93, -552, 306, 635, -3, 331, 730, -302, -610, 834, 281, -626, 101, 591, -135, 493, 726, -542, -573, 855, 627, -774, -407, 557, -262, -262, 418, -626, -1207, 398, 414, -671, -596, 265, -380, -304, 435, -457, -1061, 290, 620, -899, -386, 253, -583, -302, 454, -79, -1049, 101, 706, -605, -281, 290, -159, -143, 633, 257, -846, 223, 531, -386, -117, 699, -194, -151, 925, 438, -1048, 276, 986, -38, -369, 315, 55, -420, 815, 589, -746, -140, 769, 172, -262, 557, -200, -348, 647, 501, -917, -416, 1001, 34, -557, 51, -181, -859, 301, 626, -1026, -472, 623, -38, -644, 244, -546, -1183, 521, 492, -940, -569, 461, 167, -466, 354, -163, -822, 280, 702, -652, -786, 398, 92, -385, 674, 191, -456, 168, 852, -176, -867, 294, 251, -347, 475, 111, -705, 219, 1015, -51, -737]
5691g37J182r9o87Q89l38r21N20J261r33q31J151j78q60J147k14j337Q46R13n51
5710B23p94M73l5n94J308q2j407J16J469m38j226Q62N3n07Q29q6r24j49J420j34
5730C77j194N83L25q19P44P17j046l58J236j28o65N99L6j161M53J358j291o04
5748h38J127J99o62L16j23m09N52Q82j181p68J224J33q84O43K51j053N67R11r86
5767i9p00R83m5m87O95J98j070K84J179p23r53R65J50p12L21L32q97J54J310m33
5787D52j174O14Q77r68N00J62r78k6J656n82j289Q46N56r66N60N01j233l0J166
5806F44k8j324P00O11j231O99P80j185m11J222K88j566P74K39n47N83N47r46n79
5825g30J291lr92K68O98j003O3J212r78j007J015R20j267J85O94l61m68J088l42
$$ y = [-737, 445, 346, -341, 548, 210, -711, -191, 1070, 137, -694, 457, 279, -581, 566, 352, -985, -139, 774, 223, -571, -98, -133, -727, 581, 499, -908, -792, 677, 239, -987, -125, -72, -579, 250, 164, -760, -909, 511, 377, -817, -234, 91, -728, 16, 733, -313, -671, 565, 437, -228, 371, 407, -754, -301, 1057, -234, -838, 289, 488, -174, 142, 19, -390, 162, 1044, -137, -905, 319, 452, -432, 211, 462, -591, -24, 887, -99, -799, 184, 139, -348, 347, 545, -525, -241, 938, 215, -738, 227, 377, -335, -14, 318, -579, -425, 885, 452, -722, -108, 769, -199, 301, 463, -515, -541, 1115, 533, -756, 90, 646, -320, 240, 741, -492, -522, 644, 616, -708, -8, 603, -628, 71, 851, -334, -745, 477, 765, -801, -27, 212, -335, 248, 795, -151, -730, 561, 558, -434, -166, 532, -471, -408, 804, -174, -1181, -166, 754, -513, -328, 366, 5, -463, 625, 283]
5844B83j118N84R39j114l7O42o76K4J316l43j330O73P15n59k07O45n82l07J044
5863E92n8j465Q08N60n12k0M05q49p0J377j23j191K67O60n11j33Q50q66l14R33
5883C40J67r27J02Q35o76J90M08q27o23J236N25j020n99J163l14m10J326p26j172
5902a002J375N62j331k67J298n15m19J161q02j218J131P89q63N3L41k72j48P96
5920F69l47q18N10Q24q27m15P64n11k32J024Rj400M99R12m10o49P33m92l29J126
5940F40j57j147J72J259n82n17M93k49k35R26J79j455o0J334l54n15O20l60r13
5959i21R61R17j502j08R04k25p39J460p13r21R36O03r60l34J228n27m21O02q1
5978A59q65R05J019j469m05Q30j30l84P45P2j273P75J059j173n07P85J39o52M59
$$ y = [283, -835, -251, 688, -426, -463, 179, -497, -473, 843, 500, -830, -157, 558, -1, -208, 437, -145, -452, 592, 534, -931, -123, 437, -75, -95, 310, -539, -609, 768, 645, -546, -279, 381, -130, -263, 587, -279, -593, 340, 507, -420, -318, 517, -159, 31, 439, -388, -1011, 225, 750, -270, -869, 294, -20, -430, 896, 170, -1002, 373, 935, -396, -663, 635, 120, -299, 862, 60, -1158, -27, 762, -101, -48, 293, 21, -127, 669, 322, -496, 14, 838, 11, -404, 360, -151, -383, 641, 650, -750, -251, 661, 251, -398, 335, -157, -486, 640, 483, -664, -492, 767, 185, -332, 161, -88, -323, 603, 782, -673, -733, 601, 247, -268, 352, -8, -921, 40, 957, -545, -653, 251, 26, -713, 747, 34, -887, 49, 652, -308, -642, 586, 59, -362, 240, 159, -706, 199, 1218, -251, -656, 174, 44, -340, 405, 477, -796, -21, 1038, -135, -642, 143, 282, -370, 89]
5997H9L46j094P34Q78r46o58R17o6p06P64J79q84j30J386o92m78L81K9o01O46
6017I4M46j024K7J386n99p33M73j93m97P88L98j139k7J220j55r66N22K24n67L75
6037E3M71q53l45J437k94j081N22N92r97M67R68j057q07J363o6l81QM25q95M95
6057B5O86p71o22Q97M07j013N57K01r27L40R81p82o48P00N69r12L90L18q78P6
6077d06J181m85j012P06M51j008L86O69o66k35Q81J08j436P91M14l22P8L30o19
6096a94n44J425l74j001O17O09q39k2Q86q32m92J323J46j321N31P45r01P8P41
6115E81m89r61J034K23j044J79N28l94J35P83q76n92Q62P19j115R7N18o06J30
6134b88J215j106q73J050N21l53n87Q60o74p8Q42J18j504M74R83n38k79O60o20
$$ y = [89, 435, -659, 75, 953, 7, -651, 266, 200, -506, 258, 437, -447, -577, 809, 117, -361, 20, 49, -552, 94, 540, -484, -457, 929, 330, -403, 70, -123, -620, 168, 566, -573, -600, 620, 465, -501, 21, 245, -322, 53, 524, -329, -674, 763, 469, -612, -90, 502, -495, -28, 940, -117, -924, 439, 373, -8, 0, 425, -470, 25, 711, -60, -682, 215, 622, -391, 166, 367, -560, -220, 761, -21, -669, 31, 600, -312, 78, 396, -482, -406, 775, 290, -722, -16, 435, -573, -187, 482, -184, -419, 462, 570, -866, -75, 339, 17, 95, 425, -194, -738, 687, 313, -688, -71, 538, -301, -323, 563, -269, -761, 562, 708, -613, -82, 663, -238, -160, 581, 92, -869, 165, 388, -656, -477, 51, -343, -208, 575, -301, -893, -31, 688, -427, -330, 188, -418, -288, 927, -179, -1052, -2, 519, 166, -421, 439, -235, -313, 529, 647, -857, -383, 600, 62, -217, 443, -177]
6153a77j22J038k17j262O88J001r88j15P16o16j44P88Qj074K67Q95m78k98N67
6172D77n94l12Q95o0j031N84O47p19k43P59l08n48Q30L00r84NQ86o82k19P32j21
6193B94r34N34J016j118r0P68l18o19M54J06q73R67M55r30k39O58j25l97O41P3
6213C23r72N68O70n73p55Q05j8n11Q81K22j329N07P71n56m23O52j34m83P34N9
6233D38j036L34P13n61p6M50n1n13K60M15r49K0J177n02o79O87K7n88P24J74p82
6254c18k98J060k45o00L85K78p79N06N70q96n76J482l05r82O97k4n84M79P47n57
6274D0p02Q32K1n02L87L75q44M31N61o60n71R77p2k04K29K29j060K32J217m82
6294D34q86N06L50k53J56Ro74r3J097j85j226Q69ql81M72N09q14j75Q61n6r25
$$ y = [-177, -299, 739, 522, -740, -52, 949, -39, -154, 562, -54, -198, 590, 598, -476, -209, 686, 208, -90, 477, -117, -429, 466, 406, -625, -41, 606, -113, -356, 403, 95, -453, 377, 677, -307, -302, 584, -98, -317, 415, 294, -640, -106, 910, -208, -298, 470, 152, -467, -13, 93, -780, 187, 642, -288, -527, 131, 6, -391, 250, 323, -649, -81, 589, 16, -739, 66, 48, -463, 418, 640, -689, -182, 589, 33, -390, 262, 128, -355, 379, 438, -598, -264, 449, -112, -188, 262, 211, -302, -42, 373, -576, -556, 621, 119, -560, 127, 154, -434, 290, 464, -318, -616, 444, 199, -401, -16, 262, -517, -11, 559, -337, -913, 569, 264, -718, -21, -45, -629, -150, 597, 40, -662, 170, 191, -311, 76, 451, -393, 38, 599, -61, -632, 345, 273, 69, 298, 527, -533, -301, 916, 434, -452, 54, 404, 151, 307, 316, -358, -451, 646, 461, -765, 104, 96, -285, 187, 696, -118, -293, 568, 512, -413]
6315d13O74L48q75L52K91m63o54J139J26j074O93J25o93N44L46n75p18J419K14
6334H06j036K7O10p21j7R48p91n93J014J76p98J20P75j070L26Q03q71o05Q30K03
6354A36m08L09K49p01OO26j25r88P87N89q30J56P51r59nJ033p34k82N61L35j009
6375e03K32N24p15O7P64K2q87M00N73r19K14M27j26o84J111J09j047N25M54n45
6395dk38R32p65n11J101j37p34J64M30k99k24O38j95o51O69K26n84p4O61l64m55
6416d14P35m38l00N83M58p74l61P77l33j34Q48o51n01N29L97p11j15R08n31m22
6436d50R90l65o06J12J100q67m57Q11J4n02N06L4r20N44N95n57k34O95j94p19
6456d70R47J86q84jQ34o05m97P21k54l16P01M21j442N30Q06n19j83K34q4p16R02
$$ y = [-413, 261, 609, -266, 86, 377, -86, -740, 399, 525, -549, 144, 269, -424, 120, 466, -109, -827, 592, 806, -230, -203, 407, -314, -331, 617, -174, -767, 247, 423, -375, -255, 520, -550, -224, 579, -292, -897, -67, 136, -272, 37, 286, -415, -409, 217, 92, -896, -109, 480, -350, -194, 557, -402, -407, 626, -108, -390, 171, 506, -503, -271, 253, -462, -395, 369, 391, -496, -96, 477, -442, -228, 199, 73, -611, 500, 609, -438, 87, 541, -4, -242, 690, -75, -586, 515, 378, -356, -192, 238, -61, -285, 353, 158, -493, 176, 402, -182, -256, 405, 41, -414, 321, -117, -417, 166, 624, -150, -511, 266, -67, -201, 647, -4, -505, 24, 421, -290, -405, 503, -28, -450, 540, 175, -431, -319, 781, -86, -543, 268, 282, -220, 286, 320, -600, -56, 539, -18, -252, 443, 249, -470, 477, 663, -221, -222, 612, 7, -490, 231, -23, -339, 362, 783, -659, -129, 677, 158, -25, 209, 125, -591, 311]
6477C11K37r39j63J021k51n07K76K38p96O84K64o70j9M40l45l90P80n7o64K56
6497b94J093p72m73M99q0j22j3M00m33n1R42p80m56Q80m62k81P31J67r03L45M92
6518D29l00m77O54j68r4R6K34o44j60J034n88m85J058o79k15O14K90r91M78M35
6538E21k59q67N43K25o19R13j67o19j21R18l4n80M93K33q30L87J15r32J14J060
6558D94k08o01P9L13n57L31M79m72k88O30j20k84l2N02n02J01O81q95q6N92K70
6579D27n70K49K11o08K92O91o44m05N67N3j13PL71p01q5O58k44m99L47O49m79
6600A74l28N66o09l40Q20k16o37M31M09n35K69L44o94l94Q36J21r20M78N70m78
6620a33o7N46o64k98Q95j27p13N23O8k92k5P27k50p67O33L25m52k54M64k39l59
$$ y = [311, 548, -391, -554, 467, 216, -291, -15, 223, -573, 111, 375, -295, -314, 126, -219, -609, 171, 114, -550, -294, 799, 27, -446, 53, -27, -149, -162, 238, -195, -246, 696, -84, -540, 340, -122, -403, 328, 495, -408, -63, 429, 129, -348, 306, 138, 44, 140, 374, -270, -430, 604, 16, -469, 589, -90, -305, 309, 599, -392, 86, 521, 262, -605, -62, 163, -456, 457, 290, -329, -450, 468, 434, -146, 347, 580, -250, 137, 252, -680, -566, 494, 286, -315, -236, 77, -480, -149, 330, -142, -430, 200, 80, -204, -236, 266, -236, -135, 546, -349, -435, 157, 427, -143, 106, 317, -291, 1, 692, 48, -357, 210, 263, 150, 157, 528, -173, -258, 400, 156, -343, 4, 653, 174, -154, 412, -197, -537, 283, 67, -570, -139, 270, -265, 4, 348, -346, -740, 96, 217, -703, -225, 345, -133, -200, 346, -318, -616, 279, 152, -561, -38, 30, -262, -287, 440, 190, -577, 56, 381, -71, -325, 139, -100, -459]
6641d59J003p55k89J074m08k91M7K35j44m51J003m44o07M59N85p33j9M99m66k42
6661d03R94j31r16Q40K22n42j74M66m13q0O29q1q88M57L32m03q3M30j43o27N91
6682G7N63j249N10M59k83k37M00J2n84M54J82m80l65O61k07k39O58J49p59M43
6702A65N18r72K27K58l61Q2L80k25o91O61L80m94j89N16k42k95M76j56m69L84
6722d7M59m71o2N77n09j83P58m7q57K73L26m10r2N56k43l80M75j55k14O8Q08m44
6744A86n37L94j10l92M61L03n95k60O95j29j79J19J88l55L41J92q00J86O44j90
6764A62o40N77j52l28M96L54p67R5L77k70k03L58j7n39P52K63o54k72O63K59o84
6785a70K22k13k06L92K75m42k13N38Q3l02n9K76o74N03N52o03r0J92K53p96O99
$$ y = [-459, 544, -211, -500, 574, 166, -125, -78, 157, 13, -438, 565, 121, -486, -27, 558, -175, -194, 305, -161, -403, 591, 460, -456, 384, 606, 64, -110, 356, -57, -137, 492, 411, -477, -20, 312, -91, -174, 256, 113, -514, 77, 640, -609, -99, 360, 77, -160, 240, 252, -332, 122, 304, -176, -541, 120, -87, -326, 332, 481, -278, 165, 683, -289, -62, 196, -165, -83, 297, 72, -619, 42, 422, -72, -261, 255, 13, -282, 194, 38, -431, -47, 412, -59, -121, 456, -53, -236, 522, 475, -382, -109, 217, -193, -285, 271, 28, -352, 123, -32, -246, -178, 630, 186, -351, 43, -67, -459, 2, 305, -290, -550, 145, 16, -163, -44, 144, -211, 130, 322, -478, -292, 352, 162, -478, 99, -53, -381, 115, 469, -298, -203, 174, -96, -299, 59, 42, -497, 255, 518, -136, -408, 255, 514, -170, 52, -161, -367, 25, 300, -142, -355, 183, 266, -36, -95, 181, -493, 10, 562, -41, -131, 61, 314, -482, 217]
6806B17j32l58l83R19M8p31N36J35r15O86K43n43j72Q93k90o97O45L48n37N4N37
6827E03m38l69O45J47q27P10R4m22N8M52p00k57R58M7p98L16K2m54M66L64o16
6848i9j90N33jo72L96L39l89k20P76n32m43K66L94n23M49J26l68l5J50k2k97N80
6870B18m5m12q5J05j44J54P26o44m05L87K92k85r0P04o87J90L81k88o28M05N40
6891C89m53L1L04m53k42N05K33n64j28P05l77L3M72o21j86N04L84j009N75M28
6911E30o28j5K57l00j36O67J17r72N22R4l7J1K58K0r45P85J99r78M81L54n67J0
6933b73R02o27o83N27L68o46M24o8J28k78K75K92p31k1P01k60j21M96n47n3M90
6954B95l53m19N54K88m25K4M4K5p8M1K47m77N03J2j26m51M35k14j67R8K61m16
$$ y = [217, 85, -273, -656, 263, 311, -420, 116, 251, -664, 22, 265, -278, -450, 443, 153, -544, 101, 449, -88, -34, 503, 65, -304, 341, 488, -339, 371, 465, 43, 101, 553, -147, -404, 554, 601, -197, 119, 141, -313, 153, 517, -99, -289, 244, 243, -429, -33, 306, -83, -303, 473, -59, -502, -236, 158, -365, 84, 210, -158, -193, -43, -65, -362, 218, 173, -239, -324, -219, -363, -209, 517, -127, -532, -145, 147, -138, -228, 476, -211, -21, 360, 72, -556, -151, 389, -64, -33, 271, -182, -424, 81, 314, -250, -378, 327, -50, -17, 455, -166, -352, 152, 536, -473, 102, 530, -98, -113, 144, -156, -292, 375, 492, -480, 42, 136, 99, 110, 368, 388, -557, 228, 427, -551, -70, 284, -283, -273, 629, 2, -681, -154, 214, -432, -8, -76, 52, -226, 49, 341, -390, -411, 290, 30, -91, 405, -142, -195, 295, -58, -477, 77, 365, -60, -36, 8, 33, -45, -4, 243, -234, 269, 281, 155, -296, 139, -75, -242, -144, 117, -299]
6976b99n1N44l25K7K43Jo36N65M03r05K67M48j94m61Q99o14p8N44N7p46k7M77
6998A39n9k10K28m5j75N3M92p03P6L46j71l29K79L16p25M25M46n64j09M21O2l94
7020b01M19L79j111N61L71k84m85K36L26l38L05J30r56O23M68l70l76L76N9p80
7040f48P76J06n68k1N78k14m13M30J76k88J25M58q07j95O73k61q1L8J66j0P7K09
7062C06k51n65J025k87m44K52K00n21K46L15o12n2N99Ll82L60K14o15J09N45n92
7083a47m43J066m16q1K28q3j02q7N66j82m42O0J60p9l1R1j20j29N27l32l25J31
7105a70M18m52K02M66p89J17L18j68m50O54j70l17k1N62o37K06L95n9k49P1J26
7126E3l08J32M56k80m69Q02Q5r22L76N39n10K43J53l26k93P87j88o68L45O2k58
$$ y = [-299, -350, 194, -131, -104, 139, 140, -496, 69, 472, -433, -166, 282, 88, -373, 526, -88, -166, 378, 435, -311, -338, 139, 80, -130, 98, 53, -122, -69, 423, -280, -204, 142, -29, -358, -79, 237, -488, -63, 383, -181, -290, 131, 193, -201, 218, 597, -514, 47, 418, 134, -351, -115, 211, -127, 178, 308, -648, -25, 443, 73, -303, 73, 132, -648, 128, 234, -334, -355, 223, 9, -404, 26, 202, -86, 39, 497, -310, -505, 168, -93, -174, -136, 30, 20, 97, 306, 55, -510, 515, 228, -216, 36, 236, -285, -39, 276, -336, -388, 211, 214, -168, 192, 406, -209, -100, 445, -147, -590, 476, 60, -21, 207, 124, 22, -65, 501, 319, -123, -63, 97, 18, -13, 78, -42, -171, 356, 24, -301, -170, 248, -204, -2, 464, -325, -208, 110, -58, -508, 146, -24, -341, -362, 200, -437, -231, 164, 105, -144, -73, 53, -255, -123, 333, 53, -416, 386, 471, -451, -75, 464, -46, 197, 350, 24, -269, 518, 330, -338, 7, 69, -189]
7147a89P3M34k29n42P39k0m80O2K81j39m6M62l46l30N04J26o76P3M91m38J62K35
7169B07r0n99K32P96q67k02Q46m30j81O75m21l16K33L97l23j2K94k56n01P97J59
7190D38o87j76N78j07j44K51l45m7N07N9o85K21M71m42O2L48k75l69M26m0l47
7211c03K9P21m75p9L04p5o07O23J37m69p1O74l81n64P08j10n86O17K74o47L2M59
7233B11Qm13N12l93k66J82O17p56J03L11j00l8J92R4o74K29K58q6l89O58k98l83
7255d21O27J36m76R8K25r6m65N76k02k5K34K05r50P0N82j09k02L49j99m49N60
7276F8J73l88l26Q20j62n72L82J5m70N42L92o06l5N37k21m14N75k07l86O15m0
7297B92m10l20O15k18j08Q8J88m24L55K66p54J19M99r2N0q4K95l31l82O60l13
$$ y = [-189, -116, 318, 89, -453, 286, 266, -214, -152, 129, -10, -56, 406, 60, -270, 234, 360, -316, -243, 248, -190, -28, 207, 117, -482, -250, 546, -321, -523, 323, -107, -288, 387, -34, -350, -117, 280, -43, -55, 239, -17, -518, 279, 438, -249, -425, 153, 46, -98, 153, -192, -239, 268, 327, -358, -137, 334, -108, -46, 302, 27, -342, 84, 44, -303, -274, 447, -28, -107, 197, 122, -485, 138, 275, -194, -265, 409, 28, -536, 172, 62, -524, 93, 367, -280, -248, 211, 219, -194, 318, -75, -341, -159, 458, -298, -195, 116, 16, -22, 170, 264, -410, -181, 77, -9, -398, 260, -38, -421, 206, 342, -134, -36, 189, 93, -372, 204, 2, -23, 211, 416, -534, -464, 118, 9, -193, 156, -43, -492, 68, 241, -147, -473, 347, 185, -387, -5, 10, -460, 82, 474, -132, -167, 370, 149, -265, 310, 103, -283, 332, 292, -118, -438, 177, -41, -149, -61, 127, -297, 58, 324, -430, -311, 188, 96, 146, 62, 357, 26, -356, 304, -9]
7318ik19M17p8l43J57J35m82K92P70m39o98P61K00p20M87K4m99L3L94n11O1K75
7340HK36k13J09J94p20J52Q01l58m38K64J50k56J57M05n99j88N32K11p89L51M3
7361E2n57J82O09r7m89L78M01p69N9N85o67K21O3j25l03P88K18j056N59j99Q6
7382f1N7M74l85l65M53M9k75K14K06p15K25M69l34p5J48O1l04P8L70l39k93N48
7404B06N0o19K12M87m03r3K01l48J16M48l5l54R8J62n14J58N56n30L19n8J46l90
7426a85M5L69n70j10O43n86o5O15p5m03R5O77m84j35K37l27k20P33L59p58j23
7447b68K69K39l61M08o4n95M44K05l38j78M67k39m2L81j54n73N52J85l96j22L70
7468A90j29r2M20p6m45P2M46m05j22L68n89K38K84j1o21J87N11k24j78L40k18
$$ y = [-9, -228, 189, 111, -232, -75, 60, -422, -130, 640, 201, -497, 264, 464, -256, 231, 255, -244, -211, 183, -328, -267, 8, 244, 31, 140, 334, -386, -234, 567, 209, -229, 35, 185, -71, 86, 491, -108, -296, 236, 447, -342, 9, 52, -505, -323, 286, 189, -300, 78, 479, -290, -231, 354, -313, -92, -29, -154, -457, 331, 549, -507, 52, -147, -61, -4, 470, 85, -280, 173, 222, -53, 161, 367, -348, -123, 346, 12, -63, 85, 146, -158, -80, 290, -49, -342, 206, 256, -363, -151, 336, -67, -160, 41, -307, -191, 257, 222, -132, -34, 128, -386, -228, 328, -202, 117, 59, 205, -185, -140, 229, -341, -451, 192, -394, -459, 156, 81, -322, -227, 450, -34, -169, 68, -259, -479, 254, 613, -145, -268, 1, 240, -121, 287, 223, -372, 72, 277, -61, -239, 228, -11, -53, 328, 174, -399, 153, 338, -58, -180, 190, 61, -31, 389, 313, -132, -60, 386, -19, -141, 227, -362, -124, 160, 149, -472, -285, 226, 2, -176, 164, -54]
7489e4k70M43Q6n99L10K91l81k69M72M1n32N34J34n67JM95q5l06L05P8l44L63
7511A46j7l26J0N31k31j68k6r1j01K00K80n32J66M70j5n87M65l4o25M19L22l11
7533e5j40M69n7n18M46j74j44J52K58l67j08M59p8n19O58L2m64j68N93k48n86
7554e59O82k27j28L64O3n68K36M77k46m11N27j82k7o7K02k31l46Q56q8m23L80
7575B84k24k30P5N97o22k22P17m04L0j24K84m34r8R50m79k17L89J98r01N55P4
7596A98o52O90N37p66q5L96o4l47R7J82l53L6M42j04m95L54r0k31M13l9l01q6
7618b68P31m24m96K16K96k27K46P3k35j49J53J54l58Q8K93j86l42N22k89k10Q49
7639D37k46n93M48l0j66p3o0N5O9M06pn18J94O04r77N00K63m91J0K79K87o22N0
$$ y = [-54, -324, 119, 205, -394, -84, 207, -174, -443, 29, 70, -462, 72, 206, -361, -360, 135, 50, -256, 49, 127, -217, 146, 129, -197, -187, 344, 113, -55, -81, -172, -273, -73, 207, -325, -159, 311, 296, -291, 174, 140, -485, -66, 256, -55, -195, 274, 217, -301, 145, -29, -173, -21, 237, -130, -238, 221, 143, -376, 282, 314, -150, -318, 275, 27, -559, 123, -104, -232, 132, 195, -373, -137, 340, 94, -317, 210, 28, 1, -66, 136, -95, -441, 415, 327, -96, 284, 60, -170, -95, 502, -120, -342, 375, -29, 1, -123, 161, -273, -371, 579, 100, -117, 272, 470, -431, 124, 198, -454, 236, 773, 7, -78, 318, 254, -93, 4, 186, -167, -131, 311, 207, -288, 66, -24, -255, 158, 119, -182, -268, 463, 39, -457, -241, 55, -172, 74, 147, -88, -237, -84, 70, -288, -200, 93, -93, -435, 87, -202, -412, 437, 191, -402, 46, 16, -150, -223, -283, -228, -159, 247, 240, -278, -84, 520, -457, 43, 306, -185, -175, 104, 391, -231, -181]
7662a81N06p28K92K51m7m46N82r0j43j40K77k97j47K76J28k80M05J36n41J12M53
7683C78m25m39J021o23j72K31J36k92q2O40o12n7M39j05n54N99J46k99M9J79l84
7704b26l8M83k22l88K16N77n69M8L76l21l04M94j33p0J0J33q4k64L10J35k55K22
7726A30K39m58J70J85j10j34J73Ll73M65J29k95q3J22k71Q7K80k61k13q1N76l16
7748c6j55N74n40J51O9k17l08O35K27m81j32N88l81j49M59j61l17J19K84l42j9
7769a32J99M3m68P50m08k47L35l4j45j95N35p9l36K93j14m73L85M42m18M4J66
7790A43K9l83K99k22O5kJ33p6m38N73k82l00N74J94m83O6K30r9l08J70K75j27
7812C1N7J72n50Q3L09j21j2K45j55k21J11K59n39oL79Q5k55N32r0o88M47R8k12
$$ y = [-181, 325, -403, -111, 140, 93, -353, 229, 139, -4, -144, 133, -164, -311, -35, 93, -187, 218, 354, -187, -75, 378, -47, -486, 535, -88, -260, -29, 107, -185, -267, 373, -239, -296, 143, 38, -516, 83, 229, -70, -21, 158, -226, -264, 219, -3, -391, -175, 402, -167, -119, 257, -64, -368, 126, -7, -77, -67, 66, -18, -282, 28, 163, -92, 130, 369, -89, 81, 266, 156, 22, 195, 198, -175, 290, 419, 124, 41, 163, -108, -21, 259, -2, -215, -296, 280, -36, -191, 383, -157, -6, 63, -154, -462, 173, 400, -81, -213, 375, -6, -155, 304, 143, -174, -55, 229, -113, -132, 67, 110, -358, 392, -16, -263, 72, 38, -107, -302, 233, 154, -182, 111, -3, -476, -91, 351, -67, -23, 143, 172, -211, 88, -134, -69, -71, 62, -14, -452, 121, -161, -461, 113, 307, -176, -110, 120, 21, -287, -117, 158, 31, 88, 260, -290, -207, 102, -19, -31, 214, 59, -162, -51, 208, -331, -337, 42, 127, -128, 404, 314, -374, 73, 171, -41]
7835d1l09M36J65l57J59L20l90j7M20j23k30J24J81m69L47q9l39J27M55j88o06
7856d24M55J32l73J82L95n63l24O92k82M4L85q3l43n6P01o05k64O98l70k71L51
7877G7k52P1L19k31j58m3M58k33l51M28Q6m60L38J72k45m44P66l0l06L7L20m12
7899i3O4K04m65R8L41k97R3j54K40k34R9N63m32m18J96M88m89K73J58j43j75J83
7921A00Q4l64K74n9m30J82L82k70o2L81m33q6J18K49J28m38N07n81J10K14J17
7942A23l75L68oj63j79N08o01L2L30J89l41L78l44lk3J76j42k75L09J16j21J21
7964G7M3j02r9L43l11l83K53L49m17J04K88j52l88M99p8j59J94J49j56m05O67
7985C16n00K63L19k74o84O95J18l31k55L71K21j73L17J22p38L17M72o02J3r0k14
$$ y = [-41, -350, 86, 251, -106, 53, 373, -17, -34, 386, 263, 33, 157, 338, -131, 216, 127, -212, -85, 370, 182, -424, 31, 163, -210, -28, 367, -196, -520, 172, -110, -66, 319, 236, -107, -163, 538, -67, -331, 367, -3, -274, 77, -175, -104, 215, -16, -174, -217, 241, 8, -343, 85, 171, -289, 49, 221, -24, -468, 298, 268, -38, -1, 319, -93, -29, 175, -290, -192, 149, -148, -55, -209, 31, -203, -104, 459, 27, -391, -195, 293, -196, 77, 235, 92, -83, 100, 184, -180, 94, 35, -395, -213, 169, -101, -163, 218, -215, -301, -183, 66, 194, -244, 263, -318, -208, 6, 123, -252, 116, 110, -53, -232, 276, -325, -293, 37, 226, -115, 263, -81, -84, -107, 69, -73, -348, -39, 77, -44, 77, 120, 18, -81, 262, -49, -432, -179, 170, -247, -143, 145, -7, -395, 104, 26, -133, 61, 210, 54, -351, 316, -184, 79, 398, 124, -560, 135, 253, -78, -333, 38, 259, 86, 403, 525, -213, 104, 576, -26, -13, -103, -317]
8006c17M44j8o0j87K62M0l26P1L29k15j02J58l2j81m0M30k60k16j2K92l40J68
8028a12K42j39l91L63L10n12M68r0o67P31r0k40L22N0k63j24K38%j48K04P4m32
8050b06K74K3j27J22j54L16m42R0L13k13m7J70M0k33L13m02o1r2K66j17J83K11
8072B27K2p5o2J13l29J0K78j9l15K7K20j88r3L69k33j57M30j65j7K59m65K48n4
8095C1K36l06K6J77j49j25N02j70m65N69j16j67o0K31R0k49J8j53J2K45J25l40
8117c8k2M26k73j95j9K00k60K29L26m94j47M15j27k5J05k03j45J93J07j3l99K73
8139h6J61j10L74J47q70J13M16N8l37L67J37m63J72n8k61k1N70n7k97L9j51K58
8161A01m41M36k81L64p9k46J23J94k31k06J58J59j46k62L00m5J32J23k0l47K24
$$ y = [-317, 127, 109, 49, -138, 124, 164, -162, -91, 238, 23, -79, 79, 47, -134, -174, 256, -4, -220, -232, 60, -280, -112, 130, -9, -400, -37, 273, -239, 229, 139, -528, 203, 113, -127, 195, 245, -18, -142, 96, 96, -52, 152, 226, -206, 68, 91, -36, 86, -68, 248, -194, -104, 209, -4, -51, 119, 159, -74, 239, -163, -224, -316, -50, -167, 16, 227, 249, 174, 112, 225, -104, -94, 184, 165, -150, -123, 97, -91, -184, 185, -48, -205, 225, 60, 43, 302, -163, 85, 31, 267, -39, -13, 164, 15, -110, 392, 222, -243, 326, 210, 43, -17, 214, 304, 55, 73, -80, -68, 177, 302, -38, -60, 366, 93, -102, -121, 79, -181, 48, 374, -120, -267, 148, 21, -4, 101, -102, -247, -54, 53, 40, -359, -86, 75, -35, 339, 486, -384, -271, 145, 203, -134, 233, 370, -93, 79, 21, -240, -261, 309, 252, -45, -6, -157, 101, -340, 96, -185, 179, 100, -146, -23, 171, -60, -266, -108, 51, -95, -357, -57, -102, 30, 153, 133, -214, 10]
8182A0K49m11k78K71M29n12K26L09l01
$$ y = [10, 259, -152, -430, -159, 270, -242, -16, 293, -8]
8191h
$$ Imaginary data points
##PAGE= N=2
##DATA TABLE= (X++(I..I)), XYDATA
0@%%%%QqQj6J6k4L3m1N2o1P4q9J12j36J60j91K23k57K98l46L98m54N20n94O73
29C58p63Q60r64J082j212J351j504J677j866K068k293K541k812L114l451L821
45B007m236M707n240N848o555P384q371R580j1094J3050j5695J9494k5446L6189
59B1622o1659K28111K38601l76345j69762O9499K30665J16650r4714k64927k7735
70h9994K25774J22577j49896j25829K8473J36298J09369p2352k47556n2283K49443
81A34024J77933j39826k32497j08674Q4171K12452Q4891k13276k17359O5689J75865
92B3393M1376n9792q6069l4973R9589R6862j00177j28160P7319J40162j156r5535
104b7161j06973m3880J25863J66591n6522j91639m4544R7423Q9912N3097k4884
$$ y = [0, 0, 0, 0, 0, 8, 0, 8, -8, 8, -16, 17, -24, 28, -33, 41, -48, 64, -72, 88, -103, 120, -137, 161, -185, 213, -241, 279, -315, 358, -405, 455, -509, 573, -639, 712, -792, 885, -981, 1087, -1206, 1335, -1477, 1637, -1814, 2007, -2229, 2478, -2762, 3086, -3469, 3915, -4456, 5124, -5970, 7080, -8615, 10879, -14567, 21622, -40037, 188074, 426675, 50330, -119432, -49933, 180732, 297382, 202668, -62259, -89994, 135780, 258357, 108461, -17368, 11105, 147403, 256772, 184420, -63136, -115419, 134024, 311957, 172131, -60366, -169040, -84869, 127583, 212474, -802, -218161, -152472, 23393, 64769, 4977, -81092, -116065, -16476, 80386, -19791, -147951, -70632, 69530, 68374, -27161, -134134, -178014, -52151, 114440, 57918, -133721, -178265, -80842, 9070, 62167, 37283]
115C7283r7230j552J07796J8297o0310L0085O4916j4521l3255k7042m1964M5644
127B8147J22928q423j36681m6268N8930N0662M5964J0773p5813l8286O8732K3603
139A04268m7665K5236N7701k9816n4314k4756l1020L0874J05574q457j47957o7659
151h7991O3150O2624L2561r336q9434n0263Q1411N6001n7679k4271M3972N893
163B6638k2189k0842n6328m752J13555N1834j20018j10301K4143P9839P7527K2816
175F1922j02784j03096O7818J21782Q58m8639j2127n495K1877M2337l7725o3867
187e7139N9845R0704m2164r4500k4833L1568P9993Q0994n4864j39914o756J17635
199D0569O2656j0748l5468o1475j1302P9025K8309o6975j3823M9802j0571m5750
$$ y = [37283, -59947, -61499, 46297, 64594, 4284, 34369, 99285, 84764, 51509, 24467, -17497, 28147, 151075, 142652, 5971, -40297, 18633, 69295, 115259, 126032, 50219, 11933, 80665, 104268, 56603, 81839, 139540, 109724, 55410, 30654, -366, 30508, 136082, 127625, -20332, -87991, -24841, 37783, 70344, 61008, -28426, -78689, 2722, 58723, 1044, -23227, 20745, 26638, 4449, -16393, -72721, -77473, 36082, 87916, -32102, -142403, -118260, -38421, 39106, 61922, -40862, -143958, -76140, 45642, 46500, -2139, -14266, -19761, 2116, 44453, 6728, -57139, 2706, 93410, 51246, -43254, -68087, -36519, 43474, 124468, 69604, -70310, -77066, 40569, 103225, 92477, 57009, -4466, -15768, 63257, 91566, 24591, 10768, 60570, 49999, 4249]
211D249j1948r082J8455P4394L180j08704m7648O6715N6204J6560l006o2481n8490
224f1602M7789O1087k5834k1049J6729k9322l9509J9066J5188n215L5255Q217
236B0800p6264l3903O2867M2087l111M630k8413m6932K9370N2233j9897j5510
248a2043L3124j5310n4412K131K7581J2845L7868O134q6022m8994P4983P3426
260E1311m108k5859m1571l5898N0945P1757l1517n6987K2595K4993k4661j5124
272a4124o756o977N1451M7476p4459r6289L4356R5145M0549j7655p1964p6888
284i6135M4338J21580R922r0121l8008K0539K2813K5918j4975o1132J1606Q3618
296C9963o607r4327k6363N6964O2324L6160m4475j14620j6801J27607P9538n7477
$$ y = [4249, -7699, -16781, 1674, 76068, 79248, -29456, -77104, -10389, 45815, 62375, 59369, -3112, -61602, -13813, 47274, 21440, 391, 17120, -12202, -51711, -32645, -17457, -22672, 12583, 20800, -55464, -89367, -26500, 15587, 12476, 17106, -11307, -58239, -28869, 23364, 3467, -12043, 21081, 5771, -48641, -46510, -18929, -6084, 31784, 37918, -48104, -97098, -22115, 51311, 47203, 21344, -20227, -56125, -5180, 66577, 35060, -21927, 668, 25661, 1000, -14124, -20880, -27857, 23594, 71070, -3389, -99678, -65322, 29823, 70372, 52717, -19247, -96135, -51797, 69783, 79705, -10416, -48424, -27885, -5072, 20846, 5871, -55261, -43655, 39963, 33356, -60971, -87334, -30370, 31954, 68114, 23639, -90981, -107782, 19825, 99363, 41886]
308D1886p7503l0466J8802P4038L6647p5291n8960N7234M9055l7504l6971J548
320c7485K5273O0116J8604r3958p3551P4883J03828P37o0797o5824k8097P0793
332e478R0681l5808r4657l426M8893J1532n435j4613k4189L1833N5698m0749q2733
345f8451K0719Q2152K9258k4746n8489o1391L3936J06112J3523q8032m3028K2133
357c6304K5484K5846K919m5529r171N6270L135o2303n601N3762K8018j218l2168
370C140o5678j747R4889M5191o5684n7846R52K0632M0350K4883m6132m0436M1754
383e732L0662l8653j6524L1448J8849Q641p319n7858k8321P5005O3818m2575o2899
396c1458j6085J1098M5189M4757l7887o4778K0019M8247j3047j9460J2012N098
$$ y = [41886, -35617, -66083, -47281, 26757, 63404, -11887, -70847, -13613, 35442, -2062, -39033, -37485, -12212, 47904, 66508, -27450, -101001, -26118, 77710, 78447, 17650, -48174, -76271, -5478, 85203, 49395, -45262, -48688, 205, 11737, 6302, -8311, -32500, -667, 55031, 14282, -68451, -47732, 34420, 63678, 38932, -19557, -80948, -47012, 59100, 72623, -15409, -58437, -36304, -10820, 15026, 17945, -27584, -36755, 19515, 22650, -39653, -45254, 8508, 36526, 35308, 3140, -62538, -64285, 30604, 75795, 10111, -47735, -46783, -26151, 14199, 39082, -7050, -47486, -5732, 24930, -13723, -30247, 1201, 20050, 28691, 21372, -36486, -64807, 10198, 74016, 31441, -31458, -47543, -36445, 8744, 53501, 15614, -49164, -29145, 19102, 6055, -13405, -1393, 3705]
408C705J0782J5566m1636m8388M7528P3397j5280n9289l1054l535M2938O4314
420E9048j9211q1246r888N3032J5684j0324k149j4575L109L4869j3858n6624J4013
433b8120O7818R177m2551l5528k2060K7529P5291J0378q1452m1118M0748L5521
445A5633R386k698l2442j8407M1938J9478m7128j5067M6235K1107k0328k4756
457g049l2821L66P0619L9644o3732o1994J8472L9715K6525J0856l8092m3593L0916
470a0168M6717k3753l0484K0680J8143m522n343l0383k4188N0507N8537l7253
482B8490o7910m576L1192L5896K8391l1049o4208Q669O0500M882l1300k391M921
495A507J191J4291j5522m0544K2204O2693q731o0164k1502J5526L3782M3645j2296
$$ y = [3705, 14487, 30053, -11583, -59971, -12443, 60954, 45674, -13615, -44669, -48204, -5266, 59048, 39837, -41409, -51297, 1735, 17419, 7095, 4946, -9629, -6520, 28349, 14491, -42133, -28120, 39698, 48875, 6324, -29204, -51264, -23735, 51556, 61934, -19518, -60636, -19888, 15633, 25019, 22321, -10121, -28528, 13410, 32888, -14240, -29307, 16928, 38035, 17707, -7049, -39870, -39504, 31115, 70759, 7027, -54967, -36495, 3220, 29745, 40601, 2509, -41084, -10168, 36549, 12796, -17688, 2992, 21135, 16613, 11270, -19113, -43301, 7206, 65743, 28490, -39420, -43996, -12804, 23092, 51483, 20434, -43774, -35105, 25395, 30277, -1023, -3414, 1507, 2698, 16989, 1467, -39077, -16873, 45820, 37089, -23075, -44577, -29051, 4731, 48376, 36080]
508C6080p3846j9314N8870L1433j9099j5169j2771n012K8507R079m2702q148N1466
521A9374J4007m0437k5972j426J9753N0575J3322o7078m4258M2840M7261O20j4348
534A4233k6756k0348L1086L5300l0509l0587K9794K3523j9549j7610j0376j760
546b3559M3309L5410m6745n9750J9960M8966J7281m198l0282l9994J9538N4040
558C3976p978m1559M658J9403m819l142q738j9757K4216M7590k2645o0933j980
571d1708M0419K5060R970k3313n3092j27N9973J7512l7820j4901P687N37J2107
584B304K950k8771J023M6444K234n0184j5881K7121K5130J9974q420n4095k0697
597e0868N3982L8211k4861k5498m679j566K0361J8939k7375k0718L5483K0086
$$ y = [36080, -37766, -57080, 1790, 33223, 14124, -1045, -13816, -18828, 9679, 18758, -23944, -32092, 19374, 33381, -7056, -33028, -34454, -14701, 35874, 49196, -17882, -62140, -19300, 27961, 28581, 14233, -12523, -32871, -1785, 33515, 3006, -27581, 2213, 25736, 6187, -11423, -21799, -23559, 19750, 55160, 8415, -51335, -31375, 17591, 34872, 30674, 392, -39602, -20064, 33976, 25998, -15561, -10903, 8500, 3681, 539, -8199, -27956, -3740, 43850, 21205, -39728, -41708, -1289, 23771, 33741, 10428, -42664, -42791, 17182, 34694, -3126, -18027, -10340, -9803, 2304, 5254, -23517, -22494, 23950, 26184, -24000, -39881, -12760, 12370, 32344, 23924, -30171, -50868, 3114, 41325, 16464, -9034, -13713, -15279, 5082, 24021, -3354, -24072, 11411, 31497]
609C1497l3841k1546J3308J6768K4319Q174m7772l9048L9402N0227r421k8836
621C231j7395j0234K2933L4868k0010l9095J6933L0095j5402k0461P15L171K1513
634A0862K4982l3223n3302J7497N4729R633k3286k6908k4263J7543N1087j416
646B3935m9465p928K9471M461p747l598j3413R402L8171p576n4783o305M5986
659F11K4272o659k3152l7213J73N7188K5576m3061k9042J5161J3493J0245O129
672A3721k2810j3558L5378J8076l8060k1649K6239K3025O558p320l7780k1087
684c9267M4614M2235k4781l6445k500P380J6633K0824j8233l2123J8026K9670
696B6033j9149k3830J1524J3743O957N476k7496l2693K6352M6801r496l5374j1071
$$ y = [31497, -2344, -23890, -10582, 6186, 30505, 38679, -9093, -48141, -8739, 41488, 32067, 3231, -14164, -24398, -1465, 33403, 13393, -25702, -8769, 21326, 5924, -14537, -13822, -10651, 10862, 35844, 2621, -50681, -33184, 21545, 31178, 7892, -19016, -43279, -25736, 25351, 23935, -25530, -33458, -3987, 474, -7273, -10871, -24284, -14882, 23289, 15713, -39070, -45375, 611, 24883, 18224, -4928, -42141, -41968, 15220, 40796, -2265, -31307, -16146, -2653, 7592, 13721, -9089, -22647, 12731, 30807, -7253, -28902, -2663, 20362, 26920, 19600, -18180, -39267, 5347, 47582, 22801, -13644, -16144, -8764, 7869, 28693, 10460, -21663, -3637, 26033, 6884, -16946, -5422, 8321, 15278, 20754, -6742, -39435, -13083, 33718, 24222, -11152, -22223]
709b2223N35J5259K9079q577m0376L091L3713m806k1969L804P645O741J3105j6353
723a332l8603J2574M9778N169l3078j8668m233J5684L8277J070m7366j2574L7654
736D352J3601j7141o863k024M738K6158j142m4817r161M6980K4525k1354k7159
749i307j8727Q053M8630K1393m8063l8714K5503L2274J905r457k1483j2396L1437
762A1048K7113l4918l5447K2415L3725K718j6409l3184j8000M2045M8469k6010
774B3565n5352m377K8423K4233J1142k5232m1157J3098M8298j989l8534q357J7124
787i115J6434J0566k0856m0572J2290N5821P979m2087k5058N199K2568L5274j531
800B6912n0789j8970M0763K5786j5579j5410o849J806K4756Q881l4911j5990L5718
$$ y = [-22223, -21688, -6429, 22650, 14073, -26303, -23212, 10501, 5695, -16274, -12470, -4825, 1916, 15021, -1332, -39935, -27361, 22417, 27586, -5492, -24160, -28393, -12709, 25568, 26638, -20728, -33302, 4352, 17953, 812, -6051, -8075, -3337, 22821, 21679, -23138, -32299, 14681, 39206, 17852, -9307, -28034, -19981, 28649, 50042, 1979, -36735, -11232, 21042, 22947, 13490, -7993, -20389, 11048, 38161, 3243, -32204, -9789, 23936, 26654, 10245, -22939, -40939, 1106, 49575, 23565, -31787, -36164, -7741, 16492, 27634, 2402, -38755, -25657, 22641, 20652, -17882, -26239, -9115, 7319, 17885, -2971, -43543, -31253, 24568, 32547, -9540, -34598, -29399, -6831, 28443, 26912, -23877, -42847, -2084, 23702, 8123, -7287, -14136, -12330, 12426, 21307, -13604, -29594, 6124]
813F124K2083j7980j7830r525J366L2617K3436l4038l4972J8758K6044K56k641
826A3698r884j6517J2201K3025j5649k0631J7273J5070j1167p135l275q637J6740
839E112K5622j8949l2200R523K0340j033q0k494j6891K293K1485p801k0488J3321
853b240J6012j1798r564o27o364J2983K6014j5165l6434N816K6871M190m179o582
867a067j8113M094K8785k104k9157K317K2392K75p444o963j4228J0107L6797j662
881B4029m2708j1633K6388J8303N261q324l0983p513L8145J9111k8073j8208J0892
894e313R921Q275Q52k5357j1729L5603K2064k9098k5697O368J5374J9840Q241
907B9344l2508l1388K5314L6616p870k2286q290k474J5025K1042j6500l0267J3489
$$ y = [6124, 28207, 10227, -7603, -17128, -15762, 16855, 40291, 6253, -28719, -9961, 16083, 16339, 13698, 3814, -12703, -502, 22523, 6874, -13757, 3516, 18586, 7419, 284, -2991, -11628, 5112, 30734, 11785, -20415, -10892, 9448, 8415, 8335, 5841, -11050, -8757, 12728, 4927, -15561, -2240, 13772, 1974, -7590, -8217, -14581, -1598, 24416, 9251, -27183, -21367, 5504, 9694, 5515, -1067, -19180, -15086, 13699, 11595, -17562, -15245, 7147, 7422, -22, -6985, -21213, -11106, 25691, 24029, -18679, -30312, -3924, 14379, 19640, 11316, -19667, -27180, 10965, 30076, 2003, -16205, -5313, 4608, 12883, 13735, -11622, -23351, 12252, 34316, 5218, -20479, -14111, 1263, 21103, 29344, -3164, -34552, -9238, 27378, 19508, -2778, -11068, -13542, 1483, 22525, 6025, -24242, -10753]
920a0753K8920o855j8942m739j745J4148K4064j3431l9376K744L2487P815r818
933D519r820j5486K171K8597M294k8599l921J9421L96o922J253p562JK2761J969
948A3072l0280n704K4014Q040m843k003j3684p070K3084J2303k1055p178J5797
961D493K02p166M365k678m115J8594M979k7102r024K4759J0594p640m503j1348
975e590p400K3115J5917k2822j6227J6259Q609n444j090p471p371K1317J5185
988B6987k7702k2591J8522K0229N43o293j9434j6867K4236L1536j7017l1143K659
1001a6335J4902Q172N024j4524k3572J5593L3183j1438l1717j398J6962J3999
1013H851R157j8537l4739R630M3934O899l0450j7096K540J4940K4914l365l7133
$$ y = [-10753, 18167, 11312, -7630, -12369, -14114, 34, 24098, 10667, -28709, -25965, 6522, 14337, 4519, -5301, -20787, -18616, 9981, 14275, -14324, -18245, 1176, 1572, -5350, -4097, -11659, -11658, 11103, 13072, -17208, -22912, 1102, 9142, 4299, 2296, -11388, -18458, 4626, 16929, -4126, -11304, 4493, 4695, -2471, 1894, -784, -4899, 13695, 18674, -8428, -17452, 7307, 17901, 10261, 5758, -5590, -12990, 10125, 26042, 3220, -13007, 3252, 11861, 6417, 5327, -2144, -9515, 11802, 26987, -715, -23306, -4784, 15445, 15988, 9695, -9739, -26606, -2370, 29166, 12149, -18994, -16335, -1433, 6739, 11763, -2761, -26333, -10740, 22443, 11005, -20712, -22110, -5148, 8851, 18008, -529, -35268, -25638, 18296, 25195, -5255, -22351, -19811, -4871, 20043, 16678, -20455]
1026b0455p967L4991J4707j9237j4351j944R118K5332K653l7323j6520L3325K4292
1039B6621j0750j7947j5173l30L1294K0401k9178k8491J6036K1660j34n761j2765
1052d517j0998K0205K3034k1325k7494J2258K1236K038m772j4782j7575J7263
1064e429L1563j0360l0155k68J3847N034O724o171k1490M843K6461m556k2915
1077a2872K273J2582J482L518m978k0082M406K9060J182k4325m463R082L372R087
1091I324J960k0537m038K3848L608j9569j060J0901J041L665l79j8875k276K7725
1105A5338P964k3226r153P518N183R470M735k1235j1414K3630J2418j8217r009
1118e998O707K795P270M204k0629j2917K5073J8147j7548j6474N62M054J4663
$$ y = [-20455, -28422, 6569, 21276, 2039, -12312, -14256, -5138, 20194, 22847, -14476, -30996, 2329, 26621, 15871, -2076, -17249, -17579, 13715, 34116, 4938, -23553, -7517, 14143, 14009, 8248, -4517, -15515, 4690, 27724, 6399, -21095, -8837, 12399, 14437, 9665, -5117, -22692, -5429, 26134, 15774, -14381, -14649, -802, 4232, 10956, 4785, -16705, -11862, 14599, 10043, -12872, -10599, 1983, 3465, 6983, 2005, -18077, -13671, 15389, 16571, -7754, -12217, -3135, 237, 9324, 11284, -9253, -13291, 10557, 14165, -5404, -6464, 4437, 5478, 9143, 8764, -10111, -12387, 15338, 23302, 76, -9077, -1559, 3624, 13094, 17829, -3406, -14820, 8810, 21228, 3011, -5998, 709, 3504, 10774, 14978, -5651, -18568, 6505, 24652, 7104, -9370, -8808, -4754, 9909]
1131I909J2106k1153k3778J6937K3140p666j3179k620k400J1218J6338j5928k5376
1144b2452J3109K5726l705j4235p753m996J4077K4484j0474l2535J625K5190O139
$$ y = [9909, 22015, 862, -22916, -5979, 17161, 9495, -3684, -6304, -8704, 2514, 18852, 2924, -22452, -9343, 16383, 12678, -1557, -9310, -14306, -229, 24255, 13781, -18754, -17129, 8061, 14200]
$$ [...]
8191c40
##END NTUPLES=NMR FID
##END=
