##TITLE=1H_CA-8682
 DMSO, 8 sc, 
 30.1.2020
##JCAMPDX= 6.0         $$ Bruker NMR JCAMP-DX V2.0
##DATA TYPE= NMR FID
##DATA CLASS= NTUPLES
##ORIGIN= UXNMR, Bruker Analytische Messtechnik GmbH
##OWNER= root
$$ XWIN-NMR		Version 3.5
$$ Thu Jan 30 13:47:42 2020 Russian Standard Time (UT+4h)  she@DPX200
##.OBSERVE FREQUENCY= 200.1315
##.OBSERVE NUCLEUS= ^1H
##.DELAY= (6, 6)
##.ACQUISITION MODE= SIMULTANEOUS
##.ACQUISITION SCHEME= undefined
##.AVERAGES= 8
##.DIGITISER RES= 18
##SPECTROMETER/DATA SYSTEM= spect
##.PULSE SEQUENCE= zg30
##.SOLVENT NAME= CDCl3
##.SHIFT REFERENCE= (INTERNAL, CDCl3, 0, 15.7039)
##AUDIT TRAIL= $$ (NUMBER, WHEN, WHO, WHERE, WHAT)
$$ ##TITLE= Audit trail, XWIN-NMR		Version 3.5
$$ ##JCAMPDX= 5.01
$$ ##ORIGIN= Bruker BioSpin GmbH
$$ ##OWNER= she
$$ F:/spectra/data/she/nmr/H-F/1/audita.txt
$$ ##AUDIT TRAIL=  $$ (NUMBER, WHEN, WHO, WHERE, WHAT)
(   1,<2020-01-30 13:46:41.96 +0400>,<she>,<DPX200>,
      <created by zg, POWCHK disabled, PULCHK disabled
       configuration hash MD5:
       00 E9 B6 7A A2 85 ED C7 34 08 36 98 17 FE 4E 26
       data hash MD5: 16K
       0B 50 5B E8 C4 BD 16 8B 99 90 35 92 8D 81 76 1C>)
$$ ##END=
$$ 
$$ hash MD5
$$ A2 3C 10 5A 2D 8A 76 D4 A1 0E 6E 51 F1 FE D8 FD
##$RELAX= 
##$RELAX= 
##$RELAX= 
##$RELAX= 
##$RELAX= 
##$RELAX= 
$$ Bruker specific parameters
$$ --------------------------
##$DU= <F:/spectra>
##$EXPNO= 1
##$NAME= <H-F>
##$PROCNO= 1
##$TYPE= <nmr>
##$USER= <she>
##$AMP= (0..31)
100 100 100 100 100 100 100 100 100 100 100 100 100 100 100 100 100 100 
100 100 100 100 100 100 100 100 100 100 100 100 100 100 
##$AQSEQ= 0
##$AQ_mod= 1
##$AUNM= <au_zg>
##$AUTOPOS= <>
##$BF1= 200.13
##$BF2= 200.13
##$BF3= 200.13
##$BF4= 200.13
##$BF5= 200.13
##$BF6= 200.13
##$BF7= 200.13
##$BF8= 200.13
##$BYTORDA= 1
##$CFDGTYP= 0
##$CFRGTYP= 5
##$CHEMSTR= <none>
##$CNST= (0..31)
1 1 145 1 1 1 1 1 1 1 1 1 1 1 1 1 1 1 1 1 1 1 1 1 1 1 1 1 1 1 1 1 
##$CPDPRG= <>
##$CPDPRG1= <>
##$CPDPRG2= <>
##$CPDPRG3= <>
##$CPDPRG4= <mlev>
##$CPDPRG5= <mlev>
##$CPDPRG6= <mlev>
##$CPDPRG7= <mlev>
##$CPDPRG8= <mlev>
##$CPDPRGB= <>
##$CPDPRGT= <>
##$D= (0..31)
0 1.2 0 0 0 0 0 0 0 0.06 0 0.03 0 0 0 0 0.0002 0 0 0 0 0 0 0 0 0 0 0 0 
0 0 0 
##$DATE= 1580377601
##$DBL= (0..7)
120 120 120 120 120 120 120 120 
##$DBP= (0..7)
150 150 150 150 150 150 150 150 
##$DBP07= 0
##$DBPNAM0= <>
##$DBPNAM1= <>
##$DBPNAM2= <>
##$DBPNAM3= <>
##$DBPNAM4= <>
##$DBPNAM5= <>
##$DBPNAM6= <>
##$DBPNAM7= <>
##$DBPOAL= (0..7)
0.5 0.5 0.5 0.5 0.5 0.5 0.5 0.5 
##$DBPOFFS= (0..7)
0 0 0 0 0 0 0 0 
##$DE= 6
##$DECBNUC= <off>
##$DECIM= 24
##$DECNUC= <off>
##$DECSTAT= 4
##$DIGMOD= 1
##$DIGTYP= 9
##$DL= (0..7)
0 120 120 120 120 120 120 120 
##$DP= (0..7)
150 150 150 150 150 150 150 150 
##$DP07= 0
##$DPNAME0= <>
##$DPNAME1= <>
##$DPNAME2= <>
##$DPNAME3= <>
##$DPNAME4= <>
##$DPNAME5= <>
##$DPNAME6= <>
##$DPNAME7= <>
##$DPOAL= (0..7)
0.5 0.5 0.5 0.5 0.5 0.5 0.5 0.5 
##$DPOFFS= (0..7)
0 0 0 0 0 0 0 0 
##$DQDMODE= 0
##$DR= 18
##$DS= 0
##$DSLIST= <SSSSSSSSSSSSSSS>
$$ [...]
##$SUBNAM2= <"">
##$SUBNAM3= <"">
##$SUBNAM4= <"">
##$SUBNAM5= <"">
##$SUBNAM6= <"">
##$SUBNAM7= <"">
##$SUBNAM8= <"">
##$SUBNAM9= <"">
##$SW= 24.9337058887773
##$SWIBOX= (0..15)
0 0 2 0 0 0 0 0 0 0 0 0 0 0 0 0 
##$SW_h= 4990.01996007984
##$TD= 16384
##$TD0= 1
##$TE= 0
##$TE2= 300
##$TE3= 300
##$TEG= 300
##$TL= (0..7)
0 120 120 120 120 120 120 120 
##$TP= (0..7)
150 150 150 150 150 150 150 150 
##$TP07= 0
##$TPNAME0= <>
##$TPNAME1= <>
##$TPNAME2= <>
##$TPNAME3= <>
##$TPNAME4= <>
##$TPNAME5= <>
##$TPNAME6= <>
##$TPNAME7= <>
##$TPOAL= (0..7)
0.5 0.5 0.5 0.5 0.5 0.5 0.5 0.5 
##$TPOFFS= (0..7)
0 0 0 0 0 0 0 0 
##$TUNHIN= 0
##$TUNHOUT= 0
##$TUNXOUT= 0
##$USERA1= <user>
##$USERA2= <user>
##$USERA3= <user>
##$USERA4= <user>
##$USERA5= <user>
##$V9= 5
##$VALIST= <valist>
##$VCLIST= <CCCCCCCCCCCCCCC>
##$VD= 0
##$VDLIST= <DDDDDDDDDDDDDDD>
##$VPLIST= <PPPPPPPPPPPPPPP>
##$VTLIST= <TTTTTTTTTTTTTTT>
##$WBST= 1024
##$WBSW= 4
##$XGAIN= (0..3)
0 0 0 0 
##$XL= 0
##$YL= 0
##$YMAX_a= 397593
##$YMIN_a= -240163
##$ZGOPTNS= <>
##$ZL1= 120
##$ZL2= 120
##$ZL3= 120
##$ZL4= 120
##$ABSF1= 10
##$ABSF2= 0
##$ABSG= 5
##$ABSL= 3
##$ALPHA= 0
##$AQORDER= 0
##$ASSFAC= 0
##$ASSFACI= 0
##$ASSFACX= 0
##$ASSWID= 0
##$AUNMP= <proc_1d>
##$AZFE= 0.1
##$AZFW= 0.1
##$BCFW= 1
##$BC_mod= 2
##$BYTORDP= 1
##$COROFFS= 0
##$CY= 11.3945322036743
##$DATMOD= 1
##$DC= 2
##$DFILT= <>
##$DTYPP= 0
##$F1P= 16.9975609425685
##$F2P= -3.02152046262296
##$FCOR= 0.5
##$FTSIZE= 0
##$FT_mod= 4
##$GAMMA= 1
##$GB= 0.15
##$INTBC= 1
##$INTSCL= 1
##$ISEN= 128
##$LB= 0.24
##$LEV0= 0
##$LPBIN= 0
##$MAXI= 10000
##$MC2= 0
##$MEAN= 0
##$ME_mod= 0
##$MI= 1.114404
##$NCOEF= 0
##$NC_proc= 0
##$NLEV= 6
##$NOISF1= 3.799351
##$NOISF2= 2.8
##$NSP= 1
##$NTH_PI= 0
##$NZP= 0
##$OFFSET= 15.70392
##$PC= 1
##$PHC0= -9814.075
##$PHC1= 47.20081
##$PH_mod= 1
##$PKNL= yes
##$PPARMOD= 0
##$PSCAL= 0
##$PSIGN= 0
##$REVERSE= no
##$SF= 200.130013532006
##$SI= 16384
##$SIGF1= 3
##$SIGF2= 2
##$SINO= 400
##$SIOLD= 16384
##$SREGLST= <1H.CDCl3>
##$SSB= 0
##$STSI= 0
##$STSR= 0
##$SW_p= 3612.71676300578
##$SYMM= 0
##$S_DEV= 0
##$TDeff= 0
##$TDoff= 0
##$TI= <>
##$TILT= no
##$TM1= 0
##$TM2= 0
##$TOPLEV= 0
##$USERP1= <user>
##$USERP2= <user>
##$USERP3= <user>
##$USERP4= <user>
##$USERP5= <user>
##$WDW= 1
##$XDIM= 8192
##$YMAX_p= 0
##$YMIN_p= 0
$$ End of Bruker specific parameters
$$ ---------------------------------
##NTUPLES= NMR FID
##VAR_NAME=  TIME,          FID/REAL,        FID/IMAG
##SYMBOL=    X,             R,               I
##VAR_TYPE=  INDEPENDENT,   DEPENDENT,       DEPENDENT
##VAR_FORM=  AFFN,          ASDF,            ASDF
##VAR_DIM=   8192,          8192,            8192
##UNITS=     SECONDS,       ARBITRARY UNITS, ARBITRARY UNITS
##FACTOR=    0.0002004,     1,               1
##FIRST=     0,             0,               0
##LAST=      1.6414764,     0,               0
##MIN=       0,             -240163,         0
##MAX=       1.6414764,     397593,          0
$$ Real data points
##PAGE= N=1
##DATA TABLE= (X++(R..R)), XYDATA
$$ [...]
$$ plain form
1903 -73 -13 101 62 135 -77 105 118 67 -8 -65 294 237 94 -92 15 -44 259 -76 -56 50 68 -61 112 98
1927 98 166 126 83 -159 -10 25 -177 -155 -234 -193 169 243 87 127 -34 -108 131 -208 96 114 69 11 -64 -42 259
1952 259 -3 123 -254 -216 193 122 292 89 -107 -168 306 56 22 -97 -150 9 94 108 100 12 165 125 16 -15
1976 -15 121 141 323 158 -66 221 180 -104 -337 -23 -13 -266 -13 -95 60 -148 -241 485 284 -1311 -341 -472
1998 -472 -51 386 -251 729 -71 137 174 9 490 224 -206 -262 -350 615 112 121 -23 -42 81 -74 -98 412
2020 412 269 -350 -16 142 65 22 -111 -61 -88 181 197 -18 -24 -137 18 -4 -14 -51 259 -293 -21 -32 -14 121
2044 121 225 -73 -184 -74 148 65 -63 158 86 215 64 -25 -22 293 -32 127 -90 0 -6 145 199 111 -77
2067 -77 -13 324 -41 -132 33 -252 52 213 48 -181 149 137 -116 -109 92 -185 -4 175 -69 47 -294 -308
$$ packed form
1903g3O0J14l9P3k12J82J3n1p5n7L59n7j43j86J07n9L03l35K0J06J8j29J73j4
1927I8O8m0m3k42J49L5k02K2p9M1L62P4j56M0j61p4K39l39L04J8m5n8p5K2L01
1952B59k62J26l77L8M09p1J70k03j96o1M74k50l4j19n3J59Q5J4qq8J53m0j09l1
1976a5J36K0J82j65k24K87m1k84k33L14J0k53K53q2J55k08r3P26k01j595R70j31
1998d72M21M37o37R80q00K08L7j65M81k66m30n6q8R65n03Rj44j9J23j55k4N10
2020D12j43o19L34J58p7m3j33N0k7K69J6k15oj13J55k2j0l7L10n52K72j1J8J35
2044A21J04k98j11J10K22q3j28K21p2J29j51q9LL15l25J59k17R0oJ51N4q8j88
2067g7O4L37l65r1J65k85L04J61j65k29L30j2k53PK01k77J81J79k44J16l41j4
$$ plain form
2089 -308 -257 70 203 -27 -84 -97 -133 -150 -120 260 5 -180 -22 -87 -149 63 148 -64 -43 126 -64 -9 -35 80
2113 80 -237 -311 169 -167 -287 -104 -230 13 -131 -57 -146 -34 -113 -41 -31 28 257 -164 101 254 -36 -254 119
2136 119 -19 112 -135 39 -36 -5 -66 68 172 122 -223 -234 -92 -196 -4 -131 0 -184 168 8 89 -79
2158 -79 -170 -121 128 186 30 -72 -143 21 -128 93 163 142 -97 60 -105 -161 -8 68 404 -123 125 -233 -94
2181 -94 292 -148 91 54 273 275 -196 93 -209 -190 -206 -212 176 -7 78 -69 192 -45 174 273 225 -271 -67 111
2205 111 -229 -114 6 15 -88 -46 -116 -173 -68 -52 282 187 130 -201 -7 82 171 -213 79 220 -164 -78 -37 -44 90
2230 90 28 -82 0 -271 16 -88 -62 -256 81 129 236 -392 222 201 155 367 53 324 238 -79 -99 -238 29
2253 29 123 146 -1 -199 -72 -35 -34 324 160 145 128 -13 130 167 119 -172 -43 -67 -8 192 8 -178 163 61
$$ packed form
2089c08N1L27J33k30n7j3l6j7L0L80k55j85J58o5o2K12Q5k12K1J69j90N5k6J15
2113H0l17p4M80l36j20J83j26K43j44P4q9J12p9P2J0N9K29m21K65J53k90k18L73
2136A19j38J31k47J74p5L1o1J34J04n0l45j1J42j04J92j27J31j84L52j60Q1j68
2158g9r1M9K49N8j56j02p1J64j49K21P0k1k39J57j65n6J53P6L36n27K48l58J39
2181i4L86m40K39l7K19Km71K89l02J9j6oL88j83Q5j47K61k37K19R9m8m96K04J78
2205A11l40J15J20Rj03M2p0n7J05J6L34r5n7l31J94Q9Q9l84K92J41l84Q6M1pJ34
2230I0o2j10Q2k71K87j04K6j94L37M8J07o28O14k1m6K12l14K71q6l17k0j39K67
2253B9R4K3j47j98J27L7JL58j64j5j7j41J43L7m8k91J29k4N9K00j84j86L41j02
$$ plain form
2277 61 -64 -39 171 -13 -209 -65 -39 8 -114 350 181 -105 131 165 110 121 -59 -31 81 -147 -12 257 109
2300 109 -75 -91 -171 240 157 336 38 -239 -46 -148 0 -24 236 -86 141 394 -108 12 -119 -119 -312 -2
2322 -2 -106 -434 12 45 -74 61 53 -248 164 137 -205 95 135 16 -61 221 -131 119 -27 -365 -146 191 -21
2345 -21 109 72 -160 -67 -3 -97 -85 75 -4 -139 -88 79 288 -51 -80 -41 -47 -176 12 -22 -139 -245 55 -222
2369 -222 272 164 -95 202 -247 6 -126 145 -126 215 34 37 17 -159 171 20 -165 142 334 -110 145
2390 145 -255 178 76 -188 113 -170 -102 -282 96 47 -230 163 83 123 -152 31 51 -47 191 55 9 -262
2412 -262 17 201 160 8 242 -43 -174 -115 135 62 -82 -124 138 118 71 -135 -367 326 -93 67 -94 104
2434 104 18 166 -182 14 53 -213 221 79 -8 -131 40 221 80 108 -66 29 150 -6 35 -83 -68 -52 38
$$ packed form
2277F1j25K5K10j84j96J44K6M7j22M64j69k86K36L4n5J1j80K8J12k28J35K69j48
2300A09j84j6q0M11q3J79k98k77J93j02J48k4K60l22K27K53n02J20j31%j93L10
2322bj04l28M46L3j19J35ql01M12k7l42L00M0j19p7K82l52K50j46l38K19L37k12
2345b1J30l7k32R3O4r4J2J60p9j35N1J67K09l39k9L9oj29J88l4j17j06L00k77
2369b22M94j08k59K97m49K53j32K71k71L41j81Lk0j76L30j51j85L07J92m44K55
2390A45m00M33j02k64L01k83O8j80L78m9k77L93q0M0k75J83K0r8K38j36m6k71
2412b62K79J84m1j52K34k85j31N9K50p3j44m2K62k0m7k06k32O93m19J60j61J98
2434A04q6J48l48J96L9k66M34j42q7j23J71J81j41K8j74R5J21j56M1j18J5J6R0
$$ plain form
2457 38 -118 11 -243 -70 25 -90 -166 34 299 -244 150 -156 108 -137 -266 -12 386 78 -106 28 -68
2478 -68 87 187 -7 -182 271 -52 -278 178 -126 129 62 175 221 -34 184 67 -20 67 111 -22 -415 -270
2500 -270 139 14 -147 -38 171 108 -255 8 -64 138 160 -159 -78 59 152 -249 176 -45 89 -115 122 106
2522 106 -156 -211 -203 193 43 -193 57 -11 -171 -311 -99 -64 -301 63 -38 -85 -71 -90 128 -116 -138 -15 146
2545 146 150 131 -156 -155 44 277 -137 162 217 140 53 -27 203 -67 -295 -205 84 49 8 -98 279 176 63 76
2569 76 45 250 1 231 -58 -34 -83 8 65 256 269 63 111 -24 91 91 27 65 -118 107 81 81 -47 1 -12 280
2595 280 132 24 84 -144 50 20 50 -197 -246 162 95 -60 185 273 -1 -138 302 22 318 171 -33 104
2617 104 -160 -56 63 -241 -69 187 180 -75 160 53 211 -11 -212 61 -278 -215 -244 -84 -250 89 -96
$$ packed form
2457C8j56J29k54J73R5j15p6K00K65n43L94l06K64k45j29K54L98l08j84J34r6
2478f8J55J00j94j75M53l23k26M56l04K55o7J13M6k55K18j17q7Q7M4j33l93J45
2500b70M09j25j61J09K09o3l63K63p2K02K2l19Q1J37R3m01M25k21J34k04K37j6
2522A06k62n5QL96j50k36K50o8j60j40K12L5k37L64j01m7J4j9K18k44k2J23J61
2545A46Mj9k87JJ99K33m14K99N5p7q7q0K30k70k28R0K89l5m1j06L77j03j13J3
2569G6l1K05k49K30k89K4m9R1N7J91J3k06M8j35J15%o4L8j83K25k6%j28M8j3K92
2595B80j48j08O0k28J94l0L0k47m9M08o7j55K45Q8k74j37M40k80K96j47k04J37
2617A04k64J04J19l04J72K56pk55K35j07J58k22k01K73l39O3k9J60j66L39j85
$$ plain form
2638 -96 97 -202 -93 -375 -146 43 147 31 -278 279 170 -155 -320 -163 -28 429 93 230 97 -28
2658 -28 105 -21 -318 -4 106 -136 48 -227 -126 -219 45 -98 -59 -148 45 -182 51 182 -301 233 182 203
2680 203 -146 -11 13 176 109 -106 -113 85 -232 -101 69 143 156 -70 20 7 135 152 -95 80 0 170 188 -59
2704 -59 160 100 -229 63 -41 -66 -113 32 -105 291 -17 -126 -223 -131 -500 156 -221 12 293 -156 -26 79
2726 79 -145 58 -54 -54 160 -300 -159 23 20 -281 140 113 -164 2 331 -16 -33 -111 -92 -34 43 -5 28 -6 -241
2751 -241 238 -223 -9 99 -92 147 -163 330 -81 -3 -126 -199 -118 163 25 137 78 -231 56 34 207 376
2773 376 103 -107 -6 -148 -386 89 -27 -194 -228 -187 -1 -108 27 -192 -27 109 -290 70 -43 76 145
2794 145 -65 104 -115 -93 50 -277 217 16 20 6 -58 19 -143 -85 18 -168 -15 -10 -1 31 -176 -180 -205 -91 235
$$ packed form
2638i6J93k99J09k82K29J89J04j16l09N57j09l25j65J57J35M57l36J37j33j25
2658b8J33j26k97L14J10k42J84k75J01r3K64j43L9q9J93k27K33J31m83N34n1K1
2680B03l49J35K4J63o7k15pJ98l17J31J70P4J3k26R0j3J28J7k47J75q0J70J8k47
2704e9K19o0l29K92j04k5m7J45j37L96l08j09r7R2l69O56l77K33K81m49J30J05
2726G9k24K03j12%K14m60J41J82ll01M21k7k77J66L29l47j7p8J9N8P7m8L3l4k35
2751b41M79m61K14J08j91K39l10M93m11P8j23p3Q1K81j38J12n9l09K87k2J73J69
2773C76k73k10J01j42k38M75j16j67l4M1J86j07J35k19J65J36l99L60j13J19O9
2794A45k10J69k19K2J43l27M94k01Mj4o4P7j62N8J03j86J53NRL2k07mk5J14L26
$$ plain form
2819 235 3 -295 153 198 -10 -13 -8 -165 204 -116 -66 216 227 -205 -148 -116 263 -80 168 49 124 7 -175
2842 -175 93 62 41 -175 -26 274 24 -86 14 -124 13 -262 -180 -136 -105 86 314 -1 -86 69 342 -118
2864 -118 -83 -123 -127 -30 -76 176 9 -53 -57 -180 -141 -48 -63 67 -60 28 116 -43 238 -109 -185 56 62 59 -88 -92 -313
2891 -313 -191 -31 -106 397 -55 220 -55 186 113 124 -2 183 -51 -54 -28 -147 37 -127 178 5 -91 5 -15
2914 -15 51 78 -77 55 120 -145 122 -13 -75 -79 201 143 -234 -101 -83 48 -100 -122 -63 -204 28 87 117 218
2938 218 -206 23 19 -99 -206 20 -151 -132 72 -280 34 154 -36 -165 171 -122 -81 -172 24 104 98 -13 -154
2961 -154 25 99 -217 -70 81 -16 280 -74 -73 220 49 -428 353 67 65 127 -283 -51 -151 -79 127 -8 -216
2984 -216 -112 -166 90 114 -59 -3 98 -189 121 126 81 72 -95 44 164 63 -53 -188 -57 51 75 -39 48
$$ packed form
2819B35k32k98M48M5k08lNj57L69l20N0K82J1m32N7L2L79l43K48j19P5j17j82
2842a75K68l1k1k16J49L00k50j10J00j38J37k75Q2M4L1J91K28l15q5J55K73m60
2864a18L5m0mR7m6K52j67o2mj23L9R3j5J30j27Q8Q8j59K81l47p6K41Olj47mk21
2891c13J22J60p5N03m52K75k75K41p3J1j26J85k34lK6j19J84j64L05j73r6R6k0
2914a5O6K7j55J32O5k65K67j35o2mK80n8l77J33J8J31j48k2N9j41K32N9L0J01
2938B18m24K29mj18j07K26j71J9K04l52L14J20j90j29L36k93M1r1J96Q0oj11j41
2961a54J79P4l16J47J51r7K96l54JK93j71m77P81k86kO2m10K32j00P2K06j35k08
2984b16J04n4K56K4j73N6J01k87L10Nm5rj67J39J20j01j16j35J31J08K4j14Q7
$$ plain form
3007 48 -34 34 -110 -174 199 -134 148 -327 -172 84 -115 -202 -80 125 114 -169 -157 155 111 -65 82 -85 -31
3030 -31 -5 270 161 7 312 38 387 29 -52 31 -122 32 87 88 11 -101 115 -196 15 205 178 -122 207
3053 207 58 -124 35 -103 -129 147 45 52 -103 -73 181 -52 -162 -315 -225 -274 51 176 208 -175 -3 46 -50
3076 -50 94 376 14 268 -4 201 53 -281 106 190 309 134 -116 106 -14 195 47 198 -157 58 -75
3097 -75 275 64 -140 -97 -98 -218 161 454 -25 96 -42 55 116 236 221 -66 -101 -121 85 -261 -448 -21 -67
3120 -67 63 39 119 61 -156 -2 -95 -34 129 -160 313 -275 -23 4 -178 25 -139 -179 203 36 63 -56 -94
3143 -94 92 153 -41 -12 -227 -191 366 101 -123 -346 29 245 66 29 -143 15 130 -200 28 73 -105 -100 -255
3166 -255 72 74 39 35 -174 33 92 -204 -14 342 132 -95 240 73 -161 93 188 -317 -105 -117 -30 -41 172
$$ packed form
3007D8q2O8j44o4L73l33K82m75J55K56j99q7J22K05j1k83J2L12m4j76J47j67N4
3030c1K6K75j09j54L05k74L49l58q1Q3j53J54N5Jp7j12K16l11K11J90k7l00L29
3053B07j49j82J59j38k6K76j02Pj55L0K54k33j10j53R0m9L25J25L2l83J72M9r6
3076e0J44K82l62K54k72K05j48l34L87Q4J19j75k50K22j20K09j48J51l55K15j33
3097g5L50k11k04M3jj20L79K93m79J21j38R7O1J20j5k87l5k0K06l46j87M27m6
3120f7J30k4Q0n8k17J54r3O1J63k89M73n88K52K7j82K03j64m0L82j67K7j19l8
3143i4J86O1j94K9k15L6N57k65k24k23L75K16j79l7j72J58J15l30K28M5j78Nj55
3166b55L27Kl5mk09K07N9k96J90L56k10k27L35j67k34K54R5n05K12j2Q7j1K13
$$ plain form
3189 172 117 -86 -62 -72 -100 -87 26 32 32 79 2 93 -266 -80 73 114 84 -222 206 78 74 -24 -292 53 58 18 -66
3216 -66 -86 83 103 180 30 187 -48 95 131 -79 -206 -56 24 -115 120 295 -139 -26 -232 -255 -1 36 -155
3239 -155 163 -17 -85 244 -51 35 208 -102 -144 27 -151 -303 -66 231 62 -76 28 -75 392 -178 128
3260 128 -254 -16 -176 -94 95 -293 1 169 75 -8 39 -140 207 -47 9 77 78 248 131 211 -170 214 358
3283 358 164 193 -60 -55 -199 -219 -12 21 -92 168 -212 23 88 -142 -45 -274 117 -23 86 62 -97 110 166
3306 166 162 -29 -138 11 197 -82 -81 48 168 -166 -138 -162 -339 126 -30 -38 -174 -122 183 -13 -353 -234 165
3329 165 -59 11 140 52 219 142 58 -73 -67 -137 -126 3 37 156 -94 139 -149 -186 332 5 102 -229 2 176
3353 176 -344 162 -41 -46 117 -85 24 36 16 172 -73 -38 222 176 354 134 297 -170 -9 -30 -69 106 -22
$$ packed form
3189A72n5k03K4j0k8J3J13O%M7p7R1l59J86J53M1l0l06M28j28mr8k68L45Nm0q4
3216f6k0J69K0P7j50J57k35J43L6k10j27J50Q0j39K35J75m34J13k06k3K54L7j91
3239a55L18j80o8L29k95Q6J73l10m2J71j78j52K37K97j69j38J04j03M67n70L06
3260A28l82K38j60Q2J89l88K94J68r4q3M7j79L47k54N6O8JJ70j17Q0l81L84J44
3283C58j94K9k53Nj44k0K07L3j13K60l80K35O5k30R7k29L91j40J09k4j59K07N6
3306A66mj91j09J49J86k79JJ29J20l34K8k4j77M65j56qj36N2L05j96l40J19L99
3329A65k24P0J29q8J67p7q4j31Op0J1J29L4J19k50K33k88l7N18l27R7l31K31J74
3353A76n20N06k03nJ63k02J09J2k0J56k45L5K60m6J78k20J63m67J61k1l9J75j28
$$ plain form
3376 -22 -170 229 103 -10 96 21 33 19 -85 -65 56 -111 -183 53 230 40 -154 184 114 -177 179 -132
3398 -132 3 35 156 149 141 194 78 208 -117 151 28 77 56 -324 -32 93 88 130 -115 17 -128 -145 248 175
3422 175 63 -197 230 -226 -99 -204 136 139 83 -42 -171 235 -51 22 89 -135 33 123 40 -124 220 137 -240
3445 -240 -32 80 -55 168 209 5 204 -242 -276 -190 76 -155 -94 -14 78 -18 35 -98 -17 76 67 58 -73 -199 -255
3470 -255 132 0 180 -69 -29 -118 -133 32 29 -48 24 -57 70 -266 -14 90 -306 89 44 -116 -114 85 -68 152
3494 152 51 243 -187 -79 32 189 -63 -170 163 -212 -83 -138 74 142 -333 46 -237 -90 59 -150 1
3515 1 -91 59 44 244 1 -109 -237 -52 -122 103 -123 118 89 -206 -76 -150 89 267 -21 225 100 -122
3537 -122 -91 -252 215 -57 -323 -137 232 35 73 -85 151 139 41 317 -53 159 88 -167 -149 99 -17 -30
$$ packed form
3376b2j48L99j26j13J06p5J2j4j04K0J21j67p2K36J77j90j94L38p0k91L56l11
3398a32J35L2J21pqN3j16J30l25K68j23M9k1l80K92J25nM2k45J32j45j7L93p3
3422A75j12k60M27m56J27j05L40Ln6j25j29M06k86P3O7k24J68R0q3j64L44q3l77
3445b40K08J12j35K23M1k04J99m46l4Q6K66k31O1Q0R2r6N3j33Q1R3rrj31j26n6
3470b55L87j32J80k49M0q9j5J65lp7P2q1J27l36K52J04l96L95m5j60KJ99j53K20
3494A52j01J92m30J08J11J57k52j07L33l75J29n5K12O8m75L79k83J47J49k09J51
3515Ar2J50j5K00k43j10j28J85p0K25k26K41k9k95J30p4K39J78k88K46j25k22
3537a22L1j61M67k72k66J86L69j97L8j58K36j2r8K76l70K12p1k55J8K48j16j3
$$ plain form
3559 -30 -23 -284 -39 -173 -172 128 179 -185 25 144 71 129 -61 40 -2 99 -23 -195 144 124 136 140 15 40 234
3584 234 19 85 -271 171 -231 180 96 107 65 -183 185 -266 172 -226 3 53 129 -7 -12 228 -242 151 -110
3607 -110 -162 141 166 251 128 -87 330 251 -74 77 225 153 -309 -79 -180 -169 -164 -181 -172 195 4 -190 70 29
3631 29 133 -52 56 -7 139 115 -54 231 79 70 109 -280 271 -164 54 -122 -118 158 -79 -60 131 68 124 1
3655 1 174 116 -202 21 71 -59 -133 103 -34 -128 -44 -150 -149 -26 -66 312 35 15 -271 63 14 -488 102 4
3679 4 229 420 21 112 -156 -97 205 -30 21 131 -53 -128 -93 -121 -173 40 108 -320 174 -200 -123 94 -73 11
3703 11 81 -178 -28 113 -142 123 183 104 139 -9 -193 82 -173 -77 187 44 -176 44 1 -66 53 -209 -9
3726 -9 25 388 -333 99 187 92 -62 -87 49 -223 -42 7 -103 27 -219 -225 51 -19 5 -128 121 229 294 -238
$$ packed form
3559c0Pk61K45j34JL00N1l64K10J19p3N8j90J01m2J01j22j72L39k0J2Mj25K5J94
3584B34k15O6l56M42m02M11q4J1m2k48L68m51M38l98K29N0P6j36nK40m70L93k61
3607a10n2L03K5Q5j23k15M17p9l25J51J48p2m62K30j01J1Nj7RL67j91j94K60m1
3631B9J04j85J08o3J46k4j69K85j52rL9l89N51m35K18j76MK76k37J9J91o3N6j23
3655AJ73n8l18K23N0j30p4K36j37r4Q4j06JJ23m0L78k77k0k86L34m9n02N90r8
3679DK25J91l99R1k68N9L02k35N1J10j84p5L5k8n2K13O8m28M94l74P7K17j67Q4
3703A1P0k59J50J41k55K65O0p9L5j48j84K75k55R6K64j43k20K20m3o7J19k62K00
3726iL4L63p21M32Q8r5j54k5J36k72J81M9j10J30k46oK76p0K4j33K49J08O5n32
$$ plain form
3750 -238 35 45 -19 350 -19 88 -24 222 -140 244 30 1 149 -50 159 -9 -206 -224 -139 -162 8 -148
3772 -148 -113 -105 -15 189 143 -153 23 149 209 94 -120 -203 165 70 79 -61 -205 82 123 71 -86 77 -90 121
3796 121 168 -202 116 -195 162 -4 -11 28 34 251 -118 20 138 -115 3 -155 21 99 -9 -167 229 -195
3818 -195 68 -95 -43 -157 -184 30 -64 -30 -62 178 -13 -48 -69 -86 58 48 144 -38 232 65 -60 -172 202
3841 202 -74 47 -165 -248 160 100 -202 -94 -42 104 140 -143 27 192 -2 143 -173 -127 77 65 -95 -315
3863 -315 -22 -123 8 -228 -38 -16 -276 -183 -167 -336 -65 -272 -254 193 -13 -237 -114 -104 -7 -199 14 8 4
3886 4 118 -181 -67 -34 -248 5 116 -29 -69 27 -62 -106 -40 -11 -68 -24 54 222 72 188 142 102 47 -362 277
3911 277 167 -49 -68 183 -47 -47 -259 84 19 8 184 118 -80 95 -46 -57 178 166 121 1 -152 167 188
$$ packed form
3750b38K73J0o4L69l69J07j12K46l62L84k14k9J48j99K09j68j97j8Q5k3J70j56
3772a48L5QR0K04m6k96J76J26O0j15k14q3L68r5Rj40j44K87M1n2j57J63j67K11
3796A21M7l70L18l11L57j66pL9OK17l69J38J18k53J18j58J76P8j08j58L96m24
3818a95K63j63N2j14k7K14r4L4l2K40j91l5k1j7J44j0R6j82K70j67j25j12L74
3841B02k76J21k12q3M08o0l02J08N2J46L6k83J70J65j94J45l16M6K04j2j60k20
3863c15K93j01J31k36J90K2k60R3J6j69K71k07J8M47k06k24J23J0R7j92K13om
3886DJ14k99J14L3k14K53J11j45m0R6q9m4O6K9n7M4P8J68j50J16m6m0n5m09O39
3911B77j10k16j9K51k30%k12L43o5j1J76o6j98J75j41j1K35j2m5j20j53L19K1
$$ plain form
3934 188 -112 188 -21 126 135 -58 -39 126 -85 54 131 244 -68 190 -21 -232 -514 -120 20 -92 -131 111
3956 111 -338 -77 13 -312 64 -247 -209 63 59 -114 41 -61 -273 -101 115 59 -39 -110 196 -205 -190 -148 180
3979 180 194 249 78 -102 105 63 -205 150 -12 132 -415 187 -47 -48 180 52 369 -35 300 208 -221 -108
4001 -108 -126 -83 -173 -272 -41 -139 10 -365 60 -164 109 -192 -126 120 36 85 -131 -235 137 59 -135 98 78
4024 78 118 168 -101 246 -33 169 52 17 310 56 -14 64 47 -8 -45 -187 -118 68 -47 -102 -15 -496 169 36
4048 36 -138 140 -177 135 -73 223 -239 10 -288 -101 42 -136 17 174 47 178 251 -80 142 -65 124
4069 124 -86 47 -159 33 12 15 30 26 83 25 -24 -118 -11 3 253 -8 -286 -54 -109 -112 -33 69 -132 -13 -115
4094 -115 -137 -121 -55 -174 -35 -137 125 30 12 160 16 -99 126 12 -179 -74 -22 -85 -188 -181 6 -38 190
$$ packed form
3934A88l00L00k09J47Rj93J9J65k11J39P7J13l12K58k11k11k82L94J40j12l9K42
3956A11m49K61R0l25L76l11L8K72mj73J55j02k12J72K16n6r8p1L06m01J5M2L28
3979A80J4N5j71j80K07m2k68L55j62J44n47O02k34jK28j28L17m04L35r2m29J13
4001a08j8M3r0r9K31r8J49l75M25k24K73l01O6K46q4M9k16j04L72p8j94K33k0
4024G8M0N0k69L47k79K02j17l5K93k54p0P8j7n5l7j42O9J86j15n5Q7m81O65j33
4048C6j74K78l17L12k08K96m62K49k98J87J43j78J53J57j27J31P3l31K22k07J89
4069A24k10J33k06J92k1LJ5mN7n8m9r4J07J4K50k61k78K32n5lP9J02k01J19j02
4094a15k2J6O6j19J39j02K62r5j8J48j44j15K25j14j91J05N2o3j03PJ87m4K28
$$ plain form
4117 190 100 -167 -219 -9 -203 -188 -69 93 92 -213 -194 207 -261 -135 -69 41 68 -228 -296 -44 -152 -5 148
4140 148 104 -111 -141 234 -161 -179 8 279 13 -247 220 -40 -50 129 -49 -61 -83 29 -143 -144 -98 306 141
4163 141 282 -58 -177 89 85 -43 -118 20 -107 -318 69 -183 -55 86 -25 -77 398 359 -2 -6 7 -22 -278
4186 -278 -142 -120 -83 1 -71 112 -147 101 156 -57 176 -10 195 -257 -5 359 -319 6 20 -72 -64 -127 258
4209 258 107 -153 -233 -227 -173 -7 221 287 96 -44 -126 -97 -151 -199 90 -25 97 90 107 99 257 201 42 -6 327
4234 327 -225 -271 -54 -32 -41 -19 14 -27 -23 200 -87 -8 224 -86 210 78 0 -30 -269 29 73 159 64 139 116 89
4260 89 -20 118 -184 -101 -139 143 -106 200 -132 19 -130 -81 -90 81 109 64 -101 -100 125 61 357 64 121 -92
4284 -92 29 -57 -360 -88 91 39 366 -87 21 226 -89 -78 83 -81 150 -282 -24 124 -38 -44 84 37
$$ packed form
4117A90r0k67n2K10j94J5J19J62jl05J9M01m68J26O6J10K7k96o8K52j08J47J53
4140A48m4k15l0L75l95j8J87K71k66k60M67k60j0J79j78j2k2J12j72jM6M04j65
4163A41J41l40j19K66mj28p5J38j27k11L87k52J28J41j11n2M75l9l61mJ3k9k56
4186b78J36K2L7Q4p2J83k59K48N5k13K33j86K05m52K52L64o78L25J4r2Qo3L85
4209B58j51k60q0ON4J66K28O6j91j40q2K9n4m8K89j15J22pJ7qJ58n6j59m8L33
4234C27n52m6K17K2rK2L3m1MK23k87P9K32l10K96j32p8l0k39K98M4Q6r5P5k3k7
4260H9j09J38l02Q3l8K82k49L06l32J51j49M9rJ71K8m5j65JK25o4K96k93N7k13
4284i2J21q6l03K72J79n2L27m53J08K05l15J1J61j64K31m32K58J48j62oJ28m7
$$ plain form
4306 37 -174 -102 -118 32 -161 -79 57 -84 -8 -20 -484 47 -182 -53 51 39 3 278 196 -150 -67 49 -37 182
4330 182 -75 160 148 80 -12 -18 138 306 -448 36 -22 32 265 119 47 6 152 -258 104 -22 -275 -19 152
4353 152 37 -56 107 67 -15 62 182 -52 -97 10 11 -479 -88 78 229 15 -122 136 -180 11 -79 92 -232
4376 -232 29 162 -29 -68 10 -124 56 -311 -323 -74 90 139 176 25 -162 254 68 -8 26 246 -149 245
4398 245 155 -107 -10 77 -48 106 178 95 152 117 51 -97 99 92 91 -127 -253 -43 -69 -59 -154 -271 43 -199 -144
4423 -144 -273 199 -14 88 69 -154 -298 -97 137 -63 -123 -9 -86 -98 99 150 -157 0 110 267 -138 219
4445 219 -5 -263 -186 65 140 -43 66 66 -108 5 41 -95 50 188 216 132 -104 91 -216 -95 129 -75
4467 -75 -115 -84 145 163 -70 -269 240 -101 201 -123 112 323 -75 -244 -138 -184 -94 2 -147 -62 -218 50 -259
$$ packed form
4306C7k11P2j6J50j93Q2J36j41P6j2m64N31k29J29J04j2l6K75q2l46Q3J16q6K19
4330A82k57K35j2o8r2oJ56J68p54M84n8N4K33j46p2m1J46m10L62j26k53K56J71
4353A52j15r3J63m0q2P7J20k34m5J07Jm90L91J66J51k14j37K58l16J91r0J71l24
4376b32K61J33j91l9P8j34J80l67j2K49J64M9L7j51j87M16j86p6L4K20l95L94
4398B45r0k62R7Q7j25J54P2q3N7l5o6j48J96pjk18j26K10k6J0r5j17L14k42N5
4423a44j29M72k13J02j9k23j44K01K34k00o0J14p7j2J97N1l07J57J10J57m05L57
4445B19k24k58P7K51P5j83J09%j74J13L6j36J45J38K8q4k36J95l07J21K24k04
4467g5m0L1K29J8k33j99N09l41L02l24K35K11l98j69J06m6R0R6j49Q5j56K68l09
$$ plain form
4490 -259 5 -137 197 -89 -32 80 224 -265 2 -123 -25 -25 154 -157 -138 -69 -54 1 82 286 -190 25 -21
4513 -21 -8 183 217 66 -26 -263 -245 -64 -61 -13 -141 -387 112 -124 -143 364 -45 -163 -228 32 95 -134 141 -227
4537 -227 -192 12 129 -140 11 57 32 29 65 -8 -287 261 -313 -198 -231 -56 -170 41 -124 -91 179 88 -192
4560 -192 79 -164 83 359 208 -82 -50 -20 57 96 -184 106 -167 64 -62 -202 106 -41 175 35 -414
4581 -414 -67 -36 -71 -64 55 19 276 353 170 190 374 140 126 -191 74 67 -26 87 27 -426 -219 176 267 -28
4605 -28 -159 110 -240 -111 25 73 182 -101 48 -111 282 -211 70 -23 -123 42 -173 108 -187 197 215
4626 215 -20 -166 33 90 -179 74 -29 81 -325 -153 205 -9 221 -118 76 74 -54 -57 106 58 -42 9
4648 9 165 96 -15 -87 -27 263 62 68 126 -67 169 -47 295 -39 -15 -108 -126 52 91 322 217 -311 79 100
$$ packed form
4490b59K64j42L34k86N7J12J44m89K67j25R8%J79l11J9O9J5N5Q1K04m76K15m6
4513b1J3J91L4j51r2k37J8J81LM8j28k46M99k36j9N07m09j18o5K60O3k29K75l68
4537b27L5K04J17k69J51M6k5lL6p3k79N48n74J15l3J75j14K11j65L3K70r1k80
4560a92K71k43K47K76j51k90L2L0P7L9k80K90k73K31j26j40L08j47K16j40m49
4581d14L47L1l5PJ19l6K57P7j83K0J84k34j4l17K65pr3J13o0m53K07L95R1k95
4605b8j31K69l50J29J36M8J09k83J49j59L93m93K81r3j00J65k15K81k95L84J8
4626B15k35j46J99N7k69K53j03J10m06J72L58k14K30l39J94kj28lJ63m8j00N1
4648IJ56o9j11p2O0K90k01ON8j93K36k16L42l34K4r3j8J78L9K31j05n28L90K1
$$ plain form
4672 100 41 58 40 -82 -283 94 -121 -113 -88 45 88 -62 -85 -17 -384 284 -33 -83 -229 213 -189 -5 133
4695 133 38 192 -34 76 -103 -315 85 -187 -70 -103 -7 117 245 15 -158 82 -132 -70 239 -61 -198
4716 -198 164 -139 147 256 -2 -56 -57 -127 228 27 1 -29 94 61 53 -32 -125 -34 -305 -120 158 193 -47 -186
4740 -186 -217 100 -243 245 86 5 7 41 261 164 132 -14 -7 -8 189 -12 323 -134 -69 -31 -248 109 1 -192
4764 -192 -30 -95 -297 155 6 155 157 155 12 316 39 -242 -144 -76 113 -25 171 -107 203 150 -94 -212 70
4787 70 21 29 -116 -175 80 -61 24 9 -85 -342 -207 -382 -91 -213 -146 -125 -56 -7 13 102 -91 88 -135 -344 -40
4812 -40 -57 143 -176 -22 4 238 117 -259 123 -135 95 -78 10 28 -161 199 -76 -92 -295 -127 146 67
4834 67 71 -96 33 -3 -272 55 -9 125 85 -233 84 114 202 -176 -503 -18 30 -86 -24 -99 -63 24 113 -14 169
$$ packed form
4672A00n9J7j8j22k01L77k15QK5J33M3j50k3O8l67O68l17n0j46M42m02J84J38
4695A33r5J54k26J10j79k12M00k72J17l3R6J24J28k30j73K40k14O2L09l00j37
4716a98L62l03K86J09k58n4jp0L55k01k6l0J23l3qq5r3R1k71J85K78L5k40j39
4740a86l1L17l43M88j59q1KL4K20r7l2j46PjJ97k01L35m57O5L8k17L57j08j93
4764a92J62o5k02M52j49J49Kkj43L04k77k81R8O8J89j38J96k78L10n3k44j18K82
4787G0m9Qj45n9K55j41Q5j5r4k57J35j75K91j22O7K1O9M9K0Q9j93J79k23k09L04
4812d0j7K00l19J54K6K34j21l76L82k58K30j73Q8J8j89L60k75j6k03J68K73p9
4834F7Mj67J29l6k69L27o4J34m0l18L17L0Q8l78l27M85M8j16O2p5L6Q7Q9j27J83
$$ plain form
4859 169 -57 52 144 -5 -221 -223 -330 -78 180 169 -276 -182 -61 -117 217 -24 20 -109 25 -52 -101 -94 -149 222
4883 222 -216 7 -114 -134 208 82 -112 -21 311 -27 -32 79 -19 257 -138 -238 231 -208 -139 287 226 203 -4
4906 -4 -157 3 -36 -132 15 -24 277 99 72 67 -187 -89 9 157 145 177 -336 23 -332 99 126 -24 14 -141 331
4931 331 -33 -64 -40 200 10 27 16 119 -529 -62 45 -320 -160 17 197 -84 -207 218 416 -129 -26
4952 -26 94 63 206 -262 102 19 229 191 29 113 -12 -23 262 80 224 -152 -110 344 -159 -106 -227 -35 -132
4975 -132 278 -86 -33 126 -31 34 148 99 -58 68 -16 -199 145 295 63 -278 151 151 -142 -258 -266 -33 -125
4998 -125 -149 -104 74 -154 23 -73 -130 -52 1 30 -157 41 -167 -221 -46 53 17 -14 119 1 20 -50 -184 159
5022 159 64 237 -23 -227 189 29 70 195 187 -169 59 -132 203 -307 -30 -33 65 13 70 144 50 1 -134 -32
$$ packed form
4859A69k26J09R2j49k16kj07K52K58j1m45R4J21n6L34k41M4j29J34p7m9Pn5L71
4883B22m38K23j21k0L42j26j94R1L32l38nJ11r8K76l95j00M69m39O9M26o1k3k07
4906dj53J60l9r6J47l9L01j78k7nk54R8R8J48j2L2n13L59l55M31K7j50L8j55M72
4931C31l64l1K4K40j90J7j1J03o48M67J07l65J60J77J80k81j23M25J98n45J03
4952b6J20l1J43m68L64q3K10l8j62Q4j25j1K85j82J44l76M2M54n03N3j21J92r7
4975a32M10l64N3J59j57O5J14m9j57J26q4j83L44J50k32l41M29%k93j16qK33r2
4998a25k4M5J78k28J77r6n7P8N3K9j87J98k08n4J75R9l6l1J33j18J9p0j34L43
5022A59r5J73k60k04M16j60M1J25ql56K28j91L35n10K77lR8n2N7P4r4m9j35J02
$$ plain form
5046 -32 -104 -136 36 -12 -94 -62 153 22 -164 239 -65 -179 -75 50 -68 -64 -40 180 108 -18 150 -109 -252
5069 -252 -31 -172 28 292 -125 -247 -243 131 -6 -47 -21 72 51 19 58 82 -12 -160 13 31 -16 -208 155 -107
5093 -107 -49 92 -287 115 297 -39 151 21 -85 35 -19 -134 53 68 -44 216 457 -39 256 -119 -143
5114 -143 -99 -62 -156 95 -47 -71 110 -233 -108 -21 -261 139 58 -69 61 78 56 -256 63 -166 -323 73 87
5137 87 274 75 177 105 33 -245 -226 140 -77 -98 138 195 -119 -258 -113 -27 144 -47 -61 29 -67 -75 8 63 -171
5162 -171 134 -16 70 4 -195 104 -240 125 140 80 -30 94 -38 110 192 -138 -1 -297 -48 274 -129 -186
5184 -186 12 14 115 -245 227 82 132 47 -164 108 -313 -26 4 -22 -76 102 185 -201 40 -71 46 141 11
5207 11 -12 178 -58 165 -99 -54 298 220 75 -184 94 52 9 11 44 343 -79 -30 -115 140 57 -30 187 71
$$ packed form
5046c2p2l2J72m8q2L2K15j31j86M03l04j14J04J25j18MK4K20p2j26J68k59j43
5069b52K21j41K00K64m17j22ML74j37m1K6R3k1l2L9K4r4j48J73J8m7j92L63k62
5093a07N8J41l79M02J82l36J90j30j06J20n4j15J87J5j12K60K41m96K95l75k4
5114a43M4L7r4K51j42k4J81l43J25Q7k40M00q1j27J30J7k2l12L19k29j57L96J4
5137H7J87j99J02p2p2k78J9L66k17k1K36N7l14j39J45Q6J71j91j4R0r6qQ3N5k34
5162a71L05j50Q6o6j99K99l44L65J5o0j10J24j32J48Q2l30J37k96K49L22m03n7
5184a86J98KJ01l60M72j45N0q5k11K72m21K87L0k6n4J78Q3l86K41j11J17R5j30
5207A1k3J90k36K23k64M5L52p8j45k59K78m2m3KL3K99m22M9q5K55q3q7K17j16
$$ plain form
5231 71 188 68 46 -14 199 -187 57 -148 -287 26 -39 206 23 134 -288 -72 -224 118 5 99 76 -84
5253 -84 30 -22 -150 -167 83 41 102 272 -125 106 262 92 116 88 -60 217 -139 -49 -14 -32 80 -98 -25 -109
5277 -109 97 62 -288 122 -189 -71 242 143 -1 169 -104 10 130 -2 100 59 25 -152 108 76 208 -50
5299 -50 -52 139 87 20 1 -225 99 0 -194 -55 -295 -64 150 -317 -26 -200 -33 -110 -92 -302 54 420 207
5322 207 -183 -348 162 -145 107 -73 -7 38 -2 293 -318 40 -267 138 -15 29 133 76 137 -26 -5 388
5344 388 -24 369 156 152 186 79 246 376 -193 19 -44 -158 133 -26 118 -51 -278 120 -110 -96 141 116
5366 116 59 105 218 3 -125 46 -179 -244 231 -20 170 -237 214 147 230 -8 -49 -55 257 163 71 142 -68 210
5390 210 57 4 -44 -148 71 140 67 123 -172 -3 71 -84 -29 -294 31 -210 5 53 -34 -105 -41 142 93 -22
$$ packed form
5231G1J17j20k2o0K13l86K44k05j39L13o5K45j83J11m22K16j52L42j13R4k3j60
5253h4J14n2j28j7K50m2O1J70l97K31J56j70K4k8j48K77l56R0L5j8J12j78P3q4
5277a09K06l5l50M10l11J18L13r9j44J70k73J14J20j32J02m1l4j77K60l2J32k58
5299e0kJ91n2o7j9k26L24r9j94J39k40K31K14m67K91j74J67p7J8k10L56L66k13
5322B07l90j65N10l07K52j80O6M5m0K95o11L58l07M05j53M4J04n7O1j63K1L93
5344C88m12L93k13mL4j07J67J30n69K12o3j14K91j59J44j69k27L98k30J4K37k5
5366A16n7M6J13k15j28J71k25o5M75k51J90m07M51o7Q3k38m1oL12r4r2P1k10K78
5390B10j53n3m8j04K19O9p3N6k95J69P4j55N5k65L25k41K15M8q7p1O4J83m9j15
$$ plain form
5414 -22 -174 -1 -51 -121 -275 -75 -206 -35 214 -206 -176 112 -128 198 69 -69 -100 -34 -4 -93 -76 53 144
5437 144 129 320 219 166 10 94 273 91 -155 -30 53 -65 137 -179 -69 78 -339 -221 -9 -14 -184 -21
5459 -21 90 45 330 235 -77 27 48 45 -133 65 -169 155 -118 -5 181 -163 123 174 21 -181 -59 -44 -24
5482 -24 46 52 -107 -170 -7 70 -204 -175 130 161 -54 63 -203 172 92 236 145 -46 -222 -162 33 56 10 -27 174
5507 174 -102 -171 -429 45 88 -127 149 27 -57 162 -53 -180 -156 440 277 2 2 108 -166 -24 118 -51
5529 -51 108 102 -111 89 -192 -6 105 214 -24 -98 68 93 -33 137 -100 -118 -78 277 -17 -116 250 -78 -107
5552 -107 -165 132 157 100 -113 75 -20 280 138 -277 -117 14 245 -84 -34 164 226 151 299 -123 21 266
5574 266 55 -238 -94 328 -92 -23 -31 -202 75 141 -95 -101 96 20 -93 168 -213 -198 138 91 100 -38 -43 103
$$ packed form
5414b2j52J73n0p0j54K00j31J71K49m20L0K88k40L26j29j38l1O6L0q9J7J29R1
5437A44j5J91j01n3j56Q4J79j82k46J25Q3j18K02l16J10J47m17J18K12nj70J63
5459b1J11m5K85r5l12J04K1lj78J98k34L24k73J13J86l44K86N1j53k02J22J5K0
5482b4P0Oj59o3J63P7k74K9L05L1k15J17k66L75q0J44r1j91j76O0J95K3m6l7K01
5507A74k76o9k58M74M3k15K76j22q4K19k15j27K4N96j63k75%J06k74J42J42j69
5529e1J59ok13K00k81J86J11J09k38p4J66K5j26J70k37j8M0L55k94r9L66l28k9
5552a07n8K97K5n7k13J88r5L00j42m15J60J31K31l29N0J98O2p5J48m22J44K45
5574B66k11k93J44M22m20O9qj71K77O6k36oJ97p6j13K61l81J5L36m7Rj38nJ46
$$ plain form
5598 103 -90 14 248 211 -244 95 -12 -67 86 28 19 -183 91 -50 -25 -9 107 133 -14 61 86 128 121 60 -51
5623 -51 122 -160 -199 -91 -54 376 28 -343 -148 89 58 -115 -113 -48 141 -116 33 99 133 29 20 168 -83 56
5647 56 -95 107 117 -132 188 -68 42 53 -137 118 -80 168 75 121 -45 399 114 -287 -10 -147 127 43
5669 43 -10 258 126 -73 -225 -145 174 -155 -134 272 -19 -40 332 -351 -14 -158 -193 72 -224 153 -52 -97
5691 -97 153 -29 -54 139 25 -121 -22 55 -46 162 33 0 -191 -61 -224 -11 -184 -26 82 297 -254 355
5713 355 193 198 -47 -162 -140 66 113 78 249 -59 209 211 -5 -90 41 -22 119 7 -21 -149 7 39 -109 -116
5737 -116 -27 -26 -112 -104 -64 214 172 186 -45 -227 -156 39 112 102 161 135 -217 139 172 -195 56 -75 -84 187 194 -41
5763 -41 175 140 58 -227 50 -414 -133 -78 86 -70 -137 202 64 170 -231 220 55 -53 87 25 -130 14
$$ packed form
5598A03j93J04K34l7m55L39j07n5J53n8rk02K74j41K5J6J16K6j47P5K5M2po1j11
5623e1J73k82l9J08L7M30l48l71J95K37l1j73KO5J89k57J49O6L4j04rJ48k51J39
5647E6j51K02J0k49L20k56J10J1j90K55j98K48r3M6j66M44k85m01K77j37K74q4
5669D3n3K68j32j99j52Q0L19l29K1M06k91k1L72o83L37j44l5K65k96L77k05m5
5691i7K50j82k5J93j14j46R9P7j01K08j29l3j91J30j63K13j73J58J08K15n51O09
5713C55j62Nk45j15K2K06M7l5J71l08K68Kk16q5J31o3J41j12k8j28J56L2j48p
5737a16Q9Jq6QM0K78m2J4k31j82P1J95P3j0N9k6l52L56L3l67K51j31rK71Pk35
5763d1K16l5q2k85K77m64K81N5J64j56o7L39j38J06m01M51j65j08J40o2j55J44
$$ plain form
5785 14 54 9 237 -140 18 -61 134 -303 -184 369 -191 131 11 -68 23 80 -149 -18 -93 274 43 -139 259
5808 259 -2 40 202 -90 139 -126 -250 -107 -123 -245 -51 39 -231 108 -170 43 21 -62 78 -183 -266 -4
5830 -4 8 -71 -192 -110 -164 37 183 -244 85 -139 103 -203 18 -191 17 -96 -119 -69 92 252 -56 -183 -145
5853 -145 -211 21 176 22 -134 -77 90 -421 65 49 136 93 93 145 -54 -14 29 -180 -149 31 185 -114 -129 -123 -102
5878 -102 62 -290 -125 33 -116 -56 -212 41 69 -174 173 45 113 408 68 124 -24 -137 13 62 300 -66
5900 -66 123 71 -89 -15 151 -20 -347 -197 -135 -189 -161 -24 148 67 -167 83 0 83 -170 -53 163 125 -179
5923 -179 198 164 62 200 161 -190 313 -108 14 -1 -83 140 -33 -227 149 -129 203 196 88 35 185 47
5945 47 -24 -95 16 149 -6 120 61 5 -107 183 -85 0 47 -194 211 -129 62 -20 12 190 -132 171 287
$$ packed form
5785A4M0m5K28l77J58p9J95m37J19N53n60L22j20p9R1N7k29J31p5L67k31j82L98
5808B59k61M2J62k92K29k65j24J43j6j22J94R0k70L39k78K13k2q3J40k61q3K62
5830dJ2p9j21Q2n4K01J46m27L29k24K42l06K21k09K08j13k3N0J61J60l08j27L8
5853a45o6K32J55j54j56N7J67n11M86j6Q7m3%N2j99M0M3k09L1J80J54k99j5OK1
5878a02J64l52J65J58j49O0j56K53K8k43L47j28O8K95l40N6j48j13J50M9K38l66
5900f6J89n2j60P4J66j71l27J50O2n4K8J37J72q1k34K50q3Q3k53J17K16l8l04
5923a79L77l4j02J38l9l51N03m21J22j5q2K23j73j94L76k78L32pj08n3J50j38
5945D7p1p1J11J33j55J26n9n6j12K90k68Q5M7k41M05l40J91q2L2J78l22L03J16
$$ plain form
5968 287 126 70 46 -39 -187 -129 98 229 -219 -380 233 21 439 -151 228 138 -296 -17 -164 -345 147 119
5990 119 94 42 -152 122 -120 -101 73 -43 -98 294 252 -40 -86 132 73 -212 66 138 509 211 93 39 68
6013 68 138 204 -155 275 -18 38 82 109 52 124 -142 -129 -125 75 128 -157 32 55 20 106 -115 87 281 -185 137
6038 137 -14 117 -51 -62 -230 211 -80 -77 38 -73 217 290 -78 243 256 -117 -18 -103 307 37 188 91 -10
6061 -10 40 -81 -79 -207 -133 -7 163 22 -47 150 118 4 188 -114 -295 7 128 90 103 -151 75 189 55
6084 55 65 117 -96 -175 80 9 302 207 -111 -116 52 -98 322 -231 -119 20 -26 61 164 24 -64 -225 19 157
6108 157 -132 -40 -240 15 47 -37 -88 -156 33 287 151 -160 216 5 -174 158 -21 -86 -20 -41 320 294 -213
6131 -213 40 -34 -287 175 -329 82 -101 -141 -4 50 -178 -95 129 -65 -141 99 116 135 -133 -151 77 55 12
$$ packed form
5968B87j61n6k4q5j48N8K27J31m48j61O13k12M18n90L79r0m34K79j47j81M92k8
5990A19k5n2j94K74k42J9J74j16n5L92m2k92m6K18n9k85K78P2L71k98j18n4K9
6013F8P0O6l59M30k93N6M4K7n7P2k66J3MK00N3k85J89K3l5Q6k21K02J94m66L22
6038A37j51J31j68j1j68M41k91LJ15j11K90P3l68L21J3l73R9q5M10k70J51r7j01
6061a0N0j21Kj28P4J26J70j41o9J97l2j14J84l02j81L02J21l8J3k54K26J14j34
6084E5J0N2k13p9K55p1K93r5l18nJ68j50M20n53J12J39m6Q7J03j40q8j61K44J38
6108A57k89R2k00K55L2q4n1o8J89K54j36l11L76k11j79L32j79o5O6k1L61k6n07
6131b13K53p4k53M62n04M11j83m0J37N4k28Q3K24j94p6K40J7J9k68j8K28k2m3
$$ plain form
6154 12 238 -197 66 29 -135 -218 74 1 51 -209 297 74 68 133 36 64 149 -120 37 63 57 -101 119 313 466
6179 466 -16 38 -68 57 -395 245 19 -212 -204 -108 2 -153 121 146 -23 161 -68 -126 -260 -66 -220 -153
6201 -153 97 9 -93 -10 59 168 -18 -88 109 74 -94 42 366 -130 3 -201 -134 22 -18 -235 -238 -229 -271 14
6225 14 -11 -162 51 189 129 17 64 183 116 121 84 94 -58 147 62 191 -114 258 54 -12 -29 88 -310 3
6249 3 18 177 -111 -84 -5 162 213 -105 -75 22 99 -182 -92 215 -15 187 -201 146 -60 62 194 -164 238
6272 238 52 252 -34 50 93 -52 -79 136 -203 83 32 18 -147 67 -194 69 -42 232 60 -115 127 131
6294 131 85 9 130 347 -283 -159 -183 -200 75 39 230 207 39 57 71 -129 280 109 -96 90 -20 69 0
6317 0 220 94 57 166 -131 33 73 -72 136 269 -171 -70 -91 44 11 30 -194 53 57 151 29 86 255 209
$$ packed form
6154A2K26m35K63l7j64q3K92p3N0k60N06k23oO5r7K8Q5k69J57K6oj58K20J94J53
6179D66m82N4j06J25m52O40k26k31QR6J10j55K74K5j69J84k29n8j34J94j54O7
6201a53K50q8j02Q3O9J09j86p0J97l5j68J36L24m96J33k04O7J56m0k17lRm2K85
6225A4k5j51K13J38o0j12M7J19o7Nl7J0j52K05q5J29l05L72k04o6j7J17l98L13
6249CJ5J59k88K7P9J67N1l18L0R7P7k81R0L07k30K02l88L47k06J22J32l58M02
6272B38j86K00k86Q4M3j45k7K15l39K86n1j4j65K14k61K63j11K74j72j75K42M
6294A31m6p6J21K17o30J24k4j7K75l6J91k3j68J8J4k00M09j71k05J86j10Q9o9
6317@K20j26l7J09k97J64M0j45K08J33m40J01k1J35l3J9k24K47MR4j22N7J69m6
$$ plain form
6341 209 -84 166 -154 61 -179 -68 94 73 152 20 82 377 168 -202 2 -101 291 -93 50 -20 -161
6362 -161 154 -183 -32 27 -131 -209 -136 -96 115 150 -268 85 -177 -129 -269 318 133 -51 -314 310 -400 145
6384 145 86 -126 -219 253 -3 -45 -255 154 108 60 173 2 33 132 -133 -222 -50 -63 -71 31 32 -206 -65 326
6408 326 75 84 145 360 123 -140 37 -204 15 -74 318 284 -335 12 190 -127 -20 134 -151 8 144 -152
6430 -152 122 179 62 135 49 -31 -39 130 -20 208 157 2 77 -3 -96 -268 113 -153 98 111 224 -377 -12 -72
6454 -72 -129 133 65 84 232 150 -71 -64 12 -162 -25 284 -13 -102 33 192 -349 -13 103 120 106 -276 168 -151
6478 -151 199 -35 15 232 -83 -23 113 -11 -163 -157 229 -116 -76 -155 -21 18 20 84 -272 95 119 -413 -52 75
6502 75 -143 153 -108 174 -177 -64 -175 12 -229 -214 -76 -65 22 -218 132 66 4 100 64 48 3 189 1
$$ packed form
6341B09k93K50l20K15k40J11J62k1P9j32O2K95k09l70K04j03L92l84J43p0j41
6362a61L15l37J51N9j58p8P3M0K11L5m18L53k62M8j40N87j85j84k63O24p10N45
6384A45n9k12r3M72k56m2k10M09m6m8J13j71L1R9k65q9J72j3qJ02Jk38J41L91
6408C26k51RO1K15k37k63J77k41K19q9L92l4o19L47J78l17J07J54k85J59J36k96
6430a52K74N7j17P3q6q0qJ69j50K28n1j55P5q0r3j72L81k66K51J3J13o01L65o0
6454g2n7K62o8J9J48q2k21PP6j74J37L09k97q9J35J59n41L36J16J7j4l82M44l19
6478a51L50k34N0K17l15O0J36j24j52OL86l45M0p9J34L9KO4l56L67K4n32L61J27
6502G5k18K96k61K82l51J13j11J87k41J5J38J1Q7k40L50o6o2R6l6j6m5J86j88
$$ plain form
6525 1 -143 205 -242 -10 73 492 115 17 -68 17 71 -204 -69 148 98 116 139 205 -174 -84 129 13 -166 108
6549 108 -193 141 -288 116 -188 20 87 102 165 -237 -88 -272 -165 4 -66 133 44 337 -107 204 87 -44
6571 -44 69 -114 29 -86 -1 55 -56 38 -236 140 -213 27 -41 -100 -2 6 42 36 61 -149 84 68 -30 28 289
6596 289 -63 165 146 -236 136 -105 -97 108 3 -26 102 -125 31 -101 101 -4 -107 -18 142 124 315 16
6618 16 200 -303 112 20 -81 -101 196 -196 58 -282 159 52 49 -35 -3 -11 221 10 41 -84 -199 185 22
6641 22 10 -155 -116 -174 180 187 -4 162 124 170 -5 234 -192 -133 59 -226 137 -250 165 -87 -152 -62 70 152
6665 152 -57 127 99 21 -89 -81 71 87 42 135 -165 -17 -131 69 -188 -46 -33 -91 -69 34 -220 -63 -97 -322
6689 -322 28 176 113 22 -83 -78 299 41 242 -188 37 24 216 -220 96 -78 206 5 -235 56 191 -23
$$ packed form
6525Aj44L48m47K32Q3M19l77r8q5Q5N4k75J35K17n0J8K3O6l79R0K13j16j79K74
6549A08l01L34m29M04l04K08O7J5O3m02J49j84J07J69p0J99q9K93m44L11j17j31
6571d4J13j83J43j15Q5N6j11R4k74L76l53K40o8n9R8QL6oK5k10K33j6r8N8K61
6596B89l52K28j9l82L72k41QK05j05k9J28k27J56j32K02j05j03Q9J60j8J91k99
6618A6J84n03M15r2j01k0K97l92K54l40M41j07lq4L2qK32k11L1j25j15L84j63
6641B2j2j65L9n8L54Pj91J66l8M6j75K39m26N9J92k85L63l87M15k52o5R0J32Q2
6665A52k09J84k8p8j10QJ52J6m5R3l00J48j14K00k57J42J3n8K2J03k54J57l4k25
6689c22L50J48o3r1j05NL77k58K01m30K25j3J92m36L16j74K84k01k40K91J35k14
$$ plain form
6711 -23 90 -149 105 -240 -50 -75 92 61 -17 -158 123 -111 151 252 -125 68 57 49 94 -24 194 -32 -21
6734 -21 -71 -41 148 -59 -48 0 -202 -6 21 21 157 38 -25 -41 -89 -13 -136 59 -95 350 47 136 -49 15 -115
6759 -115 28 -96 129 -88 127 -54 35 201 51 -59 -268 164 117 18 -34 -9 -170 358 125 140 10 -5
6781 -5 108 -11 -308 118 -146 -285 211 31 -25 14 103 -43 -147 232 146 -26 -102 -216 34 237 -186 -125 30
6804 30 277 -279 99 -213 119 22 23 12 204 331 302 -109 -50 238 -218 -274 -241 -32 156 225 315 121 19 115
6828 115 38 35 -90 121 -125 103 -11 78 99 25 91 -64 51 29 -277 -86 204 -33 102 146 -115 5 199
6851 199 -75 -102 34 -109 -334 291 -69 134 -264 -6 -13 -284 34 -128 -7 -104 -92 -63 -191 113 59 51 -88
6874 -88 179 -78 8 61 -252 -128 -15 137 290 96 325 161 144 69 6 -119 11 60 48 75 28 -70 75 -218
$$ packed form
6711b3J13k39K54l45J90k5J67l1p8j41K81k34K62J01l77J93j1qM5j18K18k26J1
6734b1n0L0J89k07J1M8k02J96K7%J36j19o3j6m8P6j23J95j54M45l03Q9j85O4j30
6759a15J43j24K25k17K15j81Q9J66j50j10k09M32m7r9n2K5j61N28k33J5j30j5
6781eJ13j19k97M26k64j39M96j80n6L9Q9j46j04L79q6j72p6j14K50K03m23O1J55
6804C0K47n56L78l12L32r7Jj1J92J27k9m11N9K88m56n6L3K09J88O9R0j94j02R6
6828A15p7lj25K11k46K28j14Q9K1p4O6j55J15k2l06J91K90k37J35M4k61J20J94
6851A99k74k7J36j43k25O25l60K03l98K58pk71L18j62J21r7J2K9j28L04n4qj39
6874h8K67k57Q6N3l13J24J13J52J53j94K29j64j7p5o3j25J30M9j2K7m7r8J45k93
$$ plain form
6898 -218 -307 49 -161 217 27 138 -134 9 90 101 -27 98 212 48 133 114 244 5 248 61 126 317
6920 317 -112 -373 196 171 -32 -178 -16 73 41 -281 106 -30 -13 -245 37 339 16 42 -110 112 32 -72
6942 -72 -38 74 -7 92 -129 196 -354 -41 363 51 -131 -31 61 108 -67 -51 -103 -33 6 145 -114 233 -111
6965 -111 45 46 -14 344 234 1 -88 -188 -335 -290 -111 -3 -19 73 62 232 77 -89 -96 142 70 217 -111 -71
6989 -71 -117 -84 -184 -56 57 163 -101 -306 -151 290 47 164 248 -36 -91 244 -35 -211 -271 -40 352 -107
7011 -107 -54 -245 93 11 58 234 -276 -84 141 -45 35 171 15 219 -381 -61 -185 170 -253 179 -61
7032 -61 211 90 248 4 -21 125 -31 72 27 -64 -44 -98 106 356 47 -204 -162 89 -110 -240 176 37
7054 37 -178 122 -499 134 -133 38 -93 -119 -61 57 -363 -86 -72 35 -70 305 -31 -85 73 65 80 -26 95
$$ packed form
6898b18q9L56k10L78j90J11k72J43Q1J1j28J25J14j64Q5j9J30k39K43j87O5J91
6920C17m29k61N69k5k03j46J62Q9l2l22L87j36J7k32K82L02l23K6j52K22q0j04
6942g2L4J12q1R9k21L25n50L13M04l12j82J00R2M7j75J6n2P0L9J39k59L47l44
6965a11J56Jo0L58j10k33q9j00j47M5J79J08j6R2j1J70j55j66pK38p2J47l28M0
6989g1m6L3j00J28J13J06k64k05J55M41k43J17Q4k84n5L35k79j76o0K31L92m59
7011a07N3j91L38q2M7J76n10J92K25j86Q0J36j56K04o00L20j24L55m23M32k40
7032f1K72j21J58k44k5J46j56J03m5r1K0n4K04K50l09k51M2K51j99j30M16j39
7054C7k15L00o21O33k67J71j31k6N8J18m20K77J4J07j05L75l36n4J58qJ5j06J21
$$ plain form
7077 95 48 191 32 153 -195 49 209 -27 43 77 -4 140 102 186 299 -141 21 136 21 -20 -13 197 33
7100 33 -213 -91 -102 -169 -44 76 -13 73 187 246 -159 135 124 -4 444 296 12 279 6 -223 -66 -29 116
7123 116 182 -19 86 106 -67 -14 2 3 99 104 171 100 -139 -132 133 201 -57 -145 -71 111 5 32 -128 34 -215 136
7149 136 -29 -36 -56 182 193 -154 -75 25 6 55 -132 -66 -71 -125 -27 294 223 47 167 -24 -165 124 -10 -243
7173 -243 -43 47 22 181 265 234 256 -100 25 -184 70 71 -58 39 -104 5 3 53 210 -225 -49 139 -30 -187
7197 -187 58 99 -30 -84 -144 -58 -74 -95 -22 86 184 -3 18 78 373 -90 -104 -70 78 -164 -60 -168 -29 27
7221 27 75 127 78 19 -104 -84 -33 -100 -143 -53 -292 187 -126 30 -43 -29 -89 -128 -183 27 -75 -105 -18 -255 201 18
7247 18 -114 -75 -171 93 -151 49 -299 -134 -171 -217 119 55 157 -47 -41 -44 -37 -296 -41 -155 39 -215 131 -80
$$ packed form
7077I5m7J43j59J21l48K44J60k36P0L4q1J44l8Q4J13m40J62J15j15m1PK10j64
7100C3k46J22j1o7J25J20q9Q6J14N9m05K94j1j28M48j48k84K67k73k29J57L7J45
7123A16O6k01J05K0j73N3J6JR6NO7p1k39PK65O8k58q8P4J82j06K7j60J62k49L51
7149A36j65pk0K38J1l47P9J00j9M9j87O6nn4R8L21p1j76J20j91j41K89j34k33
7173b43K00R0k5J59Q4l1K2l56J25k09K54Jj29R7j43J09kN0J57m35J76J88j69j57
7197a87K45M1j29n4o0Q6j6k1P3J08R8j87K1O0K95m63j4L4J48k42J04j08J39N6
7221B7M8N2m9n9j23K0N1o7m3R0k39M79l13J56p3J4o0l9n5K10j02l0Q7k37M56j83
7247A8j32L9r6K64k44K00l48J65l7m6L36o4J02k04OlPk59K55j14J94k54L46k11
$$ plain form
7271 -80 76 -57 44 -224 -209 25 30 9 -218 193 10 -346 60 116 -262 -43 207 -76 306 -38 -184 178
7293 178 116 -48 -23 -173 -45 259 -2 -96 -13 78 232 -41 141 67 130 87 141 279 156 -85 205 -111 54
7316 54 33 -222 27 51 -99 -229 -248 -92 -215 -245 161 -334 155 -76 14 152 180 -181 -39 178 -95 313
7338 313 381 3 93 -239 155 -78 -25 63 -336 130 32 61 -55 196 162 24 -41 11 -65 -65 -99 -53 120 -65 151
7363 151 -91 -179 -101 -64 65 53 -3 176 51 235 218 84 74 -191 319 -37 52 155 -55 158 -6 104 205
7386 205 114 -23 16 74 -107 -266 -96 51 357 145 -25 111 -10 163 -162 31 -134 -59 27 296 162 252
7408 252 -30 -16 169 -5 -250 163 38 75 20 -36 226 179 51 -107 253 -128 101 -23 -86 -30 -151 -7
7430 -7 -95 -97 189 -63 -112 136 -26 161 96 181 -187 -87 10 358 176 -3 26 -231 -254 65 -30 197 -26 -368
$$ packed form
7271h0J56j33J01k68J5K34Nk1k27M11j83l56M06N6l78K19K50k83L82l44j46L62
7293A78o2j64K5j50J28L04k61r4Q3R1J54k73J82p4O3m3N4J38j23k41K90l16J65
7316E4k1k55K49K4j50j30j9J56j23l0M06m95M89k31R0J38K8l61J42K17k73M08
7338C13O8l78R0l32L94k33N3Q8l99M66r8K9j16K51l4j38o5N2p6%l4M6J73j85K16
7363A51k42q8P8L7J29j2n6J79j25J84j7j34j0k65N10l56Q9J03k10K13j64J10J01
7386B05r1j37L9N8j81j59J70J47L06k12j70J36j21J73l25J93j65P5Q6K69j34R0
7408B52k82J4J85j74k45M13j25L7n5n6K62m7j28j58L60l81K29j24o3N6j21J44
7430gq8kK86k52m9K48j62J87o5Q5l68J00R7L48j82j79K9k57k3L19r5K27k23l42
$$ plain form
7454 -368 -93 16 89 -72 183 -193 124 -24 -99 41 77 -48 23 175 -48 129 -75 -299 -161 64 31 -8
7476 -8 -114 -264 174 308 -16 -125 93 300 -18 -145 36 245 122 -76 -40 -97 91 -26 -106 -332 -73 31
7498 31 -163 154 -367 -87 79 36 -173 -35 63 40 -116 88 82 -4 210 18 -428 -177 -104 -201 234 -158 -61
7521 -61 187 -250 -266 55 -289 -90 -17 -158 -2 115 -99 -25 -192 153 -32 -55 51 130 342 378 160 4
7543 4 30 105 129 150 67 -171 -7 68 71 -125 9 137 -39 -14 -40 -15 -179 65 -7 -191 134 -67 216 22 -91
7568 -91 74 161 314 -169 -58 269 178 1 -54 197 -36 194 145 280 -46 -66 -55 146 -210 104 158 -91 -193
7591 -193 379 -57 41 -103 -43 -259 -157 -63 -137 -252 -33 -230 14 157 -20 271 -108 93 -121 -192 194 72
7613 72 103 184 -133 -177 -9 -13 23 256 -26 -10 -96 249 -147 183 -55 96 -43 -107 146 74 -92 -118 -135 48
$$ packed form
7454c68K75J09P3j61K55l76L17j48p5J40L6j25P1J52k23J77k04k24J38K25l3l9
7476hj06j50M38J34l24j09K18K07l18j27J81K09j23j98L6n7J88j17q0k26K59J04
7498C1j94L17n21K80J66m3k09J38R8k3j56K04oq6K14j92m46K51P3r7M35l92R7
7521f1K48m37j6L21l44J99P3j41J56J17k14P4j67L45j85k3J06P9K12L6k18j56
7543DK6P5K4K1q3k38J64P5Lj96J34J28j76K5k6K5j64K44p2j84L25k01K83j94j13
7568i1J65Q7J53m83J11L27r1j77n5K51k33K30m9J35l26k0J1K01l56L14N4k49j02
7591a93N72m36R8j44O0k16J02R4p4j15K19j97K44J43j77K91l79K01k14p1L86j22
7613G2L1Q1l17m4J68mL6K33k82J6q6L45l96L30k38J51j39o4K53p2j66k6j7J83
$$ plain form
7637 48 88 245 -93 40 275 117 73 99 -67 267 111 43 71 266 137 128 -3 -105 184 89 265 -150 144
7660 144 82 -157 183 87 161 91 186 -39 228 -106 117 -267 -73 211 220 -267 -43 155 27 -57 -97 -260 17
7683 17 -69 255 156 113 -72 -62 143 -122 -170 72 335 -208 68 -27 92 -7 172 47 284 33 -114 -88 1
7706 1 131 49 -2 -67 165 101 182 -83 -70 -203 -197 -14 -361 -195 91 -364 45 -378 195 -15 -3 -95 127 196
7730 196 -18 315 -208 168 141 124 -276 -96 65 28 99 -116 -94 66 68 159 179 -35 149 -69 33 -23 15 -62
7754 -62 37 329 -29 140 -114 44 348 -9 207 144 -33 -16 -213 -297 179 -178 -21 8 165 -67 464 169
7776 169 -356 45 94 397 212 76 34 263 78 199 -42 -181 55 92 33 147 -68 270 104 -44 -28 -172
7798 -172 16 -16 156 72 139 -245 -151 -268 312 -190 55 -124 125 279 -211 -62 -82 14 -377 -105 -7 -16 98
$$ packed form
7637D8M0J57l38J33K35j58m4K6j66L34j56o8K8J95j29rj31j02K89r5J76m15K94
7660A44o2k39L40r6P4p0R5k25K67l34K23l84J94K84Rm87K24J98j28q4m0j63K77
7683A7q6L24r9m3j85J0K05k65m8K42K63n43K76r5J19r9J79j25K37k51j47K6Q9
7706AJ30q2n1o5K32o4Q1k65J3j33OJ83l47J66K86m55M09m23N73k10J2r2K22O9
7730A96k14L33n23L76k7j7m00J80J61l7P1k15K2J60KR1K0k14J84k18J02n6L8p7
7754f2R9K92l58J69k54J58L04l57K16o3j77J7j97q4M76l57J57K9J57k32N31k95
7776A69n25M01M9L03j85j36m2K29j85J21k41j39K36L7n9J14k15L38j66j48J6j44
7798a72J88l2J72q4O7l84R4j17N80n02K45j79K49J54m90J49k0R6l91K72R8rJ14
$$ plain form
7821 98 -20 107 -72 19 122 234 57 -16 -218 121 -118 72 216 -17 167 -99 110 178 -77 0 -12 -175
7843 -175 -169 -197 -150 197 68 -106 15 -67 -371 -38 98 148 -289 74 -156 -108 22 -292 72 32 134 -53 -203
7866 -203 91 -94 -50 -226 -48 -46 46 31 -26 -14 -430 213 -26 194 115 234 -26 -21 -244 -173 66 59 -50 -144 161
7891 161 -67 228 341 99 185 -28 72 -92 337 -166 94 -31 37 84 58 12 222 -111 -87 157 -70 -104
7913 -104 -258 -178 -101 34 -198 189 -265 105 -3 46 253 100 31 -109 72 38 89 130 226 70 117 94 -92
7936 -92 67 312 -101 -69 -52 -121 -99 247 182 -101 51 62 -205 -5 111 -126 164 -110 -143 -43 -17 57 -99
7959 -99 71 220 40 71 160 -175 4 187 -75 43 14 159 38 166 162 46 -36 126 38 272 343 -35 -110
7982 -110 -74 -198 2 -193 16 -193 -399 60 194 -17 -210 55 75 -137 -281 247 -130 62 57 -289 174
$$ packed form
7821I8j18J27j79R1J03J12j77p3k02L39k39J90J44k33J84k66K09O8k55P7j2j63
7843a75Ok8M7L47j29j74J21q2l04L33J36N0m37L63k30M8J30l14L64m0J02j87j50
7866b03K94j85M4j76J78KR2j5n7J2m16O43k39K20p9J19k60Nk23P1K39pj09r4L05
7891A61k28K95J13k42Q6k13J00j64M29n03K60j25O8M7k6m6K10l33K4K44k27l4
7913a04j54Q0P7J35k32L87m54L70j08M9K07j53o9j40J81l4N1M1R6j56M7k3j86
7936i2J59K45m13L2J7o9K2L46o5k83J52J1k67K00J16k37K90k74l3J00K6P4j56
7959i9J70J49j80L1Q9l35J79J83k62J18k9J45j21J28mj16q2J62q8K34P1l78p5
7982a10L6j24K00j95K09k09k06M59J34k11j93K65K0k12j44N28l77J92nl46M63
$$ plain form
8003 174 114 -122 55 -250 -12 94 -183 -54 -151 -249 99 -300 -154 138 40 -24 134 300 -92 -158 -152 228 -23
8026 -23 -99 356 -293 257 -280 -180 278 -136 -58 318 9 -29 203 -20 32 -158 16 -69 -188 7 -29 124
8048 124 -107 108 60 -56 301 147 121 -55 -73 -42 69 -211 -120 122 115 -80 -91 -242 -35 109 -87 169 -108
8071 -108 272 -35 -34 -144 8 100 81 -92 -77 199 250 -187 -189 -226 106 42 -87 93 199 11 -38 -310 1 183
8095 183 -163 -110 213 -256 -292 -106 86 269 397 104 93 75 -6 221 -28 -149 -106 -107 -118 -20 -187 96 175 287
8119 287 239 26 -173 -187 -110 -91 108 -279 158 76 75 41 142 47 6 120 226 131 73 -51 5 242 1 -22 156
8144 156 -70 -65 -236 -249 -153 -78 -2 -9 122 20 -5 -92 4 -85 231 96 -50 -121 -70 13 -452 -266 21 25 -202 -191
8170 -191 -154 112 35 -181 273 92 -60 151 427 -2 150 99 -186 -15 135 138 57 -164 151 143 73
$$ packed form
8003A74o0k36J77l05K38J06k77J29r7r8L48l99J46K92r8o4J58J66l92o6OL80k51
8026b3p6M55o49N50n37J00M58m14P8L76l09l8K32k23N2j90J74q5j19J95l6J53
8048A24k31K15m8j16L57j54k6j76j8L1J11k80R1K42pj95j1j51K07J44j96K56k77
8071a08L80l07Jj10J52R2j9j73J5K76N1m37kl7L32o4j29J80J06j88m9k72L11J82
8095A83l46N3L23m69l6J86J92J83J28k93j1j8q1K27k49j21M3jj1R8j67K83P9J12
8119B87m8k13j99j4P7J9J99l87M37q2jl4J01r5m1J14J06r5n8j24N6K37k41k3J78
8144A56k26Nj71j3R6P5P6pJ31j02k5q7R6q9L16j35j46p1N1Q3m65J86K87Mk27J1
8170a91L7K66p7k16M54j81j52K11K76m29J52n1k85J71J50Lq1k21L15qp0
8191G3
$$ Imaginary data points
##PAGE= N=2
##DATA TABLE= (X++(I..I)), XYDATA
$$ plain form
0 0 0 0 0 0 1 0 8 -8 8 -16 16 -17 24 -32 40 -48 56 -65 80 -96 108 -128 145 -169 193 -225 254 -289 328
29 328 -369 417 -467 523 -586 652 -727 810 -900 996 -1105 1224 -1354 1500 -1661 1840 -2042
46 -2042 2269 -2529 2827 -3174 3585 -4081 4688 -5460 6471 -7865 9921 -13268 19656 -36363
60 -36363 174888 397593 103967 -88711 -112250 77930 202464 182178 24339 -70229 -40302
71 -40302 90308 164556 131011 10216 -78812 -84381 -5180 82434 123246 72710 -24899 -85379
83 -85379 -37074 62234 108580 44164 -60003 -98530 -23109 89415 129004 55150 -53646 -93957
95 -93957 -32552 59678 93249 46898 -17316 -39291 -11075 36622 67743 56527 7940 -37026
107 -37026 -32184 25412 87233 91158 25415 -48247 -56492 10488 84430 89660 18886 -52809 -50517
$$ packed form
0@%%%%JjQj6J6k4L2l3M1n6P2q8J04j21J45j76K04k36K73l14L62m18M79n43O17
29C28o97P86q84R90j109J238j379J537j710J896k101K329k578K854l161L501l882
46b042M311m798N356o001O759p666Q769j0148J1931j4336J7786k3189L2924n6019
60c6363K11251K22705k93626j92678k3539J90180J24534k0286j57839r4568K9927
71d0302J30610P4248l3545j20795q9028n569P9201Q7614M0812n0536r7609o0480
83h5379M8305R9308M6346o4416j04167l8527P5421J12524L9589p3854j08796m0311
95i3957O1405R2230L3571m6351o4214k1975K8216M7697L1121j1216m8587m4966
107c7026M842N7596O1821L925o5743p3662q245O6980P3942N230p0774p1695K292
$$ plain form
120 -50517 17579 71612 58311 -1598 -47574 -43528 826 43056 48865 16242 -27937 -50154
132 -50154 -31700 17097 52110 38131 -14853 -56683 -41425 22481 69127 42649 -31268 -71852
144 -71852 -34791 40455 74997 34880 -34445 -61084 -23598 31152 50304 23027 -17917 -35791
156 -35791 -19823 11364 30670 25853 -1158 -32944 -40280 -7884 38178 50956 11902 -44658
168 -44658 -59282 -13400 45766 52860 1198 -50444 -47379 5481 49586 38791 -13252 -49218
180 -49218 -35807 6834 35866 31586 4971 -19009 -23296 -8816 13433 27860 19800 -8351 -29644
193 -29644 -17091 23506 51051 33516 -16837 -49159 -26421 28513 55947 28550 -21192 -39160
205 -39160 -10553 31230 40108 8855 -26539 -32225 -7966 20854 30469 15899 -9054 -24364 -19257
$$ packed form
120e0517O8096N4033j3301n9909m5976M046M4354M2230N809l2623m4179k2217
132e0154J8454M8797L5013j3979n2984m1830J5258O3906M6646k6478p3917m0584
144g1852L7061P5246L4542m0117o9325k6639L7486N4750J9152k7277m0944j7874
156c5791J5968L1187J9306m817k7011l1786p336L2396M6062J2778l9054n6560
168d4658j4624M5882N9166P094n1662n1642L065N2860M4105j0795n2043l5966
180d9218J3411M2641K9032m280k6615k3980m287J4480K2249J4427q060k8151k1293
193b9644J2553M0597K7545j7535n0353l2322K2738N4934K7434k7397m9742j7968
205c9160K8607M1783Q878l1253l5394n686K4259K8820R615j4570k4953j5310N107
$$ plain form
218 -19257 1393 20740 20579 -2906 -26848 -24118 5549 31499 25020 -9185 -36187 -25929 10246
231 10246 33525 21233 -8770 -24242 -12072 11165 21128 10277 -5952 -12160 -6844 3945 14138
244 14138 17420 9440 -5533 -16178 -9614 10846 25982 16739 -8921 -22852 -8420 18863 29363
257 29363 8995 -19405 -25550 -2795 21845 23479 3655 -15500 -16058 -1559 11214 10977 1604
270 1604 -5895 -9565 -6377 2352 11412 12236 1049 -14557 -18321 -1798 19322 21012 -882 -21356
284 -21356 -18116 5152 23585 16519 -8838 -23087 -12139 10249 20477 10130 -7741 -14573 -7025
297 -7025 5087 10006 6955 -293 -8116 -10685 -3561 8484 13917 5647 -10083 -17898 -6946 12711
311 12711 18936 3878 -16791 -19867 -1777 17599 17015 -2005 -17209 -13661 2712 12642 9340
$$ packed form
218a9257K0650J9347j61k3485k3942K730K9667K5950o479l4205k7002J0258L6175
231A0246K3279j2292l0003j5472J2170K3237R963j0851j6229o208N316J0789J0193
244A4138L282p980j4973j0645O564K0460J5136r243k5660j3931J4432K7283J0500
257B9363k0368k8400o145K2755K4640J634j9824j9155n58J4499J2773k37r373
270A604p499l670L188Q729R060Q24j1187j5606l764J6523K1120J690k1894k0474
284b1356L240K3268J8433p066k5357j4249J0948K2388J0228j0347j7871o832P548
297g025J2112M919l051p248p823k569P124J2045N433q270j5730p815J0952J9657
311A2711O225j5058k0669l076J8090J9376n84j9020j5204L548J6373R930l302
$$ plain form
324 9340 -2502 -10219 -7651 6 6347 7660 4025 -4223 -10498 -7883 3145 13134 10612 -3411
338 -3411 -15138 -10236 6847 16191 8103 -9385 -16472 -6547 9954 15259 5025 -8385 -12058 -4743
352 -4743 4988 8377 4172 -3286 -7535 -5799 11 7409 8490 821 -10376 -12073 -1981 10945
366 10945 13565 1045 -13292 -13119 1352 13316 10068 -3927 -13192 -8070 4804 11646 6155 -4077
380 -4077 -8960 -5631 571 5239 5476 1802 -2577 -5893 -4576 1747 7829 5910 -3888 -10867 -6895
395 -6895 5489 13282 7226 -6697 -13730 -6238 6878 11648 4041 -7164 -9864 -1847 7642 8346
409 8346 1498 -5145 -7387 -3482 2588 6676 5987 671 -5420 -7354 -1605 6861 8456 1089 -8146
424 -8146 -8756 402 10785 9961 -1036 -10642 -8591 1430 8644 7189 -1188 -6644 -5035 1112 5623
$$ packed form
324I340j1842p717K568P657O341J313l635q248o275K615J1028R989k522j4023
338c411j1727M902J7083R344q088j7488p087R925J6501N305j0234j3410l673P315
352d743R731L389m205p458m249J736N810P398J081p669j1197j697J0092J2926
366A0945K620j2520j4337J73J4471J1964l248j3995r265N122J2874O842n491j0232
380d077m883L329O202M668K37l674m379l316J317O323O082j919r798o979L972
395f895J2384P793o056j3923p033P492J3116M770p607j1205k700Q017R489P04
409H346o848o643k242L905O070M088o89n316o091j934N749Q466J595p367r235
424h146o10R158J0383q24j0997r606K051J0021P214j455q377n456J609O147M511
$$ plain form
439 5623 4810 275 -4709 -5759 -2478 3804 7383 4577 -2976 -8653 -5361 3793 9466 4925 -4695
454 -4695 -9543 -3669 6704 9952 3134 -6149 -8042 -2020 5375 7409 2706 -3512 -4706 -1816 1968
469 1968 4618 4018 -464 -5133 -4962 -74 6202 6805 476 -7093 -6912 148 7822 6939 -544 -7258
485 -7258 -5940 1719 7120 5111 -1277 -5444 -3942 689 4306 4240 490 -2776 -3634 -2153 2229 5573
501 5573 3795 -1859 -6031 -3928 2898 7600 4183 -3205 -7357 -2905 4491 7025 2729 -4358 -6449
516 -6449 -1963 3888 5277 1819 -2770 -3896 -2078 1001 2906 2077 -546 -2913 -3202 -471 3592 4565
532 4565 660 -4054 -5686 -1542 4330 5601 750 -4761 -4985 -458 4367 4370 -308 -4926 -4235 165
548 165 3873 4183 799 -2663 -4026 -1786 2190 3493 2085 -1762 -4069 -2449 2005 4533 2439 -2701
$$ packed form
439E623q13m535m984j050L281O282L579k806p553n677L292R154N673m541r620
454d695m848N874J0373L248o818r283j893O022P395K034m703o218j194K890L784
469A968K650o00m482m669J71M888O276O03o329p569J81P060P674q83p483o714
485g258J318P659N401k009o388m167J502M631L617o6l750l266q58J481M382L344
501E573j778n654m172K103O826M702l417p388m152M452P396K534m296p087k091
516f449M486N851J389l458m589j126J818L079J905q29k623k367k89K731M063R73
532D565l905m714j632M144N872J271m851n511k24M527M825Lm678m618O91M400
548A65L708L10l384l462j363K240L976J303j408l847k307J620M454K528k094n140
$$ plain form
564 -2701 -5524 -2724 2383 5055 2417 -2377 -4365 -1966 1671 3098 1246 -2109 -2796 -1529 612
579 612 2246 2183 -291 -2806 -3413 -1228 1734 3376 1248 -2752 -3948 -615 2866 3450 271 -3596
595 -3596 -3540 150 3763 3306 -100 -2627 -2611 -552 1943 2181 584 -1563 -1951 -876 1258 2456 1360
612 1360 -1180 -3144 -2148 874 3216 2476 -1246 -3450 -2151 1525 3145 1797 -1610 -3157 -1634 1943
628 1943 2865 1469 -1197 -2377 -1334 685 2351 1390 135 -1341 -1696 169 2074 2392 653 -1486
644 -1486 -2043 -176 2427 2155 401 -1038 -1922 -308 3016 2496 915 -1758 -1880 713 1989 1664 285
661 285 -1502 -1596 -218 1115 1518 632 -718 -1639 -642 1130 1535 1135 -452 -1559 -1134 719 1976 1251
679 1251 -836 -1615 -1016 778 1982 1412 -286 -1338 -1103 326 1923 1894 206 -1677 -1191 199 1692
$$ packed form
564b701k823K800N107K672k638m794j988K399L637J427j852l355o87J267K141
579F12J634o3k474k515o07K185K962J642k128m000j196L333L481N84l179l867
595c596N6L690L613m57l406k527J6K059K495K38j597k147l88J075K134J198j096
612A360k540j964R96L022K342p40l722k204J299L676J620j348l407j547J523L577
628A943R22j396k666j180J043K019J666r61j255j476l55J865J905L18j739k139
644a486n57J867K603k72j754j439q84J614L324n20j581k673j22K593J276l25j379
661B85j787r4J378J333M03q86j350r21R97J772M05m00j587j107M25J853J257p25
679A251k087p79N99J794J204n70j698j052K35J429J597k9j688j883M86J390J493
$$ plain form
696 1692 1804 485 -1684 -1504 101 2181 2379 -16 -1853 -1882 296 2002 1613 -14 -1544 -1214 271
713 271 1528 1471 -318 -1462 -1200 307 935 1112 221 -300 -1168 -747 365 1325 702 -708 -1120 -529 854
732 854 1658 832 -815 -1605 -1066 979 1454 716 -543 -1109 -417 716 898 625 -599 -884 -607 537
750 537 1546 1062 -268 -1163 -943 -24 828 1055 108 -1253 -1072 124 1128 1391 -297 -1407 -1226 -91
768 -91 1049 1224 319 -1200 -1471 -231 801 1049 10 -1003 -1324 -246 845 1204 196 -691 -1236 -713
786 -713 836 1275 379 -923 -1175 -469 767 1584 311 -925 -1449 -704 692 1077 615 -791 -1221 -651
804 -651 504 1007 482 -350 -1171 -791 424 692 206 -314 -1136 -778 301 1257 704 -336 -953 -902 197
823 197 930 620 -366 -991 -479 -109 640 606 -38 -708 -816 -509 558 1295 407 -716 -1025 -373 888 1005
$$ packed form
696A692J12j319k169J80J605K080J98k395j837k9K178J706l89j627j530L30J485
713B71J257n7j789j144K62J507O28J77q91n21q68M21J112R60o23j410m12N91J383
732H54Q04q26j647p90N39K045M75p38j259n66O92J133J82k73j224k85K77J144
750E37J009m84j330q95K20R19Q52K27r47j361J81J196J004K63j688j110J81J135
768i1J140J75r05j519k71J240J032K48j039j013l21J078J091L59j008q87n45N23
786g13J549M39q96j302k52P06J236Q17j273j236n24P45J396L85m62j406m30N70
804f51J155N03n25q32q21L80J215K68m86n20q22L58J079R56n53j040o17N1J099
823A97P33l10r86o25N12L70P49l4o44o70j08L07J067P37q88j123l09O52J261J17
$$ plain form
843 1005 593 -903 -1337 -693 939 1193 546 -918 -1419 -572 865 1152 271 -735 -826 -375 598 948 258
862 258 -486 -972 -508 154 712 566 -366 -1010 -713 189 960 584 107 -678 -625 250 664 694 -202 -847 -678
883 -678 226 1026 839 45 -397 -821 -129 942 836 130 -645 -779 -31 594 1019 84 -621 -895 -535 871
903 871 955 262 -599 -968 -419 252 886 399 -672 -1044 -311 528 560 537 -545 -980 -630 478 1041 771
923 771 -288 -627 -585 111 856 672 0 -716 -581 194 892 896 -222 -541 -731 167 617 611 -104 -708 -589
944 -589 -286 638 734 -311 -449 -616 -34 472 758 453 -700 -431 -70 513 564 -5 -306 -655 46 728
964 728 556 320 -265 -451 -412 37 711 533 -428 -626 32 168 296 485 56 -510 -298 -219 506 500 -155 -429
986 -429 -499 392 630 720 -129 -592 -646 -3 475 424 -105 -130 -275 -109 582 573 -110 -1019 -544 306 371 617 178
$$ packed form
843A005m12j496m34O44J632K54o47j464n01Q47J437K87q81j006r1M51R73L50o90
862B58p44m86M64O62N58j46r32o44K97R02P71l76m77p85N3Q75M14L0q96o45J69
883f78R04Q00j87p94m42m24O92J071j06p06p75j34P48O25M25r35p05k74L60J406
903H71Q4o93q61l69N49O71O34m87j071l72P33Q39L2k3j082m35L50J108N63k70
923G71j059l39M2O96P45j84o72p16J35P75O98Mj118l19j90Q98M50op15o04J19
944e89L03R24R6j045j38j67N82N06K86l05j153K69L61N83N1n69l01l49P01O82
964G28j72k36n85j86L9M49O74j78r61j98O58J36J28J89m29n66K12P9P25oo55k74
986d29p0Q91K38R0q49m63n4O43M78n1n29k5j45J66O91ro83r09M75Q50O5K46m39
$$ plain form
1009 178 -463 -598 -126 257 446 356 -489 -475 20 201 238 422 -135 -585 -285 190 389 116 -94 -70 -456
1030 -456 87 574 180 -59 -486 -289 206 682 -148 -453 -560 -416 221 210 97 -269 -227 -378 18 449 74
1051 74 -102 -413 -242 -151 245 329 248 -324 -270 191 509 492 143 -131 -468 6 279 318 350 -240 -327 -249 219
1074 219 546 114 -254 -464 155 172 252 113 -476 -462 24 318 312 93 -28 -239 -216 408 289 63 -295 -175
1096 -175 28 -244 33 -9 -342 -270 -213 77 273 62 -213 -158 -42 66 186 191 79 -87 -303 22 138 -21
1118 -21 46 -31 -211 -66 162 47 32 -85 -117 73 190 181 197 34 -90 40 262 83 280 -184 -28 83 39
1141 39 301 102 -312 -101 -51 -145 408 187 -359 22 18 300 215 412 -155 -227 -81 5 188 -83 5 -131 136
1164 136 217 119 33 -27 -90 -67 216 185 -135 21 74 -448 -117 267 4 53 -42 17 31 42 203 20 -401 -289
$$ packed form
1009A78o41j35M72L83J89r0q45J4M95J81L7J84n57m50L00M75J99k73k10K4l86
1030d56N43M87l94k39m27J97M95M76q30l05j07J44O37j1j13l66M2j51L96M31l75
1051G4j76l11J71R1L96Q4q1n72N4M61L18j7l49k74l37M74K73L9L2n90q7P8M68
1074B19L27m32l68k10O19J7Q0j39n89J4M86K94ok19j21k11K3O24j19k26l58J20
1096a75K03k72K77m2l33P2N7K90J96k11k75N5J16J08J20Nj12j66k16L25J16j59
1118b1O7p7j80J45K28j15j5j17l2J90J17rJ6j63j24J30K22j79J97m64J56J11m4
1141C9K62j99m14K11N0r4N53k21n46L81mK82q5J97n67p2J46Q6J83k71Q8j36K67
1164A36Q1r8q6o0o3K3K83l1l20J56N3n22L31L84k63M9r5N9J4J1J61j83m21J12
$$ plain form
1188 -289 135 15 224 -155 -187 -164 127 135 168 215 -235 -156 -6 152 74 -155 -167 95 -108 -32 -14 42 64 -128
1212 -128 -123 153 237 -227 81 -350 -63 46 478 129 49 -135 170 -10 164 68 -136 -322 49 -147 50 45
1234 45 -239 -120 -31 291 339 132 -205 -133 -268 429 273 348 -292 -190 158 -153 167 74 -35 -232 3 83
1256 83 294 268 177 -238 -24 -10 189 218 -167 -161 -290 44 154 401 215 -92 -143 -117 328 85 -30 -130 -96
1279 -96 172 262 227 274 519 -274 -46 117 140 112 -295 12 -216 33 244 239 -83 -358 -152 331 65 -37 5
1302 5 -158 -300 308 310 -224 272 -16 185 210 210 -156 -189 -260 -13 -143 -95 206 -74 -71 -288 -181 150 26 84
1326 84 -151 -67 -149 193 258 308 293 -40 -112 -52 294 -44 178 -94 -302 -9 119 -32 14 -237 -9 -106 468
1349 468 -23 67 226 -115 75 38 -56 -14 -355 -214 -39 -163 137 115 50 -159 80 329 43 242 -52 -176
$$ packed form
1188b89M24j20K09l79l2K3K91QL3M7m50P9J50J58p8k29j2K62k03P6J8N6K2j92
1212a28NK76Q4m64L08m31K87J09M32l49q0j84L05j80J74r6k04j86L71j96J97n
1234D5k84J19Q9L22M8k07l37P2j35O97j56P5o40J02L48l11L20r3j09j97K35Q0
1256H3K11k6r1m15K14J4J99K9l85Oj29L34J10K47j86l07n1K6M45k43j15j00L4
1279i6K68R0l5M7K45p93K28J63K3k8m07L07k28K49K11nl22k75K06M83k66j02M2
1302Ej63j42O08Kn34M96k88K01K5%l66l3p1K47j30M8L01k80Lk17J07L31j24N8
1326H4k35Q4q2L42O5N0j5l33p2O0L46l38K22k72k08K93J28j51M6k51K28r7N74
1349D68m91R0J59l41J90l7r4M2l41J41J75j24L00k2o5k09K39K49k86J99k94j24
$$ plain form
1371 -176 131 123 275 -169 -4 17 -140 239 -83 -5 -231 -149 -24 340 62 140 -186 -133 -227 -18 54 123 19
1394 19 6 -26 -101 11 74 127 -127 -192 35 82 -1 61 -297 -106 197 -158 9 -95 -55 47 59 117 39 62 -222
1419 -222 56 -118 138 -96 -131 -205 -466 -292 -63 408 254 57 -249 242 330 -204 358 47 73 -91 -129 578
1441 578 -74 -197 152 -168 179 -95 -118 -105 -229 37 66 -252 230 -225 -8 -160 -197 460 169 -236 -21
1462 -21 -98 133 -104 236 367 -384 20 -185 269 -71 -113 -203 -244 -339 176 -13 -13 24 143 88 -55 -123 -40 46
1486 46 -56 19 -274 -75 -189 71 -30 -248 19 85 223 -141 -11 102 245 50 -102 26 -206 61 -219
1507 -219 -64 -87 -132 8 -302 235 -244 363 122 -57 62 -263 177 87 -54 192 207 179 215 -134 58 -79
1529 -79 12 -33 107 130 216 2 41 206 -81 -274 -203 23 -54 -138 -21 90 249 163 -13 -51 130 -94 -30 -63
$$ packed form
1371a76L07qJ52m44J65K1j57L79l22P8k26Q2J25L64k78P8l26N3r4K09P2O9j04
1394A9j3l2p5J12O3N3k54o5K27M7q3O2l58J91L03l55J67j04M0J02J2N8p8K3k84
1419b22K78j74K56k34l5p4k61J74K29M71j54j97l06M91Q8n34N62l11K6j64l8P07
1441E78o52j23L49l20L47k74k3J3j24K66K9l18M82m55K17j52l7O57k91m05K15
1462b1p7K31k37L40J31p51M04k05M54l40m2r0m1r5N15j89%L7J19n5j43o8Q3Q6
1486D6j02P5k93J99j14K60j01k18K67O6J38l64J30J13J43j95j52J28k32K67k80
1507b19J55k3m5J40l10N37m79O07k41j79J19l25M40r0j41K46J5k8L6l49J92j37
1529g9R1m5J40K3Q6k14L9J65k87j93P1K26p7q4J17J11J59q6j76l8J81k24O4l3
$$ plain form
1553 -63 9 -409 132 -62 84 308 34 -201 157 84 169 98 80 -64 20 -104 -27 -260 23 -25 -65 188 162 238
1577 238 -262 -10 234 56 162 -195 -4 98 13 -396 -51 -28 310 -27 -12 -53 44 207 -76 116 -72 275
1599 275 -56 102 -277 1 -2 74 85 102 -103 -104 183 -144 -239 -68 -150 -78 128 269 26 26 184 -30 234 -147
1623 -147 17 -11 -244 -110 15 -105 198 -153 8 -192 -60 12 -194 -280 -124 6 456 -128 170 169 -206 10
1645 10 -305 138 -186 -15 -53 264 -57 307 -67 -258 -384 50 427 -34 -25 4 -256 -117 126 94 -234 -14
1667 -14 147 118 -191 48 100 -157 -3 224 -83 8 -49 -12 88 -194 -93 44 307 -35 -181 11 6 -11 151
1690 151 -64 -106 125 -67 71 -57 -85 -33 77 322 -10 -158 47 210 104 -180 -48 116 -171 145 -86
1711 -86 122 28 132 -12 28 329 -281 -135 189 208 -148 -223 41 96 -22 171 -105 170 69 -6 64 -138 232
$$ packed form
1553f3P2m18N41j94J46K24k74k35L58p3Q5p1j8j44Q4j24P7k33K83m8m0K53k6P6
1577B38n00K52K44j78J06l57J91J02q5m09L45K3L38l37J5m1R7J63k83J92j88L47
1599B75l31J58l79K78lP6J1J7k05jK87l27r5J71q2P2K06J41k43%J58k14K64l81
1623a47J64k8k33J34J25j20L03l51J61k00J32P2k06q6J56J30M50n84K98jl75K16
1645A0l15M43l24J71l8L17l21L64l74j91j26M34L77m61RK9k60J39K43l2l28K20
1667a4J61k9l09K39N2k57J54K27l07R1n7L7J00k82J01J37K63l42j46J92nj7J62
1690A51k15m2K31j92J38j28k8N2J10K45l32j48K05J63j06k84J32J64k87L16k31
1711h6K08r4J04j44M0L01o10J46L24J9l56p5K64N5j18J93k76K75j01p5P0k02L70
$$ plain form
1734 232 -3 -125 7 -163 3 153 9 162 -40 -73 94 187 -84 309 -74 -42 249 -89 -214 244 -129
1755 -129 -51 -206 -324 103 58 -161 80 -206 -140 70 11 103 -61 -161 -79 -58 99 -147 -276 -139 122 -103
1777 -103 7 -271 -112 -164 145 -109 180 -106 -344 -172 -24 19 186 -70 -65 140 293 38 51 116 -89 -157
1799 -157 -109 111 -189 12 77 -22 -11 -74 104 144 166 -62 52 403 203 21 -279 -22 66 188 125 -123 43
1822 43 -70 59 158 115 167 -55 -66 163 129 117 88 -69 -222 297 -147 18 50 -30 86 241 294 170 100 -222
1846 -222 4 78 -299 90 10 -251 -100 72 9 -33 -2 -78 18 446 119 151 242 78 119 -138 -50 -127 133 -243
1870 -243 41 -141 -54 -72 -65 -31 385 -270 195 128 20 93 133 32 -28 48 179 -57 76 -399 -235 150 62 179
1894 179 -30 155 -81 98 109 15 26 -171 66 -22 -257 150 2 232 201 -59 69 -109 125 79 -190 -295
$$ packed form
1734B32k35j22J32j70J66J50j44J53k02l3J67R3k71L93l83L2K91l38j25M58l73
1755a29P8j55j18M27m5k19K41k86O6K10n9R2j64j00Q2K1J57k46j29J37K61k25
1777a03J10k78J59n2L09k54K89k86k38J72J48M3J67k56NK05J53k55J3O5k05o8
1799a57M8K20l00K01O5r9J1o3J78M0K2k28J14L51k00j82l00K57Q8J22o3k48J66
1822D3j13J29R9m3N2k22j1K29l4j2k9j57j53N19m44J65L2q0J16J55N3j24p0l22
1846b22K26P4l77L89q0k61J51J72o3m2L1p6R6M28l27L2R1j64M1k57Q8p7K60l76
1870b43K84j82Q7j8PL4M16o55M65o7j08P3M0j01o0P6J31k36J33m75J64L85q8J17
1894A79k09J85k36J79J1r4J1j97K37q8k35M07j48K30l1k60J28j78K34m6k69j05
$$ plain form
1916 -295 -109 92 -329 -6 37 167 95 -147 291 95 18 275 171 370 -182 136 98 -111 -123 51 -148 -257
1938 -257 -46 143 61 -12 -212 -256 137 -185 -104 281 57 -344 217 15 2 -10 158 -114 6 22 222 -82
1960 -82 -217 -18 -197 173 117 75 -386 25 -23 37 -94 -131 197 -43 197 -199 147 -195 64 120 53 -92 -53
1983 -53 -288 -249 26 -127 116 1 -149 -159 -12 -36 409 303 -568 -32 53 -81 168 642 429 -2 326 -232
2005 -232 536 -74 -13 -174 455 -164 -100 -292 -470 22 -150 30 2 212 -205 -12 -89 -213 -62 -255 70
2026 70 -139 -62 27 61 52 24 57 -85 44 63 -36 9 -28 -41 -40 -149 261 47 78 233 -34 -172 175 -182 -243 -152
2052 -152 239 121 -223 -61 -122 120 36 -89 64 66 -163 153 137 -176 220 38 -147 76 185 38 -153 216
2074 216 91 -174 24 257 -34 0 98 182 48 -182 -70 -136 243 95 -120 118 35 -23 -33 46 183 258 -224
$$ packed form
1916b95J86K01m21L23M3J30p2k42M38j96p7K57j04J99n52L18l8k09j2J74j99j09
1938b57K11J89q2p3k00m4L93l22Q1L85k24m01N61k02j3j2J68k72J20J6K00l04
1960h2j35J99j79L70n6m2m61M11m8O0j31l7L28k40K40l96L46l42K59N6o7j45L9
1983e3k35L9K75j53K43j15j50j0J47k4M45j06q71N36Q5j34K49M74k13m31L28n58
2005b32P68o10O1j61O29o19O4j92j78M92j72J80k8K10m17J93p7j24J51j93L25
2026G0k09P7Q9L4rk8L3j42J29J9r9M5l7j3Jj09M10k14L1J55k67j38L47l57o1R1
2052a52L91j18l44J62o1K42q4j25J53Kk29L16j6l13L96j82j85K23J09j47j91L69
2074B16j25k65J98K33k91L4R8Q4j34k30J12o6L79j48k15K38q3n8j0P9J37P5m82
$$ plain form
2097 -224 111 194 -17 174 142 -23 -139 58 304 81 200 -22 -189 57 -190 31 116 -121 -73 -120 2 -52
2119 -52 -7 22 -327 144 -6 54 -92 55 -224 -251 198 -108 182 228 -114 139 114 -66 173 95 343 -157 -62
2142 -62 261 -100 112 40 15 -240 30 166 -46 10 37 212 -60 -44 -78 74 -126 35 183 -97 72 118 178
2165 178 20 -27 -66 63 47 -84 -66 53 -141 -197 86 37 -204 28 102 -112 -131 95 54 -157 20 -262 -201
2188 -201 136 99 116 -46 -298 -13 -57 0 224 -8 -201 -64 134 15 155 -173 106 167 -134 131 -88 -201
2210 -201 -19 -99 46 -122 20 34 -130 41 36 -71 13 219 179 -51 80 -418 3 108 182 181 141 224 177 58
2234 58 113 73 48 -67 123 -55 65 -243 30 332 27 -127 -211 505 93 -264 413 203 305 -191 17 89
2256 89 -110 128 -290 -52 -166 -188 -215 103 -195 250 -16 34 -115 234 151 -87 -135 -44 -176 -162 55 100 -71
$$ packed form
2097b24L35Q3k11J91l2j65j16J97K46k23J19k22j67K46k47K21Q5k37M8m7J22n4
2119e2M5K9l49M71j50O0j46J47k79k7M49l06K90M6l42K53k5j80K39p8K48n00R5
2142f2L23l61K12p2k5k55K70J36k12N6K7J75k72J6l4J52k00J61J48k80J69M6O0
2165A78j58m7l9J29j6j31J8J19j94n6K83m9k41K32P4k14j9K26m1k11J77k82O1
2188b01L37l7J7j62k52K85m4N7K24k32j93J37J98j19J40l28K79O1l01K65k19j13
2210b01J82q0J45j68J42J4j64J71nj07Q4K06m0k30J31m98M21J05P4jm0Q3m7j19
2234E8N5m0k5j15J90j78J20l08K73L02l05j54q4P16m12l57O77k10J02m96K08P2
2256H9j99K38m18K38j14k2k7L18k98M45k66N0j49L49q3k38m8R1j32J4K17M5j71
$$ plain form
2279 -71 79 87 -52 16 -10 -184 108 -59 -43 101 49 244 -164 62 136 -71 29 -137 151 21 74 187 -240
2302 -240 101 -166 330 65 -9 106 -20 -203 -145 -42 133 61 271 -322 -204 -51 89 150 226 236 228 -106 51
2325 51 -35 5 -61 -60 -46 -170 -264 177 -308 -158 -114 126 -103 -189 37 -63 314 -74 245 9 217 -33 -287
2348 -287 64 34 -155 76 43 60 -24 17 -136 126 58 -179 33 41 90 186 -12 -149 -312 76 -198 141 149 95
2372 95 -95 206 52 -186 329 -127 -28 -79 88 -79 -132 -25 76 89 -268 -79 -33 -281 70 -152 41 154
2394 154 130 84 -44 27 13 -5 121 177 20 -46 117 206 245 -221 -120 -33 -23 -221 -122 88 -115 222 -44 215
2418 215 -143 -35 271 162 -14 -40 49 54 -180 -131 244 -13 93 -80 -96 160 125 -56 146 -264 -219 3 -119
2441 -119 -339 69 -9 -24 22 70 337 191 -236 -36 -77 63 -183 258 17 -75 171 -54 -269 -151 257 -271
$$ packed form
2279g1J50Qj39O8k6j74K92j67J6J44n2J95m08K26P4k07J00j66K88j30N3J13m27
2302b40L41k67M96k65p4J15j26j83N8J03J75p2K10n93J18J53J40O1P6J0ql34J57
2325E1q6M0o6JJ4j24r4M41m85J50M4K40k29q6K26j00L77l88L19k36K08k50k54
2348b87L51l0j89K31l3J7q4M1j53K62o8k37K12QM9R6j98j37j63L88k74L39Qn4
2372I5j90L01j54k38N15m56R9n1J67j67n3J07J01J3l57J89M6k48L51k22J93J13
2394A54k4m6j28P1j4j8J26N6j57o6J63Q9L9m66J01Q7J0j98R9K10k03L37k66K59
2418B15l58J08L06j09j76k6Q9Nk34M9L75k57J06j73j6K56l5j81K02m10M5K22j22
2441a19k20M08p8j5M6M8K67j46m27K00m1J40k46M41k41r2K46k25k15J18M08n28
$$ plain form
2463 -271 -139 -182 -25 137 19 -392 -120 72 -27 41 -47 45 -2 -72 -286 -131 114 281 14 -33 59 -24 -15 -249
2487 -249 89 120 -188 -88 47 -194 -136 -68 342 40 125 42 63 -212 299 67 -35 -150 -211 -161 -26 -47 -206
2510 -206 44 -331 -90 -68 -103 -138 -93 -34 126 -132 9 -77 59 91 -411 -71 -5 -110 -165 -38 -11 37 -94 32
2534 32 53 138 -38 126 -121 -63 176 40 293 -84 -38 -85 -25 -116 144 -55 -267 -112 378 -98 -6 77 -258
2557 -258 174 129 -252 -65 -103 3 -230 197 -153 -175 34 -77 -182 82 -206 62 -240 124 25 -220 79
2578 79 -12 239 144 316 -14 14 -170 -31 -35 -124 -190 -236 107 -150 22 143 2 -378 24 -175 125 -182 235
2601 235 -45 238 -48 -40 -160 35 -61 -85 -64 -259 -111 87 -30 46 176 -78 -34 -106 252 -104 70 -48 85
2624 85 6 151 52 202 49 154 -98 -115 73 -58 35 -21 138 47 149 8 -109 131 6 47 73 -53 162
$$ packed form
2463b71J32m3J57J62j18m11K72J92r9O8q8R2m7p0k14J55K45J67k67m7R2q3Rk34
2487b49L38L1l08J00J35k41N8O8M10l02Q5q3K1k75N11k32j02j15o1N0J35k1j59
2510b06K50l75K41K2l5l5M5N9J60k58J41q6J36L2n02L40O6j05n5J27K7M8j31J26
2534C2K1Q5j76J64k47N8K39j36K53l77M6m7O0r1K60j99k12J55M90m76R2Q3l35
2557b58M32m5l81J87l8J06k33M27l50k2K09j11j05K64k88K68l02L64r9k45K99
2578G9r1K51r5J72l30K8j84J39mq9o6m6L43k57J72J21j41l80M02j99L00l07M17
2601B35k80K83k86Qj20J95r6k4K1j95J48J98j17P6J30k54M4p2L58l56J74j18J33
2624H5p9J45r9J50j53J05k52j7J88j31R3n6J59r1J02j41j17K40j25M1K6j26K15
$$ plain form
2647 162 59 56 169 126 125 -118 -273 -255 31 77 51 29 -17 182 13 -54 35 41 182 239 -69 41 -157 -21 139
2672 139 -116 -38 149 -16 -21 -62 -165 138 78 89 -180 -100 -108 199 357 80 -264 120 98 -18 0 -114 -48 -116
2696 -116 -98 84 -66 101 -326 146 -74 -143 -209 99 -117 -121 -45 266 -67 -18 34 154 90 10 14 -1 77 -76 -199
2721 -199 -355 -245 -166 -34 12 -32 -133 155 -208 -14 -82 16 73 58 -108 -225 -252 -93 173 56 52 -76 -38 351
2745 351 -125 -282 264 41 139 -15 -51 -132 71 -175 102 70 98 114 43 161 187 60 83 265 -212 152 113
2768 113 -128 90 208 0 227 -266 31 -1 -56 -24 180 62 -10 20 197 -119 50 92 106 -10 38 -119 -40
2791 -40 -99 182 93 114 132 125 320 428 -56 -11 -27 -87 -186 -191 -74 42 9 -179 -91 69 75 -133 -103 -251 -120 -161
2817 -161 -146 -22 142 255 -31 92 -90 101 -46 11 144 -58 196 -293 30 49 259 194 -281 -346 -133 175
$$ packed form
2647A62j03lJ13m3jk43j55J8K86M6k6k2m6J99j69o7Q9OJ41N7l08J10j98J36J60
2672A39k55P8J87j65nm1j03L03o0J1k69Q0qL07J58k77l44L84k2j16J8j14O6o8
2696a16J8J82j50J67m27M72k20o9o6L08k16mP6L11l33M9N2J20o4q0Mj5P8j53j23
2721a99j56J10P9J32M6m4j01K88l63J94o8R8N7j5j66j17k7J59K66j17mj28L8L89
2745C51m76j57N46k23R8j54l6q1K03k46K77l2K8J6p1J18K6j27K3J82m77L64l9
2768A13k41K18J18k08K27m93K97l2n5L2K04j18p2L0J77l16J69M2J4j16M8j57P9
2791d0n9K81q9K1J8pJ95J08m84M5j6o0r9nJ17J16l3j88Q8J60Ok08L0j48J31m1
2817a61J5J24J64J13k86J23j82J91j47N7J33k02K54m89L23J9K10o5m75o5K13L08
$$ plain form
2839 175 14 11 -182 24 -15 204 289 -171 59 48 -94 17 31 200 -57 -78 -149 265 247 -5 -108 248 218
2862 218 -233 180 210 -52 53 -138 116 -24 -299 -137 38 -236 102 75 -301 355 -88 -142 205 189 -239
2883 -239 -59 9 119 -249 80 -369 346 -81 131 64 191 -142 -189 273 197 -72 -184 -97 134 -384 -137 37
2905 37 -185 -49 -13 -123 -140 186 22 13 292 149 57 -163 302 197 -244 -114 -219 46 -4 52 -8 128 -24
2928 -24 -110 126 337 104 -82 -91 185 54 84 9 70 153 282 80 24 187 67 27 -55 -31 -1 -91 -90 -80 68 -70
2954 -70 0 97 152 22 5 87 176 -166 -10 28 -43 8 26 -268 -68 10 17 379 295 213 83 227 -131 12 -178
2979 -178 168 212 19 299 87 -136 56 4 144 -28 -95 -29 -187 115 129 39 -109 -25 4 -196 -86 276 12
3002 12 -182 -56 152 -130 -78 -13 -11 -46 -369 57 51 105 82 -89 97 -149 -77 165 94 34 -93 -67 237 106 -150
$$ packed form
2839A75j61lj93K06l9K19Q5m60K30j1j42J11J4J69k57k1p1M14j8k52j03L56l0
2862B18m51M13L0k62J05j91K54j40k75J62J75k74L38k7l76O56m43n4L47j6m28
2883b39J80O8J10l68L29m49P15m27K12o7J27l33m7M62p6k69j12Q7K31n18K47J74
2905C7k22J36L6j10j7L26j64rK79j43r2k20M65j05m41J30j05K65n0N6o0J36j52
2928b4q6K36K11k33j86rK76j31L0p5O1Q3J29k02n6J63j20m0q2K4L0r0JJ0J48j38
2954g0P0R7N5j30j7Q2Q9l42J56L8p1N1J8k94K00P8PL62q4q2j30J44l58J43j90
2979a78L46M4j93K80k12k23J92n2J40j72o7O6j58L02J4r0j48Q4K9k00J10L62k64
3002A2j94J26K08k82N2O5Kl5l23M26oN4k3j71J86k46P2K42p1o0j27K6L04j31k56
$$ plain form
3027 -150 -29 -241 -23 98 -102 165 80 91 -31 -125 -113 -45 -195 56 201 102 459 39 4 -215 131 -22
3049 -22 -215 76 406 -243 160 -173 284 63 -31 -69 -9 5 -129 46 362 -20 -151 194 -203 -202 -69 199
3071 199 57 -84 10 146 -63 -26 -45 -239 -108 6 -52 -15 41 212 -191 246 141 -261 156 171 33 -180
3093 -180 -6 -38 107 246 114 -53 -133 46 -4 -7 -116 139 42 216 45 -24 239 -117 84 42 -322 -2 -227
3116 -227 67 74 177 26 -155 246 -135 263 -15 -126 -143 -352 -76 124 73 35 240 -2 245 -288 -30 213
3138 213 -1 83 55 -36 -12 -369 -28 -90 16 -31 -95 -347 -111 285 81 16 231 -41 -185 314 -210 97 236
3161 236 8 169 -138 -264 88 -102 208 69 -96 -169 -161 -151 -158 128 211 -62 8 76 -123 126 166 -269 183
3184 183 -43 7 -168 -263 -390 -5 125 -15 36 -336 58 45 -68 -20 -23 164 -218 106 -15 -135 -11 -279
$$ packed form
3027a50J21k12K18J21k00K67q5J1j22r4J2O8j50K51J45r9L57m20l5k19L46j53
3049b2j93K91L30o49M03l33M57k21r4l8O0J4j34J75L16l82j31L45l97JJ33K68
3071A99j42j41R4J36k09L7j9j94J31J14n8L7N6J71m03M37j05m02M17J5j38k13
3093a80J74l2J45J39j32j67q0J79n0lj09K55r7J74j71o9K63l56K01m2l64L20k25
3116b27K94PJ03j51j81M01l81L98k78j11j7k09K76K00n1l8K05k42K47n33K58K43
3138B13k14Q4k8r1K4l57L41o2J06m7o4k52K36L96k04o5K15k72j44M99n24L07J39
3161B36k28J61l07j26L52j90L10j39j65p3QJ0pK86Q3k73P0O8j99K49M0m35M52
3184A83k26N0j75r5j27L85J30j40N1l72L94j3j13M8lJ87l82L24j21j20J24k68
$$ plain form
3206 -279 44 -270 -103 178 -139 -73 -31 14 -34 114 293 -87 4 214 131 77 6 -22 -131 -153 63 103 -21 -274
3230 -274 -79 28 441 -123 -149 -218 -77 -338 -143 48 -33 -55 -141 -86 257 38 -24 -34 358 324 250 -92 130
3253 130 6 -197 290 10 117 92 73 211 -2 51 51 -94 14 112 47 152 10 155 -134 -55 -33 225 14
3276 14 70 92 -168 44 193 418 -19 65 -76 124 61 270 536 85 47 81 -119 -57 200 -2 -19 -52 72
3299 72 -108 -187 -139 -182 -75 -190 -167 -79 -168 35 -422 31 -269 -90 -76 -56 22 -181 -92 -49 -43 -279 -3 -318 -164
3324 -164 -86 133 -151 -182 214 185 -335 -39 -95 178 55 -39 -25 -184 -156 -71 301 -82 60 -274 118 -58 176
3347 176 -9 -157 -217 -202 -56 -18 -95 162 11 236 411 -304 -72 88 -183 40 42 -189 -47 89 104 156 -9
3370 -9 177 211 54 124 196 -51 33 -136 37 10 -93 -71 211 245 240 33 -116 460 -275 39 258 94 -58 -24
$$ packed form
3206b79L23l14J67K81l17O6M2M5m8J48J79l80R1K10q3n4p1k8j09k2K16M0j24k53
3230b74J95J07M13n64k6o9J41k61J95J91q1k2q6N5L43k19o2j0L92l4p4l42K22
3253A30j24k03M87k80J07k5j9J38k13N3%j45J08R8o5J05j42J45k89P9K2K58k11
3276A4N6K2k60K12J49K25m37Q4j41K00o3K09K66m51l8L4k00O2K57k02j7l3J24
3299G2j80p9M8m3J07j15K3Q8q9K03m57M53l00J79J4K0P8k03Q9M3Ok36K76l15J54
3324a64P8K19k84l1L96k9n20K96n6K73j23r4J4j59K8Q5L72l83J42l34L92j76K34
3347A76j85j48o0J5J46L8p7K57j51K25J75p15K32J60k71K23Kk31J42J36J5N2j65
3370iJ86L4j57P0P2k47Q4j69J73k7j03K2K82L4nk07j49N76p35L14K19j64j52L4
$$ plain form
3394 -24 66 146 366 -97 107 145 111 -38 -168 -99 -164 211 -39 30 26 -85 86 125 107 -175 -85 136 -73 -258
3418 -258 -60 137 -130 -244 224 90 -289 -21 87 -104 19 -29 8 29 63 -129 98 -152 -49 -252 33
3439 33 24 8 -64 -189 -19 203 -1 172 203 141 70 -141 140 124 -205 123 262 -161 -76 -12 5 -205 121 -12
3463 -12 131 257 -106 58 -39 -65 178 -40 -107 20 -89 160 273 -232 -8 -62 33 -138 -125 129 -23 68 6
3486 6 294 63 305 10 -250 -180 -181 -101 -271 269 -182 -50 309 -119 193 223 55 32 -95 -24 106 -129 -169
3509 -169 92 276 0 -57 -140 -56 13 -4 -58 -49 -204 190 21 -25 -209 -156 225 -194 -252 212 -272 201 -28 33
3533 33 44 -95 1 81 23 -198 -186 277 130 -170 -123 57 162 -2 -17 -141 327 -1 -7 -28 17 -154 -205 60
3557 60 115 -208 -348 -104 -192 -167 48 52 -404 12 -204 1 -219 160 128 76 -2 -9 26 -76 -54 166 -82 271
$$ packed form
3394b4R0Q0K20m63K04L8l4j49j30O9o5L75k50O9mj11J71L9j8k82R0K21k09j85
3418b58J98J97k67j14M68j34l79K68J08j91J23m8L7K1L4j92K27k50J03k03K85
3439C3rj6p2j25J70K22k04J73L1o2p1k11K81j6l29L28J39m23Q5O4J7k10L26j33
3463a2J43J26l63J64r7k6K43k18o7J27j09K49J13n05K24n4R5j71J3K54j52R1o2
3486FK88k31K42k95k60P0jQ0j70N40m51J32L59m28L12L0j68k3j27P1J30k35m0
3509a69K61J84k76n7q3Q4O9j7n4Rj55L94j69m6j84N3L81m19n8M64m84M73k29O1
3533C3J1j39R6Q0n8k21J2M63j47l00M7J80J05j64j5j24M68l28ok1M5j71n1K65
3557F0N5l23j40K44q8K5K15Mm56M16k16K05k20L79l2n2p8pL5j02K2K20k48L53
$$ plain form
3581 271 -120 138 26 -252 -121 120 -116 107 164 -42 -147 -16 100 -266 5 -231 71 -88 207 216 -8
3602 -8 103 -118 -224 94 15 -72 -16 -40 -67 27 -79 224 -26 -57 42 -106 -180 -28 -23 -50 -61 -127 -228 27 11 -21
3628 -21 267 -141 -58 -278 153 -151 -146 -61 300 217 -8 -44 -286 -45 -340 -98 15 198 -381 -125 -96 -115 64
3651 64 -272 142 85 -318 77 141 -270 -201 -89 163 -96 -83 -89 97 -6 -50 -75 10 -113 -84 145 -35 91 -20
3675 -20 307 51 125 144 -189 265 82 138 -111 136 -88 32 176 154 23 -108 257 -2 59 103 -87 -52 -54
3698 -54 -9 115 -13 176 192 -129 90 -39 1 197 5 -45 51 -264 -199 95 -58 85 15 -16 157 68 -156
3721 -156 60 28 -24 -212 61 -71 -34 86 229 49 -127 -12 127 -53 80 -36 21 109 -44 66 -118 210
3743 210 -22 225 -180 237 140 15 122 -179 151 17 -11 20 65 95 -71 8 -13 -8 -41 131 -173 119 2
$$ packed form
3581B71l91K58j12k78J31K41k36K23N7k06j05J31J16l66K71k36L02j59K95Rk24
3602hJ11k21j06L18p9q7N6k4k7R4j06L03k50l1R9j48p4J52Nk7j1o6j01K55j6l2
3628b1K88m08Q3k20M31l04NQ5L61q3k25l6k42K41k95K42J13J83n79K56K9j9J79
3651F4l36M14n7m03L95O4m11O9J12K52k59J3oJ86j03m4k5Q5j23K9K29j80J26j11
3675b0L27k56P4J9l33M54j83N6k49K47k24J20J44k2j31j31L65k59O1M4j90L5k
3698e4M5J24j28J89J6l21K19j29M0J96j92n0R6l15O5K94j53J43p0l1J73q9k24
3721a56K16l2n2j88K73j32L7J20J43j80j76J15J39j80J33j16N7Q8j53J10j84L28
3743B10k32K47m05M17r7j25J07l01L30j34k8L1M5L0j66P9k1Nl3J72l04K92j17
$$ plain form
3766 2 -187 122 86 76 -166 -116 -266 178 175 -112 -124 9 153 89 51 -13 20 -259 211 -172 130 -96 22 24 -25
3791 -25 -4 271 -231 93 176 -265 25 -1 -199 -89 -124 96 50 -158 -180 3 31 -145 42 -143 62 -19 141
3814 141 -39 30 -11 22 176 -272 -499 100 -15 -229 335 165 -135 -95 -122 -197 -153 -100 -36 -140 91 -163 20
3837 20 35 76 -77 -579 -202 -183 204 -173 -102 86 -180 -192 48 179 81 8 -155 34 53 137 221 83 -207 245
3861 245 -29 146 60 192 -140 78 -136 -271 -7 219 -154 148 -97 -178 14 -20 117 -129 64 176 -77
3882 -77 119 110 51 34 20 151 -15 -82 147 -93 -255 264 -90 -204 -124 -202 456 -54 -134 -176 -120 -175 -6 98
3906 98 -95 227 -127 141 -33 -133 287 46 296 76 38 -169 -269 -49 97 -27 -32 3 -17 -83 72 140 235
3929 235 -152 -87 46 -38 -173 80 103 36 -5 174 -151 65 -127 74 -77 33 -361 151 -81 17 217 342
$$ packed form
3766Bj89L09l6j0k42N0j50M44lk87j2J33J44o4l8o4L3k79M70l83L02k26J18Km9
3791b5K1K75n02L24Q3m41K90k6j98J10l5K20m6k08k2J83K8j76J87j85K05q1J60
3814A41j80O9m1L3J54m48k27N99j15k14N64j70l00M0k7p5M4N3O4j04K31k54J83
3837B0J5M1j53n02L77J9L87l77P1J88k66j2K40J31r8p3j63J89J9Q4Q4j38k90M52
3861B45k74J75q6J32l32K18k14j35K64K26l73L02k45q1J92l4J37k46J93J12k53
3882g7J96rn9j7j4J31j66o7K29k40j62N19l54j14Q0p8O58n10q0m2N6n5J69J04
3906I8j93L22l54K68j74j00M20k41K50k20l8k07j00K20J46j24nL5k0o6J55O8R5
3929B35l87O5J33q4j35K53K3o7m1J79l25K16j92K01j51J10l94N12k32R8K00J25
$$ plain form
3951 342 22 -20 71 -364 -107 -14 -48 -105 -50 -4 -117 -1 -50 -93 72 21 285 -186 -108 -7 -79 307 117 -50
3975 -50 28 -33 443 -49 28 104 182 -212 15 -425 -31 62 27 199 -21 48 -175 -196 205 212 -86 74 -15 196
3999 196 203 -68 -132 -16 -72 307 -155 -60 85 92 48 -56 184 141 -217 345 91 -33 -255 -25 -86 108 163 39
4023 39 -181 -114 27 85 287 -132 122 94 108 12 -279 -5 -47 -202 -93 -20 11 -5 137 36 183 -48 141
4046 141 10 34 -45 51 103 -97 -100 152 359 146 -64 -235 168 -14 234 -83 -7 41 60 -45 -192 31 248
4069 248 -133 174 73 -160 -74 -121 195 -75 32 180 396 34 -69 17 -345 207 -192 -54 -236 24 -113
4090 -113 327 -296 -143 -25 -38 -1 -173 142 -155 69 -100 -190 280 -72 -135 40 56 148 -2 14 -124 -45 83
4113 83 -52 97 -113 191 181 103 160 67 -246 -20 -25 -93 -5 132 115 -221 -156 285 313 -31 45 37 18 216 -96
$$ packed form
3951C42l20m2R1m35K57R3l4n7N5M6j13J16m9m3J65n1K64m71P8J01p2L86j90j67
3975e0P8o1M76m92P7P6P8l94K27m40L94R3l5J72k20O9k23k1M01Pk98J60q9K11
3999A96Pk71o4J16n6L79m62R5J45Pm4j04K40m3l58N62k54j24k22K30o1J94N5j24
4023C9k20O7J41N8K02m19K54k8J4r6k91K74m2j55J09P3L1j6J42j01J47k31J89
4046A41j31K4p9R6N2k00lK52K07k13k10j71M03j82K48l17P6M8J9j05j47K23K17
4069B48l81L07j01k33Q6m7L16k70J07J48K16l62j03Q6l62N52l99J38j82K60j37
4090a13M40o23J53J18j3L7j72L15k97K24j69r0M70l52o3J75J6R2j50J6j38P9J28
4113H3j35J49k10L04j0p8N7r3l13K26no8Q8J37j7l36O5M41K8l44P6qj9J98l12
$$ plain form
4138 -96 56 30 200 47 32 -110 -36 -95 102 66 112 -211 49 46 16 46 31 -73 97 142 153 -15 30 82 77 -38
4164 -38 -33 45 138 -233 81 -11 97 -58 -206 153 217 16 -123 164 -130 -6 279 69 -114 -106 51 56 9 -215
4188 -215 -71 -133 -282 -101 307 -126 131 -392 -63 155 -39 -141 85 116 15 -110 -170 50 77 -349 -46
4209 -46 -192 -83 214 24 216 107 172 204 51 -143 6 -130 -9 -232 -70 -12 64 23 97 -42 -315 -53
4231 -53 -14 3 219 -24 9 56 -211 56 -249 -27 -279 73 91 215 -58 61 233 7 48 -43 -63 37 20
4254 20 -146 -109 -35 -91 -109 62 183 182 87 -110 -82 -141 222 202 -132 35 -218 204 -75 -26 -148 -88 3 191 216
4279 216 220 -89 -314 -88 112 -187 181 91 -122 6 -140 -161 3 -147 49 -9 -127 -51 -108 -97 -11 130 -120
4302 -120 -193 -417 -56 -108 -23 13 195 57 -257 82 -310 -104 163 73 238 84 240 262 -164 -80 9 193 -33
$$ packed form
4138i6J52k6J70j53j5j42P4n9J97l6M6l23K60ll0L0j5j04J70M5J1j68M5N2nj15
4164c8NP8R3l71L14r2J08j55j48L59O4k01j39K87k94J24K85k10j83QJ57Nm7k24
4188b15J44o2j49J81M08m33K57n23L29K18j94j02K26L1j01j25o0K20K7m26L03
4209d6j46J09K97j90J92j09O5L2j53j94J49j36J21k23J62N8P6m1P4j39k73K62
4231e3L9J7K16k43L3M7k67K67l05K22k52L52J8J24k73J19J72k26M1r1k0J00j7
4254B0j66L7P4n6j8J71J21jr5j97K8n9L63k0l34J67k53M22k79M9j22O0R1J88K5
4279B16Ml09k25K26K00k99L68r0k13J28j46k1J64j50J96n8j18P6n7J1Q6J41k50
4302a20p3k24L61n2Q5L6J82j38l14L39l92K06K67r0J65j54J56K2m26Q4Q9J84k26
$$ plain form
4325 -33 48 -133 -117 -72 -41 -5 -74 -26 -51 40 -171 42 -32 124 9 138 42 -25 26 149 87 262 -15 265 -251
4350 -251 208 -87 55 -168 -10 27 254 -55 -147 134 -209 -136 177 107 94 87 -83 -308 132 -5 99 340
4372 340 -182 341 -66 17 191 189 -136 134 -290 -29 -162 207 45 61 176 71 163 -38 30 -101 -155 53
4394 53 87 -253 78 134 -9 -78 -6 194 73 -190 107 72 19 -33 -104 159 55 10 -45 174 -161 -33 288 3
4418 3 63 -197 7 -48 -120 60 64 232 4 -59 16 173 123 -58 42 -172 -77 -137 75 -5 -183 -172 -121 10 -72
4443 -72 15 152 333 -60 309 186 -153 -172 81 208 -28 -177 78 135 -150 45 -128 -198 7 -59 58 -52
4465 -52 136 181 -104 225 -5 41 -66 -93 195 -139 95 116 61 222 47 118 84 -33 11 230 133 335 101
4488 101 -61 -99 -70 111 -2 -248 -72 -105 357 102 142 -169 -116 -64 -91 275 260 -9 -13 158 111 -29 -57 80
$$ packed form
4325c3Q1j81J6M5L1L6o9M8k5R1k11K13p4J56j15J29r6o7N1J23o2J75k77K80n16
4350b51M59k95J42k23J58L7K27l09r2K81l43P3L13p0j3pj70k25M40j37J04K41
4372C40n22N23m07Q3J74kl25K70m24K61j33L69j62J6J15j05R2k01O8j31n4K08
4394E3L4l40L31N6j43o9P2K00j21k63K97l5n3n2p1K63j04m5n5K19l35J28L21k85
4418CO0k60K04n5p2J80MJ68k28o3P5J57n0j81J00k14R5o0K12q0j78J1N1J31q2
4443g2Q7J37J81l93L69j23l39j9K53J27k36j49K55N7k85J95j73p0K05o6J17j10
4465e2J88M5k85L29k30M6j07k7K88l34K34K1n5J61j75P1l4j17M4K19r7K02k34
4488A01j62l8K9J81j13k46J76l3M62k55M0l11N3N2k7L66j5k69mJ71m7j40k8J37
$$ plain form
4512 80 -244 11 -16 77 118 -140 -142 34 -55 23 -101 -121 -17 -160 -405 -37 -175 -251 258 110 73 50 345 248
4536 248 -270 -116 225 -243 -184 101 34 3 -174 -274 -114 -65 -35 193 -187 -17 258 -69 206 231 -2 204
4558 204 -126 -153 388 183 -274 -156 -42 28 87 92 48 16 -168 84 73 -272 -271 247 -105 11 110 140 55 -23 -485
4583 -485 150 -180 113 -4 53 -103 198 205 29 17 70 37 -241 148 91 254 272 260 22 214 -82 21 -65
4606 -65 62 153 0 -57 189 -197 88 -186 -207 142 -279 -215 1 -54 43 15 -11 38 -141 196 62 -193 -141 343
4630 343 98 484 110 -20 67 100 15 -220 -175 57 180 -109 84 -182 -33 212 -142 -166 118 13 44 126
4652 126 -34 -127 42 47 182 -17 20 -92 192 197 27 -125 85 32 -57 106 236 -354 -31 126 -80 30 154
4675 154 -95 -26 -34 125 129 -97 271 126 -203 -172 77 -20 -6 -176 -75 -253 19 67 157 -3 -81 -216 65 34
$$ packed form
4512H0l24K55k7R3M1k58kJ76q9P8j24k0J04j43k45L68j38p6N09j48l7k3K95r7
4536B48n18J54L41m68N9K85o7l1j77j00J60M9L0K28l80J70K75l27K75K5k33K06
4558B04l30k7N41k05m57J18J14P0N9Nm4l2j84K52j1l45JN18l52J16R9L0q5p8m62
4583d85O35l30K93j17N7j56L01Pj76j2N3l3k78L89n7J63J8j2k38J92k96J03q6
4606f5J27R1j53n7K46l86K85k74k1L49m21O4K16n5R7k8k6M9j79L37j34k55N2M84
4630C43k45L86l74j30Q7L3q5k35M5K32J23k89J93k66J49K45l54k4K84j05L1Q2
4652A26j60r3J69NJ35j99L7j12K84Nj70j52K10n3q9J63J30n90L23J57k06J10J24
4675A54k49O9qJ59Mk26L68j45l29L1K49r7J4j70J01j78K72M8R0j60p8j35K81l1
$$ plain form
4699 34 156 -82 239 -341 37 57 57 240 -125 -138 -51 137 -148 92 -17 -307 59 253 361 -137 -171 80
4721 80 -27 97 -21 31 -139 166 89 -209 43 -181 63 -174 120 -53 263 88 -153 -19 -351 -20 236
4742 236 -75 55 229 -46 325 257 240 -119 39 -2 -261 -24 64 229 196 -115 193 -146 -44 237 197 105
4764 105 192 14 53 -80 -176 -195 169 -112 175 132 -101 37 -150 -48 122 -26 -67 49 -40 -262 -70 -62 39
4787 39 -137 -59 207 192 168 -190 -144 24 5 280 -52 15 25 -267 118 29 236 197 9 -18 -28 162 -59 -248
4811 -248 -258 -53 199 -196 -62 -208 -92 -136 -51 2 136 52 -250 21 -36 -174 95 136 182 -67 15 -67 225
4834 225 57 218 258 -155 156 362 48 84 -172 339 -149 43 -54 -52 -88 -236 59 -3 -5 71 33 157 173 -205
4858 -205 -86 51 142 -103 -9 147 60 110 26 -36 -123 83 -63 83 -97 -6 84 -79 227 -162 40 -153 -148 -71
$$ packed form
4699C4J22k38L21n80L78K0%J83l65j3Q7J88k85K40j09k90L66J94J08m98l4K51
4721H0j07J24j18N2j70L05p7k98K52k24K44k37K94j73L16j75k41J34l32L31K56
4742B36l11J30J74k75L71o8j7l59J58m1k59K37Q8J65l3l11L08l39J02K81m0r2
4764A05Q7j78L9j33r6j9L64k81K87m3k33J38j87J02J70j48m1J16q9k22J92QJ01
4787C9j76P8K66j5k4l58M6J68j9K75l32O7J0k92L85q9K07l9j88k7j0J90k21j89
4811b48j0K05K52l95J34j46J16m4Q5N3J34q4l02K71n7j38K69M1M6k49Q2q2K92
4834B25j68J61M0m13L11K06l14L6k56N11m88J92r7Kl6j48K95o2kP6l8J24J6l78
4858b05J19J37R1k45R4J56q7N0q4o2q7K06j46J46j80R1R0j63L06l89K02j93NP7
$$ plain form
4882 -71 -135 112 153 -15 -305 89 44 -246 -91 -356 -79 -236 -174 17 8 -59 214 -29 -91 -27 -290 -73 -108 43
4906 43 155 -46 -257 50 -53 -182 -111 -241 -17 -95 43 -11 -5 -15 -37 180 144 147 -181 -34 -18 -133 -331 93
4930 93 63 -90 243 -168 33 57 15 -71 -177 -62 0 106 45 -106 -120 94 -272 190 202 -86 -208 4 -25
4953 -25 15 144 59 8 -57 70 120 -66 135 -222 -195 -17 125 -197 103 188 52 -102 -30 69 127 -7 -187 -84
4977 -84 -140 53 -49 -301 258 -155 -184 130 -60 -11 67 -91 45 -407 16 -102 -159 94 150 19 166 -52
4999 -52 -243 -53 320 205 -138 -70 -48 26 -30 -2 144 336 73 137 -44 31 127 37 53 136 -128 26 54 197
5023 197 -88 -13 73 5 52 -31 -35 107 -223 86 -27 130 30 51 -147 31 49 -34 -116 -207 147 190 -63 -110 -93
5048 -93 -184 -11 143 -31 263 310 70 -170 -192 -33 -119 129 5 33 -57 -68 -69 -191 -91 9 13 -72 -77 -226 73
$$ packed form
4882g1o4K47M1j68k90L94m5k90J55k65K77j57O2J91ro7K73k43o2O4k63K17l5J51
4906D3J12k01k11L07j03j29P1j30K24p8J38n4Oj0k2K17l6Ll28J47J6j15j98M24
4930I3l0j53L33m11K01K4m2q6j06J15O2J06o1j51j4K14l66M62J2k88j22K12k9
4953b5M0J29q5n1o5J27N0j86K01l57K7J78J42l22L00Q5j36j54P2R9N8j34j80J03
4977h4n6J93j02k52N59m13k9L14j90M9P8j58J36m52M23j18n7K53N6j31J47k18
4999e2j91J90L73j15l43O8K2P4n6K8J46J92k63O4j81P5R6r0J6Q3k64J54K8J43
5023A97k85P5Q6o8M7q3mJ42l30L09j13J57j00K1j98J78J8q3q2r1L54M3k53m7J7
5048i3r1J73J54j74K94M7k40k40k2J59q6K48j24K8r0j1jj22J00J00Mq5nj49K99
$$ plain form
5073 73 14 -30 158 271 62 34 135 -61 133 154 -141 244 41 -246 166 -11 141 -17 -146 -274 -127 225
5095 225 19 -29 -174 76 -15 -95 211 13 77 -180 -24 300 -30 -135 217 145 204 215 -54 -208 43 147
5117 147 -118 150 -120 151 -89 120 109 92 62 163 237 -25 144 -12 181 128 50 136 -178 -111 -124 -38 3 -13
5141 -13 -284 19 102 114 -213 -220 161 -67 -97 -122 -65 29 -2 80 75 48 -72 -44 63 10 229 -60 322 132 -212
5166 -212 -156 21 -247 123 274 145 -157 -23 -217 -141 10 -144 77 -1 -47 32 105 85 130 166 50 100 1 149
5190 149 -152 -24 98 125 80 134 121 206 133 254 -41 153 -222 277 57 -55 -26 182 -156 -280 -60 -308
5212 -308 53 324 183 75 -66 6 -52 98 -61 28 -132 -90 215 244 10 32 33 56 -129 0 -200 -161 21
5235 21 -61 -156 224 -37 -5 206 15 -138 121 -55 -173 241 5 -417 115 124 -4 -118 288 -179 -242 10
$$ packed form
5073G3n9m4J88J13k09k8J01j96J94K1k95L85k03k87M12j77J52j58j29j28J47L52
5095B25k06m8j45K50r1q0L06j98O4k57J56L24l30j05L52p2N9J1k69j54K51J04
5117A47k65K68k70K71k40K09j1j7l0J01P4k62J69j56J93n3p8Q6l14O7j3Q6M1j6
5141a3k71L03Q3J2l27pL81k28l0k5N7R4l1Q2nk7j20K8J07n3K19k89L82j90l44
5166b12N6J77k68L70J51j29l02J34j94P6J51j54K21p8m6P9P3k0M5L6j16N0r9J48
5190A49l01J28J22K7m5N4j3Q5p3J21k95J94l75M99k20j12K9K08l38j24K20k48
5212c08L61K71j41j08j41P2n8J50j59Q9j60M2L05K9k34K2JK3j85J29k00L9J82
5235B1q2r5L80k61L2K11j91j53K59j76j18M14k36m22N32Rj28j14M06m67o3K52
$$ plain form
5257 10 73 -157 -76 269 23 118 -121 3 60 -5 -10 104 10 -28 140 -18 4 37 201 285 -91 -106 -82 2 26 -111
5283 -111 -90 -87 243 -72 -111 -294 -250 -105 -69 -116 -159 3 -75 183 -329 -71 54 -214 83 248 189 -49 183
5306 183 -181 -126 124 -252 -4 -181 24 -185 -152 66 28 138 -14 173 -177 212 -13 -172 -103 -207 25
5327 25 182 136 208 63 5 -34 49 -163 192 141 99 190 -7 52 31 -32 96 49 109 -97 -94 -337 128 158 70 29
5353 29 -199 -142 19 -23 -74 -7 150 -12 -49 -93 -112 252 -100 -127 -70 24 44 -54 135 325 -23 -10 49 -145 16
5378 16 -109 65 91 150 -157 -143 12 -73 -142 -62 208 57 120 -17 84 256 -105 22 -76 -182 124 10 -353
5401 -353 153 99 178 87 63 -252 -22 144 -236 99 -124 82 276 176 -193 251 207 -67 -78 274 -38 -87
5423 -87 -140 116 -37 255 153 97 -214 -290 64 -295 131 363 -163 -201 -91 19 59 73 -199 258 84 -40
$$ packed form
5257A0O3k30Q1L45k46R5k39J24N7o5nJ14r4l8J68j58K2L3J64Q4l76j5K4Q4K4j37
5283a11K1LL30l15l9j83M4J45L6m7m3J62p8K58n12K58J25k68K97J65n9k38K32
5306A83l64N5K50l76K48j77K05k09L3K18l8J10j52J87l50L89k25j59O9j04K32
5327B5J57m6P2j45n8l9Q3k12L55n1m2R1j97N9k1o3J28m7O0k06Lk43M65L0q8m1
5353B9k28N7J61m2n1O7J57j62l7m4j9L64l52k7N7R4K0r8J89J90l48J3N9j94J61
5378A6j25J74K6N9l07J4J55q5o9Q0K70j51O3j37J01J72l61J27r8j06L06j14l63
5401c53N06n4P9r1k4l15K30J66l80L35k23K06J94j00l69M44m4k74j1L52l12m9
5423h7n3K56j53K92j02n6l11p6L54l59M26K32n26l8J10J10M0J4k72M57j74j24
$$ plain form
5445 -40 143 -270 -221 23 -43 -106 -42 78 84 -133 -76 147 -168 -140 -85 178 -2 -110 165 174 72 -266 246 97
5469 97 176 218 341 164 -146 -13 -105 -13 -99 -93 -28 365 -33 -180 -201 -15 -9 -40 45 154 144 -31 177 67 126
5494 126 150 -48 34 0 -100 94 -45 -42 41 37 176 271 -12 -271 207 51 6 68 12 -232 -1 -6 38 -93 -9
5519 -9 95 20 229 195 -74 109 -94 103 -54 -207 12 -59 34 -172 -53 -1 -165 118 -55 -104 -29 -129 22
5542 22 24 469 184 -103 69 260 -112 -87 -124 276 -120 87 241 -36 -47 -205 318 -81 -183 -52 -47 97 320
5565 320 -4 -43 106 -87 -43 202 95 199 -192 -106 48 100 -240 -108 -88 210 5 -23 -236 -236 174 -168 -26
5588 -26 -201 -146 -88 81 -30 3 -201 73 29 96 70 217 67 209 -154 260 -189 -61 -46 -63 89 98 -229 58
5612 58 -255 -49 -106 -230 -181 4 69 -109 37 -140 161 114 -228 -73 57 -150 78 -66 -269 124 -202 69
$$ packed form
5445d0J83m13M9K44o6o3O4J20Ok17N7K23l15K8N5K63j80j08K75Rj02l38N12j49
5469I7P9M2J23j77l10J33r2R2q6OO5L93l98j47k1J86Ol1Q5J09j0j75K08j10N9
5494A26K4j98Q2l4j00J94j39LQ3mJ39R5k83k59M78j56m5O2n6k44K31nM4j31Q4
5519iJ04p5K09l4k69J83k03J97j57j53K19p1R3k06J19N2j64K83j73m9P5j00J51
5542B2KM45k85k87J72J91l72K5l7M00l96K07J54k77j1j58N23l99j02J31NJ44K23
5565C20l24l9J49j93M4K45j07J04l91Q6J54N2l40J32K0K98k05k8k13%M10l42J42
5588b6j75N5N8J69j11L3k04K74m4O7k6J47j50J42l63M14m49J28J5j7J52Rl27K87
5612E8l13K06n7j24M9J85O5j78J46j77L01m7l42J55J30k07K28j44k03L93l26K71
$$ plain form
5634 69 55 -30 169 -242 32 252 -118 -139 -57 -100 86 31 5 -398 -227 78 -109 -205 418 40 -18 115 8
5657 8 -67 4 105 35 72 129 -48 199 132 -108 15 83 267 112 -235 108 -98 88 19 27 278 -206 361 60
5681 60 47 44 -245 -29 -4 7 4 176 -129 -287 -176 59 -72 -382 -386 -184 -222 68 -514 -105 -116 33 -107 37
5705 37 -191 174 105 167 163 377 88 -145 -62 277 -285 -29 306 -67 184 -77 -72 135 40 -47 161 -29 70 -111
5729 -111 199 49 26 -115 118 -308 -74 -41 129 32 -346 -52 -71 62 3 -158 118 -13 -77 141 108 41 -84
5752 -84 -37 86 60 -18 -97 31 -217 44 -25 213 36 24 69 406 -63 -186 1 -69 26 -131 63 82 109 74
5776 74 -14 -50 -29 -365 85 71 -16 250 -103 71 -22 99 -62 -329 182 111 -193 -164 185 -32 -26 166 3 -284
5800 -284 -226 -211 204 -151 24 105 -176 -162 44 -171 -262 177 -37 57 -24 -50 -92 -67 84 -60 26 -98 -150 -135
$$ packed form
5634F9j4q5J99m11K74K20l70k1Q2m3J86n5k6m03J71L05j87r6O23l78n8J33j07
5657Hp5P1J01p0L7N7j77K47o7k40J23O8J84j55l47L43k06J86o9QK51m84N67l01
5681F0j3lk89K16K5J1lJ72l05j58J11K35j31l10mK02l8K90n82M09j1J49j40J44
5705C7k28L65o9O2mK14k89k33Q3L39n62K56L35l73K51k61NK07r5q7K08j90R9j81
5729a11L10j50k3j41K33m26K34L3J70r7l78K94j9J33n9j61K76j31o4K18l3o7j25
5752h4M7J23k6p8p9J28k48K61o9K38j77j2M5L37m69j23J87p0R5j57J94J9K7l5
5776G4q8l6K1l36M50j4q7K66l53J74r3J21j61k67N11p1l04K9L49k17OJ92j63k87
5800b84N8J5M15l55J75Q1k81J4K06k15r1M39k14R4q1k6m2K5J51j44Q6j24n2J5
$$ plain form
5824 -135 -244 -75 -98 -254 145 167 186 37 81 -33 -293 181 8 116 97 170 -129 104 25 96 265 -65 43
5847 43 -154 82 68 59 -36 -73 -18 166 -7 284 -84 221 39 169 50 139 103 101 -240 -123 98 -109 257 -64
5871 -64 -6 -244 -138 363 189 -445 -67 47 142 -84 -161 245 150 63 237 -224 -202 -69 -180 70 -125 -83 -163
5894 -163 -63 -4 271 -104 170 486 113 101 -129 153 -126 24 37 -72 -106 225 -82 134 -12 -60 -51 106
5916 106 -302 117 138 92 -3 -63 92 10 40 179 -56 41 330 -100 296 -114 164 12 -100 231 92 -157
5938 -157 -18 -95 298 33 -96 -209 -81 -119 -31 168 -102 28 85 -151 -59 89 71 129 44 5 42 -31 279 62
5962 62 93 146 -118 148 48 -61 226 -327 -20 115 15 -38 211 -30 46 74 -160 243 -150 125 -11 49
5984 49 307 94 -303 78 -8 -31 -19 -294 135 -28 10 -240 257 41 -37 -2 -158 40 -86 -119 -2 146 27
$$ packed form
5824a35j09J69k3j56L99K2J9j49M4j14k60M74j73J08j9P3k99K33p9P1J69l30J08
5847D3j97K36j4rr5l7N5J84j73K91l68L05j82J30j19Q9l6kl41J17K21k07L66l21
5871f4N8k38J06N01j74o34L78J14R5k26p7M06r5q7J74m61K2J33j11K50j95M2q0
5894a63J00N9K75l75K74L16l73j2k30K82k79J50J3j09l4L31l07K16j46m8RJ57
5916A06m08M19K1m6r5o0J55q2L0J39k35R7K89m30L96m10K78j52j12L31j39k49
5938a57J39p7L93k65j29j13J28l8Q8J99k70J30N7k36R2J48j8N8q5l9L7p3L10k17
5962F2L1N3k64K66j00j09K87n53L07J35j00n3K49k41P6K8k34M03l93K75j36O0
5984D9K58k13l97L81q6k3J2k75M29j63L8k50M97k16p8L5j56J98j26l3J17J48j19
$$ plain form
6007 27 -101 6 181 -85 206 61 161 -150 64 -209 154 -19 159 -83 2 60 135 175 96 54 -192 139
6029 139 231 114 213 -23 92 161 -158 -247 -124 143 -187 145 124 57 140 -396 232 -52 -36 -54 -110 168 101 -232
6053 -232 113 144 195 487 103 25 261 137 71 -111 -117 -139 25 88 -57 283 86 66 -283 164 109 63 7 118
6077 118 -139 242 -197 -29 -62 -167 42 -41 -90 23 212 65 -197 -57 57 -152 127 50 -89 333 -85
6098 -85 59 -319 194 -17 -66 257 -14 109 -202 41 -113 42 -12 163 -169 -110 30 -172 59 244 -151
6119 -151 -125 16 -115 -15 -102 -146 152 -128 183 -219 238 38 14 246 -155 -135 -85 -52 -61 9 -249 67 92 -93
6143 -93 -56 172 -154 -302 -85 43 -209 -12 30 -186 -134 -88 -33 154 -221 -36 -345 -61 -50 -207 -142 158 -124
6166 -124 -143 -83 -57 101 -6 183 20 109 -50 -166 -85 -114 -97 -16 300 -72 321 -57 2 -137 65 -202 -283
$$ packed form
6007B7j28J07J75k66K91j45J00l11K14k73L63j73J78k42Q5N8P5M0p9m2k46L31
6029A39R2j17R9k36J15O9l19q9J23K67l30L32k1o7Q3n36O28k84J6j8n6K78o7l33
6053b32L45L1N1K92l84p8K36j24o6j82ok2J64O3j45L40j97k0l49M47n5m6n6J11
6077A18k57L81m39J68l3j05K09q3m9J13J89j47k62J40J14k09K79p7j39M22m18
6098h5J44l78N13k11m9L23k71J23l11K43j54J55n4J75l32N9J40k02K31J85l95
6119a51K6J41j31J00q7m4K98k80L11m02M57k00k4K32m01K0N0L3rP0k58L16K5j85
6143i3L7K28l26j48K17J28k52J97M2k16N2M6N5J87l75J85l09K84J1j57O5L00k82
6166a24j9O0K6J58j07J89j63Q9j59j16Q1k9J7Q1L16l72L93l78N9j39K02k67q1
$$ plain form
6189 -283 19 -348 70 -79 -193 -214 97 31 184 12 -203 52 4 29 -115 36 175 -102 -234 -111 -70 99
$$ packed form
6189b83L02l67M18j49j14k1L11o6J53j72k15K55m8K5j44J51J39k77j32J23M1J69
$$ [...]
8191g1
##END NTUPLES=NMR FID
##END=
