##TITLE=1H_CA-8681
 CDCl3, 8 sc, 
 29.1.2020
##JCAMPDX= 6.0         $$ Bruker NMR JCAMP-DX V2.0
##DATA TYPE= NMR FID
##DATA CLASS= NTUPLES
##ORIGIN= UXNMR, Bruker Analytische Messtechnik GmbH
##OWNER= root
$$ XWIN-NMR		Version 3.5
$$ Wed Jan 29 13:58:28 2020 Russian Standard Time (UT+4h)  she@DPX200
##.OBSERVE FREQUENCY= 200.1315
##.OBSERVE NUCLEUS= ^1H
##.DELAY= (6, 6)
##.ACQUISITION MODE= SIMULTANEOUS
##.ACQUISITION SCHEME= undefined
##.AVERAGES= 8
##.DIGITISER RES= 18
##SPECTROMETER/DATA SYSTEM= spect
##.PULSE SEQUENCE= zg30
##.SOLVENT NAME= DMSO
##.SHIFT REFERENCE= (INTERNAL, DMSO, 0, 15.7039)
##AUDIT TRAIL= $$ (NUMBER, WHEN, WHO, WHERE, WHAT)
$$ ##TITLE= Audit trail, XWIN-NMR		Version 3.5
$$ ##JCAMPDX= 5.01
$$ ##ORIGIN= Bruker BioSpin GmbH
$$ ##OWNER= she
$$ F:/spectra/data/she/nmr/H-F/1/audita.txt
$$ ##AUDIT TRAIL=  $$ (NUMBER, WHEN, WHO, WHERE, WHAT)
(   1,<2020-01-29 13:57:33.67 +0400>,<she>,<DPX200>,
      <created by zg, POWCHK disabled, PULCHK disabled
       configuration hash MD5:
       00 E9 B6 7A A2 85 ED C7 34 08 36 98 17 FE 4E 26
       data hash MD5: 16K
       0C 16 7B 05 63 67 9D 47 96 25 95 3B 1D FB 49 5D>)
$$ ##END=
$$ 
$$ hash MD5
$$ 2B 48 26 7C 87 3E 7E 7D 7C EB 1E 08 1B 56 1E E3
##$RELAX= 
##$RELAX= 
##$RELAX= 
##$RELAX= 
##$RELAX= 
##$RELAX= 
$$ Bruker specific parameters
$$ --------------------------
##$DU= <F:/spectra>
##$EXPNO= 1
##$NAME= <H-F>
##$PROCNO= 1
##$TYPE= <nmr>
##$USER= <she>
##$AMP= (0..31)
100 100 100 100 100 100 100 100 100 100 100 100 100 100 100 100 100 100 
100 100 100 100 100 100 100 100 100 100 100 100 100 100 
##$AQSEQ= 0
##$AQ_mod= 1
##$AUNM= <au_zg>
##$AUTOPOS= <>
##$BF1= 200.13
##$BF2= 200.13
##$BF3= 200.13
##$BF4= 200.13
##$BF5= 200.13
##$BF6= 200.13
##$BF7= 200.13
##$BF8= 200.13
##$BYTORDA= 1
##$CFDGTYP= 0
##$CFRGTYP= 5
##$CHEMSTR= <none>
##$CNST= (0..31)
1 1 145 1 1 1 1 1 1 1 1 1 1 1 1 1 1 1 1 1 1 1 1 1 1 1 1 1 1 1 1 1 
##$CPDPRG= <>
##$CPDPRG1= <>
##$CPDPRG2= <>
##$CPDPRG3= <>
##$CPDPRG4= <mlev>
##$CPDPRG5= <mlev>
##$CPDPRG6= <mlev>
##$CPDPRG7= <mlev>
##$CPDPRG8= <mlev>
##$CPDPRGB= <>
##$CPDPRGT= <>
##$D= (0..31)
0 1.2 0 0 0 0 0 0 0 0.06 0 0.03 0 0 0 0 0.0002 0 0 0 0 0 0 0 0 0 0 0 0 
0 0 0 
##$DATE= 1580291853
##$DBL= (0..7)
120 120 120 120 120 120 120 120 
##$DBP= (0..7)
150 150 150 150 150 150 150 150 
##$DBP07= 0
##$DBPNAM0= <>
##$DBPNAM1= <>
##$DBPNAM2= <>
##$DBPNAM3= <>
##$DBPNAM4= <>
##$DBPNAM5= <>
##$DBPNAM6= <>
##$DBPNAM7= <>
##$DBPOAL= (0..7)
0.5 0.5 0.5 0.5 0.5 0.5 0.5 0.5 
##$DBPOFFS= (0..7)
0 0 0 0 0 0 0 0 
##$DE= 6
##$DECBNUC= <off>
##$DECIM= 24
##$DECNUC= <off>
##$DECSTAT= 4
##$DIGMOD= 1
##$DIGTYP= 9
##$DL= (0..7)
0 120 120 120 120 120 120 120 
##$DP= (0..7)
150 150 150 150 150 150 150 150 
##$DP07= 0
##$DPNAME0= <>
##$DPNAME1= <>
##$DPNAME2= <>
##$DPNAME3= <>
##$DPNAME4= <>
##$DPNAME5= <>
##$DPNAME6= <>
##$DPNAME7= <>
##$DPOAL= (0..7)
0.5 0.5 0.5 0.5 0.5 0.5 0.5 0.5 
##$DPOFFS= (0..7)
0 0 0 0 0 0 0 0 
##$DQDMODE= 0
##$DR= 18
##$DS= 0
##$DSLIST= <SSSSSSSSSSSSSSS>
$$ [...]
##$SUBNAM2= <"">
##$SUBNAM3= <"">
##$SUBNAM4= <"">
##$SUBNAM5= <"">
##$SUBNAM6= <"">
##$SUBNAM7= <"">
##$SUBNAM8= <"">
##$SUBNAM9= <"">
##$SW= 24.9337058887773
##$SWIBOX= (0..15)
0 0 2 0 0 0 0 0 0 0 0 0 0 0 0 0 
##$SW_h= 4990.01996007984
##$TD= 16384
##$TD0= 1
##$TE= 0
##$TE2= 300
##$TE3= 300
##$TEG= 300
##$TL= (0..7)
0 120 120 120 120 120 120 120 
##$TP= (0..7)
150 150 150 150 150 150 150 150 
##$TP07= 0
##$TPNAME0= <>
##$TPNAME1= <>
##$TPNAME2= <>
##$TPNAME3= <>
##$TPNAME4= <>
##$TPNAME5= <>
##$TPNAME6= <>
##$TPNAME7= <>
##$TPOAL= (0..7)
0.5 0.5 0.5 0.5 0.5 0.5 0.5 0.5 
##$TPOFFS= (0..7)
0 0 0 0 0 0 0 0 
##$TUNHIN= 0
##$TUNHOUT= 0
##$TUNXOUT= 0
##$USERA1= <user>
##$USERA2= <user>
##$USERA3= <user>
##$USERA4= <user>
##$USERA5= <user>
##$V9= 5
##$VALIST= <valist>
##$VCLIST= <CCCCCCCCCCCCCCC>
##$VD= 0
##$VDLIST= <DDDDDDDDDDDDDDD>
##$VPLIST= <PPPPPPPPPPPPPPP>
##$VTLIST= <TTTTTTTTTTTTTTT>
##$WBST= 1024
##$WBSW= 4
##$XGAIN= (0..3)
0 0 0 0 
##$XL= 0
##$YL= 0
##$YMAX_a= 187421
##$YMIN_a= -116218
##$ZGOPTNS= <>
##$ZL1= 120
##$ZL2= 120
##$ZL3= 120
##$ZL4= 120
##$ABSF1= 10
##$ABSF2= 0
##$ABSG= 5
##$ABSL= 3
##$ALPHA= 0
##$AQORDER= 0
##$ASSFAC= 0
##$ASSFACI= 0
##$ASSFACX= 0
##$ASSWID= 0
##$AUNMP= <proc_1d>
##$AZFE= 0.1
##$AZFW= 0.1
##$BCFW= 1
##$BC_mod= 2
##$BYTORDP= 1
##$COROFFS= 0
##$CY= 11.3945322036743
##$DATMOD= 1
##$DC= 2
##$DFILT= <>
##$DTYPP= 0
##$F1P= 16.9975609425685
##$F2P= -3.02152046262296
##$FCOR= 0.5
##$FTSIZE= 0
##$FT_mod= 4
##$GAMMA= 1
##$GB= 0.15
##$INTBC= 1
##$INTSCL= 1
##$ISEN= 128
##$LB= 0.24
##$LEV0= 0
##$LPBIN= 0
##$MAXI= 10000
##$MC2= 0
##$MEAN= 0
##$ME_mod= 0
##$MI= 1.114404
##$NCOEF= 0
##$NC_proc= 0
##$NLEV= 6
##$NOISF1= 3.799351
##$NOISF2= 2.8
##$NSP= 1
##$NTH_PI= 0
##$NZP= 0
##$OFFSET= 15.70392
##$PC= 1
##$PHC0= -9783.776
##$PHC1= 6.20081
##$PH_mod= 1
##$PKNL= yes
##$PPARMOD= 0
##$PSCAL= 0
##$PSIGN= 0
##$REVERSE= no
##$SF= 200.130013532006
##$SI= 16384
##$SIGF1= 3
##$SIGF2= 2
##$SINO= 400
##$SIOLD= 16384
##$SREGLST= <1H.CDCl3>
##$SSB= 0
##$STSI= 0
##$STSR= 0
##$SW_p= 3612.71676300578
##$SYMM= 0
##$S_DEV= 0
##$TDeff= 0
##$TDoff= 0
##$TI= <>
##$TILT= no
##$TM1= 0
##$TM2= 0
##$TOPLEV= 0
##$USERP1= <user>
##$USERP2= <user>
##$USERP3= <user>
##$USERP4= <user>
##$USERP5= <user>
##$WDW= 1
##$XDIM= 8192
##$YMAX_p= 0
##$YMIN_p= 0
$$ End of Bruker specific parameters
$$ ---------------------------------
##NTUPLES= NMR FID
##VAR_NAME=  TIME,          FID/REAL,        FID/IMAG
##SYMBOL=    X,             R,               I
##VAR_TYPE=  INDEPENDENT,   DEPENDENT,       DEPENDENT
##VAR_FORM=  AFFN,          ASDF,            ASDF
##VAR_DIM=   8192,          8192,            8192
##UNITS=     SECONDS,       ARBITRARY UNITS, ARBITRARY UNITS
##FACTOR=    0.0002004,     1,               1
##FIRST=     0,             0,               0
##LAST=      1.6414764,     0,               0
##MIN=       0,             -116218,         0
##MAX=       1.6414764,     187421,          0
$$ Real data points
##PAGE= N=1
##DATA TABLE= (X++(R..R)), XYDATA
$$ [...]
2084A095j753N91Q02j041j08J412o51j556J566N97j367n1R45j168J57J145k58
2101C57j537J060Q10j194J02O83q51j48J500q31j110Q36R70j277J88J027j219
2118f34m47J854m56j664J106J016j229K96R80j316o34J981l62j135L59J155j087
2135b17l17J208n19j003J795j95j411N85O75r38J06J268r93q96J155O62j210J09
2153a36O39r58P9R62p66q06J520K40j620L18J202j036q2J208n69j486J372R17
2171I98j644Q4J426j532K71J139p62r73J277N89j629L19J159q04l03J123n39j189
2189i90J202Q46j449K90Q85q01n32J472l90j448O12J137j035j41J091q64n26J336
2207F95k76j248O66R12j051K91P66j066m14J494m50j154K59J056j000K00J140
$$ y = [1095, -658, -67, 735, -306, -414, 998, 347, -1209, 357, 954, -413, -464, 481, -687, -530, 615, 357, -1180, -120, 690, -504, -402, 281, -570, -718, 782, -49, -1159, -323, 647, -630, -442, 585, -634, -1081, 773, 317, -1347, -241, 775, -454, -158, 822, -494, -1128, 853, 491, -644, -285, 870, -217, -534, 674, 155, -848, 947, 752, -659, -74, 601, -337, -231, 1037, 44, -852, 303, 965, -245, -136, 503, -455, -376, 586, -180, -986, 534, 774, -846, -528, 674, -362, -444, 764, 195, -1291, 81, 998, -646, -562, 864, -668, -397, 742, -20, -993, 284, 873, -756, -437, 722, -82, -385, 738, 199, -990, 212, 1058, -391, -101, 784, -17, -549, 923, 533, -915, -303, 834, -201, -342, 749, -115, -641, 695, 419, -829, -163, 749, -302, -11, 755, -311, -725, 769, 319, -835, -576, 480, -520, -320, 820]
2224H20r17r86J700j81j228N27P69j114j90J172m43q30J419L11j460K97Q97r95
2242d32J02J028q76q42J107N20j084L11R46j288L93Q88o03j112J206L26j168L36
2260b42Q88j035k77J417p51r15J059L90j016L22P44q14j67J009m25j025R93M60
2278F15r45j07J072r60n31J377j13r85L64J042q16j21N77m17n67J208n49j198
2296a054Q35Q86p52j41Q90r83k79J207j17j355P20P97q92l0J105j039l99J148
2314E47J13j476O72Q53p56j83Q99m96r82J116J05r68M88R08j143j06Q63m11p37
2333f94J168Qj028L19R12j100k40J073m64q89R56P44j485O00P51p62k24R15m14
2352A46j387J423N99j125j21J017r84j73J126o53j049J355O57j245J53P76o10
$$ y = [820, -97, -1083, 617, 436, -792, -265, 504, -610, -800, 372, -71, -901, 518, 829, -631, -334, 563, -432, -330, 698, -178, -1020, 87, 607, -477, -166, 780, -508, -115, 773, 170, -942, 264, 590, -578, -242, 646, -389, -666, 751, 0, -915, 144, 534, -482, -160, 584, -230, -397, 612, 187, -838, 155, 615, -330, -437, 635, -325, -856, 521, 408, -577, -213, 829, 13, -108, 469, 52, -515, 693, 144, -1054, -219, 667, -85, -226, 664, -319, -598, 609, 492, -863, -143, 654, -238, -268, 837, -202, -601, 547, 660, -816, -144, 709, -47, -230, 669, 173, -809, 307, 412, -556, -68, 840, -303, -409, 454, 43, -694, 474, 482, -546, -227, 685, -415, -655, 418, -46, -935, 21, 765, -720, -120, 631, -131, -355, 560, 146, -1241, 182, 781, -344, -465, 552, -432, -605, 521, -132, -1181, 174, 831, -414, -261, 515, -95]
2369i5l41J153m08j090N76P20r15L29M68p87j46R22k73r16Q28Q20j115k90Q79
2388C19n99j40O94J08j227Q60N10p37k00J006q05m60J362j63j199M78Q67r03k31
2407d60J069n63p07Q95L94q34l68J223q54j80J076r28n35J313J43j374N14P54
2425E78q23K34L60j08r07J065M44j238K21Q74q27m26J174n17r37J069L28q90l4
2444c60J021q86n2P87j51j411J201Q57j433j07J097o21m34J185l82j155J051O02
2462H09j340K87P23p46k59Q06J89j252Q18O89j035Q0O30o60l36J166k10j296N20
2481d17R97r13l0O60m59l15P33m2q44K77Q57o91l60J022l85o68R37J31j089L43
2501b56P89j022L30O89q45p04J173L39j202M68O87m34j77O03n79n27J126m6q40
$$ y = [-95, -436, 717, 309, -781, -205, 515, -400, -71, 397, -390, -536, 386, 113, -803, 25, 845, -270, -560, 319, -280, -420, 274, 382, -845, 15, 525, -212, -412, 594, -211, -671, 691, 528, -671, -193, 674, -229, -460, 609, 46, -661, 234, 628, -206, -574, 649, -205, -385, 691, -237, -772, 541, 684, -690, -176, 578, -245, -11, 349, 241, -666, 399, 843, -395, -174, 700, -127, -553, 621, 104, -833, 236, 564, -326, -360, 661, -225, -277, 510, 359, -1052, 149, 1006, -427, -534, 563, -58, -492, 693, 311, -844, 207, 809, -531, -244, 479, -267, -526, 280, 469, -783, 35, 724, -311, -231, 399, -261, -597, 569, 359, -937, -417, 580, -333, -363, 297, -162, -477, 256, 214, -630, -353, 504, -187, -547, 475, 90, -578, 359, 490, -599, -256, 533, -489, -159, 530, -315, -1019, 154, 493, -709, -241, 446, 12, -165, 438, -141, -668, 458, 412, -428]
2520d28m8R56n70k9N26k06j074J300L52j362L6J398q08m27Q13l35q97R75M32p78
2540a74n3Q04q25j44J020o71r55J034N63r50M3P52n83k98R93k34r25Q44N21r13
2560a51k38Q92q30j40J190jj196M76N72q05m8R41p11j55N84j43m89O9J057j287
2580d13K54L74k82n66J168j41r84L75P99o92k78Q76r85l73J348r7j269N81Q49
2599E44n37o50J185o23o28R08J66q40m1Q14q22l0R37k42q33J117J62q43O8M53
2619B65m61l95J076m81p28R68M80j203k2J216o66n87Q34k4j254J301L26r09k20
2638d84Q24l73p27J421l08j200P13O00r64j0J055l89p72J057k79r42M66J152j028
2657a88j62P38j06j006Q72L40j159K47R47n65k90R20m49o38P71R7o82L68N25m93
$$ y = [-428, -476, 480, -90, -119, 407, 201, -873, 427, 779, -583, -547, 851, 43, -384, 429, 94, -803, 172, 604, -174, -227, 577, -248, -392, 628, -43, -998, 36, 599, -351, -308, 444, -139, -437, 556, 322, -603, 241, 762, -151, -389, 503, -327, -467, 723, 722, -474, 2, 574, -231, -279, 662, -49, -204, 380, 237, -252, -183, 874, -413, -159, 215, -67, -633, 535, 394, -590, -215, 584, -108, -386, 490, -495, -868, 480, 383, -886, -305, 544, 7, -643, 542, -81, -709, 199, 365, -475, -516, 298, -524, -554, 383, 141, -692, 425, 587, -256, -188, 265, -196, -591, 485, 4, -724, 244, 724, -479, -501, 715, 49, -538, 296, 272, -982, 319, 645, -264, -484, 340, -33, -760, 661, 353, -847, -134, 466, -498, -508, 547, 158, -614, 443, 164, -778, -312, 840, -188, -350, 388, 282, -724, 148, 488, -671, -424, 523, -42, -332, 588, 139, -499, 272, 369, -313, 55, 580, 87]
2677H7l91Q81l89n44P14K18j041M79L61m81j04J181p80r02R51J98r79O92M84m89
2697A46k80N56k00p62J210k57r74M66N83n59k40M62L29j213J131K89q74k19J026
2716F20r30p9Q91k76r77Q88L75j115m5J181m71m80J014p02l09M20O40j076m3Q86
2736D12n07k18N74kj012R35O39j185J65M84j78m44Q25n07o02N31N38r10j35Q62
2756B65p53j6R91j54p99N57K90n29m2N48m82l31Q19q7q45L69Q02q57KO39k46p21
2778e80J026l3j028M60N52n21n60R81M0r02P77P3o92K43R11n62m84P81o05l67
2798d90P87J75q79M33O71q30j67Q59l23m09K11O90r42M0R67o15o70J008k19n90
2818b93N48K94o59j89P83n80j88O85k24n92K89P31p84K33P49n91o29O20K20j021
$$ y = [87, -304, 577, 188, -356, 358, 576, -465, 14, 375, -106, -210, 971, 191, -711, 240, 438, -541, 151, 635, 146, -134, 422, 222, -540, 670, 413, -561, -95, 488, -71, -311, 151, 480, -733, 398, 687, -187, -406, 620, -310, -389, 502, 226, -751, 137, 512, -603, -648, 533, 62, -418, 596, -106, -415, 5, 645, -431, -474, 412, -95, -313, 261, 259, -753, 182, 821, -364, -199, 285, 107, -337, 488, -19, -621, -90, 448, -462, -597, 265, -488, -504, 487, 333, -466, 91, 381, -148, -190, 358, -124, -455, 364, 277, -568, -199, 603, -254, -252, 387, 141, -580, 446, 413, -615, -155, 397, -124, -684, 297, 337, -565, 212, 285, -407, -164, 747, 185, -299, 482, -123, -490, 297, 472, -407, 26, 697, -133, -300, 559, 236, -173, 38, 728, -214, -174, 793, 178, -492, 516, 297, -293, 255, 549, -110, -299, 484, -96, -284, 401, 177, -415, -126, 605, -179, 54, 803, 212, -417, 203, 423, -598]
2838e98M97N43n94k64J032l85p85P23m9q57N41O28n34l73P49k52l03O18Q3q85
2858d65O17M01o73l18N28r5l42P52j31q57L02Q82n05m20N15k4n84M52K80m81k98
2879d64J013l86m65O08l72n40P76L27r79K12N42j52o74M88L03j000O48O09r30
2898d36J29P76o37m30J022k08o33L81O57r02k4P26l95l40M38J20p61O63N61r27
2918b20n15J014k52l70L68L18p49L07L42k3m90P74o12o60J118j03l82J69O44q17
2938a39k39P04N6q59N25L44q08K31Q02p34k99R50l91m90O62L13j205N47L62r5
2958B37n34Q14j29q79Q24L6p08K68P15n50n56P10j86n70P98M1j011K93P82n32
2978a37n32J260m70o33L84P98j134k9Q02l50n03Q93k22m16O35J53p17j0M51l19
$$ y = [-598, -101, 442, -152, -416, 616, 231, -554, 169, 120, -737, -196, 432, -102, -475, 274, 22, -281, 337, 420, -465, 152, 553, -120, -438, 90, -5, -347, 405, 274, -583, -281, 601, 96, -324, 191, 167, -417, 35, 315, -166, -464, 549, 163, -302, 306, -66, -606, 170, 497, -482, -270, 272, 120, -554, -66, 237, -763, -115, 494, -436, -307, 469, -168, -598, 424, 216, -417, -36, 621, -281, -305, 421, 26, -314, 124, 244, -517, 146, 707, -220, -735, 279, 27, -343, 25, 343, -406, -99, 243, 220, -270, 504, -108, -768, 350, 247, -135, 34, 678, -139, -378, 326, 382, -477, 48, 392, -416, -185, 617, -117, -416, 534, 143, -347, 315, 628, -577, -30, 332, 237, -297, 517, 388, -491, 333, 369, -339, -71, 644, 94, -462, 248, 62, -508, 290, 331, -680, -387, 395, -137, -669, 591, 121, -512, -128, 670, -464, -493, 309, -41, -544, 349, 127, -289, 346, 499, -218, -228, 223, -96]
2998i6n77O15J83o19M58M33r01P5J029n25k98K36J26j144P25Q42p68m00J115m56
3018E3o98P18K9o36L03Q57o97l04P59k06n27O40j95l82K29K90l70n93Q24J99o79
3039c86N35O7n69K99M89n03k53N80k98l88P82j26o77L66Q93o11o84P63j28n67
3059d16M35K92o75nQ98k92p02N07R2n82L48N52p08J3Q37n06m49M93K72p16M56
3080A44M77q59n8R85o24n43O68K02n66LQ32p00k34Q94k12j012P67k15l32M41L02
3101C60n67q1P04k38l62L70P9q49M06L66m76j35P69j96n13M44K93o41K65K71m50
3122a81l44R27k61l86K73Q5p39K63P63m58n10R14j35m90J07N20q70L68Q65q41
3142a30j89M15M2n73M12K50m03j92J070r74l97P48K0n51N52L74p62k7O82o08r0
$$ y = [-96, -673, -58, 125, -494, -36, 397, -504, -429, 600, 75, -223, 13, 139, -1005, -280, 562, -206, -606, 509, 53, -645, 73, 102, -534, -231, 626, -71, -375, 384, 178, -349, 291, 96, -286, -57, 233, -137, -730, 94, 293, -386, 149, 216, -353, -54, 435, -68, -321, 259, -39, -427, 355, 229, -448, -82, 811, 200, -484, 279, 151, -416, 19, 311, -364, -369, 529, 237, -465, 42, 134, -448, -100, 452, -256, -243, 594, 88, -361, 132, 404, -312, 144, 621, -238, -296, 689, 65, -478, 190, 392, -174, -171, 661, -39, -273, 621, 409, -603, 164, -51, -383, 58, 360, -207, -288, 416, 178, -184, 186, 265, -584, -178, 188, -288, -423, 346, 150, -363, 81, 374, -267, -2, 269, -181, -525, 402, 141, -245, 28, 113, -626, -363, 400, -58, -568, 346, 211, -279, -172, 348, -522, -154, 711, -130, -319, 96, 138, -435, -23, 227, -176, -368, 702, -272, -669, 79, 99, -452, 100, 474, -288, -315, 367, -241, -331]
3163c31M01K37l92k6N45p22J14P13m44l87N15L13r64L87O02r77J14P72j99p05
3183d34O26J7o31O08L01n85m83J054k81m81N20J68k89J62K73r11j20Q30j23n42
3203c21O30rm42K28N92p28n86J176k51o99Q24P6p08L77J68l28n32O89p5m76N77
3224A82M33r52L5N76l83m56R30k69l29M60J33p00K18O43n80o44Q17j61j94L00
3244E9L01p11R8O84m09m60N48P6k86J46M81o97k72R01j53n62N52k77k71M45J60
3265C53l98n43J075m82m30N30q3j19J58L95p08L0M01K69r42O69p9k99j98P89l94
3286fn84R66l70l13N69q8n20J32O30p99q4R14k41m62Q0M88o12J34N53r17J76P97
3308D43p8r05O32K44m98j38R87o24l36M96O3l88LP12j059J58Q81o05%j56L36m48
$$ y = [-331, 70, 307, -85, -111, 434, -288, -174, 539, 95, -292, 223, 536, -428, -41, 561, -416, -302, 470, 271, -434, 192, 209, -422, 186, 487, -98, -581, 473, 192, -289, 231, 399, 110, 272, 545, -366, -486, 344, 221, -321, 309, 300, -142, 86, 678, -50, -636, 540, 289, -410, 414, 490, -218, 159, 327, -1, -533, 156, 81, -395, 182, 615, -337, -302, 274, -109, -565, 365, 96, -233, 227, 360, -340, -122, 521, -59, -703, 114, -47, -241, 59, 360, -351, -253, 431, 22, -438, 110, 186, -100, 46, 527, -170, -442, 459, 306, -256, 296, 19, -252, 193, 353, -45, -588, 487, 5, -425, 105, 22, -97, 61, 456, -252, -222, 179, 448, -494, 175, 96, -203, -401, 388, -6, -590, 376, 6, -307, 262, 174, -346, -214, 416, -383, -467, 447, 206, -256, -176, 312, -300, -166, 387, -530, -354, 443, 365, -540, 92, 336, -162, -300, 687, 63, -273, 223, 286, -102, -99, 613, -446, -288, 593, -12, -12, -168, 168, -280]
3330b80L53J83l74k59Q14m27k64L34J52n48L84J62m88O8N06p7n10N61N5p62K45
3351a72N73n96j9O43j18n01M90k46k01J42L30o71K29N93m67k64J63K74m91K50
3371e9K51m92j99P25j6l72K39J74n87K29N18m58m83O97on66M98L65r44J97M78
3392A89l52L47r9j06n33M00M83q28O07K99l01k16L01Qm22O9M57m56k79J061o30
3413aj95L74Mm27J44P07r35K47L71k73l02L67L17n13o2L73l80k6Q89p43o38Q23
3435A21Km06K16K51l52m1N64k67k29L71j1l97j37O60l33K6K33j92l72M99J05n53
3457b42J08L43l32k55N29R2m86L15J97k91n4O90l56o09N68J15n65K96J50m71J08
3478a50O44l80n15O19L2p66O21J60m32j53M72j65m18P52J98q75L32K98l02j31
$$ y = [-280, 73, 256, -118, -377, 437, 10, -254, 80, 232, -316, 68, 230, -258, -190, 316, 239, -271, 290, 345, -417, -172, 401, -195, -214, 429, 311, -190, 300, 54, -147, -5, 325, -346, -117, 476, 9, -255, -92, 182, -309, -59, 192, -300, -499, 226, 210, -162, 77, 251, -336, -107, 411, -47, -530, 167, 161, -405, 93, 458, -486, -289, 189, -163, 184, 85, -21, -554, -154, 329, -499, 108, 407, 106, -110, 191, 199, -223, -154, 303, -153, -432, 629, -1, -196, 178, 182, -245, -101, 606, -329, -82, 289, 16, -286, 81, 398, -115, -177, 196, -184, -210, 679, -64, -702, 121, 123, -283, -67, 184, -168, -209, 355, 88, -141, 230, 219, -178, -315, 345, 12, 38, 271, 79, -293, 206, 311, -242, -134, 209, -123, -378, 151, 243, -243, 72, 269, -22, -76, 614, 258, -351, 217, 332, -233, 63, 213, -258, -150, 494, 114, -401, 218, 250, -516, 105, 265, -167, -320, 152, -13, -431, 321, 519, -356, -24, 274, -28, -159]
3498a59L70j93k47L86m9m40M52L61j000K24O18k94k24L55Rn79M5K62l11J4O13
3519B13k57l28N25j82jj47M92o63j60M94rm25M31J91k57l6N99k51n64N78k20n60
3541e37O88L81j014M25K36k27m89O75j31k28L10J38q15K43P06o63k16O50j4p31
3561f13Q52j24l43J39M38m28l99N09k2m6L87k18l40l2M64k99J68R2J77p10O27
3582B79j95j28J54K58l31j16L01L3k46J30J37o25K15L17j38k88N27L1l92J51P6
3603A50n2l66O70m65k60P43o1m95J13L47p6l05J59K4o62O50J33n85M57j4j18k90
3625c03M62J06n35K94L46o98K75K31l20K46P1n5m44N26J31n81K24K80l24p5N21
3646C78l21k80K69O9l00l43P71m40l15P65j11l99K80J58n46J63M75l78j28M23
$$ y = [-159, 211, 18, -229, 157, 108, -332, 120, 481, -519, -295, 323, 29, -195, 160, 169, -410, -365, -103, -414, -400, 213, -44, -372, 153, -29, -30, -177, 315, -348, -508, -14, -23, -448, -17, 174, -83, -119, 480, 229, -335, 243, 23, -537, 151, 532, -482, -57, 179, -48, -537, 138, 7, -221, 89, 227, -588, -345, 361, -302, -518, 132, 118, -613, 239, 115, -228, -89, 349, -79, -478, 31, 9, -37, 350, 132, -208, -240, 224, -75, 93, 185, 362, -348, 279, 84, -44, 110, 368, 37, -79, 222, 255, 9, 139, 276, -349, -134, 183, 45, -243, 284, 315, -77, 74, 150, 98, -268, 402, -63, -323, 420, 359, -136, -23, 324, 248, -57, 102, 126, -536, 114, 247, -338, 119, 105, -13, -303, 159, 265, -270, 24, 370, -328, -53, 178, -142, 104, 175, 120, -324, 202, 333, -248, -24, 256, -68, -143, 378, 57, -223, 46, 115, -185, -528, 243, -197, -512, 253, 142, -257, 23, 181, -365, -202, 273, -105, -233, 190]
3666A90J25o16K12L2j63K48J93o3p79O59L98n79J04K22k78j63J43N1j82M43Q0
3687B77j13k17K03l47M3N75m25k58M87M4n87M15j20o1j48M62l07m90R27j13o75
3708d28L16M96m84p2K18J69l96K93L07q00L71L91k76o07P65L9m59J32N2p9oO00
3730E42n94l04N86l86n6K04J68l04m0P11n05p2J12K58l62l3L72l70k01P16n14
3751g2k08N59K7o17M29j50J20l73O83m74l43N31p0j44Q1J70l31N9J64o1n1J72
3773A01k51j78J03O22n58L31j09J60o96N13p8k74J34N48l41m55P02k97n2j4L84
3794B95k22k16L35k10m2M54j18n92M06N3o14L95M08l62k27M83L5l86K63K16n74
3815b20k61P81l93j26N27l71k75M26j1l93J19N10k63l32O11k71m26N34J64o54
$$ y = [190, 315, -301, -89, -57, -220, 28, 221, 158, -621, 38, 436, -143, -39, 183, -95, -258, -115, -64, -246, 197, 277, 164, -53, 150, -197, -154, 421, -4, -262, 225, 269, -318, 97, -23, -84, -232, 230, -77, -567, 360, 247, -428, -112, 384, -100, -172, 46, 215, -181, 112, 419, -381, -10, 381, 105, -502, 263, 302, -157, -25, 27, -52, -58, 542, -52, -356, 230, -156, -212, -8, 160, -144, -184, 527, 22, -50, 62, 320, -42, -75, 297, -73, -274, 442, -72, -280, 279, 306, -311, 118, -32, 88, -285, 398, -76, -419, 112, 42, -102, -21, 149, -182, -123, 41, -20, -71, 101, -150, -328, -225, 397, -161, 170, 61, 221, -475, 38, -40, -314, -180, 368, 27, -428, 274, -23, -75, -89, 295, 73, -143, 192, -18, -60, 394, 276, -316, 90, 143, -471, -76, 332, -30, -257, 226, 261, -125, 138, 354, -220, -481, 300, -93, -219, 308, -63, -338, 88, 77, -316, -197, 313, 50, -282, 329, 58, -368, 166, 330, -324]
3835c24L21K05K7k92J32Q0k79K11Rk21m9M32k75M2K56j29m10K51N46o11J17J16
3857A55k30k98P42m08j58RN18k05j05K81q1l69O90k81l52nL32l88P7L22j77j90
3879a21J43M08p46M05J45k49m73M33J79n18K33K55k79P1K57m5k47N38m02l24M52
3900A15J62m03K67Qj86m44O96P9p67M48M17n37o2N34m66J34J48l7l47L75N1n5
3922A30k90K48J94k55K14n04N7L29K74m83J45%k60j26N45Lk76k25O16o08K9N73
3944C30k36l87M82o3l43J17K04l24J7K95K05p83L10M21n03K15K72l5o23N14l4
3965E1m82N65J05m12J04J17j50N8M84l06k79K32K37l59k25N19j44k47J53K76l93
3986i6M59k98K0j71K83n5m13N67K0p30N33M5j87q7j02L84l82K49L51o47L13L65
$$ y = [-324, -3, 202, 229, -63, 69, 149, -130, 81, 90, -131, -180, 252, -23, 19, 275, 146, -264, -13, 533, -78, 39, 155, -75, -373, 369, -39, -197, -188, 330, 125, 20, 301, 220, -149, 541, 260, -92, -97, 235, -153, -76, 246, 69, -121, 22, 430, -316, 89, 234, -15, -488, -55, 124, -394, -161, 94, -185, -114, 143, 98, -149, 389, -13, -337, 115, 277, -126, 141, 149, -37, -481, 215, 294, -473, -25, 392, -145, -207, 327, -139, -5, 143, 106, -241, 134, 185, 130, -160, 88, 282, 27, 241, -263, -206, 123, 397, -86, 59, 59, -201, -327, 218, 221, -55, -280, 336, -272, -243, 330, 94, -293, 189, 126, -217, -100, 104, -220, -203, 92, 297, -486, -176, 245, -258, -43, 229, 194, -429, 85, 51, -431, 134, 239, -173, -69, 48, -102, -44, 440, 134, -145, 87, 324, -35, -260, 259, 115, -132, 21, 297, -96, 363, 65, 85, -86, 197, 142, -271, 296, 316, -414, 119, 164, -23, -110, -212, 172, -210, 39, 390, -257, 56, 421]
4008D21n30j39M69j6k40l3L58m86Q9J86n15M47J28p4k77L13L19n96J08K65j83
4029A4k51K30J60m45M09j37k12J02K75r3k02M58k97j40L6L28o80L45M38k45k44
4050a51M34j82l36J34L44k97m9M06m43L20nk92o6J0L69k68j63K42k8l49M25R3
4072A48l12J0N79q30K14K24ko4n6P9j49M17R6l44n2J68n5l25K45K12l69P8M66
4095C78q2n27L42k60L8M67j51o18M73n4k45L38j21R2j20M10j54p00K94M98k00
4116I8m78N40k4m16K88K75k75k70N34j63l10J49o9k12K65K59l25J4L4M4l40P07
4138C25p4m69K31r8j14r5L36j37K00j43K92l53J88J35l74j3M54j29n64P26q6j96
4160D2q5J03J8j90M99l99j27N5K44p56M42K64l35OM92m13j35J87N3j11m4L51k30
$$ y = [421, -109, -248, 221, 205, -35, -68, 290, -196, -107, 79, -436, 11, 139, 65, -212, 101, 420, -176, -68, 197, 14, -237, -7, 153, -292, 117, -20, -232, -130, 145, 52, -150, 308, 11, -129, -93, 235, -445, -100, 338, 93, -151, 283, 101, -235, -101, 243, -54, -103, 303, -140, 180, 175, -117, -183, -173, 196, -72, -235, 7, -21, -370, 55, 148, -164, -154, 425, -405, -191, 33, 31, -33, -89, -10, -159, 258, 354, 10, -42, 126, 71, -254, -9, 203, -166, -88, 378, 296, -231, 111, -149, -111, 356, 205, -413, 60, 6, -239, 99, -22, 70, -50, 360, 206, -494, -200, 298, 98, -380, 160, 136, -280, 8, 283, 8, -262, 272, 109, -201, -52, -121, -333, -68, 191, -134, -120, -86, -42, -382, 325, 251, -218, 13, -85, -199, -294, 42, -95, 105, -38, 254, -99, 89, 224, -150, -163, 291, 162, -402, 324, 238, 42, -43, 60, 78, -112, 387, -12, -139, -84, 160, -596, -154, 110, -225, -219, 273, -140, -275, -88, -35, -146, -190, 161, -69]
4183f9J24L57n92n9L44j29k24Q1L17j6k73L18nn61M55J81m17J36M27o30K81J18
4205A64j20m01L93j09p9K92J29k70j30R8M1j40J84L68n74L05J06l29q3J9J53j03
4227h6J01N65o45m7K15r2k31L65K4l45J99R8j19k81M49k56n6L45J66o13j9O10
4249C47n94P5M67P0n17L85j16j92j63J01l58K34M88n57L66J53P0m30L5M95n90
4270b31J7M28l52L4Q5p2J31k19N73n99R1M10l64J25K93k62k01J5L20m63K74Q3
4292A16p7m51L54l2j05L2L13k91p4O69n72j54K79P6l46o8L58j13j09L43m9l82
4314b83%L46k9k23K51K00n65M51k19j23K32K51q4l48J91J1j59NJ34m08N44L2l39
4337a32K1K74n33M14J56l7j83k17M56k03j00J79j18k27K00M78n57n1M59l00j64
$$ y = [-69, 55, 412, -180, -239, 105, -24, -248, -167, 150, 134, -139, 179, 174, -387, 68, 249, -168, -32, 395, -235, 46, 164, 44, -357, 36, -73, -152, 140, 269, -1, -131, -33, 8, -132, 52, 420, -154, 151, 257, -72, -155, -136, 17, -86, 15, 580, -65, -112, 103, 11, -220, 145, 169, -176, 23, 121, 2, -279, 170, -86, -142, 203, 369, -244, -263, 347, -247, -172, 295, 365, -152, 233, 117, -75, -238, -137, -495, -261, 227, -330, 36, 189, 259, -171, -136, 359, -231, -214, 214, -138, -104, -19, -91, 40, -179, 394, -205, -114, 296, -68, 57, 350, 88, -113, -98, 222, -241, 33, 116, 39, -412, -58, -90, -195, -163, 150, -141, -215, 454, -118, -272, 7, 83, -263, -331, 27, -86, -195, 148, 99, -283, -283, 63, 34, -189, 62, 262, -303, 148, -71, -194, 38, 289, 205, -143, 48, 59, -100, -95, 39, -369, 175, 207, -132, -111, 163, -370, 44, 200, 163, -20, -237, 219, 16, -84, 95, -23, -250, -50, 428, -129, -180, 279, -21, -185]
4358a85K69p7m0L47j93k13N2L28l77j40L45N9l25J06J32m16J47J81o8QL73k32
4380H1l32K6L30k43k69N06m7m31N12j26l50L70J11l10r8L97j21k97L72o3j96K57
4402G9J02k32j3M92m59O6L72m06k54K00N98n05j10J83j32m30N34K49q10O59P8
4423B61k08l54O39l32R1nK36o96L79K13l88J36J69j85r7J28Q3j47J35K73n18n5
4445b42L86l20ML91j42n6j72L51l22k04N91l89k34N17Q0k47J1J41L8k03J37j37
4467b1n0J42P9m64K78o9K23l75L61l7j08q1M91m37j36M37l72j38L28Pk03J20K22
4490A97k37j07L6M10l50L37J9m73M00k51j8o4K21l16J22N12r9l21j06L26k42J36
4512A32J35k79J14J51m68m15O57J23k66p5K80J20m79K20J62M7j57J57k70q8L71
$$ y = [-185, 84, 7, -33, 314, 121, -92, -40, 288, -89, -229, 116, 175, -150, -44, 88, -328, -181, 0, -68, -60, 313, 81, -251, -225, 105, -138, -407, 99, 52, -379, 133, 7, -343, 27, 138, -172, -270, 127, 6, -291, 81, 18, -178, 79, 181, -51, -64, 428, -31, 35, 407, 1, -253, -53, 545, 40, -70, 113, -19, -449, 85, 334, -476, 183, 261, 53, -301, 338, 6, 97, 92, 328, -368, 11, 224, -164, -28, 141, -44, -141, -13, 70, -77, 58, 331, -187, -242, 144, -176, -172, 219, 77, 21, -151, 200, -122, -326, 265, -124, -358, 159, 239, -8, 3, 144, 182, -21, 116, -21, -71, 71, 150, -314, -36, -105, 118, -257, 104, 67, -41, -122, 369, -68, -204, 233, -139, -277, 51, 58, -145, -25, 197, -40, -147, -111, 299, -51, 286, 305, -168, 232, -19, -37, -101, 120, -196, -74, 438, 339, 18, -88, 238, -4, 132, 267, -12, 102, 253, -215, -630, 27, 150, -116, -191, 89, 209, -270, -50, 112, 159, 2, 159, -111, -199, 172]
4533A72r5l48K61j24L3O8J37l25MN05m79Q0L04k90J21M5J79l01j09K81pr9j42
4556a29N17o07K45L40k40k45k78M60k15K28j59oM0M10n68l0K92j36j29L93n1j29
4578Ck0J23k2l80L92j94k5k09L28l20N5J72j68J76J49o0j58M34j75l39J73N91
4600E26n40k44M68l7l98J42K76k72j23K74j48k46L6M20k56K85j21l51L54j08L81
4621C18m35M87n4n48N3M14J54l90O3L8j43J24k5k22r6N09j74m71K57K86l61K27
4643A1J39k35M9L29l63L5o2R6m6L02j75j95J52j05J68l50K51J73l41m9L09k83
4665a90J27M72m91j29M93j65r3k95N29m27J45K9Q3l63L08Q6l59K81Q5k55J63J22
4687A56ll07M55N3n19J93lJ99l65K01j07j84L20j79m5J49J77k10j95M63K8k57
$$ y = [172, 77, -271, -10, -134, -101, -33, 104, -221, -217, 288, -191, -111, 193, -97, 24, 69, 248, -53, -162, 119, 112, 13, -129, 388, -219, 26, 366, 126, -119, -397, 63, -152, 76, -83, -89, -49, 361, -207, -237, 55, -81, -210, 183, 132, 3, -17, 106, 84, -296, 96, -98, -123, -332, -4, -324, -269, -97, -265, -89, 60, 0, -158, 276, 101, -238, -65, 526, -14, -258, 210, 173, -225, -83, 193, -79, -202, 72, -76, -322, -286, 134, -122, 163, 42, -309, 45, -63, 318, -117, 370, 316, -232, -179, 235, 389, -1, 62, 100, -43, 81, 56, -166, -262, 247, 73, -398, -141, 145, -216, 11, 150, -85, -36, 293, -70, -35, -97, -1, -47, 255, 80, -115, 37, -68, 100, -250, 1, 174, -167, -216, 93, -190, -63, 409, -82, -211, 282, 117, 24, -271, 258, -169, -24, 5, 88, -275, 33, 119, -240, 41, 126, -129, 34, 156, 153, -154, 301, 354, -165, 28, 25, 224, -141, 60, -47, -231, 89, -90, -135, 14, 191, -19, -214, 249, 277, 20]
4709B0j55M82m11l4L99k71m89O13J23m02l17L04N4j87M16q8m98N21J15l31J92
4730E6R8l10L72J1k42J1N2J9k97J81L08k87Q3L19k99r9J52Rk46K02J37l93K80
4753A17J12j49l44N72j11J7l02J45k21P8L89l52j35M6K51l30K69l4k1j68M46n96
4775c21q9N41j75j73J08K40l33K72M56m55j27j17M68m99P4K45r7j59K31L7l31
4796b04K77J9O8j48J00k30p1L90j91j61L57l9n0k34kJ30j80J10R9o70R30k78j97
4819a75m7O81o00J5K05M1l49J21J73j96j45L15R0l23K49j34k5L93k14n9j11K64
4841A69r7l80J62J53n7r8O76o23k15M91j45k65L13N0k28O3J89l54J15L16n9l26
4863a50m7K58l93K33L51k42j92M10l52j18L96j54Q1o9k00N1L28n1j40J9QQ2l29
$$ y = [20, -135, 347, -64, -98, 301, 30, -459, 154, 277, -125, -442, -138, -84, -271, 145, 57, -441, 80, 195, -136, 56, 154, -156, 216, 227, -15, -4, 48, 67, -230, -49, 259, -28, 55, 374, 75, -24, 128, 137, -109, 93, 230, -163, 117, 229, 80, -264, 308, 197, 214, -88, 57, -164, -86, 303, -49, -184, -138, 113, -217, 52, 18, -3, -171, 275, -321, -410, 131, -44, -217, -109, 131, -202, 70, 526, 71, -56, -173, 295, -204, -130, 115, 18, -141, 90, 127, -204, 73, 92, 160, 12, 112, -118, -189, 201, 10, -151, 206, 167, 117, -117, -119, 11, -169, -59, 40, -630, 300, 22, -175, -222, 459, -141, -126, 79, 120, -229, -108, 65, -131, -276, 39, 129, -194, 55, -79, -104, 289, 75, 16, -95, 169, 72, -308, -146, 7, -50, -148, 528, -95, -310, 181, 36, -229, 84, 134, -94, -31, 158, -196, -81, 235, 176, -150, -197, 61, -332, -99, 252, 10, -182, 228, -124, -242, 154, 0, 81, 12, -188, -137, 191, 140, 0, 19, 27, 109, -220]
4886b20L83K37k45j56m5Q6j84Q6K57p2m92M39Q0k47L84l51K5o0K46k82j73J67
4908a37K98l82L74J86m31J01K35k14N4q2j23K06J38ko53L83J21j52r7L33l85L79
4930A50j25J83l58M6J77j28O9J84j37l92M56N7o49K51L42r6k44M80j59j65Q5M6
4952G3j97M05m4k41j25K33lk26K13k2j44n3j18L10j31K85j87K4j39M89q83K10
4974b71J05K12k04K51J39j57k56K07m07L85K09m80J08L18J81k15N6q5q8m3P7J7
4996E9m47O27K7n10N3L19k8j05L20n77j19O31N1l54O0O5j37K27p9R2m5k91K19
5019E8l10L31J01k72o4J56mmr6L03m93M95J63k85k40M04k79j00L87n3k37k34K79
5042Fj30L08j5k03j08J13q3j89L37K47l52p9J38r8K6Q2N60o42K5K47j62J62Qj6
$$ y = [-220, 163, 400, 155, -1, -46, 40, -144, -58, 199, 127, -365, 74, 154, -93, 291, -60, -35, -95, 151, -131, -304, -137, 161, -221, 153, 339, -92, 9, 244, 30, 84, 2, -121, 85, 223, 221, -432, -49, 72, -80, -177, 156, -229, 150, 25, 208, -150, -104, 73, -55, 14, 198, 61, -331, 125, 182, -467, -216, 126, 30, -214, 266, 107, -58, 27, 73, -124, 281, 237, -4, -129, 104, 101, -125, 88, 66, -78, -131, -249, 61, -70, 215, 28, 52, -87, 402, -481, -271, -166, 46, -158, 93, 232, 75, -181, 26, -381, 4, 213, -267, -159, 159, 340, 125, 181, 96, 8, -35, 42, 59, -388, 239, 266, -244, -191, 128, 100, -5, 315, -262, -381, 250, 301, -53, 7, 72, -65, 162, 83, 175, 130, -161, 58, -252, 79, 180, -92, -156, 0, -4, -8, -104, 199, -294, 201, 364, 79, -161, 243, -36, -136, 251, 198, -39, -273, 6, -124, 184, 169, -34, -142, -29, -112, -301, 36, 283, -69, -148, -10, -108, -82, 0, 560, -82, -57, 190, 28, 190, 198, 182]
5066A82m94N70j80j44J36n0L58k15k73L0l40L29K14r1k42K89k39Q2J45l29K31
5087c1M31l90n5RO6J71k33K04k85k01L25r5r9J83K45j36l28K36J20l44K71j16
5109e2p1K82k81K46k03M25l25J2N9K68j87j28L67m51j28j02K65J94k15L61l59
5130b3j70M54m28J0K31j9j09j09J39J61l25L38j22j01O1L3k49%M02q2q7Q4l7l20
5154b68K55J48m52K85N8K0q0R7m1J30o6J2p7K1Rl61KL00j95K06RQ5r2k17K79o7
5180@p2L7J28J44j95J15k36l2J62j04J32j79L18n55K35K71k67O9J28j19j91R7
5202a14L93m01o0K90Q1ok07K02n62K45M29k72l1K65m63LL54j35k02N7k74L30j63
5225b41L87j86p4J96n3J6K4q1m6N2J26k35K0J18R1n21L20J15l9J36M5l22J32j01
$$ y = [182, -312, 258, 78, -66, 70, 20, 378, 163, -110, -80, -420, -91, 123, 32, -210, 79, -160, -78, 67, -262, -31, 400, 10, -45, -36, 30, 201, -32, 172, -113, -314, 11, -84, -183, 0, 245, 109, -219, 17, 137, -207, 64, -52, -123, 159, -122, 124, -79, 346, 21, 33, 92, 360, 173, 45, 412, -39, -167, -269, -4, 190, -25, 336, -23, -193, 261, -167, -157, 74, 55, -54, -163, -24, 137, -188, 150, 28, -73, -12, 21, -228, -228, 174, 92, 5, 89, 52, -268, -13, 135, -317, -32, 26, 46, -34, 63, 22, 152, 86, 98, 21, 42, 51, -310, -308, -8, -203, 3, 12, 97, 5, -212, 67, 0, -72, -35, 93, 237, 42, 157, -79, -111, 51, -53, 79, -100, 218, -337, -102, 169, -98, -29, 99, -20, -211, -114, 279, -122, -182, 108, 189, 183, -24, 178, -384, -139, 290, 18, -13, 252, -211, -208, 146, 11, -191, -134, -408, -78, -241, 146, -40, -114, 82, 29, 45, 69, -12, -58, -6, 120, -115, -95, 23, 114, -407, -87, 28, -11, 125, 170, -152, -20, -121]
5249a21K30r8k45K39k16l6L11P0K2k88Q8k25K05M93n27q6L35J75l76K7M63m90
5271e0k31K45r6J39J02J55l10m9M22m73N7K4q4M3P9n3k1K98k22k37L89K31l55
5294Cj42K30k6k05L45k73R4j37j77K36J18P7k88J81j55J31N6m18K91J6j37K49
5316F9rl21K1K62j44k32K88J25l96N09l28J55L3ML0ok16J85j1k10L3O8r9L57n14
5341c47L52rj08J82QL2j81K8L03m06k11L70o9m0J19K59n37L10o0k3M6R4lJ02j79
5366C2K4r8J27k6k63K5K28k05K90O2j22m21M78J73k73j29L2N9j24L80m5k04L44
5389C44l18p2j09L84l6k03n3O57o08J36O6P2m34J15J52k45O0j43j57M32r7p9J27
5412in2K7P8l20M66l54L84q4k36J29j30L18j70K4K76m05J32n3J14j63k0O9k74
$$ y = [-121, 109, 11, -234, 5, -211, -247, 64, 134, 156, -132, -44, -269, -64, 429, -98, -184, 151, 326, -50, -23, 440, -50, -281, -36, -132, 7, 109, 264, -46, -95, 327, -146, -89, -65, -149, -106, -27, -80, -101, 197, -25, -262, 127, 358, 3, -139, 91, 65, -140, 205, -68, 26, -111, -288, -52, 66, 143, -145, 36, -119, 12, 68, -350, -59, -43, -180, 69, 60, -261, -240, 22, -122, -354, -66, 59, -337, 172, -156, -1, 32, 36, 66, 60, -156, 29, 18, -192, -159, -91, -190, 167, -347, 5, -4, -112, 70, 78, 110, -71, -43, 260, -146, -357, 13, -56, -96, 23, 282, -255, 55, -5, -28, 18, 112, 109, 211, 32, 56, -42, 85, 59, -204, -179, 49, -156, 134, 196, 74, -347, 131, 304, 31, -98, -66, -7, -131, 249, 204, 0, 344, 26, -46, -155, 229, 193, -10, -63, 594, -14, 122, 188, 260, -174, -59, 93, -152, -92, -235, -392, 40, -57, -136, -9, -61, -34, 44, -276, 190, -164, 220, 136, -100, 29, -101, 217, 47, 71, 347, -58, 74, 21, 135, -28, -48, 21, -253]
5435b53J8M2N2J06J21L6k31L64j07j38j71J58J15j40J46l65J47K14J81k52k49
5456b06J37j14o6M27q4Rj43J62m85L46K86nl41K58m43J30J31L30m39M7K02l37
5478a98J50K01N7l36l1M04l4p5j00Ql83J17K62k1Q6j12k08p3M92l36K91K1k49
5501f7OQ8K14l37R4J88j69l58N54j52m0j81J03m8K13k6j26J19J62n12K22m6K55
5524A56NjN2j51j07J51j47JJ8P8J33l89K30l0j63l4K43l70M63R5m04N1j86M06
5548A00m01N45m5k46j91M76l6m89K48K98l06P2M0q1l12M41N5l98J01K69j30KK10
5571B22l00N8K65m60nj5J44j04K22J65j35k35O4J65k8K87j19m8j97K9L3j09q7
5594a88L10k18O7J48j44o1J88L06n63J33P7m29N13l13J60J8j45M7L4j51K25J8
$$ y = [-253, -235, -193, -141, -35, 86, 122, -109, 255, 148, 10, -161, -3, 112, -28, 118, -247, -100, 114, 295, 43, -206, -69, -183, -249, 178, 94, 103, -40, 122, -363, -17, 269, 264, -77, 181, -262, -132, -1, 329, -110, -63, 139, -198, -48, 153, 210, -126, -157, 247, 213, 138, 38, 46, -337, -220, 42, 21, 107, -5, -213, -286, 206, -130, 161, 182, -67, -61, 27, 241, -96, -2, 186, 17, -341, 213, 61, 21, -160, -57, -105, 108, 82, -44, 75, 237, -275, -53, -99, 156, 161, 160, 212, 61, -46, 105, -42, -41, -23, 55, 188, -201, 29, -1, -164, -198, 45, -325, 138, 233, -171, -120, -306, 100, -301, 244, 199, -47, -238, 238, 202, -287, -39, 259, -47, 25, 65, -16, -328, 113, 168, -230, -129, 140, 10, 12, 222, -78, -20, 245, -215, -220, -235, -91, -195, 27, 192, 57, -178, -114, 51, 23, 310, 191, 143, -54, -25, 8, -101, -188, 122, -96, -29, 119, -25, -86, 102, 408, -155, -22, 55, -374, 139, -174, -14, 4, -141, -94, -60, -211, 14, 32]
5616C2m2J31L4l24J88l54L38K08k24K05j07mk66L74J25m19J23N3k2r2n7O6J44
5639A10J52O1j07n50K86R4j03k06N38l93p3N15k56j78Q4n6O7O2J29j95j82K91
5661I0j04o0n8K59j96J72l19J45n3O7K11l19R2L2o7K22l7J28l04L14k44j05J49
5684A5m1j61K8K04j51%M00l26m4k09K86n3j35J05O5M09j98j89l50O78j86k91l2
5707a76M25l22ml4N6M5k65L09j95j49M56r8m38M27k53K08l44N61o0j12j67m3Q1
5730i2k3R5J4L6J07l48n0K59j61L42k09n7l7J48k8l99M68n4j84j2J32J84j82Q9
5754C8J8k29j72O88l27m4k13rK62j40J78j66r5J48J6p1j20N78l93k63L41m9j11
5777a35L06j74j71O46m41j30j8J92k48Q1K42j99j63K36j26O1k22K89P4j44j05
$$ y = [32, -10, 121, 155, -169, 19, -335, 3, 211, -13, 192, 85, 81, -185, 189, 314, -105, 18, 71, 49, -43, -100, -34, 110, 262, 323, 216, -334, -48, 46, -57, -263, 275, -118, -191, 324, 68, -110, -26, -82, -15, 47, 176, -19, -201, 90, -14, -74, -132, 127, -69, 103, -216, -71, -124, -57, 154, -165, -73, -41, -108, 114, 77, 205, -99, 215, -29, -134, 15, -26, -187, -159, 45, -106, -106, 294, -32, -76, -285, 1, -52, -187, -82, -17, 392, 194, 5, -345, 333, 147, -144, -176, 249, -73, -77, -111, -55, -10, -275, 34, -161, -310, 146, 48, -390, 37, -216, -8, -352, 209, 149, 37, -130, -173, -92, -115, -20, -6, 30, 137, -211, -261, -2, -163, 179, -30, -87, -124, 24, -4, -403, 65, 11, -173, -185, -53, 131, -51, 38, 56, -173, -345, 343, 16, -28, -241, -250, 12, -128, 50, -116, -211, -63, -47, -118, -238, 340, -53, -316, 25, -24, -135, 171, -3, -174, 472, 31, -99, -117, 75, -173, -92, 150, -49, -212, 24, -102, -41, -263, 26, 100, -44, -149]
5798a49M6R7%N2L4m28M78j87q8M14k18j20J58J21k57J6K12K15k88q9P8q2J15J36
5822B66k47j01q5O9q9J77o3lj56L63k36P9j82L46j49j49J18k18L23l5j02j6J08
5845A8p5j14J43Rj05O7Q7q0l1k1J47k30K29J7l07K19O9l00K93r1N9n1K93k66j76
5870a97M60k06m3J9K56k20k27p4J06J91j04K7k39K10P1L4j70J79k1k42R2M55l23
5893C4j19N9l4Q9R6L2j09k10L51j04j96L65k47O8j86K26m67M05J16p0L4j72l8
5916g7m5L17J2m27K45j41J86l91L06J5k80O40l64j79K20K7l46M5J24K81j75mK41
5939B30k79k70M72j31j25J97o2J82n18M47P0k98M0K2J53L2k25K44m47O22m38j18
5961b00K33M3R3m57M62j05LK08J94m61q9j32K02Q1J95l16k9J39j58P5j06J20j33
$$ y = [-149, -103, -6, -6, 46, 80, -348, 130, -57, -145, 269, 51, -69, 89, 210, -47, -31, 181, 396, 108, 19, 97, 15, 130, 266, 19, -82, -167, -98, -187, -10, -73, -76, -232, 131, -105, -26, -208, 138, -11, -160, -42, -260, 63, 28, -74, -90, 18, -57, -171, -28, -19, -124, -57, 30, -50, -81, -102, 45, -185, 44, 61, -246, -27, 42, -258, 35, -56, 3, -48, 245, -21, -197, 263, 57, 14, 33, 289, 69, -158, -232, -126, 65, -39, -12, -251, -41, 30, 64, -106, 73, 52, -190, -98, 357, 34, -85, -26, -60, 29, 125, 157, 48, -162, 189, 85, -111, 254, 7, 75, -111, 115, -352, 53, 169, 99, 133, -39, -77, -122, 195, 207, -220, 25, -116, 70, -321, -15, 0, -280, 360, -4, -183, 37, 64, -282, -237, -113, 168, -7, -11, 230, -49, -319, 153, 22, -103, 94, 32, 214, -304, 143, 213, -85, -45, -23, 130, 162, -63, 181, -266, 356, -82, -200, 33, 76, 169, -288, 174, 69, 72, 280, 474, 13, -76, -208, -6, 75, 270, -46, -75, 64, -94, -19, -125, -5, -138]
5984a38k3J31N8J6N2K52m33J16j79Q1Q3l75J88K69j82J84J38J0O0n67M30K48l05
6007A14Q9m4k17j7l5Kl1M4J43j65k1L01rm1j30L56J6l52J15m5k48J78J15k93M37
6032B62l33O1J67J55j58k31J64k10O7Mj7l12K36K13K3j83J85j89J67j18R9j47
6054i5P9K42l08K58k73P8jJ6P3j8K68l15O8P4R4k37k24K02J83J8m92J19J26M6
6078a9o4j3k40O50l49j37J51p1l6j7J04O4l08L83J35m71L63M3%l01M28Lk58K99
6102C39m99L14l28K33J82l65K2J50k31J99j32K41j95P3J2P3jj6M5J2k19J30L62
6125D01o29K81j17j34K88j94P1J46n45K47O0K2k7R6P1Q7j79o3K63o1l4j06k02
6148b58O40j73l84J17N1k1K8p9j53Mj15K98J58j27K38m25P6K07O2k27o6K37k87
$$ y = [-138, -161, -30, 28, 44, 96, 348, -85, 31, -148, -67, 16, -359, -171, 98, -84, 100, 238, 248, 308, -259, 171, 419, 114, 203, 159, -58, -75, -110, -108, -139, -95, 48, -117, -138, 163, 154, 113, -17, 339, 355, 3, 118, 73, -175, 3, 118, -175, 262, -71, -10, 157, 312, 154, -77, 87, -123, -56, -52, -69, -381, -145, 68, 91, -92, 93, -96, 71, -47, 52, -95, -16, 226, -82, 176, -97, -19, -20, -4, 69, 51, 319, 4, 72, 146, 240, 3, -221, -19, 164, 182, -310, -191, -65, -19, -83, -96, -336, 314, -35, -172, -21, -92, -128, -145, -41, 23, -285, 98, 233, -238, 125, 168, 168, -133, 295, 298, 40, 339, -160, 154, -174, 59, 241, -124, -102, 48, -183, 16, -116, 125, -70, 3, 15, 88, 87, 71, 116, 128, -91, 39, 401, -228, 53, -64, -198, 90, -104, -33, 113, -432, -185, -125, -103, -130, -34, 37, 124, -55, -118, 145, 84, 50, -56, -258, 382, 209, -175, -58, -7, -28, 0, -79, -232, -228, -343, -45, 113, -14, 224, -201, -125, 82, 144, -83, -149, 88, -199]
6171a99K1O69n46N4k0j26l3K18l4k73J26M54j86j52K21K68o77J25J57j28QP9k6
6194@k49R2j03R7K70%k60k15L68k95M08r7j77Q2j52N7K10k49L91j92j13k9N13
6217C57m68q0L19m05Q2J70l9P2P2J7K30l45Q8j34J41Q1m6j72J62k75k5K09k06
6240a95K32l13J73N2K28j99J38j96N5p7M1j29K86R7j61j41K28k91j0n0K35k60
6262b57N91k84j79J0L14k87k07P09n16p9L41l03j74M70L07k58k00l7R9L6J1M0
6284A47j24Oo4r0j44M70k04k79Q7L01J65m52K64J66q6q0k4j33J10n3k08P2K00
6307D7mk21K81N8m47N4M6m0M78q2m30Q0J90N5j79L1J77j57K44j6m82P5L09j34
6331f7k81N95k89j55K58P3j92J31J09j09q7J42l40R7n1L25l18K34n8J41j59p7
$$ y = [-199, -178, 491, -55, -1, -21, -147, -180, 38, 4, -269, -143, 311, 125, -27, 194, 462, -215, -90, 67, -61, -53, 26, 0, -249, -157, -260, -163, 107, 107, -153, -368, 0, -295, 113, 16, -161, -79, -231, -174, 36, -213, 178, -14, -127, -156, 357, -111, -191, 128, -277, -195, -25, -64, 8, 80, 97, 327, -18, 70, -64, 77, 158, 112, -60, 102, -173, -198, 11, -195, 37, -276, -103, -51, 177, -22, 116, -80, -25, -102, -61, -190, 96, 193, 32, -109, 119, -172, -182, -232, 3, -257, 334, 50, -129, -119, 195, -92, -299, 410, -106, -185, 156, -147, -321, 149, 456, 198, -2, -39, 60, 96, 107, 147, 23, 29, -35, -125, -269, 201, -3, -282, -195, 106, 271, -181, 83, 249, 163, 83, 59, -74, 36, -17, -225, -153, 47, 43, -178, 103, 161, -286, -232, -186, -226, 252, 170, -260, -180, 10, 65, -114, -83, 94, -63, 181, 165, -317, -242, 67, -67, -348, 247, -42, -197, 61, 134, -58, 73, 182, 73, -14, 128, -212, -115, -166, 159, -159, 75, 17, 158, -1, -78]
6353g8K05j68j8R2J60l02L53J73m25J22M3K7l18K0J22j15K01%L4j09L00k60qj17
6377f6J96k30R4J00j86Q3J21k04j75J71k2N0M2J36k75J61k8o7l16M17j5J07J84
6400B78k57l40K78J62j34J0K33l52j10K48R9k80N4N6q7J04j32L5P5j12K43O3m
6423A30k30K44j85L38k75J45mJ72o06L75j90J61k0K0l3k48N38l61K12m01P72m14
6445A40k87J54m2K66k58J07k51J28M27l63j11j72L54Lk62M04J61k11k96N07m55
6466e7o7K16j49p6J51K56j01r2L6o7l2k90L74k34O9Q4qQ4J76l09r5J43k96K62
6490b2J6K7k54L90r2M7l70J73R8q6J09K68n30J94K63k03J95l70n9J07J02K22j58
6513F7l19M25l46J31J06nj34m8J68j88L95J0j01j50K54k83j48N1J58k78M28J22
$$ y = [-78, 127, -41, -59, 33, 193, -109, 244, 417, -8, 114, 157, 184, -134, -114, 8, -107, 94, 94, 128, 19, 319, 59, 51, -66, 130, -100, -6, 94, -92, -9, 112, -92, -267, -96, -118, -68, -26, 110, -165, -4, -32, -99, -415, 2, -13, 94, 278, 21, -319, -41, 121, -13, -3, 230, -122, -232, 16, 115, -165, -111, -55, -142, -38, -170, -135, -60, -172, 71, 134, 130, -100, 144, -41, 297, 22, 167, 163, 335, -271, 104, -86, 75, 55, 75, 42, -206, 332, -29, 183, -218, 554, 140, -147, 7, -35, 231, -27, 80, -171, -43, 384, 21, -90, -262, 92, 95, -167, 237, 398, 187, -109, 398, -57, -124, 92, -57, -133, 18, 274, 173, 81, 117, 50, 18, -272, 102, -132, -63, 21, 13, 97, 273, -36, -131, 12, -284, -22, -6, 21, -233, 157, 65, 112, -258, -85, 13, -73, 36, 304, -226, -32, 231, 28, 223, -147, -206, -99, 3, 225, 67, -252, 173, -173, -42, 64, 59, -75, -123, 45, -143, 252, 262, 161, 11, 265, -18, -166, -115, 43, -235, 193, 315]
6535C15l35k7J18l39J85J02l7K43L7m8m37K53p1O3n8J34k47RL7K74l06K16m2j30
6559i1P8q8L36k17l63K80k2k3K56J6m30N62k80l9K30K9k47M4Q0J74k21k97J02
6582a31J41n9L08k07J11R2j26j9Q1j26j71K89l14J12J11K30k34j71K31q6k15J88
6604C5K39m24J08J0n1K58r5L01j68l81K24J87l23K46j15L6q8m6K43m24M37R0k23
6627G6j27r4M0K9j14L4J66M7q2q4J38O3l83K34J41P2m52M35j15J51r9L2j93J3
6651g2K48j77k4M3N8M7p8k80L05j4j1J34j58J9j61K23j68J73m50J85L60k17k52
6674b67M28j42l4J64M1J2l23M19l82j72L79nk17l6m9J10r3M6L56j42k05L57k05
6697D0j07m6K40j23K74l79k43L27k1O3K55l47M3j42N4K89l0K2k68j79K80N23n49
$$ y = [315, -20, -47, 71, -268, -83, 19, -18, 225, 262, 214, -223, 30, -41, 22, -36, 98, -149, -140, -103, 171, -135, 81, 39, -91, -13, -101, 235, 18, -345, -65, -87, -110, 146, 162, -268, 294, 14, -25, 205, 234, -13, 31, 111, 285, 64, -233, -131, 10, -49, 259, 52, 163, 255, 129, 110, 191, 65, -106, 183, -131, -19, 92, 322, 88, -83, 148, 62, -153, 35, 274, -150, -42, -32, -83, 175, 80, 381, 213, -168, 56, 243, -80, 166, 51, 87, -1, -47, 196, -228, 209, 299, 76, -51, -145, -105, -76, -190, -156, 10, 57, -25, -109, 29, 92, -291, -57, 84, 156, -296, 139, 24, 175, 76, 108, -85, -72, 176, -1, -25, 18, 76, 123, 45, -235, 70, 56, 45, 179, 21, 40, -121, 102, -66, 107, -343, -158, 202, -15, -267, 161, 19, -15, 149, 190, 202, -121, 298, -84, -256, 123, 118, -99, -135, -184, -74, -167, -121, 235, 93, -112, 245, 40, -67, -113, 127, 4, 278, -101, -344, -17, -38, 25, 280, -67, -24, -166, -112, 177, 147, 169, -99, -278, 2, 525, -24]
6720b4J41m1n4OJ61m87M80m42Q2J70Q8R6l40J84J5Q5j14k09K35n6oj12K32m17
6744c27N39j74j5j0P6k02k6N1J5o3J78j20J92J3j67K89k17J15j04k25M35j26K3
6767A50r9J09k0l89J74K1l3M0r2K87rk40K16j12J9j98J02j7R9j28J06j75p2L74
6791A13q4J71k10q6K47l37j30L71l07L2J91K06m52K11N9k45K05q2O8n5J66l1R3
6814A14l28J31l2k13N77ok35j92J64J58j14P5o8l32L51j68NL36l02q7J00R2J14
6837A40k73K20J74l06K50q2N9k16Lk71L13O2l6j65O9K50k19J72qk95K45N8k74
6860a30J26Kj14l6J55J16j58L5R0K16m51L49k14j48K62k26J44n6K43n08j09M23
6882A1j03J6l2J96oJ16j19l2L31o28K48J79j82KK05j40m8rj63K16k7j26j84L39
$$ y = [-24, 117, 76, 22, 28, 189, -298, 182, -260, -178, -8, 80, 176, -164, 20, 35, 120, 6, -203, 32, -24, -30, -142, 90, -327, 212, 38, 23, 13, 89, -113, -139, -88, -73, -136, 42, -78, 114, 127, -40, 249, 32, 147, 43, -182, 253, 127, 150, 51, 160, 140, -249, -75, -54, -87, -47, -139, 148, 139, -101, 115, 3, 22, -176, -74, -91, 8, -120, -14, -189, -261, 113, 29, 200, -10, -96, 151, -186, -316, 55, -252, -220, -29, 177, -275, -64, -5, -250, -45, -127, -59, -114, 52, 21, 114, -214, -83, -115, -328, 249, 243, 8, -184, -20, 138, 24, 99, 31, -301, 50, -118, -113, 223, -79, -166, -66, 26, 140, -133, 87, 261, -45, 205, 123, 182, -34, -31, -302, 11, 73, 37, -128, -59, 191, -28, 144, 136, -159, 86, 144, -130, -4, -2, -116, -152, 3, 119, -39, -4, 86, 302, -149, 200, -14, -162, 100, -126, 18, -38, 205, -303, -412, 11, -92, -76, -108, 88, 82, 198, 79, 47, 378, -250, -2, 177, -5, -3, 202, 62, 14, 5, -158, 58, 31, -95, -279, 60]
6906F0N0j7j76L52l17J42J28l31l8M14j9l31K03n8R7j82J43j89J34M1Q3P2k28
6929C3Kj78P2K16j53j49J78J79l62L5K44p4n02M50J32l24J27R2k25K71r7J5n9
6952g7J66j51k09M5j9K67O0j86K39j80k3k7J00O5J01k75J09J35k19J17j8j2r2
6975h4J21K18k96J01L51m46j37K89n7R2l97M08l70R6r7K73q4l0r3Q7J95l28L21
6998A33Q5J16j75j8j21O4N5m2J9n2q5K81k40k13M37j78n59L00K77m5M3j79o1K17
7022E9j25K3n4K62j47jr7M20m87lK48r4J5l08L50j92J26R0j65M3K1Q6j31k8J55
7047F6l2J3pM2j45P5o2R8O2J8J2k25J06L0j29J64o0J34k11K8j77J44K68l56k45
7072c89M63K6j18K88j21k54L21m14P1N1P0Qj60J22J61l65J08P2l6K18k9R2k7m41
$$ y = [60, 110, 93, -83, 269, -48, 94, 222, -109, -147, 267, 248, -83, 120, 62, 159, -23, 120, -69, 65, 106, 189, 261, 33, 35, -143, -71, 145, -8, -157, 21, 200, -162, -127, 117, 43, -459, -9, 123, -201, -74, 18, -207, 64, -33, -18, -77, 89, -62, -271, -226, -245, 22, 82, -104, 135, -45, -68, -95, 5, 70, 171, -104, 5, 140, -79, 38, 20, 8, -84, 37, 255, -41, 60, 411, -35, -172, 117, 60, 152, -245, 163, -207, -111, -208, 65, -19, -49, -142, -55, 140, -188, 133, 218, 334, 159, 141, 20, 84, 139, 97, 116, 64, -21, 260, 20, -193, 244, 66, -493, -193, 84, 39, 82, -97, -158, 59, -66, -43, -97, 165, 18, 17, -80, 340, -147, -150, 98, 4, 19, -289, 61, -131, -5, 85, -80, -37, -16, 70, -61, -89, 66, 34, 47, 40, 82, -63, 12, -50, 48, 110, 128, 140, -85, 21, 51, -78, 86, 26, 160, -51, -23, -200, -56, 212, -144, -389, 74, 100, -18, 270, 149, -105, 216, -198, -127, -76, -6, 2, -158, -36, 125, -240, -132, -60, -96, 122, 93, 185, 158, -283]
7096b83L37J41l67M18k11n0j6J94l09L57r4k38Q7J6J95k88K52k6n8j38L31k09
7118D1k0J1K47k37K7K95n93p9PJ64K17l7K22o48K98J60k08J88N0J67k77Q0J46
7141B21k21o6rp9J78k48K90R8n1l53j47N78O3m29L78m1l00j26K65P5J16m80J71
7164a17qK95j8l56J35J91J13k69j20J91j75j43L77j72o0L34k64j08J13L2l0k16
7186b75N10k57m7Q7J46l41O6j04K57J0N2o9J8J15l3j23M8m7j12J09mK15j10j46
7210c5l40M12j51K19m73L62Q9K60m31M2j7p9K31j03J17j50k13M45j41J53j42k13
7232a58j37K52j8m43M44j69n7O2M42m48K76l1o2q1L92o46L43J13j58K46m19L5
7254b22n4K82M1M0L6l02L49k69J75N4k85r1K99L5q3k98L3L96Q0j89l37J50L19
$$ y = [-283, 54, 195, -172, 246, 35, -15, -31, 163, -146, 211, 117, -121, -34, -18, 177, -111, 141, 115, 57, -81, 250, 41, 21, 32, 279, 42, 69, 364, -229, -308, -301, -137, 80, 43, 265, -383, -85, 75, -133, 55, 105, 272, -5, 75, 221, 0, -66, -75, -154, 24, -224, 66, 164, 113, -240, -387, 191, 254, -175, 203, 162, -138, -264, 1, 76, 192, -288, -117, -125, 170, 152, -204, -69, 122, 235, -34, -154, 37, -138, -281, 96, -76, -136, 198, -66, -174, -61, -29, -59, -275, 235, -22, -69, 18, 164, -177, -111, -215, 42, 52, 104, 35, 53, 168, 135, 12, 60, 13, -99, 10, 6, 221, 111, -35, -375, 37, -114, 105, -368, -6, 83, 343, -88, -46, -63, -142, 89, -14, 103, -47, -260, 185, 44, 197, 55, -158, -295, -43, -61, -504, -60, -229, -286, -224, 218, -230, 46, 15, -47, -128, 264, -382, -39, 74, -84, 162, -257, -222, -276, 6, 47, 87, 123, -179, 170, -99, 76, 130, -155, -246, 53, 88, 5, -293, -260, 136, 216, 27, -310, -160, 159]
7277A59k94L61o0J79j93l88L74j28q6j14J42L37l20J95j02j63j82K06O1j79J03
7298i2l9J28r5J11j33K82j89k45J31K28k64L37m7J45m84L66r1j59J01l6K84j09
7320A30P1j22L0k36K53p9K20j62R0j93J0J25l16L5N16l20J23j81l2j3M23k19k49
7343i6N3o5l3P1K9P6O3J33K1n0k00R6k76L17J47j83j35p9n0P5N7Q9Ll06M32j20
7369F9n3j16lP6K56j25m3l40L10j31K3J78L3k99K54n3K88j92m7Oj36po5pl9J92
7395B9j75P0K12j17K1j03J49j56j34K96l6q6q7L9M7J83j26j86J76l1j30K38J9
7418A12q3j15J37J87l22K23Ol9k46L24J11n49L49J25o2P8j48j70J53r5K69k60
7440a5l3J32n86L68L49j2k15j05k7oL45J04j28j45P3j64j16L67l76J5K34r9jO1
$$ y = [159, -135, 226, 166, 345, 152, -236, 138, 10, -76, -190, -48, 289, -31, 164, 62, -101, -283, -77, -16, -195, -92, -131, -3, -98, 13, -120, 162, -27, -272, -141, 87, -177, 160, 113, 258, -226, 140, 49, -110, -9, -45, 239, 130, 201, 79, 109, -127, 126, 47, 267, 105, 195, 2, 12, 137, -179, -144, 372, 52, 175, -6, -38, -51, 372, 153, -96, -43, -108, -141, -70, -41, 35, 98, 231, 252, 202, 2, 98, -178, 139, 286, 103, -32, -111, -161, -86, -29, 60, 63, -243, 189, 69, 16, -100, -103, -27, 229, 104, 61, -279, 31, -100, -77, 101, 134, -165, 89, 36, 324, 132, 85, 91, -45, -52, -117, -124, -163, 29, -146, -76, 136, 19, 40, -63, 86, -70, -204, 92, 56, -30, -117, -78, -31, 152, 26, -160, 16, -15, -145, 93, 112, 29, -86, 51, 238, -84, 139, 145, 106, -140, 184, 295, -254, 95, 220, 158, 236, 88, -82, 71, -24, 245, -15, -48, 84, -502, -134, 215, 203, -12, -117, -144, -150, 195, 299, 171, 26, 99, -65, -181, 186, -190, -175, 59, -40, -41, 20]
7464B0R8n5l5J50p6n4n1j01j01Q3M33n44l8L39P2m29K95J54l55L62q4j76L54k74
7488a3k23L65L2o9P6m07M87j17J6j44J32j05J88k06k51L01j84m6l0L77k33P2j58
7511a40J39J09j36J92k86J5l7L63J2n7j5k18k11L57R0k80P7Q4k04j20L66o7p6
7534d3k4J41K6M3R5l02j23L70k45M0l7J2j3J29R1k04j39J18M9j68L86n9j83j49
7558a89L15j29M5P9J07j69l3l39L07k23K15n1N1L37m42j18J10Q1K56K8k42K30
7580B26l97J50K14j07j69J80M3L3rM3m70L09l83M50k54K50j01k3j14J88k33J54
7602b0M79l18N5j49K4mJ80k88k35K47J75j17j12J73j70JJ28O3k82J77Lj09L56
7625B57k87l44O52l19r4j41J16J70l54M03J6k78J98N3k79J31n6pK60j10J82k91
$$ y = [20, 118, 63, 28, 178, 102, 48, -3, -104, -205, -122, 311, -233, -271, 68, 140, -289, 6, 160, -195, 167, 83, -93, 261, -13, -236, 129, 161, 92, 168, -239, 248, 131, 147, 3, 135, 30, 218, 12, -239, 62, -122, -168, -198, 179, -54, 18, -140, -1, 108, -28, 164, -122, -107, -144, 219, 231, 174, 159, -59, -270, 87, 177, -103, -26, 58, -146, -266, 100, 33, -43, -67, 74, 100, 143, 238, -64, -187, 183, -62, -22, -59, -47, -60, 69, 160, -44, -183, -65, -16, -184, 202, 143, -40, -189, 126, -3, 42, 121, 228, 59, 26, -313, -6, -229, -14, -65, -14, 323, -119, -237, -127, -46, 210, 238, -4, 226, -171, -21, 193, 86, -83, 97, 140, 173, 164, 207, -263, 46, -337, 113, -141, 109, 8, -15, -129, 59, -174, -20, 459, 141, 196, 47, 71, 67, 247, -41, -276, -29, 146, 29, -83, 90, -80, -79, 49, 112, -170, 7, 10, -99, 257, -30, -374, 278, -41, -135, -276, -160, 10, -344, 59, 75, -203, -5, 48, -231, -100, -156, -163, 97, -13, 169, -122]
7647a22J80j06J76k08r5N8K74j97r2l1P8k34K96k43J25R7q9K35j63J23q5r3j58
7670b74L32j06P0j41oK72m75K14J47L32j22q0K36n95J52K56k03M8n1Rk23J3M5
7693a50NN6J03J28j51o1N0k13J64K95k82P6j21l1J00N6r2J20j0l5j98J59L07l40
7717f5j59K70N3k06l5J35O4j17J42K11m81R7O6m6K04k07K18l21K79j09j4K31l82
7740a72K49k66L07r2j38L63l29R6L09j31j68k8j0j39K37nj76J07m4Nn4N7l4r5
7764a51J44l7k04M81j20l82K85K28k30j20R1J78k96J26k5L16k49qJ92m0o7j33
7786b1J78j28J90l26K22o2Pj06m3K14m02K88l7m7m8K21J59m19N1K6M9n1J22%K83
7811C20n10M08l35K31j08R4Oj9M0k13J19P3r0K9N3k01O0N4M4k24J85j69J07J12
$$ y = [-122, 58, -48, 128, -80, -175, -117, 157, -40, -132, -163, -85, -319, -23, -266, -141, -44, -133, 102, -61, 62, -23, -116, -274, 58, -48, 22, -119, -125, 147, -328, -114, 33, 365, 243, 163, 399, -196, -44, 212, 9, 57, 6, 15, -208, -195, -150, -145, -89, 14, 142, -9, -70, -20, -233, -69, 226, -56, 20, -101, -132, -32, 24, -68, 52, 42, 7, -191, -32, 275, -65, -224, 46, 99, -107, -142, -7, 57, -60, 82, 293, -188, -91, -25, -71, 133, -74, 144, -177, 102, -7, -21, 210, -172, 77, -189, 118, 26, -112, 251, -78, 18, 327, 196, 28, 0, -10, -149, 88, 83, -93, 14, -30, -25, -79, -22, -56, -151, -7, -44, -248, 233, 113, -269, 16, 244, 14, -106, -15, 163, -133, -7, -32, 284, 35, 27, 219, 179, 112, -21, 157, 29, 219, -107, 115, 53, 60, -46, -89, 125, -277, 11, -26, -73, -121, 100, 259, -160, -109, -83, -34, -85, 37, 37, 320, -190, 218, -117, 114, 6, 100, 106, 87, 127, -86, 33, 106, 16, 45, 98, -103, -43, 11, 55, -169, 16, -153, -46, 66]
7835F6k81N4L17m96L83k1p9k2j07K17J25k27J38j97L1N1Q1M65l81k26N2rK06j61
7859b1J55k38K82m5k44j61J56J96j1k74J02J40r1K14j94K24o5K6j10K3k5J68j78
7882B9L08n89P6L45l05j9L09K9l32j49K52K00j60j23m2K72l5K75n17j89O90j61
7904A64j39k8j0n0J13l5j58L4J25M6J13j35O9p7L4o6Q4M1j95K19K6k84M62o01
7928b48K92j52J46J61j8j86M4n2%J73l12J63pr4J2J88j38K39k45O4o8K4K69l36
7952h1kJ26N8q1J05j7n5k52K07l4R0kj71O4J79n2n37N70P7m23K66j16o0J11Q4
7977E4K01k33J1r4J02N1K0k23J03J30K1j87J08j65j19K05o7K08l16K44j62j5K43
8000A20m9k08j09J01L2o3K16l10J44Q7N7k56J96r5p4K24O4j30p4N43l76m6J6R5
$$ y = [66, -215, -161, 156, -340, 43, 22, -57, -79, -186, 31, 156, -71, 67, -130, -99, -48, 33, 498, 117, -109, -57, -66, 140, -21, 134, -104, 178, 133, -111, -272, -116, 80, 69, -205, -103, 37, -54, 160, -34, 190, 125, 151, 41, 64, 39, 207, 29, 337, -252, -176, 169, -136, -155, 154, 183, -149, -298, -46, 154, -6, -129, -171, 101, 66, 341, -176, -365, 325, 164, 25, -3, -13, -63, 50, 15, -143, -109, 16, 62, 175, 40, 109, 32, 66, 0, 84, 125, -70, 149, 175, -109, 353, -248, 44, -108, 38, 199, 181, -5, 39, -13, -13, 160, -152, 11, 4, -90, -78, 110, -28, 211, -34, 30, -38, -14, 255, -81, -83, 43, 101, 20, 125, 108, 53, -199, 8, -26, 64, 62, -109, -45, 134, 82, -455, 115, 192, -231, 35, -81, -141, -30, 54, 255, 22, 33, -61, 41, 92, 112, -111, -8, 122, 143, -44, 64, -101, -220, -15, -82, 126, -190, 54, -108, -123, 120, 71, -137, -246, -145, -113, -176, 40, -270, -126, -39, 18, -238, -42, -137, -211, 13, 77, -53, -127, 416, 40, -6, 10, 105]
8024A05j44J25l31N9J64n6J01L1J22l50J9Q4MJ98l46M14k81O6j19K50k71Q0K01
8047A25j37j57L73j66k48M88m30J32j9N6J25k68R2K7l21J19K30J02n23N30l25
8068a95r6M81k70K5J29L9n4J03j93j44k82O12j36P7J11m13M87m54Q0K11l53L14
8090G9j96J27j20L60m34K70l48M01l32K18J04l5k41k1L87k78L0r1J76j23N5j98
8112b10QL45K4l79K26J15k17P8J5j50JK25j49J43J77k29j13KL3K77k58N42p18
8135b12L86j94k0J70j72K02q8L5O7l47K39P4J25l67J10L08k67k29j26M23l93L50
8157G4PN7o0nk13J87O3O9r1k42K11J44n45J63L46j32l0L3j77q4J03J1K54k30O7
8182b0J10J54q8j94k55J71O4J02K69
$$ y = [105, -39, 86, -245, -186, -22, -78, 23, 54, 176, -174, -155, -71, -67, 131, -215, 199, -82, -16, -135, 115, -156, -76, 125, -12, -169, 204, 38, -210, 278, -152, -20, -39, 17, 142, -126, -34, -7, -328, -209, 21, 123, -400, 130, -195, -291, 190, -80, -55, 74, 113, 59, 162, -31, -175, -457, 155, 19, 96, 207, -206, 281, -173, -93, 118, -235, 79, -117, 10, -110, 250, -184, 86, -262, 139, -193, 25, 129, 94, -147, -168, 219, -59, -29, -120, 56, -67, -12, -210, -202, 143, 167, -212, 14, 129, -88, -10, 5, -145, -144, 81, -68, 75, 252, 23, -90, -88, -55, 222, -36, 506, -212, 174, -20, -40, 130, -42, 160, 72, 107, 174, -173, 66, 140, 265, -102, 8, 316, 49, -180, -306, 117, -276, 74, 81, 138, 78, 73, -140, 47, 110, 179, 88, -154, 57, 201, -344, -181, 165, 33, 3, 36, -141, -225, -122, -111, 143, -87, -20, 90, 244, 156, -38, -293, -122, -58, 44, 313]
8191C13
$$ Imaginary data points
##PAGE= N=2
##DATA TABLE= (X++(I..I)), XYDATA
0@%%%%%%%qJ6j6J6j6K4l2M0m8N6p1Q0r0J08j30J51j74J99k26K60k97L35l78M28
31B27m82N40o04O75p53Q39r33J037j149J270j406J558j725J912k119K351k618
48a380K926l281L694m188M791n548O526p845R739j2703J8033l0584J12226R5015
62A87421j94167m6335M4844P5188N1292k3351j38806k2345J20307M3003q7425
73I626l4664J2767K1678M8722k709j15309k6416J25607N7750q1630o3405j9936
85f7919J4127R0111N2186j08324r6399N4953O8923J5k179l2243n5063L9294P4839
98C2321l6531n0696M5129K9249k7361O366Q77l4216L5794O8688m0563o9557J9643
111b0857K7906j253L1864j052p2798j1870O0032J881k0970K9929r585n4689J9801
$$ y = [0, 0, 0, 0, 0, 0, 0, 0, -8, 8, -8, 8, -8, 16, -16, 24, -24, 32, -39, 41, -49, 59, -71, 80, -94, 105, -121, 139, -158, 177, -201, 227, -255, 285, -319, 356, -397, 442, -491, 546, -603, 667, -739, 819, -906, 1006, -1113, 1238, -1380, 1546, -1735, 1959, -2229, 2562, -2986, 3540, -4305, 5434, -7269, 10764, -19820, 92406, 187421, -6746, -53081, -8237, 66951, 118243, 94892, -43914, -66259, 54048, 97051, 9626, -25038, -12271, 9407, 58129, 55420, -59889, -86305, 39302, 97052, 15422, -47983, -67919, -53792, 36319, 88505, -19819, -116218, -61265, 7658, 7673, 5494, -26749, -81812, -42518, 32321, -4210, -54906, -9777, 19472, -7889, -1523, -646, -34862, 932, 69620, 29057, -40500, -20857, 7049, 5796, 37660, 36608, -36190, -48060, 11972, 13853, -7117, 22812, 13227, -41462, -21661]
124b1661M7457j4905j12K8252l6392l5775N0555L1143l3728J742J4302l5211j480
137e813M0703k1303l2199M2819J2752o0159j2533L2350o58J3230K4237n5793n9569
150h1936N3870O3748j9470k7143j6292l2502K6703P2507j9951p0615J2564L9236
162G19j1955j344O812l0089J0673N9344k0017p0688J5510N8536J2438j405j9274
175I260n7374J0053R4347K1762p0212k8560J7135J0854L4275J8949n8436l4983
187c2930N4626K3737m3580j1032J5521l340J7254J0974n6434k8598O6870M0630
199E3698m1624l0895o349o243M2320M8099m5522o1253K6750L7632r724J974M54
212I317l1245Q031L8230k4300l7161L5073K9876k7183j2560J694j9315K2348N2099
$$ y = [-21661, 25796, 10891, 10779, 39031, 2639, -33136, 17419, 48562, 14834, 16576, 30878, -4333, -5813, 34890, 13587, -18612, 24207, 36959, -23200, -35733, -3383, -4041, 9189, 33426, -22367, -81936, -28066, 35682, 16212, -10931, -27223, -59725, -33022, 39485, 19534, -51081, -38517, 719, -11236, -12580, -5768, -35857, -25184, 34160, 14143, -56545, -41035, 17501, 29939, 28534, 9260, -48114, -38061, 56286, 78048, 7836, -20724, -3589, 7265, 41540, 60489, 2053, -32930, 21696, 45433, 1853, -9179, 6342, 3002, 20256, 31230, -25204, -53802, 13068, 53698, 12074, -18821, -25170, -31413, 10907, 59006, 13484, -47769, -21019, 16613, 6889, 8863, 9317, -21928, -13897, 24333, 33, -37128, -2055, 27821, 638, -11922, -10228, -29543, -7195, 44904]
225D4904k3896n8884J2843L2758k569J0076N004l9172o448M2891l728l2621K0144
238A302J9781k6359n733J2390j7173P619M3507j4884n3560R114L4672k95N497
251A5878M192l8010j0392M6405P785l4421O659J6538j9625j242J5558k0106l356
264a4137L9914n810n0709L97L2631L835N976K208m1307j6678N0803K2686l3144
277c335r317Q708j1611J0713K4201k2852k0058L3660J0094l7552m007K3251k58
290A637P743J1684l7147k6908M3754L2942k5318j5612P85j3803J5370L6033j8103
303A3057l5197K0500J8785k2154o94J6378j0964J380K0962k4008l0371L1276L1424
316C0374k0132j4016K39j6274J1556M0337j1175m0977R197K1109j0749K660J3707
$$ y = [44904, 21008, -37876, -25033, 7725, 5156, 15232, 20236, -18936, -25384, 17507, 13779, -18842, 1302, 21083, -5276, -11009, 1381, -15792, -8173, 35334, 20450, -33110, -23996, 10676, 10381, 15878, 20070, -17940, -28332, 18073, 25858, -8563, -1904, 14634, -4991, -6233, 9325, -10781, -14137, 25777, 19967, -30742, -30345, 2286, 6121, 12097, 14305, -27002, -43680, 7123, 29809, -3335, -12652, -3944, -15555, -4842, 19359, -3493, -23551, 10109, 20203, -17349, -21356, 1895, 1637, 9380, 21064, -16083, -42991, 763, 33705, 8387, -7225, -6440, -20243, -4873, 31160, 13057, -22140, -1640, 17145, -5009, -5703, 10675, -289, 1091, 22053, -1955, -32326, -1050, 30374, 10242, -3774, -3535, -19809, -8253, 32084, 20909, -20068, -10871, 10238, -511, 2149, 15856]
329A5856j8461n861K5648j0301k9867K0864K7253j6628j2682K125j5624O824L9910
342B9056n610m3605L21K3151j845M628R259k3502j1248K9879K696k8464Q961K2618
356A6295j1964p994N608j6190m85L8368K726m2572p480K2194L947P941Q857k8475
370i224j9731L2411J6806k4173k377J2973r895K66J4045j6709j2449L1697J2177
383B5817l3876j1491J6165K358R966J4241k8205k8792K7439K6929j5844q523L809
396gj3802L901K5144j1204k3709J9022J6577k1579q069J2075m041O052J9840j9308
410H92l2217J8575K8786q423q375J2j7358J998L1695j926k8441O680J5844j2370
424d628k041J2265q795k019K0998q106k9119J1765K5909n593o753J023j7434j461
$$ y = [15856, -2605, -8466, 17182, 6881, -22986, -2122, 25131, 8503, -4179, -2054, -17678, -10854, 29056, 23446, -20159, -19838, 3313, 1468, 6096, 15355, -8147, -19395, 10484, 13180, -15284, -6323, 16295, 4331, -3663, 1945, -14245, -14730, 23638, 26364, -16208, -23688, -1494, 2453, 10394, 19251, -9224, -28955, 3456, 20262, -3911, -6288, 6685, -3210, -2944, 11101, -5608, -18057, 13640, 25817, -8059, -19550, -3385, -1027, 8939, 23180, -5025, -33817, -6378, 20551, 4707, -3816, -7, -13809, -9908, 15236, 4032, -19677, -655, 15922, -5657, -13726, -1651, -5692, 360, 20200, 892, -31325, -12750, 16036, 7613, -762, -750, -18108, -16110, 15585, 13659, -14782, -8102, 7742, -4628, -6669, 5596, -3199, -5218, 15780, 7674, -21445, -9680, 16229, 10636, 3883, 4906, -12528, -13989]
438a3989L2449M688k8745j614J3966p146J618J3215j2171j0004K0250J09k4979
451a2353N975K1191o191o546L092j5584n824K9435R084k9214p452J2686l021L503
465a219J3668j5206j6181J9009R500k0868J242J6747n766m318Q002j2773j0283
478a8446K7370J4200k5517j0885J1160L63O308J5673j5485k3152J6973J7768j3682
491B648m270R356p457k058J3869r702j7172J8811J7616j9053j3043P116j031N851
505A481J8314j3120k8529J0122K2486o051n608L658j2362k101K0424k007k0775
518a4068P954J6762j1141q500O706n178J496K0119n374k8079L403K1380r48l328
532A204K420j5190o523K3341O707k0787q57J2756o854k979R697p098o185J8228
$$ y = [-13989, 18460, 23148, -5597, -7211, 6755, -391, 1227, 14442, 2271, -7733, 12517, 12626, -12353, -6378, 14813, 8622, 2076, 5168, -10416, -16240, 13195, 22279, -6935, -14387, -1701, -4722, -1219, 12449, -2757, -18938, 71, 9571, -11297, -10055, 6692, 926, -3392, 4610, -8163, -18446, 8924, 23124, -2393, -13278, -2118, -1755, 4553, 20226, 4741, -18411, -1438, 16330, 2648, -1622, 7734, 277, -1781, 12088, 2386, -14786, 4025, 21641, 2588, -10455, -3339, -4370, 1481, 19795, 6675, -21854, -11732, 10754, 4703, -905, 2753, -9609, -11710, 8714, 6707, -14068, -6114, 10648, -493, -8993, -2287, -7465, -5969, 14150, 8776, -19303, -15900, 5480, 4532, 1204, 3624, -11566, -18089, 5252, 11959, -8828, -9685, 3071, -3783, -6762, 2935, -4163, -10348, 7880]
546G880K595k3511O27J8187J25k335N012j3869j0039K2666J2178j7934n558R256
560E280n077n1J2921p233j2837J4245O875j8415k419J4560k106l286O216j2060
574c387j3354J9082J4869j6788r562O664l967J445J4009o595j7049R815J1982
587G164j2954l672J1926k859l326R942p756j4814J5335J7543j2056j0830N019
600a338k123K497J6238m362k1069N665J5136o628m015P349o105m702J2769k672
614F640j7046P818J6750q650j0033L823m360J73J7381o33k2919m32J5686j639
628B559k446N334r223p567J5718M267j6528J498J3644n490o359N171n114l802
642h338J6582L455k0342m428J4033J157j454N619j0442j1631J5398J0398j4059
$$ y = [7880, 10475, -13036, -12409, 5778, 5903, 3568, 8580, -5289, -15328, 7338, 19516, 1582, -3976, 5280, 203, 152, 13073, 5840, -6997, 7248, 14123, -4292, -6711, 7849, 5743, 2457, 8673, -3387, -16741, 2341, 17210, 422, -9140, -2476, -6443, -4998, 9011, 2416, -14633, -4818, 7164, -5790, -9462, 2464, -395, -3721, 6221, -1535, -16349, -1014, 16529, 4473, -6357, -1338, -3461, -964, 15274, 10912, -10157, -4492, 10644, 4016, 1, 7350, 1245, -3457, 9312, 6640, -10406, -2588, 14162, 5512, -4521, -698, -5058, -4885, 12496, 11863, -11056, -11488, 4198, 2559, 113, 5447, -3776, -11343, 4375, 8642, -7886, -6388, 7256, 1766, -4593, 578, -4536, -8338, 8244, 11699, -8643, -13071, 962, 2119, 665, 6284, -4158, -15789, -391, 10007, -4052]
655d052l643R781l881l927Q366m434q632J3011Q263j6774n848J2456J230o28P421
670H709r280j3677J2912J4601j0389p017O948l848k148J1153k612j2903Q522J0132
684A1103j2022o310R289j54j889Q121o507j5674R299J5781p446q417L712l908
698e022j769J3189J59j5625L372J1796o569n002P234j783l467J0201j871j5592
712a0749N126J5988m104p563K513m451k374J4663L340j6627j799J1668k858l348
726e75O558m622o484J0652K803j4719L47J4115k741o895L517m793n226J3778O273
741A1988j5815n260J0440m01j599O733n800r692R978P040j1549k213J0468j852
755B466n282N253l921p664J1180R135j3179p381Q846O95n68O997n561j1585P657
$$ y = [-4052, -7695, 2086, -1795, -5722, 2644, -1790, -10422, 2589, 10852, -5922, -11770, 686, 1916, 1288, 8709, -571, -14248, -1336, 13265, 2876, -4141, 2807, -1041, -3189, 7964, 5352, -7551, 971, 11103, -919, -7229, 2060, 1906, 17, 8138, 1631, -14043, -4744, 11037, 3591, -4826, -1114, -5022, -6791, 6398, 6557, -9068, -5696, 6100, -469, -5471, 1763, -20, -3487, 6714, 4843, -10749, -5623, 10365, 6261, -1302, 1211, -3240, -5614, 9049, 12389, -4238, -6037, 5631, 2773, -575, 5983, 1361, -5123, 5529, 8332, -6387, -6040, 8075, 5334, -1561, 1956, -2837, -8063, 5715, 11988, -3827, -9087, 1353, 952, -647, 6086, 286, -9406, 572, 7612, -3937, -6150, 4318, 2466, -2816, 2437, -1484, -9148, 2032, 11167, -2012, -9393, -547, 148, -420, 6577, 1016, -10569, -2912]
770b912J0824q654m654P560k399l939P266j571j0141Q012J0327r826p631P104
784f34R68j309P902l676j3762N199J3049n336n374M578l259l397R134Q17j2120
799g220L352J1078o222o829N398j64k396Q744p05j4325K036J3390k394n826L330
814A247l867m728J1251L952j2215j274J0223l410m993N709j107n305Q742K822
828G047j2747p47J1896j305m498L320m213o095J0307P147j1545l623P797j028
842A713l481O034j851p636O762N826j0046k855R898o76m561L969l232p237Q845
857A472Q880j0223o092P058l8k476O239j509r764N467P783p628m398P933k48m499
873b043M721j758q553O967J0170q213p314N264R29j782O671r88j1526L200J0784
$$ y = [-2912, 7912, -742, -5396, 2164, -235, -4174, 3092, 1521, -8620, -608, 9719, -107, -7738, -634, 334, -975, 6927, 3251, -10511, -5312, 7737, 2401, -2973, 1605, -1654, -5051, 4083, 4900, -7220, -3868, 7210, 988, -5841, -443, -607, -3003, 5741, 5036, -9289, -7253, 6137, 3743, -2083, 1247, -2620, -7348, 3903, 7855, -4360, -5634, 4589, 1179, -3814, 1895, 788, -4517, 4225, 7047, -5700, -6447, 5449, 4144, -354, 2966, -1247, -7342, 2965, 10112, -1433, -5056, 2741, 1713, -1768, 4266, 2415, -5221, 1541, 7367, -2679, -5534, 4364, 3688, -873, 3096, -136, -7373, 1472, 10352, 129, -5963, 1095, 1057, -1419, 4820, 3311, -6453, -986, 6797, -831, -5229, 2704, 2456, -2043, 2678, 920, -7633, -666, 9504, 1291, -6023, -759, 170, -1612, 5059, 4071, -7455, -4255, 6529]
888F529m765n748N143q74l836O369O31j0410L460J0760m918p489L618L32j896
903c094Q084M79j2779K07J0998j329m818L358k836m628Q294L157r974p63R740
918D096k337n146L532r35m012P563L937j1085k767R182O50l423L520l401o625
933g251P484P259q387l751O972r27m222N072j059o152N687N776q206m346P696
948A645N78k956L971k179p976N934Q380o815m539N530j047l168N419J06p327L090
964a354P289o895l994P131j2l535L857m84p825M445Q321n381n818N366l8l450
980b377N816R89q761K345P969n116m727N356R61l787M140K62q344K439R999l780
996C384o968L365O70k789O260J616r508m76Q917j895m960L517j08l989M934K638
$$ y = [6529, 1764, -3984, 1159, 285, -3551, 2818, 3449, -6961, -3501, 7259, 2341, -5148, -1530, -1198, -3094, 4990, 5469, -7310, -7103, 3895, 2566, -2252, 1106, -1730, -6358, 1936, 5093, -4881, -5644, 4096, 1759, -3387, 145, -790, -4802, 2761, 6698, -4387, -7154, 2028, 2678, -745, 2775, -626, -7251, 233, 7492, -895, -4646, 2326, 1399, -2823, 2249, 1190, -4962, 725, 6501, -1705, -6051, 1645, 2223, -733, 3238, 1059, -6917, -983, 7397, 582, -3957, 1573, 526, -2642, 2777, 2883, -4444, -1354, 5935, -960, -4954, 2177, 2165, -1370, 2487, 2003, -5822, -1377, 6944, 1563, -4255, 1111, 1073, -2377, 3439, 4428, -4333, -1988, 5981, 865, -3862, 1494, 2455, -1332, 2808, 3070, -5274, -2835, 7164, 3384, -3584, -219, 451, -2338, 3922, 5538, -3970, -4446, 4471, 2576, -2384, 1133, 1025, -2964, 1970, 4608]
1012D608r114j54R435j510o075K477o14l217O614L953r600l470Q023Q75l632K902
1028A501j654n579N628N316p333l305P086q4m215L242q36n346N533O315p510n262
1044f503O368J282k604L841j244p262L595P555m734m436M939p0l496M570N89p121
1060d731K811P492n396m831N197R43l070M395K53p818J870Q117l529m368M098
1075A433m99l811M597K130o841P25O880l439m728M703O33l380L504J512p560R09
1091c232Q225k881m898L282K47l908M680K818o891j085P386k020m782L658J086
1106A685l733L555K401p235r66Q330p49n151K053K30l318M577L909p232k637O782
1122B501L21m601K902L69m525L985M161o504l119P085J085m524J671j27m401M258
$$ y = [4608, -4506, -4660, 4775, 3265, -2810, -333, -947, -4164, 2450, 6403, -3197, -6667, 1356, 2231, -1401, 1501, -153, -5732, -104, 5212, -2121, -5426, 1660, 1576, -2639, 603, -233, -5579, -46, 6269, -1241, -6503, -135, 1147, -1457, 2384, 1140, -6122, -2527, 5028, 294, -4142, 797, 727, -2769, 1801, 2390, -4731, -1920, 5572, 176, -4655, 542, 1485, -1585, 2810, 3063, -4755, -2885, 5232, 1703, -2665, 1433, 934, -2877, 1720, 3850, -2991, -2266, 4614, 1175, -3553, 1150, 1783, -1597, 1907, 3419, -4141, -3232, 4993, 2112, -2786, 496, 743, -3165, 1515, 4333, -2558, -3643, 3743, 1723, -3059, 599, 1685, -2048, 1507, 3908, -3327, -4293, 4037, 3288, -1863, 190, 420, -2898, 1679, 5588, -1644, -4281, 2501, 2822, -1779, 1123, 1492, -3033, 952, 5113, -1391, -4510, 2575, 3660, -864, 807, 680, -3721, 537]
1138E37O008o038n366N627J189l143L249l30o050L060O139m700m544N190Q04l714
1154b082L164J95n914K756O820m133n588L839J277k745L963Q60o922N06P260k292
1170I64m805L592O03l550L629J769n888N48O241k209m784L281R15k611L592K247
1186C534o299r93O894o96m603K815O35l982L567K998n383j172O253j398m853K915
1202B32J666l365K326L039n867j454O476k00m521K029P81m097L343L803n295k467
1218c571N586nm279K187J293l759K404M274n635l257O322J219m047J657N39m346
1234c418K850N517m770m149M805J172l518K470J068m426J596N418m217m290M818
1249I26J379k621J559Q45n188J617O289k565n247L081J501k715K829J391n666
$$ y = [537, 6545, 507, -4859, 768, 1957, -1186, 2063, 1733, -4317, -1257, 4882, 182, -4362, 828, 1632, -2082, 1082, 1277, -4637, -1881, 4939, 806, -4782, -943, 334, -2411, 1552, 2412, -4510, -4004, 3256, 964, -3841, -249, 354, -3196, 433, 2202, -3686, -3138, 3103, 894, -3890, -609, 306, -2305, 1287, 3534, -2765, -3758, 3136, 2440, -2163, 652, 1287, -2695, 872, 3870, -1513, -2685, 3568, 2170, -2683, 232, 1898, -1467, 859, 3898, -1969, -3423, 3053, 2853, -1668, 361, 1142, -2955, 388, 4191, -1104, -3571, 2015, 2010, -2269, -82, 1211, -2548, -144, 4130, -1505, -4762, 1560, 2779, -1268, 389, 928, -3418, -568, 4949, 179, -3970, 835, 2007, -1511, 959, 2027, -2399, -803, 4615, 398, -3892, 926, 2305, -316, 1243, 2088, -3100, -1483, 4806, 2241, -3006, 75, 1576, -1139, 1690, 3081, -2585]
1264b585K75N757j511m504L168J201l480K392K133n447j71O206j170m921K188
1279d69J259l052L001K581n581j722N721n10l968K687O55l421K094L193m717j462
1295c711N513l82m154K226J443l552K438L091m577k524N328N63l815K113J143
1310A143l642J743M085m022k675N035J16l754J631J650l447J968L865m209l377
1325c890N162J068l747J775J087m141J629M617l338l349L939J430l328J285J335
1340A534l753J145M620l173l739L757J875l022J199J263m358P01O069k529m113
1355b524K444J485k577J994J615m492R4N216j612m420K675J793k523J781J434
1370B383m585k22N417l80m693J820J557k890K326K776m518j600M979l36l920J942
$$ y = [-2585, -2310, 3447, 1936, -2568, 600, 1801, -1679, 713, 2846, -2601, -2772, 3434, 2264, -2657, -469, 790, -2262, 739, 3320, -2261, -3983, 1738, 1228, -2740, -53, 602, -2819, -725, 2468, -2249, -3711, 1802, 1420, -2734, -508, 935, -2617, -179, 2912, -1665, -4189, 1139, 1702, -2113, 0, 1143, -2499, -756, 3329, -693, -3368, 1667, 1783, -1971, -340, 1310, -2137, -169, 3696, -513, -3890, 1272, 2340, -1407, 368, 1455, -2686, -1057, 3560, 222, -3127, 812, 2242, -1086, 199, 1534, -2219, -1074, 3546, 373, -3366, 391, 2266, -756, 443, 1706, -2652, -1951, 4118, 1589, -2524, -80, 1405, -1172, 822, 2437, -2055, -1961, 3255, 1643, -2777, -102, 1691, -832, 949, 2383, -2202, -2424, 2993, 2613, -2080, -260, 1297, -1593, 733, 3509, -1009, -2609, 2370, 2034, -1886, 56]
1386E6J778l377J712K727l858k069M953M58m121J558J481k834J375L485l869k402
1402b947M452L74l716K122J220l543J543L413l015l236M359J008l701J019J810
1417A162l169J035L555k701l236L631J181l312J248J735l323K35M638k614l331
1432c266L583J341l351R95J908l460P42M290k412m098L317K066k850O31K151l454
1448a867kM311j159l821K294J943k818J001K134l359o33M804q51m464K338J916
1464A767k660J224K078l950q15M595j93l879J653J775k857J273K333l381j556
1479b593M446r8l621J200J897k461J027K672l317k191M472O36l522J196J630l048
1495a675J504K872k724k321L442Q62l325J188J650k653N03L472k349k878L441
$$ y = [56, 1834, -1543, 169, 2896, -962, -3031, 1922, 2380, -1741, -183, 1298, -1536, -161, 3324, -545, -2947, 1505, 1879, -1837, 285, 1505, -2038, -495, 2918, -97, -3333, 1026, 2034, -1667, -648, 1162, -2007, -972, 2583, -118, -3354, 277, 1458, -1854, -606, 1129, -2194, -1959, 2679, 65, -3266, 317, 1658, -1693, -698, 1210, -2250, -1508, 2782, 370, -3728, -411, 1655, -1195, -564, 1587, -1867, -1869, 2442, 1283, -2538, -244, 1699, -1119, -118, 2016, -1343, -1976, 2828, 1977, -2487, -149, 1767, -893, 331, 2409, -1541, -2356, 2239, 2046, -1833, -180, 1595, -1262, 11, 2344, -1037, -2593, 1853, 1755, -1866, -666, 1231, -1230, -203, 2469, -848, -3039, 1433, 2069, -1453, -257, 1373, -1675, -171, 2701, -23, -2344, 1098, 1960, -1365, -177, 1473, -1180, -677, 2795, 446, -2432, 1009]
1510A009J404l277R34J684k768M63L456k176k920K613J586k886J033J618k851
1525a078J75L210j704k941K636J477k730J38K084k626j65L771j466l494K296J627
1541A210k348O75K072l034r02M219j048l366J931J979k637M63J778k306p17L727
1557A696k15l697J499J733k189Q75J753k629j353M129J75l633J219K248k541J94
1573g36K711k343j675L565M92l374N32J946j519L44K050k435k320L694J115l400
1589a353J005J840k692L52K942k555k274L264Q97k888P65J265j673L86K729k155
1605a45k448L034J208k765Q17J479k378J24L238j326l010K678J127k273N43J867
1621A770k447j30L228j316l052K455J969k717K93J842k539m71L340p19k843J316
$$ y = [1009, 2413, -864, 70, 1754, -1014, -551, 2905, 729, -2191, 422, 2008, -878, 155, 1773, -1078, -903, 2307, 603, -2338, 298, 1775, -955, -817, 1267, -1359, -1524, 2247, 781, -2713, -417, 1210, -1138, -463, 1609, -1425, -2327, 1892, 844, -2522, -591, 1388, -1249, -786, 992, -1314, -2031, 1696, 1481, -2216, -717, 1016, -1173, -298, 1455, -1174, -2527, 1602, 1777, -1856, -637, 1611, -930, -736, 1975, -368, -2043, 1522, 2014, -1360, -828, 1118, -401, -57, 1993, -442, -2762, 932, 2047, -1353, -348, 1492, -1200, -848, 2094, -461, -2735, 529, 1426, -1462, -697, 568, -1105, -719, 2010, -145, -2593, 441, 1649, -1116, -299, 1180, -1198, -1074, 2164, 838, -2172, 506, 1633, -640, -97, 1770, -677, -807, 2421, 1105, -1947, 508, 2477, -240, 53, 1895, -644, -1115, 2225, 1506, -1337, -21]
1637b1J590j830J90J747k028j182L209o68k939J714J653k157J62J858k198j035
1653a935L492o2l492J281J802j460j50K127k153j554L021K76l126J278J861j748
1669e42l88K011j831j465K915O81l016Q62J350j621L43K433j972k244K971J043
1685A530k569L35J804j662j21K703j707k451K788R82k277L42J373j613l32K595
1701A720j457k154K059J144k112L01J438j772j88K338j120k390J860J290j848
1716h91j89J782j670m37L001j052k710J564J901k256O77J382j965p35L033j00
1732A335l022J410J701j657J8J493j308j121K680p6k660J421J359j730j63J806
1748A486j754j149K802L18k556O85J479j663j77K144j609j646K563M18k642Q80
$$ y = [-21, 1569, -261, -71, 1676, -352, -1534, 1675, 1007, -1932, -218, 1435, -722, -560, 1298, -900, -1935, 1557, 1495, -1997, -716, 1086, -374, -524, 1603, -550, -2104, 917, 1193, -1933, -655, 1206, -542, -930, 1081, -750, -2215, 700, 1381, -1635, -773, 577, -1044, -701, 1732, -240, -2484, 487, 1530, -1039, -704, 1100, -562, -683, 2020, 313, -2138, 650, 1632, -645, -303, 1070, -543, -875, 1720, 263, -1891, 168, 1312, -800, -499, 939, -833, -1021, 1317, 197, -2193, -333, 957, -891, -1080, 702, -968, -1405, 1596, 544, -2166, -602, 1299, -957, -280, 1102, -863, -1598, 1435, 1335, -1687, -277, 1424, -233, -215, 1278, -30, -1151, 1529, 1453, -1207, 214, 1573, -157, -320, 1486, -268, -1417, 1385, 1703, -853, -168, 1311, -352, -529, 1615, 6, -1640, 923, 1341, -1301, -421]
1764d21J839j677j17J854j801j437K614P84k525M03J523j309m89K037j273j861
1780a856K429R73k577M78J557j458l00K332j537k021K227J168k134k56J891j491
1796e75J74J580o57k165J738J198j801j85J678j527m85K278q52k036J597J514
1812A474k051q2J525j521k73K182o37k267R25J966j699p5J427j454q00K327k61
1829G06k513J193J602j638l4J724j628o33K036K02k517R09J451j386n3J653j484
1846d10j039K326K38k206Q04J329j402j19J515j094r48K045L29k264L56J772j584
1863c52J24J301j054j541K111Q84k083J05J286p01n76J849j098j632J787J125
1879A535k245K50J548j256m31J596o39j960K097J145k124O0J437j378j16J746
$$ y = [-421, 1418, -259, -376, 1478, -323, -1760, 854, 1638, -887, -484, 1039, -270, -759, 1278, 5, -1856, 573, 1546, -1031, -553, 1004, -454, -754, 1578, 41, -1980, 247, 1415, -719, -975, 916, -575, -401, 1179, 522, -1643, 95, 1293, -508, -693, 985, -542, -1027, 1251, 399, -1637, -40, 1474, -577, -659, 866, -655, -928, 1254, 617, -1650, -725, 1241, -458, -533, 894, -560, -1360, 967, 706, -1807, -614, 988, -650, -684, 1040, -588, -1221, 815, 1017, -1500, -591, 860, -526, -579, 1074, -410, -1449, 877, 1115, -1091, -287, 1042, -360, -479, 1036, -58, -1006, 1039, 1368, -896, -540, 1232, -352, -228, 1073, 19, -1522, 589, 1473, -610, -505, 781, 80, -496, 1353, 255, -1377, 410, 1535, -710, -460, 1088, -168, -599, 997, 358, -1602, 495, 1640, -484, -424, 1013, -365, -481, 1265]
1895A265o75j787J551J038j806J38P94n26q31J991m38j961J091J452j547n57J814
1912A006j493n01J962n28j888J003J638j635n7J213q57r94K042J1k322Q38J360
1929G98j127p9J257j318p59J914J71j991P11J359j068k43J007j116q90J986K31
1946H43j920N12J249j184j19J367o49j452K107M58k447N92J528j380KJ416q29
1963I4j126J267Q11j721O7J407j017r04J856m37j766J389J340j824m26J569r18
1980c39m53K123r94j720J559P94j477l84J652j030l70J856o68j762J336J385j961
1997d53j66J359r05m19J444j74j813J161J168j643j48J309o88m90J579k39j724
2014h42O81J095j058l91J362p10r79J910l44j711O86J602j631k9J394j156j208
$$ y = [1265, 590, -1197, 354, 1392, -414, -276, 518, -8, -839, 1152, 714, -1247, -156, 1296, -251, -808, 1006, -487, -988, 974, 446, -1442, -439, 1199, -436, -493, 720, -137, -1131, 911, 922, -1400, -562, 798, -329, -408, 849, -469, -1228, 686, 857, -1134, -423, 936, -132, -375, 632, -484, -1374, 612, 843, -1077, -565, 684, -500, -619, 748, 99, -1353, 754, 1212, -1235, -643, 885, -495, -493, 923, 94, -1032, 235, 1046, -675, -608, 799, -218, -1122, 734, 297, -1469, -80, 1260, -564, -990, 579, -339, -792, 1331, 337, -1383, 176, 970, -507, -891, 761, -269, -639, 1217, 549, -1213, 123, 1508, -453, -619, 740, -165, -584, 860, 686, -1127, 34, 1202, -441, -589, 720, 32, -458, 1121, 882, -842, -161, 934, -124, -515, 847, 137, -842, 1068, 724, -987, -301, 1301, -330, -359, 1035, -121, -1329]
2031a329J780L50j649K95J274j056n63J578j050p28J544L79j701M55J076q51m97
2048f93J452q51j053J601K56j389l0J556j021m96J555q73j527J964M08j394J36
2065c99J350j167k67J243m11j431J789M91j894J33J232r43l09J462m39j679J068
2082a71J016j162m70J172m89q02J464k98j455Q86J099j358l40J527r16p33J674
2099F44n56j549J121J386j428k98J191m79q97J554k94j153K75J449j164k40J115
2116F77n93q19J480J62j560M38J323r67o91J494o50r69J541K56j871N83J223r51
2134A06m12J173o87r01J429M06j580p8J399p73k86P07l35j364J307P83j563K18
2152d51J100o36p12J203m5j163P71Q78j768L42J358q01p82J274l63j389J500O27
$$ y = [-1329, 451, 801, -848, -553, 721, -335, -898, 680, -370, -1098, 446, 825, -876, -421, 655, -196, -693, 759, -92, -1145, 456, 712, -677, -707, 849, -172, -668, 887, 14, -1513, 451, 859, -535, -399, 951, -216, -483, 760, 349, -1082, 707, 1198, -696, -563, 669, -274, -583, 879, 440, -1239, -171, 845, -317, -787, 385, -104, -906, 558, 260, -1195, -309, 790, -568, -908, 619, -297, -1030, 644, 88, -1461, -340, 1046, -382, -680, 511, 32, -865, 689, 395, -758, -483, 966, -198, -438, 677, 84, -735, 745, 907, -653, -215, 1108, 141, -550, 944, 294, -675, 866, 1122, -749, -166, 1057, 106, -306, 867, 180, -721, 708, 1114, -466, -544, 855, 82, -204, 503, 168, -1196, 111, 894, -669, -451, 649, 13, -699, 504, 459, -704, 67, 945, -823, -481, 877, 76, -706, 568, 205, -1184, 316, 943]
2170I43j383J28J263r79o28J524n50j392J321P84j220m05J272p03n85J234k28
2187C96j326P77J257j423J52O30l07o79J097Nj572N81J513j338k73J105p30o27
2205g62J033L37j741O80J485j289l24R11n34p44J287J16j539L04J320q35k76Q12
2223B41k33r67J300L69j431M14R17q85o2O86l29q26J316L88j257K95Q17o73m48
2242c68J088n29r16J163O94j496K11R90n34o77J168o52j167J343O97j433j60J130
2260E52o15n89J426l08j479J124R61j620j26J138m95l71O48p5o83L00J244j214
2278a82l25Q54l37m42J180M33j842O86J257j384l94R50k25p88J042J50j115K62
2296b20J070q24o80J164l23o90Q59K27j560O79R86o51l49P99m35n60R99K00j241
$$ y = [943, -440, -312, 951, -28, -656, 868, 318, -1074, 247, 1031, -189, -594, 678, -25, -610, 624, 396, -930, -153, 1104, -319, -167, 463, 156, -523, 574, 579, -993, -412, 1101, -237, -510, 595, -135, -762, 271, 608, -1133, -453, 1032, -257, -581, 330, -204, -948, 339, 455, -1084, -780, 540, -295, -571, 241, 8, -959, 341, 710, -721, -307, 610, -275, -337, 349, 20, -806, 510, 898, -359, -64, 753, 80, -368, 720, 191, -725, 438, 1132, -364, -153, 837, 303, -374, 794, 142, -1025, 318, 1015, -418, -578, 552, -63, -652, 774, 466, -1013, 111, 1072, -548, -674, 464, -31, -402, 246, 171, -512, -212, 1032, -182, -507, 347, 10, -432, 748, 1181, -661, 25, 1282, -102, -496, 454, 229, -559, 483, 633, -482, -220, 850, 26, -654, 510, 187, -503, 356, 583, -977, -298, 688, 37, -312, 487, 52, -508, 491, 691, -550]
2315e50K60J011j025k93R60j69r89J154M29j392J17J030o42o93J068j43j299J229
2333F3M83j302L14P09l51k36N81k99r29J324K8j029R5J054m76n62J266j98j373
2352h38P35J197j567j18J077l20r41J378m82q90M11J101j087k37J148n75m53Q03
2370C42J36j007L10P70n60k66R32n09n83Q73K27j480O70R05q53k38O89j4r05J097
2390E36N6r77L40J087j397JR48k01j115J024M19j254N6J465j065m31R86m67n14
2409e03Q51P8p40R1R86l13r39Q30O7q82O12Q19j507J83R49n67l57L67K15q21R40
2430C59L44j278K66Q22p05m11J088m89p30P17O16j127M0R63l98o21Q75J49j232
2449g52O80P17p89o23J031J2p47M96M93j253O84M98p16l29P62k83j29M25J9j085
$$ y = [-550, -290, 721, -304, -597, 363, 194, -795, 359, 788, -604, -487, 543, -99, -792, 276, 133, -1166, 63, 546, -756, -442, 267, -84, -320, 261, -38, -967, 357, 385, -644, -549, 505, 29, -533, 733, 535, -838, -103, 1094, -473, -591, 486, 166, -775, 603, 121, -769, -358, 743, -344, -581, 567, -8, -461, 342, 478, -529, -219, 551, -9, -275, 657, 148, -435, 438, 665, -815, -145, 760, -93, -331, 358, 344, -561, 536, 592, -385, -45, 1042, -355, -354, 594, 393, -722, 302, 721, -533, -477, 988, -77, -508, 478, 11, -503, 348, 426, -314, -223, 763, 450, -489, 341, 408, -474, 138, 957, -550, -367, 582, 15, -342, 25, 240, -581, 359, 703, -575, -309, 513, -192, -603, 485, -4, -734, -17, 599, -528, -488, 475, 77, -544, 331, 480, -752, -72, 645, -144, -767, 264, 276, -471, 25, 518, -735, -51, 447, -269, -598, 164, -119, -248, 177, 196, -889]
2469h89R96O79j014o55J180n84k26N27L88r76N3R22n08n44J070k83q54Q66K33
2488C81j189M24R06p54k11J112n27o30Q12M63j303L31R11o61p46J221l43p95Q01
2507B03M99j219M19J108j127n48Q17K82j053R35M65j023q4J105o80n99P49Jp07
2526d57Q92J62r34k05J361n57o31O84Kq64N14P77j074k58J236m55p31O23N19j458
2546h54Q09J166j309m04J224l00m87M18J32j313R15O96j059J44N81k62n64P35
2564B68K22r79L03J042j121k88Q75j16q31O80L91q32J3R98o77l54N26k23n87O64
2584b6K82q65J67J083n02p32R50m29o61R77p0p36j18J428p68n52N79K8p18P76
2604I3O03j303L76P07o44o08J116j38p19N44P89r64k37R62m86q06J297j40j132
$$ y = [-889, 107, 786, -228, -883, 297, -287, -513, 14, 402, -574, -521, 401, -107, -651, 419, 136, -718, 148, 381, -808, -384, 522, -232, -443, 669, 142, -488, 324, 787, -516, -185, 726, 65, -681, 540, 197, -598, 203, 702, -517, -98, 1010, -117, -665, 152, 434, -619, 316, 781, -242, -326, 779, 99, -500, 249, 250, -457, 435, 597, -337, -542, 819, 262, -369, 315, 317, -547, -33, 744, -330, -588, 648, 193, -538, 85, 604, -854, -45, 1121, -188, -592, 632, 332, -155, 263, 395, -918, -3, 693, -366, -222, 359, 97, -467, 268, 490, -489, -186, 856, -265, -553, 322, 206, -625, 55, 446, -386, -373, 625, -52, -406, 120, -103, -690, -26, 256, -609, -442, 641, 139, -593, 357, -72, -733, 244, 174, -562, -680, 748, -20, -572, 7, 35, -683, 93, 696, -607, -231, 476, -168, -776, 340, 202, -517, 27, 816, -148, -385, 577, 91, -715, 582, 442, -690]
2623f90P82L24q75j48J280n56p55J015J3r14M00O74p41l73R63k56o64Q24J09r54
2643e42K95J179r28n55J063l25p62Q79Po96K33Q79r41m00R16o2o96O12K39p00
2663c05M13N36m76j84L43N8o52M44L13r41J10J112q62l11O20o1l14M13M56r31
2683b19M4P96o42q28R94j6o03L15P79j125K28O73m70k17O39m5p10L21M82q19j63
2704e86R50m01n67P99J09r45M14O57j019O3Q31l94n38Q10K36r42L76J008j097
2723b36o1M12J6o15M73N36j149N76N47o79n65Q79L8o85N53L24r18K76J180j118
2743b16m79J163j53q12P27P3r91M34Q10q13m14Q59L3p98O08N48j354N44R76n17
2763B28r20J168k23q86M58P53j101K34Q16m51m82P89K08j029R76J22q79p3J134
$$ y = [-690, 92, 416, -459, -607, 673, 117, -638, 377, 390, -524, -124, 550, -191, -564, 399, 143, -521, 303, 412, -542, -247, 932, 4, -551, 512, 187, -575, 304, 311, -385, -152, 727, -214, -614, 302, 240, -456, 156, 395, -305, 108, 644, 168, -16, 327, 385, -267, 177, 490, -451, -341, 771, -91, -402, 218, 157, -157, 256, 712, -219, -175, 621, -21, -849, 145, 129, -474, -159, 620, -505, -277, 396, -74, -291, 348, 303, -407, -86, 396, -423, -586, 364, -37, -604, 195, 304, -641, -227, 430, -589, -526, 305, -89, -627, 183, 419, -523, -147, 861, -236, -297, 115, 131, -484, -11, 525, -624, -48, 499, -180, -745, 134, 172, -513, 40, 364, -554, -278, 902, -216, -695, 468, 315, -497, 230, 303, -688, -254, 556, -257, -671, 188, 221, -577, 31, 579, -775, -231, 745, 228, -692, 476, 253, -633, -175, 578, -523, -289, 527, 76, -406, 383, 591, -438, 538, 660, -219, -292, 842]
2782H42q15k97N63k8r42N93N95m87l60R10m61p02Q74L9r57N27M21m16j29O88l61
2803I7n03N65M18q76M83N94j203o8J126l10p79P43j43p71O02N26n96k79P61k31
2823A56n43M17K66p70L47R08q22o96J178l77p38R91L05j192J43Q17n15m47R49
2842C77j16o73L62K34o49M92O78p73n83R73j6q54L65N21j086K78J026n54l00L06
2862HM38o41Q8O79j133P0Q63j01q27L59M74o32L37N24j040J19R22m37r29Q34N01
2883D76q38J40O27q73J20Q40m45n83R52Jn95J6J028j272p5J084l66p81N07N85
2903E48q21J01Q19o07m45Q85n01l78O23L44r25K24N24l75l89O77j46m91K30O41
2923E38q55J15P17o86j65Q15k39p72O18N36p85j77J313j164k15P74q5n96L33K16
$$ y = [842, 27, -270, 293, 265, -677, -84, 511, 24, -336, 574, 113, -589, 285, 324, -633, -106, 315, -101, -230, 458, 97, -406, 159, 577, -299, 184, 778, -425, -493, 633, 323, -456, 287, 144, -627, -25, 501, -95, -374, 387, 156, -387, 30, 296, -474, -127, 781, -41, -737, 441, 64, -674, 317, 622, -570, -427, 390, -125, -572, 377, 261, -412, -50, 184, -465, 27, 705, -68, -651, 322, 306, -548, -183, 338, -748, -470, 556, 2, -298, 8, 446, -195, -107, 572, -561, -491, 372, 271, -556, -197, 277, -355, -18, 506, -534, -415, 507, 70, -859, -25, 476, -362, -222, 405, -468, -348, 492, 47, -536, 416, 417, -178, -162, 866, -406, -481, 603, 237, -544, -37, 548, -273, -172, 647, 40, -405, 480, -21, -399, 224, 568, -357, -133, 391, 16, -373, 304, 158, -333, -103, 538, -317, -202, 515, -171, -336, 479, 240, -532, 86, 622, -163, -340, 973, -191, -406, 368, 283, -313, 20, 236]
2943B36m94J4P72l57p11J121l00q06L56O03q24Q6P59n24m70P50K67r53N87K33
2963C45o27J31P56p92l62O90j2o65L69O89p59m43J051j84p15R05k52n21L21M34
2983C59o55n6R87l77o99N73K75p65K5Q61p67r1R13k33j010J022m7o05M53M20j061
3004d78J13O54r0o82O35L59o81J32O89q60n45R66O8m17R7O73p45j09R69q44j45
3025b41N67J44j045O65L77o96O5O40l64p01J043r3q29N85M21q92J56L95j24m89
3045d16O40J42o76K21N71o83j54Q28p13l98N48N93q27N27K04m01m43Q53k10p55
3065e49Q66K2o28J35M80n49k79R53k35o86N86K07q83M28N66n27m64P09J15o71
3085d04L97L18m15j08O38o78l77J093l37n52N19L50o72l69J196n95m79N65J17
$$ y = [236, -258, -244, 528, 171, -540, 581, 281, -525, -169, 434, -390, -304, 455, -69, -539, 211, 478, -475, 112, 345, -282, -151, 605, -187, -549, 141, 129, -536, -167, 522, -237, -680, 371, 187, -528, 377, 125, -396, -75, 359, -296, -352, 635, 258, -441, 132, 407, -358, -333, 528, -239, -330, 583, 350, -660, 362, 315, -290, 163, 583, -478, -365, 289, 199, -483, 152, 511, -170, -38, 651, -209, -754, 212, 280, -137, -40, 633, -112, -221, 748, -96, -241, 326, 470, -575, 90, 467, -229, -164, 476, 112, -589, 454, 361, -468, 117, 538, -354, -198, 197, 73, -416, 224, 366, -310, -89, 482, -201, -355, 473, -240, -638, -90, 503, -324, 203, 407, 6, -437, 416, 206, -549, 317, 339, -289, -154, 326, -223, -502, 451, 216, -470, 116, 323, -560, -132, 434, -93, -557, 152, 267, -404, -7, 311, -104, -212, 426, -252, -629, 464, 127, -425, 94, 444, -228, -597, 599, 4, -475, 90, 207]
3104B07p04N09N33r40K4M45l25k91M57L40o19L76K30m49K5M37m12n41J276m78
3124A00p09K31P83o48o6N90k77m78O66lm83K77K98p78K91O63j66q88P73L88o96
3145a32K87k8n46N3P49l34o89P76L46o59J30N15n08j60N57j68m77J27O69p77J3
3166b56O80l18n10J233p42n27O01L56p60K52N22p54k5P61m11n60N95K76q23L9
3186c71N58r4l79Q18k71m97K78N49o64l24Q72n09m60Q08K12j032M34M40o70o7
3206c69R52p30j61J99M32r55O95L85k71l82N44m07l00P70M3q84N54J45q34k6R43
3227C43l19p45R94o7o29P7N60n08J10M94q6p53O16K69q22N89P38j060K6N22m9
3248C00q40N85M24p21K4N88m72n9N67k00o59M91K02k98j91P75r11k9P16j01p26
$$ y = [207, -497, 12, 545, -395, -371, 74, -251, -542, -85, 255, -364, 12, 242, -207, -182, 255, -157, -698, 578, 100, -609, -378, 405, -243, -309, 281, 4, -474, 192, 189, -294, -17, 281, -497, -206, 457, 291, -597, 176, 564, -132, 155, 127, -419, -366, 383, 49, -640, 136, 482, -177, -47, 468, -40, -200, 357, 189, -288, -161, 508, -269, -256, 424, 106, -404, 829, 87, -440, 161, 517, -243, 9, 531, -223, -248, 513, 102, -458, 137, 413, -410, -371, 187, 93, -286, 532, 261, -236, 42, 591, -73, -397, 475, -34, -494, 314, 526, -506, -72, 368, -302, -369, 583, -147, -308, -109, 323, -632, 63, 448, 177, -205, 339, -68, -368, 402, 445, -439, 115, 260, -574, -600, 343, 24, -721, 273, 206, -423, -346, 214, -294, -184, 310, 224, -529, 87, 356, -466, 123, 861, -199, -173, 349, 300, -540, 45, 469, -252, -228, 360, -112, -171, 396, 196, -463, 28, 230, -68, -259, 516, -395, -424, 292, 191, -535]
3269e35O47K44o87L09M17p01j09O34j97l00K94l1p5j51P03p03j32P84j65n35J43
3290a46N12m30j45N08m77l46P06J40n52K34K97l27p7Q86p78j70L54J77o59K76
3310a7O15p08j50M60j69q6P2J56m66l5P81o72j06P29l54m37M15M1k08j91O38n34
3332b26k6L75K51r56P08L51o38M0L58k24k53P08m54m50M56M29q14R7P11o85M6
3353a96M99k38l12J16M86o51J12N93n48k78P98j56n88K55L84o35L62K75k87m71
3373d80Q58k96o25N64K88l25k83M43m42J99K15P6q49O31K79k24m00M75p1k13K90
3394A10m1m79M23N22q67J96M66j35m13L81K77n84j22N14n53L8O53l05k35J2K75
3415A33k69j16L84j71k85J194r91m43P41L15o58K13J51m8k41O03m12o72N55L57
$$ y = [-535, 112, 356, -331, -22, 395, -306, -415, 219, 22, -278, 16, -15, -90, -241, 462, -241, -373, 411, 246, -289, -146, 366, -64, -209, 299, -178, -524, 182, 322, -230, 4, 301, -26, -103, 783, 5, -165, 189, 366, -293, -17, 598, -110, -260, 200, 31, -55, 17, 173, -293, -328, 453, -219, -325, 404, 50, -387, 28, 69, -139, -330, 308, -226, -252, 123, 374, -582, 126, 477, -161, -121, 237, 13, -240, 468, 14, -436, 20, 449, -365, -268, 443, -242, -196, 303, 65, -247, -131, 355, -296, -184, 409, -139, -417, 381, 225, -363, -108, 276, -359, 3, 278, -9, -480, 378, 82, -543, 21, 309, -16, -299, 144, -298, -99, 116, 192, -657, -26, 253, 29, -371, 104, 33, -180, 110, 69, -410, 13, 535, -332, -136, 330, 195, -218, 163, 440, -144, -266, 248, -305, -267, 386, 81, -154, -142, 133, -136, -252, 132, -39, -324, 870, -121, -564, 177, 492, -166, 47, 198, 150, -91, 512, 100, -572, -17, 340]
3435C40n54J35P00p34j64N88N4o49L44J81k99o1M83n77k42O66k88j30L55K9j9
3456A58l63M61j78p18Q95M7o41N96J44l23k53N46m10l46K53L34m76J51O33o06
3476i6K1N32l92o36Q93p6n35K50J46l48l55R32l64k92K20oj04r2N94j98l67P40
3498D67m82m44N75L99n70J17L4m02R8M77k41k18K67P7l92j45Q20o22J44L12J04
3519C75p90J71M09j92q6L32k64l97O18q8k27J47N31q42K25K94l48k47M75J09n45
3540c40K20O67n57k19N24m12j41M96K0k45m9M08p59K00P13o40m4L8K44m08K73
3561a1M43p26N3M61j1l83K37P5k50P2L57k05m58P37o67k0L44M49m02l20N04l35
3583e6k76M35K52n28K26J89m35K71J18n45J49L92j19l88M8M33l44J01J95j37l26
$$ y = [340, -214, -79, 621, -113, -277, 311, 365, -284, 60, 241, -58, -119, 364, -213, -455, 211, -77, -207, 148, 177, 158, -205, 256, 78, -640, 255, 302, -339, 257, 401, 78, -175, 371, -39, -385, -132, 202, -274, -123, 510, -96, -75, 457, 65, -571, 322, 246, -289, -39, 107, -241, -596, 336, -28, -320, -100, -106, -210, -302, 292, 94, -273, 467, -15, -459, 116, 515, -55, 62, 96, -306, -208, 269, 28, -190, 77, 154, -238, -383, 437, -185, -41, 271, 375, -415, -244, 165, -27, -113, 219, -45, -442, 176, 88, -139, 8, 539, -303, -78, 216, -132, -379, 96, 205, -340, -120, 547, -10, -229, 295, -117, -258, 238, 258, 13, -36, 372, -387, -187, 526, -114, -158, -120, 124, -284, -11, 432, -294, -241, 220, 209, -174, 63, 138, -112, -40, 317, 112, -346, 391, -276, -296, 48, 497, 95, -225, 279, -56, -332, 103, 355, -173, 53, 242, -193, 78, 196, -349, -200, 192, 73, -315, -267, 166, -178, -77, 118, -19, -345]
3604c45O49k95l38K77L59n08L25m5k22N3J79m5m54L75K43q0k24M29k34l50N19
3625B68k17k12O2M48n60p9M71l38j32L43K29p18K41M60l98MK15n5l21N07m0n05
3647c27L65K00l78r3N65m09k56L63K57r16N90L39m86j02M05r8m08N35P2o45Q1
3668c46O67n55J44L90P3q47L62L92k19j18L02k13j37r7L67l81L09l5l45K01J09
3689B3j09m4L76m7n37N31n7J05q5J5k26m45M58N7m41L24N23o17m8K80k20K17K68
3712C01l81j50K47r7p8q8M34j71r1L74m31j33L91L13n37j70O41k22mj81J15o40
3734e58L96P06n32J6kJ44k90J30L81o71L66L22k65l86M73R3m14J21J78o48K06
3755b34L62k5k39J70j27m45N37J86k97m7N31m38k68M40p5n42M40L81n45J87J58
$$ y = [-345, 304, 9, -329, -52, 307, -201, 124, 79, -143, -90, 89, 44, -410, -35, 208, 128, -96, 333, 99, -251, 268, 51, -161, -99, 349, -211, -290, 181, -157, -289, 54, 283, -435, -194, 266, -132, -128, 87, 32, -289, 218, 178, -327, 38, 238, -140, -233, 332, -77, -333, 30, 287, -629, -39, 300, -186, -288, 117, 19, -389, 146, 218, -427, -346, 321, -234, -90, 300, 373, -474, -112, 280, 61, -57, 245, 32, -105, -202, 165, -216, 93, 58, -287, -86, 23, -86, -130, 246, 199, -338, 193, 136, 241, 156, 171, -55, -500, -42, 15, -426, -102, 421, -196, -244, 36, -184, 33, 301, -80, -230, 17, -80, -158, -246, 188, 17, -74, 300, -131, -264, 127, 440, -97, -267, 374, 152, 148, -33, 82, -558, -162, 544, 12, 28, 26, 170, -120, 10, 391, -280, 86, 408, 143, -243, 230, 323, -91, 30, 208, -440, -234, 128, 103, -136, 34, -93, -538, -1, 185, -112, -159, 372, -66, -334, 106, 31, -511, -71, 310, -235, -48, 110]
3776A10m24j52J010k55m34J10K84m04J03L17m65Q5L11J04l88O4L32m34j12N54
3796C16l77j60L99l22j65L93J12l61K23J55k65jL27L6n12L39J89n24J12m4J66
3817C6k55M04J9n68K3N14j18j71K57j34O7rj12m41M45L19n82r7N39n8m82O54R8
3840C48n15O3L51m30k3L01j98j03J69K56l43r8L22P3n75Q05k27l27J41K26n15
3861b99P7O31o95J2M17o4l61N19J37m40o5K10Pl93O86j83n37L54J73k12j78M99
3883B95j54k16J60P3l09O4K65l18R8K9R5m41M91p8k52J93J39j82p9K88L6m69K06
3906f6J73k92J66L78o79K63K12k31l37K95N46l55j50K87m76K06L84m15j50J60
3926h1M43o28L27J11k09k09O09j88l60L7L94k08l67M37l06M1J28l3R8J02J82m14
$$ y = [110, -314, -466, 544, 289, -145, -35, 249, -155, -52, 265, -200, -115, 196, 300, -88, -24, 308, -126, -238, 316, -61, -221, 178, -144, -309, 84, 196, -165, 58, 213, -52, -53, 274, 310, -202, 137, 326, -198, -86, -130, 36, -219, 185, 204, -364, -341, 173, 55, -116, 141, 7, 74, 65, -47, -488, -43, 276, -306, -403, 136, 78, -404, 250, 348, -167, -104, 247, -183, -206, 95, -103, -206, -37, 219, -124, -222, 100, 173, -402, 403, 176, -151, -10, 216, -299, -222, 409, -286, -274, 143, 79, -282, 237, 374, -66, -131, 79, 86, -307, 379, 196, -341, 13, 186, -26, -204, 295, 141, -75, 85, 158, -151, -87, 178, -140, -42, -13, 82, -359, 132, 54, -198, -5, 134, -48, -127, 161, 197, -272, -66, 107, -185, -19, 359, -320, -57, 155, -76, -413, -118, 428, 73, -77, 210, -266, -60, 324, -91, -241, -81, 362, -266, 61, 172, -37, -246, 363, 175, -185, -148, 246, 38, -329, 108, -198, -157, -29, -62, 36, 138, 320, -94]
3948i4j28M00j59k45L24j8k85M56j14j43J01J23j88q8M41k84k53J52L28m08M6
3969c6r1J75r5J30J30m62K54L54l91j38K35o4j71M37Po56N45J62l61j36O72n25
3991b5m00K80M22m56q8O57m43k45M18k71k49K73J98j58j57M24j11j15R6j34l10
4012c94M65M4k80L1L30k29j95M05r8j44nM37p58L02L88l64m3K9J31k98L97K3l47
4035a73m2N06j92k04O8J40k09K06J48k73k86N30j03r2K56k45j62n7K71k81k40
4056d34M55J45o30M47L01o03M16L94o18j19N94k28j36m02O17m62K71N01o02K08
4076A15Lk77L2j00M25q4l56O88m37l87M98k66j28M62J42l21k00K80k57o3O31j35
4098B65m32L64m8n4l54K96Q9m27L26o9l11L63j32K28m04N91l38p5K1J00j28L0
$$ y = [-94, -222, 178, 19, -226, 98, 80, -205, 251, 137, -6, 95, 218, 30, -58, 383, 99, -154, -2, 326, -82, -36, -127, 48, -47, 83, 213, -249, 5, 359, -32, -170, 65, 1, -170, 267, 274, -382, 163, 325, -36, -172, 500, -25, -425, -145, 277, -179, -267, 390, -53, -298, 120, -151, -400, -127, 71, -87, -244, 180, 69, -46, 50, -84, -394, 71, 115, -165, -134, 196, -33, -228, 177, 79, -65, -70, 367, -391, -89, 299, -65, -108, -79, 52, -246, 151, 174, -173, -215, 291, 99, -105, -37, 103, -106, 100, 248, -25, -311, 219, 116, 24, 280, 35, -127, -184, 87, -194, -434, 21, 166, -464, -17, 284, -319, 97, 491, -127, -246, 348, 120, -16, -418, 199, -263, 8, 509, -93, 115, 118, -159, -127, -227, 198, 114, -242, 446, 9, -378, 120, -146, -274, 188, 330, 9, -191, 89, -168, -231, 400, 265, -167, 197, 149, 95, -259, 37, 126, -301, 25, -44, -355, 8, -124, 104, -300, 291, -47, -122, -101, -1, -129, -99]
4120i9Q4P3k97J71j3j17L88l36r2J58N48p85J91L69j56l07K92j96j04J48K34l40
4142a86k71N22J49l53P3L0l98L80K31k65j25L24J49Q7j97p1l04j0N23j62l43M50
4164B33k38l68K81Q4m7m4K62k70l56O67k10m2M6J29l31k09M78o8m0J91j54l14
4186c20N49K5N4l92L87j50m98N59j30o65R15j43j45k0J47l06l01N57k65j53L11
4207A6K09l04k83O83l82o8K53p2l18L37P0k77r0K71O3k10J28L85o00L4L27n55
4229c83L52J03N0j80M99l05m16J25M52q0o60P59l21k49L45O0l79R6L02k25k23
4250b78K50J45j14J71o4l47J73M51n25o9M69j32P6l05K29l27K2O78p24J26K83
4271A88l14j0K05L07m35j47M18p7l93L76k92l7L46K47o02J27M01l53P5O9Q2j53
$$ y = [-99, -15, 58, -239, -68, -81, -198, 190, -146, -238, -80, 468, -317, -126, 243, 87, -220, 72, -124, -228, -80, 154, -186, -457, 65, 214, -139, -66, -36, -434, -54, 177, -88, -213, 111, 260, 347, 150, 79, -225, -235, 288, 126, -217, 233, -5, -373, -92, -8, -55, -99, 163, -107, -463, 204, -6, -48, -2, 127, -204, -413, 65, -3, -43, 148, -6, -320, 229, 254, 308, -84, 303, 153, -345, 214, 84, -581, 334, 191, 46, 26, 173, -133, -434, 123, -142, -295, 16, 225, -79, -362, 321, -61, -129, 124, 52, -266, 71, 141, -136, -226, 45, 108, -102, 26, 411, -189, -155, 172, -383, -31, 72, 122, -58, 441, 136, -280, -155, 297, 217, -443, 316, -5, -254, 91, 151, -228, -132, 170, -55, -278, -28, 117, 3, 174, 110, -237, -64, 387, -138, -207, 262, 130, 206, -99, 130, -197, -175, 503, -221, -95, 188, -126, -136, 69, 376, -59, -206, 212, 135, -258, 118, -174, -211, 135, 382, -220, -93, 308, -45, 30, 99, 181, 28]
4293B8oj14o8j73M70p0l26L11J18l28J80Q4j46j49K36N1k00K49J46m63K33J66
4315B29m03j32N18l7o22N23L11l90k79L18j02m6L56L0n72M99j94r4L10j67j88
4336a32r5N43l07m46M31K11l69M5P7J77m80O78jl11j0Q8n7J17k7n4j93K41m26
4359c00o3M62J31n09N93m1l91j64N74l41j55J53K7k36k69R46k53l31K50J87p38
4380d68K76M11j89j47L99k63l62K41K96l24m3J91P1j83K47o1k54P9K50l18K24
4401G3Jk69R4J76J22k90K66j83l2j91M97k34l7L84k21l92L41p1k40J12K26j87
4423e5k94O99j81m59L04r3nK5L87j11k81K42k73k35K26K95l07o7N75m31j32O20
4445D49l15m58K99M25m46J05k6M3j46N8R5k82K00K81m35K13L25q5n10L56m6k37
$$ y = [28, 22, -92, -160, -333, 137, 67, -259, 52, 170, -158, 22, 106, -40, -189, 47, 98, -102, 147, 293, -170, 63, 229, -174, -306, 212, 175, -447, 76, 387, -3, -282, 36, -66, -112, 244, 274, -298, 201, 7, -87, 223, 56, -132, -227, 316, 9, -437, -6, 205, -164, -119, -42, 135, -345, 333, 332, 21, 11, 99, 42, 159, 132, 78, -115, 126, -300, -363, 99, 230, -279, 314, 273, -118, -282, 292, -49, -204, -51, -24, -260, -529, 417, 164, -167, 83, 270, -468, -192, 219, 30, -117, 282, 19, -343, -102, 194, -130, -173, 18, 89, -94, 153, 92, -162, -83, 167, -151, 73, 74, -195, -101, 75, 197, -93, 173, -10, -42, -233, 264, 30, -7, 377, 156, -236, 105, 34, -206, -94, 132, -55, -349, 350, 169, -290, 14, -79, -84, -59, 328, 217, -64, 178, -95, -330, -104, 191, -116, -183, 392, -39, -171, 449, 134, -324, -25, 400, -46, 59, 33, 76, -70, -12, 83, -199, 1, 282, -153, 60, 385, 300, -210, 146, 100, -137]
4467a37K40n4j07j60M69O2m67J38K63k10J4L7j3j05K43m49L04m4K66m49J31K21
4489A93m23K2L25j40l96L51J99j36j94N82m97Q2M1lr6K71k77J7J44K35l16N3L36
4512C73k90m64M37J64l9m84N81l79J1L60j93k0M2J36l05n8K76o3l89N13k25l67
4534c83L77K58l63K43r5n7j86J90P8l58K82l00L12j60L74l28j29K03K05r1O5J32
4556B69m67j02L84j62O9K75Kn21K19K82k36n26N69pm72M22n1l4J49J03j93o7L6
4579e9M0M8j94N60m06j96J26J3P9K59j78l03J00K78k36J07J75l70J17L98k48l77
4601b67K22K32k81N1K46j37k35M21k65j44J7L29k15k29N85l85l02O20k91p3J99
4622I8l6m0j87M08l78j09L06lJ74j84j73J35k82M70q6l16L9P8j23K58K23m36l4
$$ y = [-137, 103, 49, -58, -218, 251, 313, -154, -16, 247, 37, 51, 88, 75, -30, 213, -236, 68, 24, 290, -159, -28, 193, -230, -208, 117, -23, -419, -68, 131, -5, -199, 383, -114, -32, 9, 6, -90, 181, -96, -79, 65, 300, -16, 37, 373, 83, -381, 56, 220, 181, -303, 278, -101, -90, 270, 77, 57, 99, 235, -70, -128, 148, 85, -304, 209, -16, -383, -6, 252, -111, 132, 37, -20, -206, -16, 62, -296, -14, -314, -2, -162, 212, -116, -245, -42, 163, 72, 137, 269, -198, -300, 84, -78, -9, 266, 268, -253, -34, 248, 12, -514, 55, 48, -424, -2, -53, -87, 62, 165, -28, -95, -59, -19, 29, -165, 395, -11, -207, -81, -68, 11, 270, 92, -211, -111, 167, -69, 38, 213, -157, -40, 358, 110, -267, -45, 187, -94, -43, 203, 66, -169, 252, -13, -157, -140, 189, -26, -255, 330, -55, -357, 263, -28, -101, 98, 62, 22, -165, 243, -135, -244, 62, 59, 233, 49, -124, 11, -271, 199, 113, -203, -164, -86, -209, 49, 272, -164, -198]
4645a98P61m52q8k50K59J46o5J92n49M1K94K9m45L02O8l09L94j31k99J83K23J40
4667B46m15K40j51K6l11N71j47l34J21J77q5k27L87k62J99L54k02o62L21J94l91
4688c51L37P4k23K62J79j69k26K78j76J46j84L56o6k32K54k67j60K36K37l62K10
4709A53k37j82J22R7j42J00L49k86j23K32o4J60m44M19p2m27M58j12m51M00J76
4730A26m62L3L41p0K12n8M6k62o4J07J1O0J80k56j34K30J31m73J67K42j45J10
4752G2j14L37p08M84k18j26jO98m65j96M02l24l2M5J42l5k67O16m78R3J62m9n36
4775d98O67K01o13K96Q4l08pL49M5n86J03J04k41K49K70k03M1J46j77n7P2O4l10
4798c09L96o3o5j66N78n23k41L89L08l80M3o6j58K96O3p6k38M66l05K16o8L50
$$ y = [-198, 563, 111, 23, -227, 32, 178, 113, 305, -244, -203, 91, 120, -325, -23, 45, -264, 130, -1, -300, -117, 106, 246, -169, 71, -80, -54, -365, 206, 59, -275, -154, 23, -62, -289, 98, -164, 35, 389, 187, -475, -154, 40, -351, -14, 60, -163, 99, 278, 109, -117, 161, -15, 131, -53, 303, 237, 5, 259, -8, -168, 68, 305, -57, 153, -84, -266, -144, -47, -189, -89, 260, -26, -149, 83, 19, 179, -265, 154, 82, -345, 113, 1, -450, -50, 126, -336, -303, 38, -32, 180, 122, 168, -94, -158, -51, -40, 20, 200, -56, -190, 40, 171, -302, -135, 107, -38, 72, -42, 295, -413, 71, -147, -273, -274, 424, -41, -237, 165, -159, -191, -146, -4, -39, -306, 310, -168, -75, 87, 38, -498, 169, 370, -243, 53, 137, -171, -178, 171, 216, -370, -267, -163, -404, -155, 115, -88, -47, 99, -78, -135, -63, 1, -309, 87, 24, -41, -207, 371, -152, -393, -4, 304, -76, -33, -99, -257, 39, 102, 26, -212, 254, -51, 165, 97, 447]
4820D47m50j90L35N4n11J05J93J26k30L83k16j05j92M64m32R7L63m76J48q3K58
4841H8n78O20r6l21M26J97k76k19jj81R3L6K63K7k26K7O2j6K97o0m11L47K5k34
4865a11j00N64l30j98J63K52j33j24J55j37L11l02J0j10K48J8k70l5J79k22J22
4886e0n9K57m65M08j15nJ52j8oj11J73jl12K89k15L9n6O5J4l9K20P8j23j31N4
4911D3r3j41J9J37k27M87j15l61J68K57m31K55J35j97l22O34k33k09K70K10l03
4932a7q4L27l81l88N53o7q3J33j00j58p5M69r2k10K41r1j3L21O4l30j16pK75m71
4956c00K73K39J7k29R0j49K34M8k98k19K1K04L4k56M76j98q6K55K7o3P5k3l75
4979b03K04J71p2N2o8K1q0L29j38k73J29j14k12J68K67p8k6o3J42j24R9Q4j79
$$ y = [447, -3, -193, 142, 196, -315, -210, -17, 109, -121, 262, 46, -59, -251, 213, -219, -122, 241, -235, -87, -170, 88, -490, 130, 34, -287, 139, 336, 60, -159, -160, -341, -248, -212, 51, 78, -148, -121, -59, -75, 222, 162, -249, 98, 123, -111, -211, 353, 23, -175, -12, 240, 107, -17, 138, 1, 312, 10, 20, -90, 158, 176, -94, -129, 50, -172, -50, -109, 148, -317, 91, -24, -29, 123, 105, 99, -12, 161, 160, -152, 137, -78, -39, -95, -30, -16, -55, 165, 243, 120, -11, 43, -50, -191, -172, -35, -262, 225, 110, -251, -83, 174, -257, -2, 133, -64, -386, 248, 15, -194, 76, 286, -17, -101, 226, -155, -543, 10, -57, -140, -7, -107, -265, -340, 129, 37, -173, 68, -23, -36, 285, 349, 19, -97, -104, 171, -300, -27, 212, 229, 0, 90, -59, 175, 223, -75, -294, -273, -69, -35, -291, 185, -13, -99, 156, 183, 120, 195, 172, -203, 1, 172, 100, 152, 84, 105, 25, 354, 216, -57, 72, -42, -254, -86, 181, 103, 77, 14, 156, 32, 131, 215, 36]
5002C6k88M36j58k48K26L82l86l65O40j96j20J92k19O8K0J63l61K55K46n0m36
5023a63K2J18k31L80K7k57J02R7R3m85M43l89q2K51J48k89k11M20qk77L99j48
5045d0R0J30j39m4K3o7M3L1k53K05J98k36Q2k00J35j82K08Pp4K90j33k56K96k10
5069i6L08l22q5J30nK55k40k8j1J3N0J54Mk89j1L07l50J40K2J3j32M04Mk88J72
5094A19j54l38O3L44K12l85K33J47l16M1o2J07J38k89J11k93M48J97n79K03K78
5115B25l15J19J17L8q6Lk06l52M65J19j64J22j29N9Q7ML4k51J04j70OK73j80M4
5139c4O5L7K0j83L18q7j24l0L02r0l41K23k1l83K57L56m70M24j08p9k31J12K06
5162A39P5n02M17N4l42J95j07j60L69J7j11j5N1%k34P8J25l25L53j43L4p2J53
$$ y = [36, -252, 184, 26, -222, 4, 386, 0, -365, 275, 79, -41, 151, -68, 0, 20, 183, -178, 77, 323, 273, -163, -141, -23, -254, 126, 153, -104, -2, 95, 188, -297, 146, -243, -325, -74, 74, -215, -426, -6, -14, -291, 108, -40, 50, 180, 41, -3, 20, -47, -4, 27, -226, -21, 177, -59, 23, -177, -42, -224, -16, -9, -83, 207, 74, -182, 114, -96, 212, -110, -195, -65, -70, 185, -55, -83, -94, -81, -31, 123, 127, -162, -173, 134, -216, -76, -54, -41, -173, 231, 235, -53, 119, -35, -373, -310, 34, 246, -139, 94, 241, -75, -34, -96, 11, 149, -140, -29, -322, 126, 323, -256, -53, 225, -90, 29, 146, 184, 98, 101, -105, -457, 8, 127, -37, 85, -44, 15, 102, 106, 140, -111, -7, -177, -171, 102, -78, -34, 31, 68, 88, -95, 223, 136, 12, -18, 284, 194, -147, 76, 55, -328, -71, 285, -185, 239, 131, 52, -179, -67, 139, 214, -288, 129, 183, -159, 36, -71, -231, 138, 155, 44, 29, 80, 80, -154, -76, 49, -276, 77, -66, -32, -104, 49]
5185D9Oj09M4O8j66J72J45n53J92K12m23M45J45k4m42K72J39l93J82L87k65k73
5207a90J23K87l71J47j02L25j31L7N1k44Q7J02m6j67K94n0l12K17k14L06j00q7
5229c8j01N2l2J88l82N24J4l12r4K83l80J56M39l95J21M0K8n7p7L33o02J21K41
5252G0n1o8k11L81l7j44Jp4j98L64j61L00J63l84kj41J66o9J99J34k23j93J15
$$ y = [49, 55, -54, -10, 58, -108, 64, 209, -344, -152, 60, -363, 82, 227, 203, -239, 33, 172, -221, -39, 348, 83, -190, -67, 220, -151, -4, -106, 219, 88, 125, 176, -68, 19, 121, 75, -92, 202, 152, -160, 57, -157, 149, 49, -38, -139, -87, -119, 69, -313, 211, 225, -87, -181, 102, -278, -122, 317, -78, 43, 83, 111, 54, -23, 310, -292, -171, 70, 19, -49, -260, 121, 84, -60, -59, -133, -331, 33, -128, 172, 335, -49, -51, -192, -26, -95, 104, 238, 15, -178, -63]
$$ [...]
8191I2
##END NTUPLES=NMR FID
##END=
