##TITLE=1H_CA-8677-1
 DMSO, 8 sc, 
 30.12.2019
##JCAMPDX= 6.0         $$ Bruker NMR JCAMP-DX V2.0
##DATA TYPE= NMR FID
##DATA CLASS= NTUPLES
##ORIGIN= UXNMR, Bruker Analytische Messtechnik GmbH
##OWNER= root
$$ XWIN-NMR		Version 3.5
$$ Mon Dec 30 16:38:06 2019 Russian Standard Time (UT+4h)  she@DPX200
##.OBSERVE FREQUENCY= 200.1315
##.OBSERVE NUCLEUS= ^1H
##.DELAY= (6, 6)
##.ACQUISITION MODE= SIMULTANEOUS
##.ACQUISITION SCHEME= undefined
##.AVERAGES= 8
##.DIGITISER RES= 18
##SPECTROMETER/DATA SYSTEM= spect
##.PULSE SEQUENCE= zg30
##.SOLVENT NAME= DMSO
##.SHIFT REFERENCE= (INTERNAL, DMSO, 0, 15.7039)
##AUDIT TRAIL= $$ (NUMBER, WHEN, WHO, WHERE, WHAT)
$$ ##TITLE= Audit trail, XWIN-NMR		Version 3.5
$$ ##JCAMPDX= 5.01
$$ ##ORIGIN= Bruker BioSpin GmbH
$$ ##OWNER= she
$$ F:/spectra/data/she/nmr/H-F/1/audita.txt
$$ ##AUDIT TRAIL=  $$ (NUMBER, WHEN, WHO, WHERE, WHAT)
(   1,<2019-12-30 16:37:15.81 +0400>,<she>,<DPX200>,
      <created by zg, POWCHK disabled, PULCHK disabled
       configuration hash MD5:
       00 E9 B6 7A A2 85 ED C7 34 08 36 98 17 FE 4E 26
       data hash MD5: 16K
       F7 70 EC 74 56 49 42 50 46 15 03 A8 64 E1 A8 0C>)
$$ ##END=
$$ 
$$ hash MD5
$$ 8F F6 97 39 C0 2C 5F 51 22 0F 69 7A A6 A8 75 8C
##$RELAX= 
##$RELAX= 
##$RELAX= 
##$RELAX= 
##$RELAX= 
##$RELAX= 
$$ Bruker specific parameters
$$ --------------------------
##$DU= <F:/spectra>
##$EXPNO= 1
##$NAME= <H-F>
##$PROCNO= 1
##$TYPE= <nmr>
##$USER= <she>
##$AMP= (0..31)
100 100 100 100 100 100 100 100 100 100 100 100 100 100 100 100 100 100 
100 100 100 100 100 100 100 100 100 100 100 100 100 100 
##$AQSEQ= 0
##$AQ_mod= 1
##$AUNM= <au_zg>
##$AUTOPOS= <>
##$BF1= 200.13
##$BF2= 200.13
##$BF3= 200.13
##$BF4= 200.13
##$BF5= 200.13
##$BF6= 200.13
##$BF7= 200.13
##$BF8= 200.13
##$BYTORDA= 1
##$CFDGTYP= 0
##$CFRGTYP= 5
##$CHEMSTR= <none>
##$CNST= (0..31)
1 1 145 1 1 1 1 1 1 1 1 1 1 1 1 1 1 1 1 1 1 1 1 1 1 1 1 1 1 1 1 1 
##$CPDPRG= <>
##$CPDPRG1= <>
##$CPDPRG2= <>
##$CPDPRG3= <>
##$CPDPRG4= <mlev>
##$CPDPRG5= <mlev>
##$CPDPRG6= <mlev>
##$CPDPRG7= <mlev>
##$CPDPRG8= <mlev>
##$CPDPRGB= <>
##$CPDPRGT= <>
##$D= (0..31)
0 1.2 0 0 0 0 0 0 0 0.06 0 0.03 0 0 0 0 0.0002 0 0 0 0 0 0 0 0 0 0 0 0 
0 0 0 
##$DATE= 1577709435
##$DBL= (0..7)
120 120 120 120 120 120 120 120 
##$DBP= (0..7)
150 150 150 150 150 150 150 150 
##$DBP07= 0
##$DBPNAM0= <>
##$DBPNAM1= <>
##$DBPNAM2= <>
##$DBPNAM3= <>
##$DBPNAM4= <>
##$DBPNAM5= <>
##$DBPNAM6= <>
##$DBPNAM7= <>
##$DBPOAL= (0..7)
0.5 0.5 0.5 0.5 0.5 0.5 0.5 0.5 
##$DBPOFFS= (0..7)
0 0 0 0 0 0 0 0 
##$DE= 6
##$DECBNUC= <off>
##$DECIM= 24
##$DECNUC= <off>
##$DECSTAT= 4
##$DIGMOD= 1
##$DIGTYP= 9
##$DL= (0..7)
0 120 120 120 120 120 120 120 
##$DP= (0..7)
150 150 150 150 150 150 150 150 
##$DP07= 0
##$DPNAME0= <>
##$DPNAME1= <>
##$DPNAME2= <>
##$DPNAME3= <>
##$DPNAME4= <>
##$DPNAME5= <>
##$DPNAME6= <>
##$DPNAME7= <>
##$DPOAL= (0..7)
0.5 0.5 0.5 0.5 0.5 0.5 0.5 0.5 
##$DPOFFS= (0..7)
0 0 0 0 0 0 0 0 
##$DQDMODE= 0
##$DR= 18
##$DS= 0
##$DSLIST= <SSSSSSSSSSSSSSS>
$$ [...]
##$SUBNAM2= <"">
##$SUBNAM3= <"">
##$SUBNAM4= <"">
##$SUBNAM5= <"">
##$SUBNAM6= <"">
##$SUBNAM7= <"">
##$SUBNAM8= <"">
##$SUBNAM9= <"">
##$SW= 24.9337058887773
##$SWIBOX= (0..15)
0 0 2 0 0 0 0 0 0 0 0 0 0 0 0 0 
##$SW_h= 4990.01996007984
##$TD= 16384
##$TD0= 1
##$TE= 0
##$TE2= 300
##$TE3= 300
##$TEG= 300
##$TL= (0..7)
0 120 120 120 120 120 120 120 
##$TP= (0..7)
150 150 150 150 150 150 150 150 
##$TP07= 0
##$TPNAME0= <>
##$TPNAME1= <>
##$TPNAME2= <>
##$TPNAME3= <>
##$TPNAME4= <>
##$TPNAME5= <>
##$TPNAME6= <>
##$TPNAME7= <>
##$TPOAL= (0..7)
0.5 0.5 0.5 0.5 0.5 0.5 0.5 0.5 
##$TPOFFS= (0..7)
0 0 0 0 0 0 0 0 
##$TUNHIN= 0
##$TUNHOUT= 0
##$TUNXOUT= 0
##$USERA1= <user>
##$USERA2= <user>
##$USERA3= <user>
##$USERA4= <user>
##$USERA5= <user>
##$V9= 5
##$VALIST= <valist>
##$VCLIST= <CCCCCCCCCCCCCCC>
##$VD= 0
##$VDLIST= <DDDDDDDDDDDDDDD>
##$VPLIST= <PPPPPPPPPPPPPPP>
##$VTLIST= <TTTTTTTTTTTTTTT>
##$WBST= 1024
##$WBSW= 4
##$XGAIN= (0..3)
0 0 0 0 
##$XL= 0
##$YL= 0
##$YMAX_a= 324193
##$YMIN_a= -224915
##$ZGOPTNS= <>
##$ZL1= 120
##$ZL2= 120
##$ZL3= 120
##$ZL4= 120
##$ABSF1= 10
##$ABSF2= 0
##$ABSG= 5
##$ABSL= 3
##$ALPHA= 0
##$AQORDER= 0
##$ASSFAC= 0
##$ASSFACI= 0
##$ASSFACX= 0
##$ASSWID= 0
##$AUNMP= <proc_1d>
##$AZFE= 0.1
##$AZFW= 0.1
##$BCFW= 1
##$BC_mod= 2
##$BYTORDP= 1
##$COROFFS= 0
##$CY= 11.3945322036743
##$DATMOD= 1
##$DC= 2
##$DFILT= <>
##$DTYPP= 0
##$F1P= 16.9975609425685
##$F2P= -3.02152046262296
##$FCOR= 0.5
##$FTSIZE= 0
##$FT_mod= 4
##$GAMMA= 1
##$GB= 0.15
##$INTBC= 1
##$INTSCL= 1
##$ISEN= 128
##$LB= 0.24
##$LEV0= 0
##$LPBIN= 0
##$MAXI= 10000
##$MC2= 0
##$MEAN= 0
##$ME_mod= 0
##$MI= 1.114404
##$NCOEF= 0
##$NC_proc= 0
##$NLEV= 6
##$NOISF1= 3.799351
##$NOISF2= 2.8
##$NSP= 1
##$NTH_PI= 0
##$NZP= 0
##$OFFSET= 15.70392
##$PC= 1
##$PHC0= -10147.37
##$PHC1= 12.2008
##$PH_mod= 1
##$PKNL= yes
##$PPARMOD= 0
##$PSCAL= 0
##$PSIGN= 0
##$REVERSE= no
##$SF= 200.130013532006
##$SI= 16384
##$SIGF1= 3
##$SIGF2= 2
##$SINO= 400
##$SIOLD= 16384
##$SREGLST= <1H.CDCl3>
##$SSB= 0
##$STSI= 0
##$STSR= 0
##$SW_p= 3612.71676300578
##$SYMM= 0
##$S_DEV= 0
##$TDeff= 0
##$TDoff= 0
##$TI= <>
##$TILT= no
##$TM1= 0
##$TM2= 0
##$TOPLEV= 0
##$USERP1= <user>
##$USERP2= <user>
##$USERP3= <user>
##$USERP4= <user>
##$USERP5= <user>
##$WDW= 1
##$XDIM= 8192
##$YMAX_p= 0
##$YMIN_p= 0
$$ End of Bruker specific parameters
$$ ---------------------------------
##NTUPLES= NMR FID
##VAR_NAME=  TIME,          FID/REAL,        FID/IMAG
##SYMBOL=    X,             R,               I
##VAR_TYPE=  INDEPENDENT,   DEPENDENT,       DEPENDENT
##VAR_FORM=  AFFN,          ASDF,            ASDF
##VAR_DIM=   8192,          8192,            8192
##UNITS=     SECONDS,       ARBITRARY UNITS, ARBITRARY UNITS
##FACTOR=    0.0002004,     1,               1
##FIRST=     0,             0,               0
##LAST=      1.6414764,     0,               0
##MIN=       0,             -224915,         0
##MAX=       1.6414764,     324193,          0
$$ Real data points
##PAGE= N=1
##DATA TABLE= (X++(R..R)), XYDATA
$$ plain form
0 0 0 0 0 0 0 0 0 8 -8 8 -8 8 -14 16 -21 24 -31 33 -40 48 -56 65 -77 88 -100 115 -131 150 -170 192 -216
31 -216 245 -272 305 -343 380 -423 470 -521 577 -639 710 -784 869 -962 1066 -1184 1320 -1473
49 -1473 1651 -1860 2111 -2415 2798 -3293 3965 -4926 6437 -9160 15640 -65874 31802 204905
63 204905 89038 -108520 -224915 -127428 34773 101922 -10815 -163586 -211279 -100023 54424
74 54424 124648 49786 -86816 -174006 -141324 -33619 55901 41964 -53263 -126152 -85712 30773
86 30773 108793 63318 -67335 -161892 -126505 -2152 89385 74648 -3565 -56969 -40389 12258
98 12258 39124 17902 -23488 -53323 -56686 -24982 35916 87785 81809 6521 -85400 -108342 -31839
111 -31839 68620 82946 -5620 -96067 -81742 32330 125810 88977 -52687 -160063 -132077
$$ packed form
0@%%%%%%%Qj6J6j6J6k2L0l7M5n5O4p3Q8j04J21j42J65j88K15k46K81l20L62m08
31b16M61n17N77o48P23q03Q93r91J098j216J349j494J653j831K028k250K504k793
49a473L124l511L971m526N213o091P258q891J1363j5597K4800q1514R7676J73103
63B04905j15867j97558j16395R7487J62201O7149j12737j52771m7693J11256J54447
74E4424P0224p4862j36602q7190L2682J07705Q9520j3937r5227p2889M0440J16485
86C0773P8020m5475j30653r4557L5387J24353R1537j4737p8213n3404J6580N2647
98A2258K6866k1222m1390k9835l363L1704O0898N1869n976p5288r1921k2942P6503
111c1839J00459J4326q8566r0447J4325J14072R3480l6833j41664j07376K7986
$$ plain form
122 -132077 -4419 100422 93404 -6045 -94602 -87626 132 76750 62782 -37457 -135722 -130873
134 -130873 -11224 119532 137509 21084 -118188 -141778 -25577 103146 102592 -22986 -130644
145 -130644 -96661 50938 161913 121421 -27763 -131739 -96390 24609 104423 79023 -5471
156 -5471 -52697 -17159 55808 91031 59295 -10387 -63178 -56730 4178 70974 91971 52745
168 52745 -11429 -42383 -12218 40649 51852 7135 -44920 -47730 4492 63005 72689 28507
180 28507 -25146 -49919 -41871 -16894 9769 23254 14415 -10825 -30333 -17612 24199 47195
192 47195 7831 -69800 -106231 -53516 46581 97193 44866 -55175 -95709 -37658 48470 65330
204 65330 -6487 -89321 -91626 -4861 86349 95416 19595 -67981 -91774 -36883 39429 63565
$$ packed form
122a32077J27658J04841p018r9449q8557O976Q7758P6618j3968j00239r8265M849
134a30873J19649J30756J7977j16425j39272k3590J16201J28723n54j25578j07658
145a30644L3983J47599J10975m0492j49184j03976L5349J20999P9814k5400q4494
156e471m7226L5538P2967L5223l1736o9682n2791O448O0908O6796K0997l9226
168E2745o4174l0954L0165N2867J1203m4717n2055k810N2222N8513R684m4182
180B8507n3653k4773Q048K4977K6663J3485q839k5240j9508J2721M1811K2996
192D7195l9364p7631l6431N2715J00097N0612n2327j00041m0534N8051Q6128J6860
204F5330p1817q2834k305Q6765R1210R067p5821q7576k3793N4891P6312K4136
$$ plain form
216 63565 17087 -48480 -63733 -7324 71261 91060 20421 -78850 -109247 -39893 61014 93652
228 93652 27640 -60732 -73309 -608 69417 56147 -27381 -94420 -76641 4273 64845 52355
240 52355 -6087 -47759 -44574 -15007 5356 -1832 -23591 -37670 -33074 -11896 15768 28844 10048
253 10048 -29366 -59395 -54348 -20026 13492 15172 -9791 -28079 -19690 2499 13422 1483 -24246
266 -24246 -42851 -39358 -16096 14574 36299 31231 -3609 -39673 -42569 -7952 29848 26863 -18598
279 -18598 -56103 -32078 38649 82757 47478 -36328 -85962 -52067 29557 70843 32245 -36464
291 -36464 -57018 -8788 55225 66846 10485 -58951 -75075 -27206 38326 65385 34330 -23133
303 -23133 -51576 -24099 27449 47569 11001 -49347 -70750 -22526 51732 77934 30494 -41601
$$ packed form
216F3565m6478o5567j5253N6409P8585J9799p0639r9271l0397O9354J00907L2638
228I3652o6012q8372j2577P2701P0025j3270q3528o7039J7779Q0914O0572j2490
240E2355n8442m1672L185K9567K0363p188k1759j4079M596K1178K7664J3076j8796
253A0048l9414l0029N047L4322L3518J680k4963j8288Q389K2189J0923j1939k5729
266b4246j8605L493K3262L0670K1725n068l4840l6064k896L4617L7800k985m5461
279a8598l7505K4025P0727M4108l5279q3806m9634L3895Q1624M1286l8598o8709
291c6464k0554M8230O4013J1621n6361o9436j6124M7869O5532K7059l1055n7463
303b3133k8443K7477N1548K0120l6568o0348k1403M8224P4258K6202m7440p2095
$$ plain form
315 -41601 -67587 -25693 32977 43380 -1492 -44873 -37088 12482 51345 42514 -1514 -38094
327 -38094 -36958 -10353 13105 19303 14008 5201 -374 304 5440 12152 11358 -3657 -23670 -24922
341 -24922 978 32977 43891 23418 -10496 -27780 -14224 10480 20826 10281 -7985 -15997
353 -15997 -3479 23514 40180 28615 -7395 -42190 -42282 -344 46421 50280 6634 -37772 -33953
366 -33953 16678 58721 39177 -27746 -71168 -42279 31645 76843 50242 -18054 -57033 -30704
378 -30704 26981 51178 19761 -32512 -51977 -17262 39798 64085 33864 -20884 -52266 -34793
390 -34793 12838 44245 29266 -14100 -37937 -16540 29926 52777 24572 -29957 -55683 -28670
402 -28670 21199 45558 26224 -11222 -25743 -6555 18869 20732 739 -18894 -21139 -7564
$$ packed form
315d1601k5986M1894N8670J0403m4872m3381P785M9570L8863q831m4028l6580
327c8094J136K6605K3458O198n295q807n575O78N136O712p94j5015k0013j252
341b4922K5900L1999J0914k0473l3914j7284J3556K4704J0346j0545j8266q012
353a5997J2518K6993J6666j1565l6010l4795r2M1938M6765L859m3646m4406L819
366c3953N0631M2043j9544o6923m3422K8889P3924M5198k6601o8296l8979K6329
378c0704N7685K4197l1417n2273j9465L4715N7060K4287l0221n4748l1382J7473
390c4793M7631L1407j4979m3366k3837K1397M6466K2851k8205n4529k5726K7013
402b8670M9869K4359j9334l7446j4521J9188K5424J863j9993j9633k245J3575
$$ plain form
414 -7564 9837 20482 21886 14060 -2916 -20253 -21628 -3157 18093 20453 2053 -17614 -13224
427 -13224 14346 34978 24150 -10337 -37695 -31697 2574 35287 37176 8925 -21392 -25865 -1536
440 -1536 27370 29295 -2413 -38346 -39975 -557 45744 53815 11183 -43068 -54046 -10958 37678
453 37678 41607 -3928 -48802 -43495 10715 55367 43053 -14268 -59473 -50669 -81 40116 32352
466 32352 -8491 -37662 -27685 7636 32049 21012 -16250 -43768 -36041 -394 31139 32946 4472
479 4472 -26361 -29384 -4893 19090 17833 -6335 -26886 -20647 6377 27706 24164 3060 -15303
492 -15303 -19195 -9289 3485 9547 9869 5534 -1861 -6479 -816 11758 16837 4616 -17549 -28691
506 -28691 -12742 19505 36725 20354 -14045 -32439 -17791 14145 28495 8388 -24809 -35322
$$ packed form
414g564J7401J0645J404p826j6976j7337j375J8471K1250K360j8400j9667M390
427a3224K7570K0632j0828l4487k7358N998L4271L2713J889k8251l0317m473K4329
440a536K8906J925l1708l5933j629L9418M6301Q071m2632n4251j0978M3088M8636
453C7678L929m5535m4874N307N4210M4652j2314n7321m5205Q804N0588M0197p764
466C2352m0843k9171R977L5321K4413j1037l7262k7518P727L5647L1533J807k8474
479D472l0833l023K4491K3983j257k4168k0551O239K7024K1329l542k1104j8363
492a5303l892R906J2774O062L22m335p395m618N663J2574N079j2221k2165j1142
506b8691J5949L2247J7220j6371l4399j8394J4648L1936J4350k0107l3197j0513
$$ plain form
518 -35322 -10603 26225 39662 15942 -24636 -43739 -24385 13486 33419 17344 -18656 -36776
530 -36776 -15600 24479 41261 15101 -30157 -49790 -22146 27072 47924 21849 -21307 -35540
542 -35540 -8320 29128 36685 6569 -28070 -30910 227 33707 40135 16024 -12587 -20321 -3367
555 -3367 18213 23410 11191 -5707 -10397 2829 20791 26953 15403 -4032 -15429 -10058 6220
568 6220 18339 17142 6475 -2790 -3837 2719 8939 8397 648 -8432 -12788 -7759 5917 18445
582 18445 16718 204 -19214 -23193 -7578 14377 17495 -2722 -24637 -23054 2908 27217 22634
595 22634 -9320 -37220 -32427 207 27678 24265 -4546 -28988 -23129 5922 27429 18462 -12356
608 -12356 -35187 -26748 6307 32927 27413 -3968 -29696 -25252 3546 26277 18141 -12813 -32221
$$ packed form
518c5322K4719L6828J3437k3720m0578j9103J9354L7871J9933j6075l6000j8120
530c6776K1176M0079J6782k6160m5258j9633K7644M9218K0852k6075m3156j4233
542c5540K7220L7448P557l0116l4639k840L1137L3480O428k4111k8611p734J6954
555c367K1580N197j2219j6898m690J3226J7962O162j1550j9435j1397N371J6278
568F220J2119j197j0667r265j047O556O220n42p749r080m356N029J3676J2528
582A8445j727j6514j9418l979J5615K1955L118k0217k1915J583K5962K4309m583
595B2634l1954k7900M793L2634K7471l413k8811k4442N859K9051K1507q967l0818
608a2356k2831Q439L3055K6620n514l1381k5728M444K8798K2731q136l0954j9408
$$ plain form
621 -32221 -20409 11120 30781 19192 -12799 -33257 -23009 3328 17897 8260 -13654 -23823
633 -23823 -13693 4991 11337 347 -16953 -25696 -20387 -7366 1653 304 -7035 -13892 -16799 -14141
647 -14141 -7971 -4904 -9202 -16487 -20355 -16659 -6752 2442 1274 -9411 -21012 -23583 -15244 -1644
661 -1644 5212 -1941 -14938 -20141 -10627 5626 12897 343 -21515 -29768 -13913 12130 23402
674 23402 8727 -17122 -26928 -9498 15848 21585 2103 -23633 -28244 -4467 23599 27663 4549
687 4549 -22753 -27492 -6888 17839 21241 260 -22462 -22429 -695 21110 20690 -2003 -25546 -26863
701 -26863 -5851 15345 16973 -682 -19183 -18858 -970 15113 11529 -6735 -21350 -17935 -907
714 -907 12748 11973 -858 -10369 -9608 -1922 5168 5136 135 -4501 -3796 218 5721 10458 9260 2908
$$ packed form
621c2221J1812L1529J9661j1589l1991k0458J0248K6337J4569r637k1914j0169
633b3823J0130J8684O346j0990j7300q743N309J3021R019j349p339o857k907K658
647a4141O170L067m298p285l868L696R907R194j168j0685j1601k571Q339J3600
661a644O856p153j2997n203R514J6253P271j2554k1858q253J5855K6043J1272
674B3402j4675k5849r806J7430K5346N737j9482k5736m611K3777K8066M064k3114
687D549k7302m739K0604K4727L402k0981k2722L3K1734K1805m20k2693k3543j317
701b6863K1012K1196J628j7655j8501L25J7888J6083l584j8264j4615L415J7028
714i07J3655p75j2831r511P61P686P090l2n001m636P05M014N503M737j198o352
$$ plain form
730 2908 -3702 -6074 -916 8430 14402 11097 1641 -3690 555 11086 17792 11959 -2488 -10932 -4289
745 -4289 12502 23755 17679 -989 -13964 -8153 10726 22109 14294 -5817 -18237 -8905 14162
758 14162 27254 15331 -10096 -24745 -13920 10880 23822 11298 -13155 -23236 -8716 14927
770 14927 23413 6837 -17766 -26054 -10287 13119 20950 7135 -14015 -20652 -7002 11797 16709
783 16709 2909 -14736 -19057 -5544 12691 17677 5547 -10246 -14314 -5204 7362 11164 3228
796 3228 -7206 -8843 -1575 7156 10064 5065 -3222 -7981 -6115 -805 4845 6494 2866 -3399 -6798
811 -6798 -5007 1081 5569 3775 -5235 -12961 -10567 667 10443 8678 -4476 -17358 -16924 -2898
825 -2898 9785 7645 -6819 -19632 -17177 -146 14195 10284 -8263 -24049 -21450 -2000 15285
$$ packed form
730B908o610k372N158R346N972l305r456n331M245J0531O706n833j4447q444O643
745d289J6791J1253o076j8668j2975N811J8879J1383p815k0111j2420R332K3067
758A4162J3092j1923k5427j4649J0825K4800J2942j2524k4453j0081J4520K3643
770A4927Q486j6576k4603q288J5767K3406P831j3815k1150o637J3650J8799M912
783A6709j3800j7645m321J3513J8235M986j2130j5793m068R110J2566L802p936
796C228j0434j637P268Q731K908m999q287m759J866N310N650J649l628o265l399
811f798J791O088M488j794r010p726K394J1234R776j765j3154j2882M34J4026
825b898J2683k140j4464j2813K455J7031J4341l911j8547j5786K599J9450J7285
$$ plain form
838 15285 12668 -7257 -23573 -18649 1706 17870 12424 -9484 -25330 -17856 5208 20455 14129
851 14129 -6964 -21764 -14493 6268 18630 10761 -7924 -19145 -10605 8742 20081 12298 -6137
864 -6137 -15752 -9210 5754 15084 9617 -4226 -11332 -6022 5882 12522 7918 -2695 -9746 -6578
878 -6578 1660 8706 8237 1929 -4799 -6101 -1910 3859 6082 3175 -2838 -7547 -5569 2014 8659
893 8659 8400 848 -8690 -10691 -1517 9852 11566 2722 -9393 -12066 -999 13136 15681 3120
907 3120 -12059 -14451 -1674 15123 19152 5252 -12079 -15073 -499 16698 19504 3678 -14494
920 -14494 -16028 1168 19418 21048 4135 -14343 -15515 1324 18476 18582 1996 -14377 -14289 2678
934 2678 18438 17691 875 -14318 -13445 1505 16078 14964 808 -12124 -10803 1577 12161
$$ packed form
838A5285k617j9925j6316M924K0355J6164n446k1908j5846P474K3064J5247o326
851A4129k1093j4800P271K0761J2362p869j8685j1221Q540J9347J1339p783j8435
864f137r615O542J4964R330n467j3843p106N310J1904O640m604j0613p051L168
878f578Q238P046m69o308o728j302M191N769K223k907o013m709J978P583O645
893H659k59p552r538k001R174J1369J714q844j2115k673J1067J4135K545j2561
907C120j5179k392J2777J6797M029j3900j7331k994J4574J7197K806j5826j8172
920a4494j534J7196J8250J630j6913j8478j172J6839J7152J06j6586j6373Q8J6967
934B678J5760p47j6816j5193Q73J4950J4573j114j4156j2932J321J2380J0584
$$ plain form
947 12161 11558 92 -10433 -9887 -36 9105 9895 2227 -6069 -8023 -2192 5226 7145 3069 -3050
962 -3050 -7189 -4167 2017 7247 6125 359 -5776 -7414 -1605 6530 9235 3786 -5261 -9683 -3780
977 -3780 6719 12137 5301 -6659 -12734 -5986 7759 14947 7768 -7282 -14778 -6938 8084 16261
991 16261 7997 -8983 -16982 -7173 9896 17762 8070 -10278 -18231 -7329 10261 17636 6509
1004 6509 -10872 -18022 -6856 11015 16965 5317 -11609 -16977 -6072 10237 15565 5038 -10971
1017 -10971 -15158 -4778 9130 12679 3648 -9632 -13184 -4049 7069 10337 3068 -7007 -10650
1030 -10650 -4579 4519 7751 3200 -4445 -8065 -5080 1688 5710 3815 -2128 -6046 -6085 -1588 3715
1045 3715 5299 1601 -4289 -7895 -4992 2718 7405 4169 -3880 -9862 -7432 1863 9409 6808 -3404
$$ packed form
947A2161o03j1466j0525N46R851R141P90p668q296j954N831P418J919m076o119
962c050m139L022O184N230j122n766o135j638N809Q135K705n449r047m422N903
977c780J0499N418o836j1960o075O748J3745P188p179j5050p496P840J5022Q177
991A6261q264j6980p999R809J7069P866r692j8348p953J0902J7590P375j1127
1004F509j7381p150J1166J7871N950j1648j6926n368J0905J6309N328j0527j6009
1017a0971m187J0380J3908L549r031j3280l552R135J1118L268p269j0075l643
1030a0650O071R098L232m551p645l620K985O768M022j895n943l918l9M497N303
1045C715J584l698n890l606K903P710M687l236q049n982K430R295P546k601j0212
$$ plain form
1060 -3404 -11813 -9004 2390 11407 9297 -3396 -13207 -10531 2998 13159 10034 -3939 -14693
1073 -14693 -11368 4244 14693 10173 -4774 -15472 -10881 4781 15016 9975 -5713 -15046 -9848
1086 -9848 5092 14602 8740 -5999 -14989 -8878 5320 13440 7599 -6253 -13440 -7635 4771 10891
1100 10891 5828 -5362 -11311 -6521 3642 9112 5257 -3723 -9061 -5871 2209 6989 4755 -1613
1114 -1613 -5728 -4908 305 4658 4798 588 -3412 -4754 -2082 2891 6437 4475 -577 -4995 -4191 1485
1130 1485 6702 7221 441 -6049 -5790 1045 8741 9469 1633 -7240 -8051 59 9797 10648 2268 -8393
1146 -8393 -9806 464 10967 11556 766 -10584 -11523 119 11885 12075 270 -11227 -11326 149
1160 149 11447 11047 -1212 -12215 -10765 1110 11417 10346 -1209 -11818 -10493 669 10280
$$ packed form
1060c404q409K809J1394R017k110j2693r811K676J3529J0161l125j3973j0754
1073a4693L325J5612J0449m520j4947j0698M591J5662J0235n041j5688r333N198
1086i848J4940R510n862j4739q990O111J4198Q120n841j3852p187N805J2406O120
1100A0891n063j1190n949M790J0163N470l855q980n338L190Q080M780k234o368
1114a613m115Q20N213M353J40m210m000j342K672M973L546j962n052m418Q04N676
1130A485N217N19o780o490K59O835P696P28p836q873q11Q110R738Q51q380j0661
1146h393j413J0270J0503N89j0790j1350r39J1642J1766J90j1805j1497r9J1475
1160A49J1298m00j2259j1003J450J1875J0307j071j1555j0609J325J1162R611
$$ plain form
1173 10280 8419 -1903 -10657 -8589 1691 9363 7246 -1944 -9132 -7596 596 7896 6523 -689
1187 -689 -6289 -5347 587 5394 5069 -58 -4816 -4518 -667 3356 4694 2512 -1825 -4607 -2840 62
1203 62 3321 3345 -181 -4689 -5021 -1356 3852 5230 730 -5949 -8183 -3622 3187 6609 1971 -6396
1219 -6396 -9793 -4784 3736 6908 1122 -8298 -12050 -5854 5067 8935 1731 -8941 -12663 -5791
1233 -5791 4962 8755 1240 -9563 -12599 -4349 6643 9652 1465 -10088 -12910 -3975 6891 9456
1247 9456 1110 -8788 -10223 -2058 7266 8699 68 -8257 -9489 -1910 6634 7739 1447 -6323 -6996
1262 -6996 -1663 4960 5476 535 -5257 -6056 -1194 4014 5233 1814 -3072 -5082 -2682 980 2750
1277 2750 2030 -1264 -3631 -2705 -428 2299 2876 462 -4091 -5380 -2932 1966 4962 3123 -2465 -6115
$$ packed form
1173A0280j861j0322q754K068J0280P672k117r190p188J536Q192P300j373p212
1187f89n600R42N934M807l25n127m758K98L851M023J338k182m337k782J767K902
1203F2L259K4l526m508l32L665N208J378m500o679k234M561O809L422m638q367
1219f396l397N009Q520L172n786r420l752O196J0921L868p204j0672l722O872
1233e791J0753L793p515j0803l036Q250J0992L009q187j1553k822Q935J0866K565
1247I456q346r898j435Q165R324J433q631q325j232P579Q544J105o292p770o73
1262f996N333O623N16m941n792p99M862N208J219l419m886k010K400L662J770
1277B750p20l294k367R26K277K727N77k414m553j289K448M898K996j839n588l650
$$ plain form
1293 -6115 -4113 2216 6017 3357 -2933 -7599 -4527 3696 9180 6035 -2793 -8121 -5238 3764 9409
1308 9409 6153 -2891 -7971 -3461 5661 10900 6817 -3251 -8949 -4554 5642 11447 7159 -2698
1322 -2698 -7738 -2913 6724 10919 5466 -3933 -8194 -2889 6449 10599 5325 -3230 -7049 -2279 5065
1337 5065 8025 3393 -3678 -6023 -1672 4446 6898 3107 -3006 -5431 -2662 2225 4266 2720 -466
1352 -466 -3042 -2039 1103 3261 2560 -34 -2710 -3768 -1012 2365 3988 2818 -531 -3157 -3047 934
1368 934 4065 3528 -193 -3922 -3586 1108 6597 6240 240 -5498 -5869 37 6826 6661 325 -6095
1384 -6095 -5537 1221 7764 6915 -1149 -8455 -7263 868 8310 7277 -674 -8047 -7068 1034 7500 5724
1400 5724 -2676 -9013 -7220 1471 7889 5837 -2239 -8598 -6921 122 6037 4227 -2841 -7631 -5446
$$ packed form
1293f115K002O329L801k660o290m666L072Q223N484l145q828n328K883R002N645
1308I409l256r044n080M510R122N239m083j0068n698M395J0196N805m288r857
1322b698n040M825R637M195n453r399m261N305R338M150n274q555l819M770P344
1337E065K960m632p071k345M351O118K452l791o113k425K769M887K041j546l186
1352d66k576J003L142K158p01k594k676j058K756L377J623j170l349k626J10L981
1368I34L131n37l721l729L36M694N489l57o000n738l71N906O789j65o336o420
1384f095N58O758O543q49q064p306J192Q131P442j033p951p373R79Q102O466j776
1400E724q400o337J793Q691O418k052q076o359J677P043N915j810p068m790K185
$$ plain form
1415 -5446 1576 5927 3757 -2653 -7316 -5180 267 4377 3329 -1222 -3916 -3336 406 2664 2648 -551
1431 -551 -3013 -3421 -873 2288 3474 1984 -731 -2798 -2448 153 2772 2977 293 -1904 -2886 266
1447 266 3650 4626 1218 -3711 -5117 -1627 3610 6105 2433 -3052 -5527 -1832 4294 5952 1538
1462 1538 -5272 -7234 -2215 5193 7769 2721 -4842 -7370 -2233 4958 6831 1522 -6111 -6933 -1243
1477 -1243 6729 7682 1315 -6120 -7299 -1335 4995 6572 1408 -4882 -5230 222 5805 6509 850 -4975
1493 -4975 -5561 -214 5311 5712 1830 -3029 -3425 148 3938 3681 517 -2412 -2671 290 3112 3885
1509 3885 2145 -132 -2084 -1613 526 2120 2131 760 -941 -1520 -149 2231 3169 1274 -1806 -3688
1525 -3688 -2520 1548 4542 3431 -838 -4154 -2843 1411 4357 2646 -1906 -5674 -3382 2493 5959
$$ packed form
1415e446P022M351k170o410m663K136N447M110j048m551k694N80L742K258j6l199
1431e51k462m08K548L161J186j490k715k067L50K601K619K05k684k197r82L152
1447B66L384R76l408m929j406L490N237K495l672n485k475L695O126J658m414
1462A538o810j962N019P408K576n048p563k528N137P191J873n309p633q22N690
1477a243P972R53o367p435j179N964O330J577n164o290l48N452N583P04n659n825
1493d975n86N347N525M01l882m859l96L573L790k57l164k929k59K961K822P73
1509C885j740k277j952M71K139J594J1j371j701n79J371K380R38j895l080j882
1525c688J168M068K994j111m269l316J311M254K946j711m552l768K292N875L466
$$ plain form
1540 5959 4351 -2065 -5963 -4387 1575 5719 4060 -2164 -6013 -3606 3099 7310 3835 -3237 -7046
1555 -7046 -3983 2498 6513 3865 -2668 -5683 -2277 3314 5642 2300 -3387 -5843 -2356 3446 5557
1570 5557 2781 -2409 -4202 -2129 1856 3636 878 -2419 -3681 -1590 1808 3784 1642 -1577 -3115
1585 -3115 -1977 -25 1285 1330 23 -1440 -1272 4 607 1132 96 -1015 -2418 -1752 31 2483
1601 2483 2698 370 -2647 -2785 -982 2081 2483 -267 -3219 -3455 393 3668 4103 41 -4119 -5140
1617 -5140 -1169 3496 4325 214 -3841 -3760 142 4736 4510 -847 -5326 -5137 34 5193 4977 -74
1633 -74 -4911 -3996 482 4633 3490 -1464 -5430 -3906 1243 5146 4036 -671 -4696 -3666 784 3644
1649 3644 2362 -1220 -3581 -2344 1423 3754 1988 -1405 -3179 -2441 149 2205 1792 -40 -1187
$$ packed form
1540E959j608o416l898J576N962M144j659o224l849K407O705M211l475p072l809
1555g046L063O481M015k648o533l015L406N591K328l342n687k456L487N802K111
1570E557k776n190j793K073L985J780k758l297j262K091L398J976k142l219j538
1585c115J138J952J310M5j307j463J68J276O03N25j036j111j403O66J783K452
1601B483K15k328l017j38J803L063M02k750k952k36L848L275M35m062m160j021
1617e140L971M665Q29m111m055Q1L902M594k26n357m479J89N171N159k16n051
1633g4m837R15M478M151j143m954l966J524N149L903j110m707m025J030M450K860
1649C644j282l582k361J237L767K331j766l393j774P38K590K056m13j832j147
$$ plain form
1664 -1187 -1122 -139 1083 915 -547 -1442 -1523 -744 703 1836 1516 481 -1256 -1431 -773 784 1787 897
1682 897 -1476 -2131 -605 2153 2820 1137 -2176 -3822 -1668 1874 4146 1958 -1602 -3644 -1443 2836
1698 2836 4115 950 -3193 -4711 -1378 3566 5107 1813 -3061 -4461 -1345 3630 4301 671 -3746
1713 -3746 -4388 -381 4268 4732 604 -3804 -4519 -538 3594 3561 458 -2877 -2854 830 3751 3181 -665
1730 -665 -3585 -3200 -210 2749 3013 315 -1931 -1676 308 1896 1487 -303 -1811 -1890 -239 1718 1885
1747 1885 847 -567 -1059 -1156 -15 251 835 646 -583 -996 -419 1201 1804 676 -1096 -2540 -1834
1764 -1834 843 2879 2092 -299 -2511 -1907 1129 3024 1826 -1658 -3558 -2221 2162 4614 2580
1779 2580 -1844 -4146 -2637 1664 3986 2084 -2142 -4488 -1582 2906 4545 2081 -2790 -4927 -2233
$$ packed form
1664a187O5R83J222j68j462q95q1P79J447J133l20j035j737j75O58J557J003q90
1682H97k373o55J526K758O67j683l313j646K154L542K272k188l560k042K201M279
1698B836J279l165m143j518L333M944J541l294m874j400L116M975O71l630m417
1713c746o42M007M649M64m128m408p15L981M132l3l103l335K3L684K921n70l846
1730f65k920L85K990K959K64k698k246K55J984J588m09j790j508p9J651J957J67
1747A885j038j414m92r7J141K66N84j89j229m13N77J620O03j128j772j444P06
1764a834K677K036p87k391k212O04L036J895j198l484j900J337M383K452k034
1779B580m424k302J509M301K322j902m226k346K906M488J639k464m871k137K694
$$ plain form
1794 -2233 2248 4534 1955 -2217 -3845 -1309 2895 3923 718 -3379 -4379 -1527 2637 3698 1595
1809 1595 -1843 -3070 -863 1543 2413 410 -2180 -2519 -721 1959 2539 1199 -1375 -1973 -1699 3
1825 3 1002 920 30 -779 -641 365 1289 1217 276 -995 -2175 -1237 683 2247 2040 238 -1932 -2070 -275
1844 -275 2151 1922 -351 -2774 -2662 659 3511 3333 -227 -3520 -3597 -236 3152 3315 -344 -3653 -3041
1861 -3041 1033 4104 3042 -810 -4350 -3517 702 4145 3513 -503 -3977 -2937 1071 4041 2479
1876 2479 -1370 -4133 -3095 1298 4604 3127 -1041 -3625 -2503 775 2634 2289 -1291 -2777 -1526
1891 -1526 1046 2937 2192 -210 -2529 -1934 24 1833 1683 191 -1082 -1173 284 1571 1430 307
1907 307 -1028 -1638 -1029 580 1845 1812 283 -1366 -1575 -852 1482 1920 609 -1439 -1926 -383 2289
$$ packed form
1794b233M481K286k579m172j628K536M204J028l205m097j000K852M164J061k103
1809A595l438j227K207K406Q70k003k590l39J798K680N80j340k574n98K74J702
1825CR99q2q90q09J38J006R24p2r41j271j180R38J920J564k07j802k170j38J795
1844b75K426k29k273k423J12L321K852j78l560l293p7L361L388J63l659l309O12
1861c041M074L071j062l852l540Q33M219L443o32m016l474J040M008K970j562
1876B479l849k763J038M393L306j477m168k584J122L278J859l45l580j486J251
1891a526K572J891p45k402k319N95J958J809j50j492j273r1J457J287j41j123
1907C07j335o10O09J609J265l3j529j649k09P23K334M38j311k048m87J543K672
$$ plain form
1924 2289 3104 741 -2645 -3876 -1325 1835 3374 1389 -2102 -3262 -802 2477 3396 650 -3076
1939 -3076 -4237 -1160 2897 4458 1538 -2488 -3718 -1281 2614 3363 526 -3066 -3583 -548 3321
1954 3321 3933 678 -2931 -3550 -995 2205 2935 808 -2174 -2666 -455 2229 2493 292 -2316 -2453
1970 -2453 -1122 1495 2437 846 -889 -1605 -606 803 1333 268 -931 -1770 -928 553 1693 1292 288
1987 288 -1030 -1481 -917 403 1073 654 -808 -1377 -883 961 1859 1175 -919 -2547 -1980 689 2922
2004 2922 2174 -335 -2685 -2052 821 2676 1955 -1152 -3328 -2085 1495 3761 2265 -1151 -3513 -2415
2020 -2415 967 3524 1960 -1159 -3364 -2123 1625 3695 2142 -1494 -3396 -2480 1270 3143 1871
2035 1871 -1180 -2580 -1113 1443 2504 1102 -1139 -3016 -1338 1134 2177 1363 -363 -1903 -1179
$$ packed form
1924B289Q15k363l386j231K551L160J539j985l491j160K460L279R19k746l726
1939c076j161L077M057J561k920m026j230K437L895P49k837l592n17L035L869
1954C321O12l255l609o19K555L200P30k127k982m92K211K684K64k201k608j37
1970b453J331K617R42j591j735p16R99J409N30j065j199q39Q42J481J140m01j004
1987B88j318m51N64J320O70m19j462n69M94J844Q98o84k094j628N67K669K233
2004B922p48k509k350O33K873J855p21l107k176J243L580K266j496l416k362J098
2020b415L382K557j564l119k205J241L748K070j553l636j902R16L750J873j272
2035A871l051j400J467K556J061j402k241j877J678K472J043q14j726j540P24
$$ plain form
2050 -1179 413 1473 493 -920 -1436 -599 341 1440 1078 -19 -1130 -1227 -753 338 784 510 -223 -886
2068 -886 -529 235 1026 921 -239 -1223 -1368 126 1619 1767 485 -1452 -1964 -505 1441 1833 313
2085 313 -2117 -2005 -346 2367 2528 267 -2069 -2906 -764 2199 2302 74 -2295 -2274 400 2564 2400
2102 2400 -391 -2787 -2567 61 2541 2590 -97 -2424 -1927 249 2237 1484 -508 -2537 -1859 608
2118 608 2287 1804 -638 -1668 -1787 267 1699 828 -942 -1587 -596 601 1564 1151 -617 -1478 -1013
2135 -1013 -373 581 968 -34 -316 -496 105 288 599 449 -384 -923 -730 -131 1073 908 266 -575 -1289
2154 -1289 -745 430 1036 410 -746 -1610 -352 1182 2002 656 -1204 -2105 -959 1180 2116 752 -1173
2171 -1173 -2098 -616 1874 2452 113 -2325 -2237 -371 1980 2258 331 -1573 -1883 -296 1900 1760 235
$$ packed form
2050a179J592J060r80j413n16Q37R40J099l62j097j111r7M74J091M46k74p33o63
2068h86L57P64P91j05j160r84j45J494J493J48j282j937n12J459J946L92j520
2085C13k430J12J659K713J61k261k336q37K142K963J03k228k369K1K674K164j64
2102B400k791k396K20K628K480M9k687k327M97K176J988p53j992k029O78K467
2118F08J679m83k442j030j19K054J432q71j770o45R91J197R63m13j768q61M65
2135a013O40R54L87j002k82j80O01J83L11j50q33n39J93N99J204j65o42q41p14
2154a289N44J175O06o26j156q64J258J534Q20j346j860r01J146K139R36j364j925
2171a173r25J482K490N78k339k438Q8J866K351K78j927j904l10J587K196j40j525
$$ plain form
2188 235 -2057 -2204 256 2172 1948 244 -1784 -2125 -167 1560 1519 -28 -1663 -1571 512 2036 1415
2205 1415 -342 -1716 -1531 156 1246 1159 32 -827 -687 -7 847 589 -182 -642 -993 -483 640 978
2223 978 865 173 -451 -887 -114 348 688 391 -365 -817 -134 787 1276 601 -680 -1408 -1123 551 1661
2242 1661 1206 -308 -1344 -909 1003 1586 1209 -1032 -2038 -789 1508 2475 1400 -1139 -2462 -1181
2258 -1181 1405 2120 1092 -1552 -2313 -419 1669 2835 975 -1404 -2285 -1059 1073 2172 757 -1477
2274 -1477 -1970 -575 1341 1865 237 -1648 -1917 -883 1054 1959 799 -1030 -1921 -558 732 1198
2290 1198 100 -899 -1209 -572 653 1153 569 -527 -936 -371 -74 342 251 489 -293 -698 -229 519 910
2309 910 597 -542 -1258 -1098 401 1511 1038 -411 -1325 -1020 203 1389 867 -727 -1857 -1252 350
$$ packed form
2188B35k292j47K460J916k24j704k028l41J958J727m1j547j635R2K083J524o21
2205A415j757j374J85J687J090q7j127q59J40O80Q54k58p71m60l51N10J123L38
2223I78j13o92o24m36P73M62L40k97p56m52O83R21M89o75j281p28K85J674J110
2242A661m55j514j036M35J912N83l77k241j006J249K297R67j075k539j323J281
2258a181K586P15j028k644p61J894K088J166j860k379q81J226K132J099j415k234
2274a477m93J395J916N24j628j885k69J034J937R05j160j829q91J363J290M66
2290A198j098r99l10O37J225N00n84j096m09N65K97M16r1K38p82m05M69P48L91
2309I10l13j139p16J60J499J110m73j449r14L05J223J186n22j594j130O05J602
$$ plain form
2326 350 1717 1654 -234 -1811 -1716 -167 1828 1745 -465 -1917 -1697 621 2062 1425 -969 -2585 -2170
2343 -2170 545 2249 1558 -423 -2095 -1490 657 2177 1076 -1047 -1846 -1099 856 1786 1357 -636
2359 -636 -1757 -982 536 1336 1076 -391 -1315 -1005 645 1446 927 87 -1183 -1033 185 945 807 102
2377 102 -494 -548 18 326 668 509 -361 -412 -1094 -106 903 832 275 -1070 -1115 -556 806 1354 140 -1385
2397 -1385 -1150 37 1359 1608 176 -1396 -1781 -326 1396 1621 380 -1457 -1628 -113 1846 1962
2413 1962 176 -1407 -2070 -675 1580 1866 587 -1666 -2137 -400 1304 1645 -243 -1738 -2050 -18
2429 -18 2001 2020 -202 -1713 -1489 -79 1274 1028 -311 -977 -826 273 1043 1051 69 -505 -1391 -378 530
2448 530 1019 621 -304 -799 -433 475 654 297 -591 -736 -443 141 792 819 137 -719 -621 -509 39 859 386
$$ packed form
2326C50J367o3j888j577R5J549J995q3k210j452K20K318J441o37k394j616M15
2343b170K715J704o91j981j672O05K147J520j101k123p99P47J955R30m29j993
2359f36j121P75J518Q00k60j467r24L10J650Q01n19q40j270J50J218P60j38p05
2377A02n96n4N66L08L42j59q70n1o82R88J009p1n57j345m5N59J362N48j214j525
2397a385K35J187J322K49j432j572l85J455J722K25j241j837j71J515J959J16
2413A962j786j583o63J395K255K86j279k253m71J737J704L41j888j495l12K032
2429a8K019J9k222j511K24J410J353k46j339o66J51J099P70Qr82n74q86J013R08
2448E30M89l98r25m95L66R08J79l57q88j45K93N84O51K7o82q56R8J12N48Q20m73
$$ plain form
2469 386 -392 -702 -471 302 1063 587 -575 -1806 -1256 155 1369 791 -833 -1567 -1165 662 1539 511
2487 511 -1090 -2024 -702 1147 1767 525 -792 -1580 -810 596 1488 543 -665 -1708 -755 612 1949
2504 1949 985 -826 -1856 -767 912 1724 654 -396 -1486 -565 928 1472 181 -866 -1118 -288
2520 -288 1165 1080 274 -786 -446 -299 230 604 159 -346 -601 -342 -147 386 222 164 -456 -765 -308 423
2540 423 437 284 -578 -520 -624 64 476 276 -417 -781 -666 -98 650 856 255 -640 -1088 -152 769 1017 -140
2561 -140 -1217 -1258 241 1366 1476 63 -1382 -1232 661 1481 1296 -393 -1514 -704 481 1404 970
2578 970 -299 -1211 -692 444 906 989 -397 -1127 -819 423 1286 720 -536 -1259 -832 201 1394 663
2596 663 -651 -832 -746 457 812 689 -543 -651 -418 206 545 512 -415 -283 -151 -89 132 248 391 -60
$$ packed form
2469C86p78l10K31P73P61m76j162j231N50J411J214n78j624p34M02J827Q77j028
2487E11j601r34J322J849O20j242j317p88P70J406Q92r45j208j043R53J367J337
2504A949r64j811j030J089J679Q12j070j050j090R21J493N44j291j047k52Q30
2520b88J453q5q06j060L40J47N29L74m45n05k55K59J95N33j64n8o20l09M57P31
2540D23J4j53q62N8j04O88M12k00o93l64J15N68P48K06o01q95m48R36R21K48j157
2561a40j077m1J499J125J10j413j445J50J893Q20j85j689j121Q10J185R23m34
2578I70j269r12N19J136M62Q3j386p30L08J242Q63n66j256p23M27J033J193p31
2596F63j314j81Q6J203L55j23j232j08K33O24L39l3r27J32J32O2K21J16J43m51
$$ plain form
2616 -60 -378 -462 41 559 653 -169 -484 -576 238 650 521 -84 -470 -617 -143 425 542 -42 -813 -610 -237
2637 -237 800 747 270 -615 -1001 -361 501 1115 478 -973 -1205 -175 1048 1487 -66 -1384 -1191 228
2655 228 1262 941 -24 -1194 -1036 345 918 339 -29 -1126 -741 119 968 804 -251 -942 -982 67
2673 67 835 767 153 -778 -755 190 881 921 209 -793 -456 313 536 511 135 -387 -328 -26 223 165 -167 -129
2695 -129 -304 -198 -43 337 647 465 -269 -845 -418 397 759 265 -314 -463 204 803 754 200 -502 -778
2715 -778 -468 67 910 212 -568 -807 -333 400 854 154 -532 -1383 -705 646 1278 695 -659 -1419 -566
2734 -566 792 1103 368 -1056 -1116 75 1005 1221 83 -819 -905 -264 1033 791 315 -731 -829 -243 434
2753 434 824 10 -387 -891 -417 719 626 404 -72 -400 -336 217 497 145 -242 -808 -95 246 470 260
$$ packed form
2616f0l18q4N03N18R4q22l15r2Q14M12j29o05l86j47M74N68J17n84p71K03L73
2637b37J037n3m77q85l86O40Q62O14o37j451k32J030J223M39j553j318J93J419
2655B28J034l21r65j170J58J381N73n79l68j097L85Q60Q49j64j055o91m0J049
2673F7P68o8o14r31K3R45O91M0p12j002L37P69K23k5l76n22N9L02K49n8l32L8
2695a29j75J06J55L80L10j82p34n76M27Q15L62m94n79j49O67N99m9n54p02k76
2715g78L10N35Q43o98p80k39M74P33M54p00o86q51O78J351O32n83j354p60Q53
2734e66J358L11p35j424o0J191R30K16j138r02q6O41J297k42m76j046r8N86O77
2753D34L90q14l97n04M74J136r3k22m76l28O4N53K80l52l87n66P13L41K24k10
$$ plain form
2773 260 -95 -249 -413 -256 224 279 181 44 -367 -240 -152 838 766 -63 -663 -489 544 1022 675 -120 -804
2794 -804 -505 425 1051 681 -521 -873 -677 324 690 866 -44 -928 -555 72 620 893 -44 -885 -1042
2813 -1042 302 1028 826 -337 -1134 -701 284 1175 747 -487 -1122 -369 542 955 363 -342 -801 -349 436
2832 436 572 525 -267 -683 -86 -184 450 410 -49 -463 -272 61 518 425 124 -360 -375 -122 264 377 -1 -405
2854 -405 -331 -87 122 763 383 -123 -317 -337 -81 435 647 108 -402 -643 -208 541 763 -64 -657 -910 -248
2875 -248 743 614 35 -947 -910 -301 738 441 -150 -894 -814 -62 937 441 -147 -692 -718 34 754 724 82
2896 82 -786 -797 14 831 791 277 -571 -547 15 802 588 -143 -598 -968 39 816 517 8 -522 -643 -105
2917 -105 502 202 298 -360 -223 49 191 300 24 -32 -415 -335 -120 70 230 -336 -386 -98 188 436 255
$$ packed form
2773B60l55j54j64J57M80N5r8j37m11J27Q8R90p2q29o00J74J033M78l47p95o84
2794h04K99R30O26l70j202l52J96J001L66J76r10q84L73O27N48K73r37q41j57
2813a042J344P26k02j163p97M33R85Q91m28j234o35P53R11M13n92p05m59M52P85
2832D36J36m7p92m16N97r8O34m0m59m14J91L33M57r3l01m84j5K53L86J13l78m04
2854d05P4K44K09O41l80n06j94k0K56N16K12n39n10k41M35P49K22q27n93k53O62
2875b48R91j29n79r82L7O09J039k97n91p44Q0P52R99m96n88n45k6P52P20l0o42
2896H2q68j1Q11Q17m0n14q48K4N62P87k14p31m55l70J007P77k99n09n30j21N38
2917a05O07l00R6o58J37K72J42J09k76n6l83Q0K15J90J60n66n0K88K86K48j81
$$ plain form
2938 255 -48 -247 -332 -47 422 486 100 -251 -366 -343 73 633 494 -333 -711 -399 466 712 501 -505 -758
2959 -758 -246 616 878 237 -595 -1022 -245 694 772 155 -584 -994 -10 703 658 302 -230 -733 -157 812 810
2980 810 299 -735 -823 -231 520 755 86 -347 -964 -270 528 634 223 -587 -272 -384 352 284 -87 -338
3000 -338 -165 55 150 274 -7 -81 -134 -36 -292 235 260 249 -120 -210 -392 106 356 211 -254 -470 -231 127
3022 127 451 352 -105 -756 -473 219 719 237 -53 -445 -318 -103 542 205 -167 -435 -945 225 563 898
3042 898 -65 -699 -65 327 550 102 -264 -1219 -286 447 461 175 -609 -561 -403 191 517 195 -356 -405 -75
3063 -75 20 424 -47 -115 -395 -418 261 381 402 -148 -317 -335 213 389 301 78 -360 -63 177 -59 332 196
3085 196 121 -215 45 50 271 238 39 -82 331 40 483 382 142 136 -411 3 368 180 -123 -476 -427 164
$$ packed form
2938B55l03j99q5K85M69O4l86l51j15K3M16N60j39q27l78L12Q65K46k11j006k53
2959g58N12Q62K62o41q32m27P77R39P8o17p39m10R84P13m5l56n32n03N76R69k
2980H10n11j034q8N92P51K35o69m33o17O94P98J06m11q10L15j12P36o8l71k51
3000c38J73K20R5J24k81p4n3R8k56N27K5j1l69r0j82M98K50j45m65k16K39L58
3022A27L24r9m57o51K83O92N00m82k90l92J27K15O45l37l72k68n10J170L38L35
3042H98r63o34O34L92K23m48l66r55R33P33J4k86p84M8J58N94L26l22n51m9L30
3063g5R5M04m71o8k80k3O79J20K1n50j69j8N48J76q8k23m38K97K40k36L91j36
3085A96p5l36K60NK21l3j99j21M13k91M43j01k40on47M14L65j88l03l53M9N91
$$ plain form
3107 164 306 479 -184 -422 -421 82 313 373 96 -514 -379 210 497 558 -11 -607 -381 167 684 673 1 -530
3129 -530 -515 269 596 416 -69 -714 -384 147 743 448 -310 -338 -341 212 514 97 -234 -489 -129 28 483
3150 483 426 -222 -91 -267 117 379 342 65 21 -519 -17 239 385 453 -266 -113 145 43 21 80 200 -260
3172 -260 -23 -86 5 -6 55 -239 -203 87 344 331 459 -345 -553 117 430 464 379 -412 -414 -110 346 515 10
3195 10 -473 -463 -264 194 521 -4 -60 -755 -275 370 878 -107 -465 -492 -120 500 328 47 -638 -462 -161
3216 -161 491 657 -18 -413 -91 -87 626 575 113 -212 -373 63 392 324 233 -286 -369 -168 -5 209 128 -236
3238 -236 -101 123 -3 -71 269 -4 -178 -195 -6 336 121 -26 -96 -44 -187 225 357 120 53 -251 174 -90
3260 -90 435 464 90 -437 -278 120 676 241 -358 -607 -170 285 594 454 -167 -606 -486 520 430 236 -230
$$ packed form
3107A64J42J73o63k38JN03K31O0k77o10J35N89K87O1n69n96K26N48N17j1o72n31
3129e30J5P84L27j80m85o45L30N31N96k95p58k8lN53L02m17l31k55L60J57M55
3150D83n7o48J31j76L84K62l7k77m4n40N02K56J46O8p19J53K58j02k2N9J20m60
3172b60K37o3R1j1O1k94L6K90K57j3J28q04k08O70L13L4q5p91kL04M56J69n05
3195A0m83J0J99M58L27n25n6o95M80O45N08r85l58k7L72O20j72k81o85J76L01
3216a61O52J66o75l95L22MP13n1m62l25j61M36L29o8r1n19q3K01J63K14q1l64
3238b36J35K24j26o8L40k73j74j7J89L42k15j47p0N2j43M12J32k37o7l04M25k64
3260i0N25K9l74n27J59L98N56m35n99k49M37M55L09j40o21m39J20J006r0j94m66
$$ plain form
3281 -230 -761 -3 577 599 215 -35 -665 -390 95 637 32 -231 -298 -62 233 389 279 -349 -426 -419 314 514
3303 514 380 -196 -420 148 444 446 132 -131 -25 -510 115 427 -50 -75 110 -393 -201 208 170 365 -103
3324 -103 -478 123 38 235 29 -144 -139 -88 -156 333 205 -93 -330 -201 -138 423 386 -115 13 -385 31 141
3346 141 354 -158 -414 -419 175 504 221 -43 -484 -586 132 298 299 -419 -428 -340 -19 428 207 -164 -620 -346
3368 -346 211 157 393 -302 -403 -250 18 382 232 -183 -474 -386 -197 284 338 -303 -388 -354 148 318 357 92
3390 92 -388 9 -24 147 356 84 -321 -326 38 102 263 76 61 -72 152 -7 159 -203 57 9 -170 43
3412 43 137 397 57 -334 -174 -282 324 516 346 -209 -530 -134 298 560 -320 -337 -570 -318 -10 221 -50
3433 -50 -480 -498 21 584 690 104 -411 -550 28 254 358 125 -542 -309 160 333 391 191 -196 -2 162
$$ packed form
3281b30n31P58N80K2l84k50o30K75M85N42o05k63o7K36K95J56j10o28p7PP33K00
3303E14j34n76k24N68K96Kl14k63J06m85O25L12m77k5J85n03J92M09l8J95m68
3324a03l75O01q5J97k06j73NN1o8M89j28k98k37J29O3N61l7n01J28l98M16J10
3346A41K13n12k56nN94L29k83k64m41j02P18J66Jp18rQ8L21M47k21l71m56K74
3368c46N57n4K36o95j01J53K68L64j50m15k91Q8J89M81N4o41q5L4N02J70L9k65
3390I2m80L97l3J71K09k72m05nL64O4J61j87j5j33K24j59J66l62K60m8j79K13
3412D3R4K60l40l91J60j08O06J92j70n55l21L96M32K62q80j7k33K52L08K31k71
3433e0m30j8N19N63J06n86n15j39N78K26J04k33o67K33M69J73N8k00l87J94J64
$$ plain form
3454 162 144 204 -212 -60 -343 -81 518 487 -130 -419 -242 -75 150 257 381 -165 -60 -253 273 391 218
3475 218 64 -244 33 78 53 168 197 -59 -223 -160 21 0 -156 -235 -153 170 4 203 222 18 54 -252 276
3498 276 273 182 55 -372 -270 162 207 62 -88 -245 -308 -99 289 435 -139 -409 -348 354 410 85 -283 -221 -84
3521 -84 283 586 467 29 -282 -93 208 489 -295 -253 -268 -149 274 116 114 -534 -462 34 295 265 83 -133
3543 -133 -336 -171 -105 201 38 -261 -157 79 206 106 163 -141 -25 -34 85 116 170 96 -85 -42 -219 83 3
3566 3 -159 161 22 -236 -313 255 180 22 -130 -213 -111 360 67 104 -185 1 -104 262 338 168 -238 -316 113
3589 113 515 145 84 -600 -338 224 551 174 76 -281 -228 36 154 333 36 -359 -308 489 449 130 -143 -240
3611 -240 -500 217 386 145 -23 -147 227 30 220 326 -139 -412 259 61 -20 96 193 -498 -75 40 20
$$ packed form
3454A62j8O0m16J52k83K62N99l1o17k89J77J67K25J07J24n46J05j93N26J18j73
3475B18j54l08K77M5k5J15K9k56j64O3J81k1j56p9Q2L23j66J99J9k04L6l06N28
3498B76lr1j27m27J02M32M5j45j50j57o3K09L88J46n74k70O1P02N6l25l68O2J37
3521h4L67L03j19m38l11J89L01K81p84M2j5J19M23j58ko48P2M96K61l0j82k16
3543a33k03J65O6L06j63k99J04K36J27j00N7l04J16rJ19L1N4p4j81M3j77L02q0
3566Cj62L20j39k58p7N68p5j58j52q3J02M71k93L7k89J86j05L66P6j70m06p8M29
3589A13M02l70o1o84K62N62L27l77r8l57N3K64J18J79k97l95N1P97m0l19k73r7
3611b40k60P17J69k41j68j24L74j97J90J06m65k73O71j98q1J16R7o91M23J15k0
$$ plain form
3632 20 185 100 17 -268 38 371 201 -240 62 -196 -41 37 230 153 -192 -327 -3 185 -18 123 122 -93
3654 -93 -157 -87 338 219 332 118 -143 -101 210 315 146 -120 -226 -232 141 446 203 -155 -418 71 403 284
3676 284 264 -113 -685 87 281 483 -102 -238 69 5 352 553 1 -216 -245 -2 74 288 105 -225 -98
3697 -98 -27 36 246 -25 -108 -99 54 92 196 60 -203 61 81 164 277 281 -16 -208 68 -1 177 333 297 138
3721 138 -38 312 -89 89 55 -237 232 -19 300 282 61 91 -343 -149 20 383 238 69 -234 -271 413
3742 413 345 255 -166 -484 -204 330 428 135 43 -600 -70 374 258 111 -292 -154 63 83 387 157 -118 -340
3764 -340 189 542 128 471 -133 -209 -135 359 172 -228 -218 -287 -261 87 252 60 -21 -83 348 179 -108 -10 -16
3787 -16 -323 134 332 137 372 156 -93 -484 -38 72 117 -141 -110 -82 -169 76 259 148 -76 -83 -299 -239 10
$$ packed form
3632B0J65q5q3k85L06L33j70m41L02k58J55P8J93p7l45j35L24J88k03J41jk15
3654i3o4P0M25j19J13k14k61M2L11J05j69k66j06oL73L05k43l58k63M89L32j19
3676B84k0l77n72P72J94K02n85j36L07o4L47K01n52k17k9K43P6K14j83l30J27
3697i8P1O3K10k71q3RJ53L8J04j36k63K64K0Q3J13Mk97j92K76o9J78J56l6j59
3721A38j76L50m01J78l4k92M69k51L19j8k21L0m34J94J69L63j45j69l03l7O84
3742D13o8r0m21l18K80N34R8k93r2o43N30M44j16j47m03J38K17K0L04k30k75k22
3764c40N29L53m14L43o04p6P4M94j87m00J0o9K6L48J65j92q1o2M31j69k87R8o
3787a6l07M57J98j95K35k16k49l91M46J10M5k58L1K8q7K45J83j11k24pk16O0K49
$$ plain form
3810 10 -1 210 -173 0 -132 356 273 -39 -233 -168 141 385 240 -108 -246 -364 194 260 292 420 -578 -384
3832 -384 27 509 342 24 -84 -487 -51 305 248 3 -189 -310 -95 281 352 48 -309 -46 110 169 226
3853 226 -92 -8 -143 93 181 -102 105 -371 124 80 114 159 98 -161 -79 -58 -274 244 13 -89 -92 -218 121
3876 121 57 183 -91 120 -130 194 236 365 -40 -45 -351 -113 413 149 88 60 -311 -2 240 372 16 -192
3898 -192 -194 -360 53 172 406 -193 -471 -84 200 167 5 -362 -471 -168 133 240 369 -59 -213 138 240
3919 240 184 106 -208 -52 127 431 178 149 -201 -511 -154 64 -2 -73 -264 -197 268 -12 249 128 -206 5
3941 5 -352 263 -102 55 30 -172 -170 -21 164 -405 184 -81 -17 42 91 28 -68 139 -136 231 -204 201 -7
3964 -7 -32 -316 -322 26 -100 -135 -250 -207 -35 -195 302 299 -103 -380 212 39 119 234 121 -254 -8 47 519 316
$$ packed form
3810A0j1K11l83J73j32M88q3l12j94O5L09K44j45l48j38j18N58O6L2J28r98J94
3832c84M11M82j67l18j08m03M36L56n7k45j92j21K15L76P1l04l57K63J56N9N7
3853B26l18Q4j35K36Q8k83K07m76M95m4L4M5o1k59Q2K1k16N18k31j02lj26L39
3876A21o4J26k74K11k50L24M2J29m05nl06K38N26k64o1k8l71L09K42J32l56k08
3898a92kj66M13J19K34n99k78L87K84l3j62l67j09L03L01J07J29m28j54L51J02
3919B40n6p8l14J56J79L04k53k9l50l10L57K18o6p1j91O7M65k80K61j21l34K11
3941El57O15l65J57k5k02KJ49J85n69N89k65O4N9M9o3r6K07k75L67m35M05k08
3964gk5k84oL48j26l5j15M3J72j60M97lm02k77N92j73Q0J15j13l75K46N5M72k03
$$ plain form
3988 316 -407 80 -291 150 129 52 -379 -220 -136 177 126 4 -206 -171 39 -120 190 81 -517 -76 -148 144
4010 144 478 169 49 -427 213 145 147 -167 -174 -81 189 48 70 -119 101 -86 102 139 -106 -171 -27 -156 3
4033 3 -195 -77 -183 43 138 -87 76 144 249 83 78 -327 -341 -252 158 256 -76 -157 -56 72 371 101 -108
4056 -108 -419 -135 34 174 67 -155 -245 29 18 9 253 -59 -235 -81 71 176 90 -237 -291 14 113 99 254
4079 254 -303 -56 30 243 158 -156 -364 3 -181 59 -7 -47 -134 -213 -87 -282 227 -79 59 104 -105 -167 8
4102 8 -76 128 45 37 142 283 149 -53 -108 -96 192 247 -172 130 -313 -376 -110 497 122 -160 55 -5 -249 65
4126 65 105 -172 -409 -61 -120 -154 442 190 44 -305 -15 400 292 259 99 -269 -96 -302 171 142 54 -280
4148 -280 -21 51 101 175 -122 -131 -23 -258 249 334 -67 -189 -289 25 38 143 -126 -260 -149 301 257 -17 -254
$$ packed form
3988C16p23M87l71M41k1p7m31J59Q4L13n1j22k10L5K10j59L10j09n98M41p2K92
4010A44L34l09j20m76O40o8Kl14pR3K70j41K2j89K20j87J88L7k45o5J44j29J59
4033Cj98J18j06K26R5k25J63O8J05j66nm05j4Q9M10R8l32q1J01J28K99k70k09
4056a08l11K84J69J40j07k22r0K74j1rK44l12j76J54J52J05q6l27n4L05R9j4J55
4079B54n57K47Q6K13q5l14k08L67j84K40o6m0q7p9J26j95N09l06J38M5k09o2J75
4102Hq4K04q3qJ05J41j34k02n5J2K88N5m19L02m43o3K66O07l75k82K15o0k44L14
4126F5M0k77k37L48n9l4N96k52j46l49K90M15j08l3j60l68J73k06M73k9q8l34
4148b80K59P2N0P4k97rJ08k35N07Q5m01j22j00L14J3J05k69j34J11M50m4k74k37
$$ plain form
4171 -254 -232 -77 182 94 317 -9 -123 136 70 10 -24 142 -105 109 110 199 30 -81 -90 -51 60 113 71 186
4195 186 165 212 -102 -185 -156 226 -6 -420 -160 -152 159 100 100 -194 -141 254 176 65 280 289 21 -65 218 -45 129
4220 129 -54 -295 -88 -219 538 275 302 2 -253 392 5 97 -139 -80 -126 319 546 171 -15 -224 -257 38
4242 38 315 173 43 129 -217 127 268 -13 -108 -220 -82 183 186 277 59 278 -429 -89 -13 -11 131 -33 -84
4265 -84 286 -65 289 21 -115 -154 -35 152 -4 56 9 -460 36 438 361 147 37 -274 -260 -38 59 51 231
4288 231 -154 -95 -86 43 384 154 31 -203 -15 65 103 124 -215 -96 304 447 344 -222 -128 -49 34 76 454
4311 454 -262 -442 -83 -44 235 376 68 -169 64 -40 278 316 226 -193 -7 64 36 8 62 -214 120 -126
4333 -126 322 36 -93 -124 -266 46 -34 254 42 20 110 -43 -169 -58 26 -73 -44 -110 -76 -8 3 -298 21 73
$$ packed form
4171b54K2J55K59q8K23l26j14K59o6o0l4J66k47K14JQ9j69j11rL9J11N3m2J15
4195A86k1M7l14q3K9L82k32m14K60QL11n9%k94N3L95p8j11K15Rk68q6K83k63J74
4220A29j83k41K07j31P57k63K7l00k55O45l87R2k36N9m6M45K27l75j86k09l3K95
4242C8K77j42j30Q6l46L44J41k81r5j12J38K65LR1k18K19p07L40P6KJ42j64n1
4265h4L70l51L54k68j36l9J19J87j56O0m7m69M96M02p7k14j10l11J4K22R7qJ80
4288B31l85N9RJ29L41k30j23k34J88Q0L8K1l39J19M00J43j03n66R4P9Q3M2L78
4311D54p16j80L59L9K79J41l08k37K33j04L18L8r0m19J86P1k8k8N4k76L34k46
4333a26M48k86j29l1j42L12q0K88k12k2R0j53j26J11Q4r9K9o6L4O8J1l01L19N2
$$ plain form
4357 73 132 210 -152 74 -51 -74 28 147 443 -409 -68 -58 -24 100 296 -39 -97 -158 -70 71 300 -123 -167
4380 -167 -148 8 142 327 29 -419 -20 -77 -220 82 16 -264 -41 300 111 -77 -66 -282 246 10 160
4401 160 241 -6 -466 -43 -362 192 208 -76 24 -167 137 164 -116 109 -24 -59 42 46 23 42 -197 22 256
4424 256 67 152 108 -350 -226 -62 -45 170 -17 -23 -170 -255 65 -6 -42 -95 -145 -200 -385 -216 260 258 -138 -237 144
4449 144 115 336 -115 123 -40 -141 60 -88 51 19 -125 -123 391 148 150 -149 -280 -63 238 8 -43 -137 -85
4472 -85 101 90 229 278 -48 -87 67 -83 10 350 291 -239 99 10 303 21 -193 -73 99 -84 -348 74
4494 74 22 1 95 81 125 347 137 -87 37 -96 134 43 -37 -160 -173 270 2 90 -36 -166 -85 -191 332 -83
4518 -83 14 133 94 40 -79 79 31 -309 36 -180 -161 347 125 -111 -44 40 94 47 34 -63 -168 21 94 241
$$ packed form
4357G3N9P8l62K26j25k3J02J19K96q52L41J0L4J24J96l35n8o1Q8J41K29m23m4
4380a67J9J56J34J85k98m48L99n7j43L02o6k80K23L41j89j88J1k16N28k36J50
4401A60Q1k47m60M23l19N54J6k84J00j91L04K7k80K25j33l5J01Mk3J9k39K19K34
4424B56j89Q5m4m58J24J64J7K15j87oj47q5L20p1l6n3n0n5j85J69M76kl96r9L81
4449A44k9K21m51K38j63j01K01j48J39l2j44KN14k43Kk99j31K17L01k30n1r4N2
4472h5J86j1J39M9l26l9J54j50R3L40n9n30L38q9K93k82k14J20J72j83k64M22
4494G4n2k1R4j4M4K22k10k24J24j33K30r1q0j23j3M43k68Q8j26j30Q1j06N23m15
4518h3R7J19l9n4j19J58m8l40L45k16J9N08k22k36O7Q4N4m7j3r7j05J89P3J47
$$ plain form
4542 241 -105 -106 38 156 -16 68 -62 -44 -531 -321 54 82 187 -236 -214 -47 242 345 79 -185 234 1
4564 1 338 53 299 162 120 166 -59 64 -82 3 86 -55 223 -234 -22 62 -140 -82 -135 18 1 -11 -336 140
4588 140 -47 -94 166 -37 -250 -130 -177 -294 -18 -15 213 130 71 235 -100 153 68 -61 56 -25 113 88 179
4611 179 -73 -28 56 229 131 106 100 148 143 201 85 43 164 53 216 60 35 138 -217 -68 26 362 -38 -168
4635 -168 -147 -88 0 399 77 -8 -37 -206 -167 -71 -61 -11 -191 -209 163 13 -58 -6 -250 -96 -122 -353 68 9 -10
4660 -10 -23 -27 -140 -256 259 50 75 -103 -70 135 232 -311 -200 -268 -6 97 -410 225 -107 -129 53 -30 -62 -122
4684 -122 -325 -12 53 -94 3 -20 90 -79 -158 -119 -110 -69 -92 -182 -420 61 80 94 198 -126 -47 320 -23 27 44
4709 44 41 -73 426 -151 168 105 40 77 -85 166 149 -42 103 -6 -69 137 76 91 -72 -1 -24 278 297 -19
$$ packed form
4542B41l46jJ44J18j72Q4j30J8m87K10L75K8J05m23K2J67K89J03k66k64M19k33
4564AL37k85K46j37m2M6k25J23j46Q5Q3j41K78m57K12Q4k02N8n3J53j7j2l25M76
4588A40j87m7K60k03k13J20m7j17K76LK28q3n9J64l35K53q5j29J17q1J38k5R1
4611A79k52M5Q4J73r8k5oM8nN8j16m2J21j11J63j56k5J03l55J49R4L36m00j30
4635a68K1N9Q8L99l22q5k9j69L9R6J0N0j80j8L72j50p1N2k44J54k6k31M21n9j9
4660a0j3mj13j16N15k09K5j78L3K05R7n43J11o8K62J03n07O35l32k2J82q3l2o0
4684a22k03L13O5j47R7k3J10j69p9L9RM1k3r0k38M81J9J4J04l24P9L67l43N0J7
4709D4lj14M99n77L19o3o5L7j62K51j7j91J45j09o3K06o1J5j63P1k3L02J9l16
$$ plain form
4733 -19 -36 -144 190 -23 79 19 -1 -111 -244 -16 235 -40 341 91 141 -101 196 -62 33 96 -69 -68 -17
4756 -17 57 -51 106 14 -226 290 154 120 -58 -103 164 218 100 16 -235 -165 209 -70 59 68 -390 -62 -142 68
4780 68 -139 84 -144 171 386 193 -140 97 -107 232 246 -24 -74 231 -84 -108 197 98 -87 -23 -190 -80
4802 -80 -13 -47 1 -35 -112 110 231 78 28 172 0 48 55 -205 -161 82 -172 -212 136 -73 274 -32 0 -187
4826 -187 47 -186 36 27 17 -289 -131 -440 161 69 27 126 -167 -47 177 78 -256 4 -44 55 267 239 -182
4849 -182 111 -172 -299 -179 -72 -189 -62 -80 122 243 363 -64 242 -101 -36 -68 -135 -115 -95 -310 22 241
4871 241 134 -29 -119 -181 57 257 -119 -262 -209 50 196 86 60 88 -245 144 8 209 77 200 -125 -410
4893 -410 62 262 -84 -167 -109 -295 -53 -76 -272 196 136 -181 -135 107 2 23 71 243 -143 4 79 179 -374
$$ packed form
4733a9j7j08L34k13J02o0k0j10j33K28K51k75L81k50N0k42K97k58R5O3j65JN1
4756a7P4j08J57r2k40N16j36l4j78m5K67N4j18q4k51P0L74k79J29Rm58L28q0K10
4780F8k07K23k28L15K15j93l33K37k04L39J4k70n0L05l15k4L05r9j85O4j67J10
4802h0O7l4M8l6p7K22J21j53n0J44j72M8Pk60M4K43k54m0L48k09L47l06L2j87
4826a87K34k33K22rj0l06J58l09O01r2m2R9k93J20K24r9l34K60m8R9K12k8m21
4849a82K93k83j27J20J07j17J27j8K02J21J20m27L06l43O5l2o7K0K0k15L32K19
4871B41j07j63r0o2K38K00l76j43N3K59J46j10k6K8l33L89j36K01j32J23l25k85
4893d10M72K00l46q3N8j86K42k3j96M68o0l17M6K42j05K1M8J72l86J47P5J00n53
$$ plain form
4916 -374 -183 -162 75 122 118 -121 -52 -135 -118 153 142 186 -278 -216 161 409 -124 -215 -161 -20 44 249 -176 -130 37
4941 37 228 -110 107 433 -40 -131 38 124 78 218 -185 -165 53 -235 318 -147 48 166 44 176 -213 -68
4963 -68 -132 410 246 -54 43 -129 -156 -119 167 -58 -9 100 93 139 -57 -5 169 59 -61 -34 -40 -146 -62 41 43
4988 43 2 -145 -125 -17 -67 84 -11 -137 -113 -46 94 234 75 110 -81 -95 -63 -122 -320 -136 -196 330 34 247
5012 247 78 303 -130 -198 -96 -40 72 -56 -258 310 53 -20 137 -115 210 279 -131 54 -4 -5 -64 128 168
5035 168 105 -68 -24 -232 -115 -120 41 58 -115 76 -267 379 369 206 31 -166 -232 15 -100 -61 197 -139 137
5058 137 -176 145 -91 26 -179 -79 293 230 83 -18 151 50 -229 10 39 -95 106 -350 13 158 89
5079 89 -27 22 -55 -56 -56 61 267 -36 -119 -165 149 -82 159 211 -188 -129 153 76 131 -290 -13 86 -96 159 -46
$$ packed form
4916c74J91K1K37M7mk39O9q3J7K71j1M4m64O2L77K48n33r1N4J41O4K05m25M6J67
4941C7J91l38K17L26m73r1J69Q6m6J40m03K0K18k88N53m65J95J18j22J32l89J45
4963f8o4N42j64l00R7j72k7L7K86k25M9J09pM6j96N2J74j10j20K7oj06Q4J03K
4988D3m1j47K0J08n0J51r5j26K4O7J40J40j59L5j91j4L2n9j98J84o0N26k96K13
5012B47j69K25m33o8J02N6J12j28k02N68k57p3J57k52L25O9m10J85n8jn9J92M0
5035A68o3j73M4k08J17nJ61J7j73J91l43O46j0j63j75j97o6K47j15L9K58l36K76
5058A37l13L21k36J17k05J00L72o3j47j01J69j01k79K39K9j34K01m56L63J45o9
5079H9j16M9p7j%J17K06l03q3m6L14k31K41N2l99N9K82p7N5m21K77R9j82K55k05
$$ plain form
5104 -46 -231 29 -287 171 -151 146 267 -133 274 -37 -62 182 15 223 147 151 245 307 4 -104 -141 193 299
5127 299 129 -112 -62 205 -142 112 -29 -33 169 184 -125 174 343 -150 -147 247 -174 -305 8 69 65 27 174
5150 174 59 -50 22 89 -179 -182 131 -54 2 268 58 -94 124 97 -1 23 -53 -54 -150 0 22 29 -27 91 75 204
5176 204 117 102 -13 -13 178 231 144 103 56 -93 -14 -50 26 46 352 75 -10 113 0 -179 48 -75 67 -47
5200 -47 43 214 -1 176 -105 -66 133 190 34 -43 -208 64 294 -204 -139 -293 -179 -174 293 -10 376 -95 127
5223 127 37 -317 168 2 -236 -9 145 -107 -74 84 -17 76 135 44 -66 19 144 -181 -3 -87 245 -216
5245 -216 81 -52 -20 -14 52 -252 28 -154 -262 -45 119 -25 55 -51 -240 27 162 -25 49 -154 -19 -85
5267 -85 60 7 117 27 70 -124 130 -122 -215 82 96 215 -95 51 15 206 -48 96 -20 321 -159 20
$$ packed form
5104d6j85K60l16M58l22K97J21m00M07l11k5K44j67K08p6MR4O2l03j08l7L34J06
5127B99j70k41N0K67l47K54j41mK02J5l09K99J69m93LL94m21j31L13O1ml8J47
5150A74j15j09P2O7k68lL13j85N6K66k10j52K18k7r8K4p6jr6J50K2Pn6J18j6J29
5176B04q7j5j15%J91N3q7m1m7j49P9l6P6K0L06k77q5J23j13j79K27j23J42j14
5200d7R0J71k15J77k81L9J99N7j56p7j65K72K30m98O5j54J14NM67l03L86m71K22
5223A27r0l54M85j66k38K27J54k52L3J58j01R3N9r1j10Q5J25l25J78q4L32m61
5245b16K97j33L2OO6l04K80j82j08K17J64j44Q0j06j89K67J35j87P4k03J35o6
5267h5J45n3J10r0M3j94K54k52r3K97J4J19l10J46l6J91k54J44j16L41m80J79
$$ plain form
5289 20 316 17 48 304 -192 -106 -149 -119 -123 122 -137 231 -17 -248 90 201 -35 14 -88 -184 115 187 7
5312 7 137 270 -18 -19 -192 -38 -277 226 254 134 20 83 -197 166 -70 -76 360 71 159 -118 -105 149 161 -35
5336 -35 20 28 -71 -53 -42 10 26 129 120 6 5 129 -49 -70 -81 -20 183 -82 201 -224 25 9 -223 5 26 -199
5362 -199 260 80 55 101 -25 227 25 32 17 272 316 46 -30 35 145 -128 -161 -87 197 -15 17 266 102 -29
5386 -29 -298 1 -112 -166 -17 -29 -192 -31 117 240 71 -66 -98 -61 162 -176 174 -338 -391 -247 -186 88
5408 88 -156 -171 288 -141 83 -37 132 213 360 -5 -135 229 -12 36 -97 140 165 -113 -22 -69 260 -115
5430 -115 -155 -95 57 36 -49 -41 149 -25 110 97 -70 301 -215 -46 -61 -19 -50 27 -40 112 -71 -68 39 -317 -91
5455 -91 -89 19 -156 15 18 -43 102 139 -145 -39 50 -280 19 56 123 -96 -305 271 -315 -33 250 -90 5 -297
$$ packed form
5289B0K96k99L1K56m96Q6m3L0mK45k59L68k48k31L38J11k36M9j02r6K99P2j80
5312GJ30J33k88jj73J54k39N03K8j20j14O3k80L63k36oM36k89Q8k77J3K54J2j96
5336c5N5Qr9J8J1N2J6J03rj14jJ24j78k1j1O1K03k65K83m25K49j6k32K28K1k25
5362a99M59j80k5M6j26K52k02Pj5K55M4k70p6O5J10k73l3P4K84k12L2K49j64j31
5386b9k69K99j13n4J49j2j63J61J48J23j69j37l2L7K23l38L50n12n3J44O1K74
5408H8k44j5M59m29K24j20J69Q1J47l65j30L64k41M8j33K37K5k78R1m7L29l75
5430a15m0O0J52k1q5QJ90j74J35j3j67L71n16J69j5M2l1P7o7J52j83LJ07l56K26
5455i1KJ08j75J71Lo1J45L7k84J06Q9l30K99L7O7k19k09N76n86K82K83l40R5l02
$$ plain form
5479 -297 79 -176 79 -83 -23 -8 36 251 48 43 269 -106 46 -292 40 -99 -91 -113 -86 -56 235 -8 -70 -85
5503 -85 -234 158 -116 122 22 246 321 66 -227 123 -138 174 128 -196 71 18 -85 -28 -87 -379 -8 -9 43
5526 43 173 -92 -204 117 290 -181 -132 -74 2 25 -140 106 -113 12 -122 -134 -164 -35 307 -10 -308 148
5548 148 160 -233 -357 209 -16 -220 -41 8 109 -165 -106 -190 -70 280 -227 1 270 86 -85 10 -33 -163
5570 -163 -2 -165 190 155 -39 32 -90 -87 -8 48 -66 -19 212 -97 5 71 -244 163 -110 86 -163 93 -43
5593 -43 -281 -223 173 93 -79 236 76 49 43 -434 238 386 -290 218 -127 115 45 194 121 44 111 115 231 -28
5617 -28 46 -176 -37 -135 -203 -115 -54 -3 20 -43 399 -29 -32 -76 -126 -154 70 -172 155 -162 4 -152 -248 141 70
5642 70 156 -281 -39 12 217 56 51 55 -217 3 149 -292 43 -115 -138 127 82 145 75 12 -143 -79 -113 -84 61
$$ packed form
5479b97L76k55K55j62O0J5M4K15k03nK26l75J52l38L32j39Qk2K7L0K91k43o2j5
5503h5j49L92k74K38j00K24P5k55k93L50k61L12m6l24K67n3j03N7n9k92L71jN2
5526D3J30k65j12L21J73m71M9N8P6K3j65K46k19J25j34j2l0J29L42l17k98M56
5548A48J2l93j24N66k25k04J79M9J01k74N9q4J20L50n07K28K69j84j71R5m3j30
5570a63J61j63L55l5j94P1j22LP9N6j14M7K31l09J02O6l15M07k73J96k49K56j36
5593d3k38N8L96q0j72L15j60k7om77O72J48o76N08l45K42p0J49p3p7O7MJ16k59
5617b8P4k22J39r8o8Q8O1N1K3o3M42m28lm4n0k8K24k42L27l17J66j56r6L89p1
5642G0Q6m37K42N1K05j61nMk72K20J46m41L35j58k3K65m5O3p0o3j55O4l4K9J45
$$ plain form
5667 61 -42 5 143 102 -11 -333 72 131 7 133 200 89 -12 152 24 -26 20 41 -84 -172 -156 13 84 46
5691 46 -34 122 -171 31 285 -108 37 64 -80 47 48 41 -4 162 97 20 85 -91 98 -268 -81 -164 -214 -59
5715 -59 -5 -317 -19 125 161 -214 66 -149 -246 279 193 113 -204 -44 199 -15 172 24 -119 -252 20 -57
5737 -57 -23 137 146 175 -113 84 4 -187 -163 -317 331 -94 -141 -63 221 110 58 -317 -290 -186 -157 -166 -52 -82 -50
5762 -50 54 -218 -7 131 211 -209 171 2 -116 116 170 110 -74 178 -219 -32 217 -169 145 -181 257
5783 257 -68 -79 -214 -89 -210 122 -100 -200 -65 208 66 15 -21 -60 -410 1 32 -129 -258 106 -58 -60
5805 -60 -18 -268 21 164 143 8 -126 -101 8 105 -54 -88 0 -140 -138 8 1 -44 99 -203 37 -173 6 197
5829 197 -111 -116 258 -240 -57 90 -3 -129 -221 72 -87 121 -28 77 -334 68 -185 -75 -162 118 150 254
$$ packed form
5667F1j03M7J38m1j13l22M05N9j24J26O7j11j01J64j28n0M6K1j25q8J6J69P1l8
5691D6q0J56k93K02K54l93J45K7j44J27Jpm5J66o5p7O5j76J89l66J87q3n0J55
5715e9N4l12K98J44L6l75K80k15r7N25q6q0l17J60K43k14J87j48j43j33K72p7
5737e7L4J60RK9k88J97q0j91K4j54O48m25m7P8K84j11n2l75K7J04K9rJ14l0L2
5762e0J04k72K11J38Q0m20L80j69j18K32N4o0j84K52l97J87K49l86L14l26M38
5783B57l25j1j35J25j21L32k22j00J35K73j42n1l6l9l50M11L1j61j29L64j64k
5805f0M2k50K89J43k1j35j34K5J09R7j59l4Q8j40KJ46pm5J43l02K40k10J79J91
5829A97l08nL74m98J83J47r3j26r2K93j59K08j49J05m11M02k53J10q7K80L2J04
$$ plain form
5851 254 -74 -228 29 -43 50 -95 -122 116 108 -60 -7 -151 287 -99 107 75 104 -38 357 -52 104 100 -73
5874 -73 -242 100 245 -162 50 -166 -231 -43 25 -342 155 -232 150 -210 34 -48 27 252 -111 -95 -187 182
5896 182 99 -42 61 83 106 206 191 120 58 18 61 205 -20 -296 10 379 -107 192 27 -15 29 48 -139 1
5920 1 -100 -112 132 -255 51 -76 -181 -103 -388 -303 47 208 -97 172 164 -301 85 75 339 140 13 -83 15
5943 15 289 -164 85 358 -38 15 -82 130 -46 135 -102 -84 117 93 -93 48 62 -201 -69 -284 -71 53
5965 53 372 10 6 -271 -81 59 253 -11 177 -72 30 94 -150 -288 -11 -55 36 35 -161 134 -14 -92 67
5988 67 142 -89 140 3 -31 -171 56 2 193 59 209 294 139 -71 -165 20 25 257 411 12 -89 268 135
6011 135 170 227 85 -10 22 19 -44 138 140 21 -266 -204 92 51 -104 29 -182 -144 61 -68 282 -58 29 60 -100
$$ packed form
5851B54l28j54K57p2R3j45k7K38qj68N3j44M38l86K06l2K9j42L95m09J56mj73
5874g3j69L42J45m07K12k16o5J88O8l67M97l87L82l60K44q2P5K25l63J6r2L69
5896A82q3j41J03K2K3J00j5p1o2m0M3J44k25k76L06L69m86K99j65m2M4J9j87J40
5920Aj01j2K44l87L06j27j05P8k85Q5L50J61l05K69qm65L86j0K64j99j27r6R8
5943A5K74m53K49K73l96N3r7K12j76J81k37J8K01k4j86J41J4k63J32k15K13J24
5965E3L19l62mk77J90J40J94k64J88k49J02O4k44j38K77m4R1jj96K95j48p8J59
5988F7P5k31K29j37l4j40K27n4J91j34J50Q5j55k10r4J85NK32J54l99j01L57j33
6011A35L5N7j42r5L2lo3J82Kj19k87O2K96m1j55J33k11L8K05j29L50l40Q7L1j60
$$ plain form
6036 -100 16 236 -129 94 29 -137 109 103 -87 -81 84 140 87 -19 47 54 -58 -38 249 171 -296 48 -29 -163
6060 -163 392 -216 66 -7 -94 51 38 234 -122 -226 191 -29 -181 3 -73 181 48 -28 6 63 25 -87 -21
6083 -21 197 89 -5 -269 -352 93 -144 -154 92 -13 188 -10 -349 90 71 224 -20 -22 -50 -73 312 66 254
6106 254 149 -55 -111 142 93 -40 58 -195 13 3 -105 79 -26 -109 1 50 127 37 -140 33 -275 488 -14
6129 -14 -53 -73 -239 -50 127 52 333 229 -66 -180 36 -48 -67 -54 397 -261 -84 -143 -314 84 -40 15 71
6152 71 -48 -17 39 -156 -98 28 88 7 -83 221 -50 -199 163 -112 117 196 -215 316 -263 -44 92 41 14
6175 14 48 294 20 -147 253 3 23 97 13 -52 -70 -80 -169 -102 -53 301 -8 -37 -45 -169 -69 284 166 14 104
6200 104 -23 -260 -70 223 40 -57 -215 71 -62 -107 3 -134 89 16 -34 226 -38 22 348 -62 -45 -147
$$ packed form
6036a00J16K20l65K23o5j66K46oj90OJ65N6n3j06O6Pj12K0K87p8m67L44p7j34
6060a63N55o08K82p3q7J45j3J96l56j04M17k20j52J84p6K54j33p6L4N7l8j12O6
6083b1K18j08r4k64q3M45k37j0K46j05K01j98l39M39j9J53k44kk8k3L85k46J88
6106B54j05k04n6K53m9j33R8k53K08j0j08J84j05q3J10M9P7r0j77J73l08P63n02
6129a4l9k0j66J89J77p5K81j04k95j14K16q4j9J3M51o58J77n9j71L98j24N5N6
6152G1j19L1N6j95N8J26O0q1r0L04k71j49L62k75K29P9m11N31n79K19J36n1k7
6175A4L4K46k74j67M00k50K0P4q4o5j8j0q9O7M9L54l09k9qj24J00L53j18j52R0
6200A04j27k37J90K93j83r7j58K86j33m5J10j37K23p3n0K60k64O0L26m10J7j02
$$ plain form
6222 -147 -55 120 161 -35 -150 -125 62 57 0 81 -61 237 -167 71 47 269 80 -45 -64 85 66 277 235 18
6246 18 -5 20 -61 228 124 45 126 143 -69 210 -182 212 0 -62 193 -163 84 90 467 -439 71 31 -24 5
6270 5 -175 -159 82 0 -150 -200 98 -227 42 212 -137 15 -107 -206 -296 -76 232 -10 2 -9 -95 132 180 194
6294 194 89 277 95 -40 32 178 141 -13 47 41 7 -23 352 -229 -195 -179 -165 127 83 -141 318 56 -72 -25
6318 -25 175 218 -214 86 -100 170 125 35 -195 -44 -51 -104 -81 53 -68 127 -143 -27 -225 -249 15 -47 -107 171
6342 171 39 -45 17 -23 199 -59 9 67 -78 -31 31 166 117 -7 101 -114 -1 338 116 -37 -155 -218 -204
6365 -204 156 -270 -179 -23 -20 38 203 -42 -60 -6 131 -241 -32 -177 -76 -283 -152 130 -26 -5 -84 26 94
6388 94 127 119 -113 -107 173 65 -313 -172 -109 168 72 230 -248 90 -19 -228 -193 56 -217 -272 -58 22 322 -67
$$ packed form
6222a47R2J75M1j96j15K5J87nn7Q1j42K98m04K38k4K22j89j25j9J49j9K11m2k17
6246A8k3K5q1K89j04p9Q1J7k12K79l92L94k12o2K55l56K47OL77r06N10m0n5K9
6270Ej80J6K41q2j50n0K98l25K69J70l49J52j22r9r0K20L08k42J2j1q6K27M8J4
6294A94j05J88j82j35P2J46l7j54O0ol4l0L75n81L4J6J4K92m4k24M59k62j28M7
6318b5K00M3m32L00j86K70m5r0k30J51pn3K3J34j21J95k70J16j98k4K64o2o0K78
6342A71j32q4O2m0K22k58O8N8j45M7O2J35m9j24J08k15J13L39k22j53j18o3J4
6365b04L60m26R1J56LN8J65k45j8N4J37l72K09j45J01k07J31K82j56K1p9J10O8
6388I4L3qk32OK80j08l78J41O3K77r6J58m78L38j09k09L5K49k73n5K14Q0L00l89
$$ plain form
6412 -67 -108 142 -90 239 -104 -110 -153 -55 -53 150 190 -87 367 -83 42 188 257 68 -43 271 -100 -84 203 100
6436 100 -7 -25 -34 -102 -30 -57 -78 20 -110 213 54 75 25 70 346 -153 117 -64 52 -75 106 -9 -21 206
6460 206 -147 -48 102 -82 -136 210 75 -115 -19 -15 36 -81 159 49 276 -252 63 279 -143 -16 -12 338 -85
6483 -85 255 52 -93 2 -90 -151 -50 94 48 -138 -141 -79 -124 -263 -124 92 35 237 9 -141 52 -313 -169
6506 -169 -143 -142 -39 -173 293 -123 56 253 66 16 -52 -163 110 163 -102 -72 -154 -228 -153 -184 101 70 1 170
6530 170 -93 133 -96 -133 -12 52 217 35 -155 -65 -107 -104 -286 48 -396 -160 29 -173 65 -18 -137 15
6552 15 -118 -120 113 95 42 -154 23 48 -65 50 158 -102 -374 -111 137 -61 92 391 201 87 68 135 -312
6575 -312 180 518 151 36 -148 118 -73 104 -104 -22 -134 -180 -110 -22 -294 14 48 55 37 45 -59 325 -46
$$ packed form
6412f7m1K50k32L29l43om3R8KK03M0k77M54m50J25J46O9j89j11L14l71J6K87j03
6436A00j07j8ro8P2k7k1R8j30L23j59K1n0M5K76m99K70j81J16j27J81j15j2K27
6460B06l53R9J50j84n4L46j35j90R6MN1j17K40j10K27n28L15K16m22J27ML50m23
6483h5L40k03j45R5r2o1J01J44m6j86lO2m5j39J39K16n7K02k28j50J93l65J44
6506a69K6JJ03j34M66m16J79J97j87n0o8j11K73N3k65L0q2p4P5l1K85l1o9J69
6530A70k63K26k29l7J21O4J65j82j90R0m2Lj82L34m44K36J89k02K38q3j19J52
6552A5j33kK33j8n3j96J77K5j13J15J08k60k72K63K48j98J53K99j90j14j9O7m47
6575c12M92L38l67j15j84K66j91J77k08Q2j12m6P0Q8k72L08L4Pj8Qj04L84l71
$$ plain form
6598 -46 -206 233 -30 -286 -217 300 -194 160 220 -143 -6 -220 -32 -56 83 -13 86 13 186 -23 -122 -54 -101
6621 -101 -138 -98 66 -311 97 -104 -241 252 133 293 170 -489 41 249 -238 -314 -245 -97 15 -75 333 214
6643 214 -37 80 -64 -75 -172 198 11 -4 -206 -111 96 469 514 -224 -186 183 -168 29 91 -94 -138 -167 7
6666 7 -248 58 -154 195 37 75 68 -139 -139 46 223 -112 63 -288 -39 -30 79 -191 96 108 -158 -191 -57 -122
6690 -122 -53 40 -84 134 -166 -154 -63 553 56 49 24 -201 239 -264 -27 215 -86 234 -321 -96 -263 -163
6712 -163 -256 37 29 211 -315 164 91 113 -97 55 50 77 15 -190 173 -17 -113 1 84 123 101 -88 -146 -53 -91
6737 -91 -204 -132 291 -26 -113 172 300 203 -114 -2 128 -267 -17 160 186 -19 -111 -102 115 -97 9 241 -102
6760 -102 277 188 -11 -176 -63 -23 8 -19 37 -102 176 -186 -148 162 -402 110 170 -68 265 -354 24 41 -149
$$ packed form
6598d6j60M39k63k56O9N17m94L54O0l63J37k14J88k4J39r6R9p3J73k09r9O8m7
6621a01l7M0J64l77M08k01j37M93j19J60j23o59N30K08m87p6O9J48J12r0M08j19
6643B14k51J17j44j1r7L70j87j5k02R5K07L73M5p38L8L69l51J97O2j85m4k9J74
6666Gk55L06k12L49j58L8pk07%J85J77l35J75l51K49RJ09k70K87J2k66l3J34o5
6690a22O9R3j24K18l00J2R1O16m97pk5k25M40n03K37K42l01L20n55K25j67J00
6712a63r3K93qJ82n26M79p3K2k10J52nK7o2k05L63j90r6J14Q3L9k2j89n8R3l8
6737i1j13P2M23l17q7K85J28r7l17J12J30l95K50J77K6k05r2RK17k12J06K32l43
6760a02L79q9j99j65J13M0L1k7N6j39K78l62L8L10n64N12O0k38L33o19L78J7j90
$$ plain form
6783 -149 150 148 49 132 130 328 -42 33 2 -10 -16 38 113 -266 118 -182 224 92 151 90 182 -238 257 -31 153
6808 153 -32 -104 -258 148 169 208 -80 -82 -278 -9 373 9 154 14 36 181 103 -106 -59 -189 -179 -187 55 -133
6832 -133 45 -224 -27 247 -125 33 105 65 17 -55 -23 23 -107 7 88 267 -1 -193 -35 -455 104 120 312
6855 312 126 -14 90 137 -94 57 -247 -88 -196 40 149 358 2 -158 242 13 -125 2 117 -119
6875 -119 76 -157 94 -239 -46 4 110 171 -121 -245 -40 262 -54 -171 -28 -549 417 -506 -246 101 37
6896 37 -77 -51 -134 26 -32 -36 -26 5 -59 58 -154 -87 26 -19 129 -209 199 -133 142 -112 49 59 45 260
6920 260 11 -141 77 97 -194 33 12 126 -56 -69 19 -39 -351 97 242 223 -208 47 257 -197 -5 -105
6942 -105 -75 152 0 88 -154 -187 -25 137 -248 46 165 -179 -25 -101 244 64 -291 116 2 45 -29 -108
$$ packed form
6783a49K99kr9Q3kJ98l70P5l1j2oN4P5l79L84l00M06j32N9o1R2m20M95k88J84
6808A53j85p2j54M06K1L9k88kj96K69L82l64J45j40K2J45p8k09M7j30J0qK42j88
6832a33J78k69J97K74l72J58P2m0m8p2L2M6j30J14Q1J79k68j92J58m20N59J6J92
6855C12j86j40J04M7k31J51l04J59j08K36J09K09l56j60M00k29j38J27J15k36
6875a19J95k33K51l33J93N0J06O1k92j24K05L02l16j17J43n21R66r23K60L47o4
6896C7j14K6q3J60n8mJ0L1o4J17k12O7J13m5J48l38M08l32K75k54J61J0j4K15
6920B60k49j52K18K0k91K27k1J14j82j3Q8n8l12M48J45j9m31K55K10m54J92j00
6942a05L0K27j52Q8k42l3J62J62l85K94J19l44J54p6L45j80l55M07j14M3p4p9
$$ plain form
6964 -108 39 203 -88 99 -6 86 -207 171 -166 -166 156 -91 -245 118 196 73 92 -308 157 -81 -72 -6 296
6987 296 -202 -248 -27 -153 -178 -164 103 91 187 203 -121 66 62 397 -46 254 55 67 257 -30 16 201 -216
7010 -216 238 66 -126 -46 61 151 18 -53 297 -121 3 107 63 400 -34 -9 42 21 -2 29 142 222 5
7033 5 -151 25 55 38 58 -108 174 228 -65 -89 243 286 -259 248 177 -205 -121 -308 157 -271 97 -245 -226 32
7057 32 61 68 135 -84 -21 190 -94 17 78 -110 7 98 -94 -11 -231 80 81 -77 -161 30 118 -310 81 -46
7081 -46 -46 106 -243 -97 254 80 11 160 -136 229 11 -188 -88 61 -36 -229 -67 119 38 80 -25 92
7103 92 235 11 -113 -182 121 143 -65 -83 73 6 -108 -124 -70 -40 -26 84 38 -134 -42 319 92 20 273 -30
7127 -30 -101 150 15 20 0 -394 306 50 117 76 -45 -115 -191 44 -121 -91 -149 8 -52 -47 41 -71 -185 -94 297
$$ packed form
6964a08J47J64k91J87j05R2k93L78l37%L22k47j54L63P8j23J9m00M65k38RO6L02
6987B96m98m6K21j26k5J4K67j2R6J6l24J87mL35m43L00j99J2J90k87M6J85m17
7010b16M54j72j92Q0J07R0j33p1L50m18J24J04m4L37m34K5N1k1k3L1J13Q0k17
7033Ej56J76L0j7K0j66K82N4k93k4L32M3n45N07p1l82Q4j87M65m28L68l42J9K58
7057C2K9PO7k19O3K11k84J11O1j88J17R1j92Q3k20L11Jj58q4J91Q8m28L91j27
7081d6%J52l49J46L51j74o9J49k96L65k18j99J00J49r7j93J62J86q1M2j05J17
7103I2J43k24j24o9L03K2k08j8J56o7j14j6N4L0J4J10m6j72R2L61k27p2K53l03
7127c0p1K51j35Nk0l94P00k56O7m1j21p0p6K35j65L0n8J57o0NQ8j12j14R1L91
$$ plain form
7152 297 -213 80 -159 -207 -124 -169 -211 64 113 -174 -53 -67 -177 -335 184 -246 -111 56 103 -40 -14 -32 101
7175 101 282 41 6 111 -174 265 93 -13 148 189 -67 -120 251 -49 41 393 -21 0 -47 -53 -225 167 -20
7198 -20 -24 27 -207 54 -59 -61 211 55 1 322 19 20 248 122 -116 -85 -256 140 13 -37 160 -44 121 -8
7222 -8 29 -51 299 208 -115 225 -113 -242 -79 119 -226 -20 220 -220 -73 -16 240 191 -287 -198 -21 8 158
7245 158 112 -33 -158 101 31 122 29 -54 -253 163 -86 33 -177 95 143 105 -187 -43 -134 -377 -19 95 -317
7268 -317 196 -80 119 110 286 -107 -224 -3 -302 -328 27 162 108 70 -117 -92 -14 242 11 -108 -284 -121
7290 -121 -136 -115 -206 -59 14 43 -166 42 158 -342 -210 -207 -177 -130 -202 -150 -121 -225 -250 9 59 -144 -30 -171 345
7315 345 88 370 66 33 39 -111 94 -120 -169 270 92 30 157 -97 19 -125 85 -172 -116 -63 -151 -118 297
$$ packed form
7152B97n10K93k39m8Q3m5m2K75M9k87J21j4j10j58N19m30J35J67M7j43K6j8J33
7175A01J81k41l5J05k85M39j72j06J61M1k56n3L71l00R0L52m14K1m7oj72L92j87
7198b0mN1k34K61j13kK72j56n4L21l03JK28j26k38L1j71L96j27n0J97k04J65j29
7222hL7q0L50r1l23L40l38j29J63J98l45K06K40m40J47N7K56m9m78Q9J77K9J50
7245A58m6j45j25K59p0R1r3q3j99M16k49J19k10K72M8l8k92J44r1k43L58J14m12
7268c17N13k76J99rJ76l93j17K21k99k6L55J35n4l8j87K5P8K56k31j19j76J63
7290a21j5K1r1J47P3K9k09K08J16n00J32LL0M7p2N2K9j04k5K59N0k03J14j41N16
7315C45k57K82l04l3Oj50K05k14m9M39j78o2J27k54J16j44K10k57N6N3q8L3M15
$$ plain form
7338 297 134 -19 84 -65 -228 -110 -98 183 -283 -22 73 72 315 -28 -53 425 44 -261 -18 -80 91 77
7360 77 160 45 -283 34 120 27 312 439 -74 -9 431 13 -187 139 -67 -155 -154 85 149 -181 -59 70 -60
7383 -60 -40 77 -121 46 455 -10 -19 -12 69 -38 -325 -27 -237 97 -51 74 58 -146 -37 -72 -82 117 -72
7406 -72 -195 -151 -191 35 -6 -29 -161 123 12 150 -60 182 -237 -232 -40 173 -23 -364 -20 -319 -82 -45 64
7429 64 -181 -84 -99 254 16 32 -122 -188 -81 -296 114 253 115 -105 127 116 115 63 10 -19 -10 -26 -84 87 -163
7454 -163 108 70 83 190 7 179 -39 -46 -39 -21 -96 -32 50 143 -120 158 38 143 -2 -221 -158 -132 -1 -23 -43
7479 -43 83 85 -11 -97 87 144 182 288 -64 -145 -13 -46 -328 -51 -213 -118 -256 1 48 -71 -186 -47 -73 -19
7503 -19 -106 -53 46 -114 -135 17 -18 -3 -35 262 -33 -18 3 -142 -244 17 -191 60 -209 256 -66 -17 -85 53
$$ packed form
7338B97j63j53J03j49j63J18J2K81m66K61R5jK43l43k5M78l81l05K43o2J71j4
7360G7Q3j15l28L17Q6r3K85J27n13O5M40m18k00L26k06q8JK39O4l30J22J29j30
7383f0K0J17j98J67M09m65rPQ1j07k87K98k10L34j48J25j6k04J09l5j0J99j89
7406g2j23M4m0K26m1k3j32K84j11J38k10K42m19NJ92K13j96l41L44k99K37L7J09
7429F4k45R7j5L53k38J6j54o6J07k15M10J39j38k20K32j1jn2n3k9Rj6n8J71k50
7454a63K71l8J3J07j83J72k18pPJ8p5O4Q2R3k63K78j20J05j45k19O3K6J31k2k0
7479d3J26Kr6q6J84N7L8J06l52q1J32l3k82K77j62R5j38K57M7j19j15J39k6N4
7503a9q7N3R9j60k1J52l5J5l2K97k95J5K1j45j02K61k08K51k69M65l22M9o8J38
$$ plain form
7527 53 -226 185 -61 5 628 -182 12 -212 137 -62 -259 188 173 -640 121 -42 -48 -73 -68 11 -36 -187 -91 -403
7551 -403 -27 223 -16 353 187 -265 -20 -111 60 -143 -153 -182 296 -172 -205 -85 -70 -39 -27 93 47 -12 -101
7574 -101 -158 90 72 -77 13 -52 -350 -39 311 -152 -42 -308 329 -274 45 216 -31 77 62 -59 -37 157
7596 157 -36 56 -50 -32 161 191 -114 257 -21 -55 -28 -70 121 177 1 271 -111 257 322 -116 91 -7 27
7619 27 90 141 -29 -67 -173 -34 27 293 -150 -235 -100 127 -216 -145 136 -254 343 201 204 -8 -74 172 -240
7642 -240 81 -10 182 4 -204 -238 -17 14 -331 -205 -9 -102 22 67 -138 105 -79 154 -195 86 -78 41
7664 41 45 52 158 -68 -183 -155 -6 -26 -40 -5 -124 -34 -107 -157 113 -13 1 108 74 110 -94 92 -155 -63 50
7689 50 -184 25 -29 -246 -158 -127 -75 50 -87 92 -163 -51 122 -231 170 97 262 -131 64 -285 -70 42
$$ packed form
7527E3k79M11k46O6O23q10J94k24L49j99j97M47j5q13P61j63ok5NP9m7j51R6l12
7551d03L76K50k39L69j66m52K45r1J71k03j0k9M78m68l3J20J5L1J2J20m6n9q9
7574a01n7K48j8j49R0o5k98L11L50m63J10k66O37o03L19J71k47J08j5j21K2J94
7596A57j93R2j06J8J93L0l05L71k78l4K7m2J91N6j76K70l82L68O5m38K07r8L4
7619B7O3N1j70l8j06J39O1K66m43q5J35K27l43P1K81l90N97j42Lk12o6K46m12
7642b40L21r1J92j78k08l4K21L1l45J26J96r3J24M5k05K43j84K33l49K81j64J19
7664D1MPJ06k26j15K8J49k0j4L5j19R0p3n0K70j26J4J07l4L6k04J86k47R2J13
7689E0k34K09n4k17Q8L1N2J25j37J79k55J12J73l53M01p3J65l93J95l49K15J12
$$ plain form
7711 42 -309 147 -14 274 14 -149 -198 50 3 -68 -43 115 7 96 128 202 -275 342 -88 -10 41 105 -121 -65
7735 -65 -31 209 365 19 217 -80 39 -223 -38 49 66 -67 -86 -128 258 434 172 -327 56 10 171 -39
7757 -39 -136 4 171 -129 -152 217 213 -263 -31 154 8 -282 -189 -198 -130 -4 12 10 84 -164 -23 -91 -113 109 -182
7782 -182 -137 -228 -121 102 46 73 -2 0 373 16 -66 -117 -163 67 -30 -140 36 15 -140 -92 45 -43 47 96 -9
7807 -9 -210 -281 -38 242 280 -116 -54 -81 82 -157 152 -178 216 -154 199 76 81 183 124 102 -339 -227 90
7830 90 181 -245 -308 -114 -57 8 273 -209 -148 5 -152 55 -241 260 323 -10 -22 168 161 86 -94 58 -60 -84
7854 -84 27 -48 67 -73 -61 -159 -30 1 -94 -114 56 60 79 262 -6 -86 -63 -185 203 -127 112 17 -142 341
7878 341 15 -108 -181 -79 -117 53 -279 -34 -229 307 -188 -149 386 -44 240 -143 -146 157 -94 157 400 -129
$$ packed form
7711D2l51M56j61K88k60j63m9K48m7p1K5J58j08Q9L2P4m77O17m30P8N1O4k26N6
7735f5L4K40J56l46J98k97J19k62J85Q7J7j33j9m2L86J76k62m99L83m6J61k10
7757c9r7J40J67l00k3L69mm76K32J85j46k90R3rO8J26J6kP4k48J41o8k2K22k91
7782a82M5r1J07K23n6K7p5KL73l57q2n1m6K30r7j10J76k1j55M8J37q8R0M9j05
7807ik01p1K43K80L8l96O2k7J63k39L09l30L94l70L53j23NJ02n9k2m41J12L17
7830I0R1m26o3J94N7O5K65m82O1J53j57K07k96N01O3l33j2J90pp5j80J52j18k4
7854h4J11p5J15j40J2r8J29L1r5k0J70MJ9J83k68q0K3j22L88l30K39r5j59M83
7878C41l26j23p3J02l8J70l32K45j95N36m95L9N35m30K84l83lL03k51K51K43n29
$$ plain form
7900 -129 116 59 -95 -92 -79 -118 141 -30 27 -16 -291 -155 5 -361 -108 45 4 32 -127 -6 105 -66 -240
7923 -240 -265 -143 216 -46 -140 29 -135 -65 210 -13 512 -97 -47 -65 93 217 -59 110 225 -163 43 -119
7945 -119 96 -265 -98 -239 -227 -74 -255 72 -242 168 -83 284 5 -60 -37 171 88 327 -168 -97 272 87
7967 87 -215 42 -136 93 433 169 -234 -120 -274 -140 -259 -314 44 68 -265 -75 -6 -65 -133 112 105 -85 105
7990 105 -74 44 60 241 31 191 -176 -96 38 -80 -32 -160 261 165 124 -1 -339 -60 -85 146 -306 -96
8012 -96 55 -183 -168 156 -60 50 73 -84 -258 134 -91 30 84 137 -85 -24 -165 -221 -116 -93 157 -124 153
8035 153 -96 -175 -87 -62 -184 -435 33 58 146 293 173 -229 -39 -125 19 112 -243 -91 479 314 -169 86
8057 86 32 -192 -201 9 -119 -6 62 -67 57 -4 199 -162 71 411 -4 100 224 -182 229 -277 37 242
$$ packed form
7900a29K45n7j54LJ3l9K59j71N7m3k75J36J60l66K53J53m1K8j59J21J11j71j74
7923b40k5J22L59k62r4J69j64P0K75k23N25o09N0j8J58J24k76J69J15l88K06j62
7945a19K15l61J67j41J2J53j81L27l14M10k51L67k79o5K3K08q3K39m95P1L69j85
7967H7l02K57j78K29L40k64m03J14j54J34j19n5L58K4l33J90O9n9o8K45pj90J90
7990A05j79J18J6J81k10J60l67Q0J34j18M8j28M21r6m1j25l38K79k5K31m52K10
8012i6J51k38J5L24k16J10K3j57j74L92k25J21N4N3k22O1j41n6J05K3K50k81K77
8035A53k49p9Q8K5j22k51M68K5Q8J47j20m02J90q6J44R3l55J52N70j65m83K55
8057H6n4k24rK10j28J13O8j29J24o1K03l61K33L40m15J04J24m06M11n06L14K05
$$ plain form
8079 242 -118 246 -20 -87 -22 168 -25 -181 152 -15 -355 -38 -198 40 -275 127 300 -286 197 330 13
8100 13 -128 41 -189 149 116 69 307 -61 -183 57 240 178 76 -201 134 60 -208 28 -169 -53 13 -148
8122 -148 -174 -40 81 -52 176 166 -346 130 7 -29 -55 -179 75 -185 -60 -271 164 131 -68 -45 -185 112
8144 112 -285 -49 260 -216 1 122 -113 51 147 14 -75 -185 -180 132 239 -115 -28 215 113 134 26 -272
8166 -272 -261 230 52 121 -56 6 -50 -126 19 33 58 45 -114 84 -12 -169 -29 -275 363 69 197 -171 -124
8189 -124 -36 16
$$ packed form
8079B42l60L64k66o7O5J90j93j56L33j67l40L17j60K38l15M02J73n86M83J33l17
8100A3j41J69k30L38l3m7K38l68j22K40J83o2j02k77L35p4k68K36j97J16O6j61
8122a48k6J34J21j33K28j0n12M76j23l6k6j24K54k60J25k11M35l3j99K3j40K97
8144A12l97K36L09m76K17J21k35J64R6j33q9j10NL12J07l54Q7K43j02K1j08k98
8166b72J1M91j78O9j77O2n6p6J45J4K5j3j59J98r6j57J40k46O38k94J28l68M7
8189a24Q8N2
8191A6
$$ Imaginary data points
##PAGE= N=2
##DATA TABLE= (X++(I..I)), XYDATA
$$ plain form
0 0 0 0 0 0 0 0 8 -8 8 -8 16 -16 23 -24 32 -38 46 -49 63 -73 84 -99 115 -132 152 -175 199 -227 255 -287
30 -287 325 -365 409 -458 510 -566 631 -702 778 -861 954 -1055 1168 -1296 1436 -1592 1771
47 1771 -1971 2206 -2476 2798 -3186 3660 -4261 5055 -6144 7757 -10387 15419 -28630 139028
61 139028 324193 84089 -100525 -135876 37680 180422 176364 14217 -102768 -72504 84900
72 84900 196798 174082 28596 -100270 -118729 -18942 95320 136016 66188 -37931 -74802
83 -74802 1266 102280 118139 18519 -102845 -130999 -30587 100911 141784 65461 -34555
94 -34555 -65652 -18730 39265 48373 8722 -29636 -32923 -4072 39887 81304 87767 39191 -41369
107 -41369 -90810 -56201 44538 117688 84642 -19901 -77252 -20118 90479 127571 35754
$$ packed form
0@%%%%%%Qj6J6j6K4l2L9m7N6p0Q4r5J12j36J57j83K14k47K84l27L74m26M82n42
30b87O12o90P74q67R68j076J197j333J480j639J815k009K223k464K732l028L363
47A771l742M177m682N274n984O846p921R316j1199J3901j8144K5806m4049J67658
61A39028J85165k40104j84614l5351J73556J42742m058j62147j16985L0264J57404
72H4900J11898k2716j45486j28866j8459R9787J14262M0696o9828j04119l6871
83g4802P6068J01014J5859r9620j21364k8154J00412J31498M0873p6323j00016
94c4555l1097M6922N7995R108l9651l8358l287K8851M3959M1417O463m8576q0560
107d1369m9441L4609J00739P3150l3046j04543n7351N7134J10597L7092r1817
$$ plain form
118 35754 -100587 -140243 -39965 99861 148435 71439 -50684 -105705 -51235 45468 82075
129 82075 20691 -81175 -126875 -61082 67036 136970 71157 -78530 -173437 -123356 21618
140 21618 108553 45001 -94639 -152933 -62407 79813 120012 9184 -142858 -182654 -77273
151 -77273 56529 91697 14907 -78059 -94564 -29574 38131 38444 -22045 -84240 -94671 -44212
163 -44212 29885 70918 48002 -16334 -68960 -66667 -13409 36026 28337 -22975 -54760 -27627
175 -27627 33649 68527 42043 -21177 -63125 -56022 -18055 17597 34480 28944 6817 -17413
187 -17413 -24819 -4934 24675 24660 -24241 -78645 -70649 8637 86982 83163 -7225 -96247 -92881
200 -92881 -6475 64471 42472 -43530 -96540 -54813 43335 95964 49486 -50561 -110164 -81791
$$ packed form
118C5754j36341l9656J00278J39826M8574p6996j22123n5021N4470R6703L6607
129H2075o1384j01866m5700O5793J28118O9934o5813j49687r4907N0081J44974
140B1618Q6935o3552j39640n8294R0526J42220M0199j10828j52042l9796J05381
151g7273J33802L5168p6790r2966j6505O4990O7705L13o0489o2195j0431N0459
163d4212P4097M1033k2916o4336n2626K293N3258M9435p689n1312l1785K7133
175b7627O1276L4878k6484o3220m1948P103L7967L5652J6883n536k2127k4230
187a7413p406J9885K9609j5m8901n4404P996P9286P8345l819r0388q9022L366
200i2881Q6406P0946k1999q6002n3010M1727R8148N2629m6478j00047n9603K8373
$$ plain form
212 -81791 2779 65478 52640 -14833 -65008 -46186 23377 74663 49841 -37492 -104493 -77212
224 -77212 24107 103555 85272 -8558 -78463 -51141 37146 82619 35514 -49501 -78320 -18564
236 -18564 68520 96274 44010 -27648 -51099 -20705 19962 33281 15391 -7387 -10952 4799
248 4799 26109 38022 28563 -3655 -37670 -44146 -16402 23169 42209 24425 -9175 -23420 -8370
261 -8370 12173 11600 -9251 -30626 -33355 -13262 14926 32768 29954 3945 -32109 -51210 -32177
274 -32177 9903 33606 13577 -30110 -45909 -5121 54139 61224 -2579 -76178 -83243 -14063
286 -14063 62994 70287 5261 -56530 -47935 15743 62272 39830 -29265 -75243 -50584 19591
298 19591 70113 59702 2551 -49291 -50918 -3459 41127 36852 -12346 -56247 -44313 18945
$$ packed form
212h1791Q4570O2699j2838o7473n0175J8822O9563N1286k4822q7333o7001K7281
224g7212J01319P9448j8283r3830o9905K7322Q8287M5473m7105q5015k8819N9756
236a8564Q7084K7754n2264p1658k3451L0394M0667J3319j7890k2778l565J5751
248D799K1310J1913r459l2218l4015o476K7744L9571J9040j7784l3600j4245J5050
261h370K0543n73k0851k1375k729K0093K8188J7842k814k6009l6054j9101J9033
274c2177M2080K3703k0029m3687j5799M0788N9260P085o3803p3599p065O9180
286a4063P7057P293o5026o1791Q595O3678M6529k2442o9095m5978K4659P0175
298A9591N0522j0411n7151n1842j627M7459M4586m275m9198m3901J1934O3258
$$ plain form
310 18945 73332 58652 -13968 -73203 -62837 910 50380 36089 -19870 -49898 -20854 30450
322 30450 47273 12759 -37338 -55818 -30375 8543 26255 17871 1138 -10541 -12912 -8518 -3140
335 -3140 -4 -4539 -16348 -24268 -12426 15950 35173 24460 -8569 -36322 -35365 -8057 17643
348 17643 18802 648 -15046 -13101 5184 24134 24220 -852 -32721 -44818 -20138 26743 54245
361 54245 31574 -19941 -47972 -22231 30103 49404 9112 -50903 -61551 -4707 62929 72223
373 72223 13815 -52724 -62336 -9833 45154 45737 -2680 -45310 -37809 13066 56796 49679 -2557
386 -2557 -50255 -52139 -9773 38017 48461 13460 -28113 -34074 2034 40401 39405 -4203 -48348
399 -48348 -46687 1731 47130 48038 9273 -28056 -28251 1675 23506 14898 -9805 -21416 -11361
$$ packed form
310A8945N4387j4680p2620n9235J0366O3747M9470j4291n5959l0028K9044N1304
322C0450J6823l4514n0097j8480K5443L8918J7712q384j6733j1679k371M394N378
335c140L136m535j1809p920J1842K8376J9223j0713l3029k7753R57K7308K5700
348A7643J159j8154j5694J945J8285J8950Q6k5072l1869j2097K4680M6881K7502
361E4245k2671n1515k8031K5741N2334J9301m0292o0015j0648N6844O7636R294
373G2223n8408o6539r612N2503N4987N83m8417m2630P501N0875M3730p117n2236
386b557m7698j884M2366M7790J0444l5001m1573n961L6108L8367r96m3608m4145
399d8348J661M8418M5399R08l8765l7329j95K9926K1831q608k4703j1611J0055
$$ plain form
412 -11361 9223 22970 21953 10609 -3948 -17244 -22108 -11117 11552 25028 16745 -5151 -17171
425 -17171 -4528 20704 28311 4635 -26997 -34814 -9227 28451 44928 26210 -10090 -29919
437 -29919 -17180 13414 32748 20163 -13961 -33675 -13720 30492 57297 37167 -16229 -52318
449 -52318 -33515 22116 56807 36194 -16227 -43214 -14516 40638 61139 21785 -37677 -56642
461 -56642 -19135 37335 56806 25274 -21626 -36171 -8850 26369 34267 7447 -28385 -37419
473 -37419 -10476 27265 41740 21692 -14538 -35575 -22414 8393 24869 11190 -14747 -25084
485 -25084 -7771 19463 28459 10304 -15714 -26036 -16854 874 12952 13134 6527 -1102 -6123
498 -6123 -5634 1733 10558 8902 -5213 -19589 -16586 7281 32282 31842 2590 -27928 -29703 -1720
$$ packed form
412a1361K0584J3747j017j1344j4557j3296m864J0991K2669J3476q283k1896j2020
425a7171J2643K5232P607k3676l1632p817K5587L7678J6477j8718l6300j9829
437b9919J2739L0594J9334j2585l4124j9714J9955M4212K6805k0130n3396l6089
449e2318J8803N5631L4691k0613n2421k6987K8698N5154K0501l9354n9462j8965
461e6642L7507N6470J9471l1532m6900j4545K7321L5219P898k6820l5832r034
473c7419K6943L7741J4475k0048l6230k1037J3161L0807J6476j3679k5937j0337
485b5084J7313K7234Q996j8155k6018j0322R182J7728J2078J82o607p629n021
498f123M89P367Q825j656j4115j4376L003K3867K5001m40k9252l0518j775K7983
$$ plain form
512 -1720 26557 27296 -1996 -27853 -21527 11305 37534 29374 -7371 -39635 -37101 -2205 31554
525 31554 32624 1242 -30984 -32733 -1370 30866 26723 -12400 -47967 -43068 -394 39551 35834
538 35834 -7803 -45039 -39542 -1166 28216 17734 -19646 -43468 -27159 11443 33222 19212
550 19212 -14886 -36582 -28328 -1553 16959 12328 -5621 -17454 -13268 3926 17560 13443 -4466
563 -4466 -19412 -18764 -3194 14699 20263 10381 -3058 -8565 -3415 5046 9935 5849 -2106 -6880
577 -6880 -3499 5821 16813 20044 9486 -8856 -19486 -11604 8980 24141 16622 -7249 -20929
590 -20929 -8022 18003 29354 10838 -21831 -35001 -12990 22156 35647 15617 -17041 -29983
602 -29983 -10962 18963 27780 6343 -23343 -30356 -6489 26862 38104 15372 -18726 -30820
$$ packed form
512a720K8277P39k9292k5857O326L2832K6229q160l6745l2264K534L4896L3759
525C1554J070l1382l2226j749L1363L2236m143l9123l5567M899M2674L9945l717
538C5834m3637l7236N497L8376K9382j0482l7380k3822J6309L8602K1779j4010
550A9212l4098k1696Q254K6775J8512m631j7949j1833M186J7194J3634m117j7909
563d466j4946O48J5570J7893N564r882j3439n507N150Q461M889m086p955m774
577f880L381R320J0992L231j0558j8342j0630P882K0584J5161p519k3871j3680
590b0929J2907K6025J1351j8516l2669j3170K2011L5146J3491k0030l2658j2942
602b9983J9021K9925Q817k1437k9686p013K3867L3351J1242k2732l4098j2094
$$ plain form
614 -30820 -10472 21449 32844 12845 -16309 -22569 2411 32454 36786 11695 -18289 -23383 1069
627 1069 28914 33122 13739 -6933 -8017 9741 26143 23573 6357 -7899 -6417 6848 20345
640 20345 23452 15245 4519 -324 1230 6702 11374 11019 5072 -815 -639 5588 13499 15319 6937
655 6937 -5533 -11645 -6753 4526 14396 13357 1016 -10496 -9644 2686 14318 11843 -5078 -21353
669 -21353 -17555 5039 25088 22132 -1639 -22697 -20140 4113 23834 17933 -7240 -24693 -15091
682 -15091 13313 32303 21487 -8655 -27443 -17036 10932 28374 19026 -6594 -21075 -9097
694 -9097 15796 27866 14488 -11880 -25508 -12969 12695 26168 15798 -7623 -19451 -10188
706 -10188 9601 18139 5171 -14516 -21446 -9630 8711 15411 4954 -11581 -17857 -11360 -1554
$$ packed form
614c0820K0348L1921J1395j9999k9154o260K4980L0043M332k5091k9984n094K4452
627A069K7845M208j9383k0672j084J7758J6402k570j7216j4256J482J3265J3497
640B0345L107q207j0726m843J554N472M672l55n947n887J76O227P911J820q382
655F937j2470o112M892J1279R870j039j2341j1512Q52J2330J1632k475j6921j6275
669b1353L798K2594K0049k956k3771k1058K557K4253J9721n901k5173j7453R602
682a5091K8404J8990j0816l0142j8788J0407K7968J7442r348k5620j4481J1978
694i097K4893J2070j3378k6368j3628J2539K5664J3473j0370k3421j1828R263
706a0188J9789Q538j2968j9687o930J1816J8341O700j0457j6535o276O497R806
$$ plain form
719 -1554 2363 -1560 -9004 -11814 -8548 -3397 -272 -472 -5109 -12067 -15618 -12384 -4180 2939 3763 -4064
735 -4064 -12959 -13866 -5748 3495 4381 -4984 -16254 -16736 -3361 11540 14002 697 -15986 -20241 -6215
750 -6215 12292 15943 1307 -16441 -18550 -1235 18879 19922 -464 -22866 -23979 -2812 19679
763 19679 21109 -60 -21334 -20549 724 19737 15709 -7154 -26702 -22351 1346 19709 15341
776 15341 -6217 -23243 -20176 -920 13852 9067 -9620 -22576 -17219 1169 14169 9494 -8458
789 -8458 -21112 -16910 -2482 8238 5723 -5438 -13574 -9892 622 7023 4861 -3638 -10162 -10067
803 -10067 -3705 3353 6194 4380 -1334 -6003 -5661 -228 4994 6305 1828 -5682 -8350 -796 10074
818 10074 13600 5302 -8120 -14148 -6261 8974 15942 6917 -8554 -14802 -5284 11648 17769 5586
$$ packed form
719a554L917l923p444k810L266N151L125k00m637o958l551L234Q204P119Q24p827
735d064q895r07Q118R243Q86r365j1270m82J3375J4901K462j3305j6683m255J4026
750f215J8507L651j4636j7748k109J7315K0114J043k0386k2402j113K1167K2491
763A9679J430k1169k1274P85K1273J9013m028k2863j9548M351K3697J8363m368
776A5341k1558j7026L067J9256J4772m785j8687j2956N357J8388J3000m675j7952
789h458j2654M202J4428J0720k515j1161q136L682J0514O401k162q499o524R5
803a0067O362P058K841j814n714m669L42N433N222J311m477p510k668P554J0870
818A0074L526q298j3422o028P887J5235O968r025j5471o248R518J6932O121j2183
$$ plain form
832 5586 -13720 -20903 -8334 11717 19953 7029 -14241 -21963 -8296 12745 18388 3394 -18190
845 -18190 -23708 -6709 15165 20097 3120 -18077 -23287 -6987 13044 16596 810 -16830 -18476
858 -18476 -2744 14875 16808 1153 -15825 -17520 -2932 11823 14066 2358 -10476 -11531 -787
871 -787 10210 11433 2476 -7648 -9806 -1916 7406 10419 5371 -2519 -6618 -4476 2263 6821 5621
886 5621 400 -4507 -5586 -618 6670 8746 3921 -5383 -10524 -6775 3753 11019 7161 -4788 -12891
901 -12891 -8994 4337 13565 8025 -7347 -17216 -11201 5068 16529 11146 -7025 -19166 -12687
914 -12687 5648 17427 10531 -8598 -20188 -11397 8858 20396 11311 -9064 -20346 -11440 9107
927 9107 19683 10491 -8566 -18346 -8677 10397 19835 9615 -9220 -17512 -7288 9932 18121
$$ packed form
832E586j9306p183J2569K0051Q236j2924k1270p722J3667K1041N643j4994k1584
845a8190n518J6999K1874M932j6977k1197n210J6300K0031L552j5786j7640j646
858a8476J5732J7619J933j5655j6978j695J4588J4755K243j1708j2834j055J0744
871g87J0997J223q957j0124k158P890R322L013n048p890m099K142O739M558j200
886E621n221m907j079M968P288K076m825r304n141L749J0528P266l858j1949q103
901a2891L897J3331R228n540j5372r869O015J6269J1461n383j8171j2141O479
914a2687J8335J1779o896j9129j1590Q791K0255J1538r085k0375j1282Q906K0547
927I107J0576r192j9057r780R669J9074R438j0220j8835q292J0224J7220Q189
$$ plain form
940 18121 9424 -7103 -14367 -5678 8553 14057 6663 -6020 -11550 -5186 7061 12228 6857 -2823
954 -2823 -8624 -5604 2561 8142 6066 -635 -5900 -5600 -416 5883 7024 2262 -4034 -7159 -4308
969 -4308 2665 8395 6461 -1364 -8427 -7378 1272 9905 9192 -998 -10851 -9667 1117 12596 12758
984 12758 257 -12000 -12468 667 13844 13946 153 -14088 -13411 1973 16661 15458 -231
997 -231 -15359 -14203 2428 17461 15213 -1269 -15671 -13302 3335 17018 14493 -2281 -15731
1010 -15731 -12235 3616 16486 13188 -2539 -14291 -10909 4083 14478 10805 -2237 -12467 -9078
1023 -9078 3690 12368 9058 -1728 -9556 -7475 1779 9345 8025 -301 -6633 -6503 -254 6258 6622
1038 6622 1694 -4093 -5889 -2624 2994 6189 4113 -1471 -6059 -5229 265 5856 7036 759 -6775
$$ packed form
940A8121q697j6527p264Q689J4231N504p394j2683n530O364J2247N167n371r680
954b823n801L020Q165N581k076o701n265L00N184O299J141m762o296l125K851
969d308O973N730j934p825p063J049Q650Q633p13j0190r853J184J0784J1479J62
984A2758j2501j2257m68J3135J3177J02j3793j4241O77J5384J4688j203j5689
997b31j5128J156J6631J5033k248j6482j4402K369J6637J3683k525j6774j3450
1010a5731L496J5851J2870l298j5727j1752L382J4992J0395l673j3042j0230L389
1023i078J2768Q678l310j0786p828K081R254P566j320q326o332J30O249O512L64
1038F622m928n787j796L265N618L195k076n584m588Q30N494N591J180o277p534
$$ plain form
1053 -6775 -8149 -1991 6645 9114 2429 -7930 -11235 -3695 7806 11330 3219 -9161 -13758 -4409
1067 -4409 8919 13197 3395 -10556 -15013 -4714 10693 14443 3110 -11616 -15202 -3795 11211
1080 11211 14550 2758 -12355 -14931 -2921 11247 13944 1647 -12182 -13740 -1772 11206 12479
1093 12479 1414 -11413 -12826 -1653 9915 10393 511 -9904 -10670 -1250 7863 8863 130 -8459
1107 -8459 -9330 -2457 5152 6753 668 -6054 -7666 -3319 2581 4585 1449 -3761 -6357 -4683 -276
1122 -276 3473 3719 -242 -5347 -6763 -2607 2778 5452 2020 -5194 -8346 -4124 3925 8006 4241
1137 4241 -4836 -10123 -5687 4345 10456 6084 -4289 -10654 -6006 5326 12332 6791 -5724 -12329
1151 -12329 -6357 6893 14116 7676 -5925 -12657 -6181 7039 13447 6984 -6604 -12811 -5179 8430
$$ packed form
1053f775j374O158Q636K469o685j0359l305P540J1501L524q111j2380m597R349
1067d409J3328M278r802j3951m457J0299J5407L750j1333j4726l586J1407J5006
1080A1211L339j1792j5113k576J2010J4168K697j2297j3829j558J1968J2978J273
1093A2479j1065j2827j413J1173J1568M78r882j0415p66R420R113J000q733q589
1107h459q71O873P609J601o085o722j612M347N900K004l136n210k596J674M407
1122b76L749K46l961n105j416M156N385K674l432p214l152M222Q049M081l765
1137D241r077n287M436J0032O111m372j0373o365M648J1332P006n541j2515o605
1151a2329N972J3250P223o440j3601o732O476J3220O408o463j3588o207P632J3609
$$ plain form
1165 8430 13635 5930 -7223 -12927 -5185 7416 12025 4501 -6908 -10957 -3969 6966 10629 3187
1179 3187 -6749 -9893 -4141 5287 8728 3395 -4597 -7501 -3022 3601 6596 2861 -3107 -5321 -2564
1194 -2564 2720 5109 3815 -76 -3414 -3487 -179 3855 5146 2936 -1202 -3486 -1602 3353 6362
1209 6362 4783 -755 -5308 -3951 2936 8233 7281 159 -6100 -5679 2111 9077 7620 -796 -8199
1224 -8199 -6596 2350 10470 8987 -1577 -10061 -8008 1534 10067 8298 -2205 -10774 -8289 2798
1238 2798 10412 7459 -3882 -12047 -9319 2570 10609 6850 -3656 -10974 -7646 3098 9350 5217
1252 5217 -4836 -10501 -6342 3538 8930 5438 -3366 -8250 -5439 2430 6927 4271 -2793 -6541 -3496
1267 -3496 2697 6455 4134 -1175 -4844 -3566 531 3826 3308 1025 -2058 -2626 -979 2287 3372
$$ packed form
1165H430N205p705j3153n704P742J2601M609p524j1409m049O988J0935L663p442
1179C187r936l144N752R428L441n333p992k904M479O623K995l735n968k214K757
1194b564N284K389j294l891l338p3L308M034J291k210m138k284J884M955L009
1209F362j579n538m553J357O887N297r52p122o259M21P790O966j457q416p403
1224h199J603Q946Q120j483j0564q484K053R542Q533j769j0503q569K485J1087
1238B798P614k953j1341q165K728J1889Q039l759j0506p318L328J0744O252m133
1252E217j0053n665M159R880N392l492q804m884K811P869M497k656p064l748L045
1267c496O193L758k321n309l669J278M097L295n18k283l083n68J647L266J085
$$ plain form
1282 3372 1839 -1357 -3901 -3680 137 4196 4233 163 -4745 -5890 -1647 3443 4594 84 -6350 -7349
1298 -7349 -2080 5354 6704 -12 -8303 -9618 -2753 5324 7266 358 -8190 -9358 -1627 6476 7547
1313 7547 -501 -9356 -10402 -1301 7823 8377 142 -8595 -8967 -881 7958 7567 -1028 -8624 -8174 631
1329 631 8457 8065 -433 -8012 -6816 515 6925 6051 -932 -6067 -5325 1639 6188 5201 -827 -5845
1345 -5845 -5180 -306 3947 3743 342 -3276 -3655 -1423 2048 2452 264 -2706 -4374 -2842 308 3058
1361 3058 2232 -706 -4027 -4604 -2165 1503 2857 489 -3696 -5228 -2576 2653 4951 1829 -4714
1376 -4714 -7828 -4319 2991 6987 3349 -4134 -7818 -3678 4066 7242 2853 -5545 -8995 -3592 5490
1391 5490 9225 3805 -4592 -8654 -3903 4828 8300 2732 -5601 -8251 -2457 6354 8564 2570 -5744
$$ packed form
1282C372j533l196k544K21L817M059L7m070m908j145M243N090J151m510o434r99
1298g349N269P434J350o716q291j315O865Q077J942o908q548j168P731Q103J071
1313G547q048q855j046R101R124N54q235q737l72Q086Q839l91q595p596M50Q805
1329F31P826l92q498p579J196P331O410q74o983n135P42O964M549r87o028n018
1345e845O65M874M253k04l401l618l79K232L471M04k188k970j668J532L150K750
1361C058q26k938l321n77K439L668J354k368m185j532K652N229K298l122o543
1376d714l114L509P310L996l638p483l684M140P744L176m389q398l450N403R082
1391E490L735n420q397m062M751Q731L472n568q333k650N794Q811K210n994q314
$$ plain form
1406 -5744 -8895 -2955 4645 7378 2067 -5095 -7107 -1995 4992 6085 748 -5699 -7192 -2326 3686
1421 3686 5044 1364 -3633 -4700 -2086 1719 2892 -20 -2849 -3963 -2405 832 3006 2326 -628
1436 -628 -3016 -3416 -1526 1190 2575 1118 -1665 -2540 -1610 1639 4288 2238 -1909 -4808 -3337 1369
1452 1369 5584 5250 -44 -4913 -3765 1275 5923 4721 -1363 -5953 -4622 2479 7744 6360 -1490
1467 -1490 -7150 -5585 1659 7375 5713 -1845 -7028 -4506 3251 8042 4816 -3112 -8120 -5375 2188
1482 2188 7389 4696 -2072 -6603 -3759 2550 5876 3232 -3155 -6787 -4054 2695 6175 4115 -1771
1497 -1771 -5184 -2997 1653 4084 2186 -1642 -3454 -1895 1592 3776 3005 -150 -2334 -2159 -280
1512 -280 1921 2587 1684 -79 -1371 -835 1046 2642 2200 -12 -2496 -2340 279 3745 4408 1452 -2737
$$ packed form
1406e744l151N940P600K733n311p162k012N112O987J093n337o447j493M866O012
1421C686J358l680m997j067K614L805J173k912k829j114J558L237K174o80k954
1436f28k388m00J890K716J385j457k783q75R30L249K649k050m147k899J471M706
1452A369M215l34n294m869J148N040M648j202o084m590J331P101N265j384p850
1467a490n660J565P244N716j662p558n183K522P757M791l226p928n008K745P563
1482B188N201k693o768m531K844O309L326k644o387l632K733O749L480k060n886
1497a771l413K187M650K431j898l828j812J559L487K184p71l155k184J75J879
1512b80K201O66r03j763j292N36J881J596m42k212k484J56K619L466O63k956m189
$$ plain form
1529 -2737 -3798 -694 3299 4262 1314 -3374 -4359 -184 4949 5556 1201 -4704 -6257 -1674 4613 6008
1545 6008 1360 -4461 -5603 -590 5505 6154 45 -5907 -6358 -529 5616 6216 636 -5255 -5253 -29
1561 -29 4732 4831 -390 -5226 -4592 792 5728 5159 140 -4474 -4128 16 3946 3480 -112 -2950 -2426
1578 -2426 1096 3488 3321 22 -2843 -2512 -431 1553 2187 920 -779 -1542 -670 355 1062 419 -515
1595 -515 -1676 -2041 -450 1552 2669 1233 -1566 -3076 -2087 717 2725 1806 -1234 -3498 -1902 2240
1611 2240 4187 2309 -2607 -5305 -3221 1764 4779 2858 -1598 -4838 -2715 2336 4932 2048 -3078
1626 -3078 -5649 -2791 3057 5932 3214 -2883 -5387 -2432 2748 4650 1621 -3329 -4872 -1122 3894
1641 3894 5208 1599 -3358 -4874 -2195 2585 3872 915 -2994 -3289 -463 2853 3128 95 -3180
$$ packed form
1529b737j061L104L993R63k948m688r85M175N133O07m355n905j553M583O287J395
1545F008m648n821j142N013O095O49o109n952m51N829O145O00n580n891KN224
1561b9M761R9n221m836O34N384M936n69n019m614L46M144L930m66l592k838N24
1578b426L522K392j67l299k865L31K081J984O34j267j699p63Q72J025P07o43r34
1595e15j161l65J591K002J117j436k799j510R89K804K008r19l040k264J596M142
1611B240J947j878m916k698K084M985L015j921m456l240K123N051K596k884n126
1626c078k571K858N848K875k718o097k504K955N180J902l029m950j543L750N016
1641C894J314l609m957j516K679M780J287k957l909k95K826L316K75l033l275
$$ plain form
1656 -3180 -3579 -583 1858 2693 1106 -1271 -1971 -760 834 1244 -5 -1034 -1705 -745 556 1358 1308
1673 1308 546 -917 -2194 -1313 -183 1121 1341 -79 -1804 -1662 454 2607 1865 -847 -3360 -2837
1689 -2837 172 3206 3065 -257 -3308 -3354 -222 3395 2409 -1118 -4357 -3117 1436 4759 3885 -1191
1705 -1191 -4778 -4079 1134 4108 2839 -1611 -4464 -2638 2302 4481 2772 -1817 -5191 -3354 1459
1720 1459 4577 2172 -1535 -3654 -2041 1782 3812 1412 -2545 -4031 -1707 2175 3946 2074 -957
1735 -957 -2622 -1335 1152 2086 838 -1317 -2307 -756 1213 2358 1554 -198 -1392 -1418 -714 349 824
1752 824 716 -217 -783 -579 253 1377 783 -347 -1982 -1848 -244 2284 2563 656 -1795 -2661 -879
1769 -879 1995 2567 256 -2721 -3240 2 3680 3845 742 -3747 -4156 -488 3442 3963 331 -3197
$$ packed form
1656c180l99K996K441Q35j587k377p00J211J594M10j249j029o71R60J301Q02n0
1673A308p62j463j277Q81J130J304K20j420j725J42K116K153p42k712k513N23
1689b837L009L034j41l322l051m6L132L617r86l527l239J240M553L323q74n076
1705a191l587O99N213K974j269m450k853J826M940K179j709m589l374J837M813
1720A459L118k405l707k119J613L823K030k400l957j486K324L882J771j872l031
1735i57j665J287K487R34j248k155r90J551J969J145q04j752j194k6P04J063M75
1752H24j08r33n66K04Q32J124n94j130j635J34J604K528K79j907k451q66J782
1769h79K874N72k311k977n19L242L678J65l103m489m09L668L930N21l632l528
$$ plain form
1785 -3197 -3329 715 4240 3783 -465 -4440 -4103 255 4420 4069 48 -3782 -3296 376 3752 3006
1801 3006 -1156 -3982 -3197 1021 3974 3266 -417 -3627 -2734 540 2564 2070 -967 -2376 -1803 636
1817 636 2549 1841 -386 -2245 -2254 -242 1078 1243 710 -681 -654 -545 459 973 228 -734 -1306 -1593 31
1836 31 2053 2386 668 -1376 -1995 -1203 1229 2104 1157 -1657 -2435 -971 1798 3632 1369 -2628 -3967
1853 -3967 -1931 1871 4148 2091 -2027 -3657 -1503 2552 4164 823 -3138 -4545 -1864 2808 4555
1868 4555 1772 -2758 -4180 -1720 2336 3774 858 -3161 -3939 -707 3302 4336 1173 -3258 -4323
1883 -4323 -1092 2241 2884 879 -2203 -2979 -347 2157 2774 470 -2181 -2954 -1111 1507 2525 1408
1899 1408 -1018 -1523 -785 502 1036 1078 -624 -1706 -826 197 1617 2035 673 -1027 -2128 -1256 403
$$ packed form
1785c197j32M044L525m57m248l975L37M358M165l51m021l830M86L672L376p46
1801C006m162k826P85M218K953p08l683l210Q93L274K024m94l037j409N73K439
1817F36J913p08k227j859rK012J320J65n33j391K7J09J004N14p45r62n72k87J624
1836C1K022L33j718k044o19P92K432Q75r47k814p78J464K769J834k263l997j339
1853c967K036L802K277k057m118j630K154M055J612l341l961j407K681M672J747
1868D555k783m530j422K460M056J438k916m019p78L232M009J034l163m431j065
1883d323L231L333O43k005l082p76K632K504O17k304k651p73J843K618J018j117
1899A408k426n05P38J287N34M2j702j082Q80J023J420M18j362j700j101Q72J659
$$ plain form
1916 403 1729 1279 -598 -1625 -1207 1052 2450 1773 -688 -3050 -2554 348 3446 2854 -313 -2933
1932 -2933 -2548 1022 3238 2231 -1053 -3999 -3012 1126 4386 3167 -1265 -3743 -3270 568 3626 2466
1948 2466 -1205 -3763 -2223 1507 4091 2804 -1461 -3989 -2423 930 3556 2252 -1019 -2816 -1559
1963 -1559 993 2962 1752 -1390 -2689 -1810 1188 2871 2078 -194 -1829 -1578 242 1507 879 -545
1979 -545 -1023 -979 152 1275 1574 681 -819 -1630 -1006 161 1468 1542 103 -1067 -925 -14 1379 1702
1997 1702 54 -1928 -2603 -405 2277 2667 1278 -1653 -2984 -839 1624 2584 420 -2111 -2823 -631
2013 -631 2808 3236 933 -2713 -3515 -906 2368 3458 892 -2305 -2687 -262 3021 3181 315 -2960
2029 -2960 -2971 -285 2750 3014 590 -2182 -2505 122 2274 2189 -352 -2263 -2146 44 2503 2114 488
$$ packed form
1916D03J326m50j877j027M18K259J398o77k461k362M96K902L098n92l167k620
1932b933L85L570K216j007l284k946R87M138L260j219m432k478M73L838L058j160
1948B466l671k558J540L730K584j287m265k528J566L353K626j304l271j797J257
1963a559K552J969j210l142j299Q79K998J683p93k272j635K51J820J265o28j424
1979e45m78M4J131J123K99q93j500q11O24J167J307P4j439j170J42R11J393L23
1997A702j648j982o75K198K682L90j389k931j331K145K463R60k164k531p12K192
2013f31L439M28k303l646q02K609L274J090k566l197l82K425L283J60k866l275
2029b960j1K686L035K64k424k772l23K627K152q5k541j911J17K190K459l89j626
$$ plain form
2046 488 -1527 -2205 -190 1570 1313 397 -1309 -1493 -202 1273 1147 413 -1277 -1510 -872 65 512 711
2064 711 223 -560 -658 -447 493 841 272 -933 -1341 -433 372 1982 1355 -460 -2169 -1589 558 1836
2082 1836 1135 -643 -1985 -1357 1337 2821 1339 -1422 -2909 -1961 865 2719 1537 -1360 -2566 -1255
2098 -1255 1388 2543 1315 -1897 -3086 -1523 1695 2918 1474 -1486 -2929 -1067 1321 2488 672
2113 672 -1722 -2665 -722 1832 2806 601 -1852 -2318 -786 1296 1851 305 -1090 -1388 -162 1235
2129 1235 1492 78 -1377 -1347 -295 443 1026 609 -334 -667 -405 -101 382 319 -1 -546 -701 197 530
2148 530 1169 647 -222 -1214 -1077 -248 614 664 227 -1287 -816 324 1756 1070 -537 -2025 -1684 208
$$ packed form
2046D88k015o78K015J760k57r16j706j84J291J475j26p34j690k33O38R37M47J99
2064G11m88p83r8K11R40L48n69j205m08R08Q05J610o27j815j709N80K147J278
2082A836p01j778j342O28K694J484j482k761j487R48K826J854j182k897j206J311
2098a255K643J155j228l212j189J563L218J223j444k960j443J862K388J167j816
2113F72k394r43J943K554R74k205k453m66J532K082N55j546j395k98J226J397
2129A235K57j414j455L0J052P38N83m17r43l33K62L04M83o3l20n45j55Q98L33
2148E30O39n22q69r92J37Q29Q62N0m37j514M71J140J432o86j607j488L41J892
$$ [...]
8191A40
##END NTUPLES=NMR FID
##END=
