##TITLE=1H_CA-8676-2
 DMSO, 8 sc, 
 30.12.2019
##JCAMPDX= 6.0         $$ Bruker NMR JCAMP-DX V2.0
##DATA TYPE= NMR FID
##DATA CLASS= NTUPLES
##ORIGIN= UXNMR, Bruker Analytische Messtechnik GmbH
##OWNER= root
$$ XWIN-NMR		Version 3.5
$$ Mon Dec 30 13:49:04 2019 Russian Standard Time (UT+4h)  she@DPX200
##.OBSERVE FREQUENCY= 200.1315
##.OBSERVE NUCLEUS= ^1H
##.DELAY= (6, 6)
##.ACQUISITION MODE= SIMULTANEOUS
##.ACQUISITION SCHEME= undefined
##.AVERAGES= 8
##.DIGITISER RES= 18
##SPECTROMETER/DATA SYSTEM= spect
##.PULSE SEQUENCE= zg30
##.SOLVENT NAME= CDCl3
##.SHIFT REFERENCE= (INTERNAL, CDCl3, 0, 15.7039)
##AUDIT TRAIL= $$ (NUMBER, WHEN, WHO, WHERE, WHAT)
$$ ##TITLE= Audit trail, XWIN-NMR		Version 3.5
$$ ##JCAMPDX= 5.01
$$ ##ORIGIN= Bruker BioSpin GmbH
$$ ##OWNER= she
$$ F:/spectra/data/she/nmr/H-F/1/audita.txt
$$ ##AUDIT TRAIL=  $$ (NUMBER, WHEN, WHO, WHERE, WHAT)
(   1,<2019-12-30 13:47:39.93 +0400>,<she>,<DPX200>,
      <created by zg, POWCHK disabled, PULCHK disabled
       configuration hash MD5:
       00 E9 B6 7A A2 85 ED C7 34 08 36 98 17 FE 4E 26
       data hash MD5: 16K
       82 DF 7C 15 B6 3F AA D6 26 6C 25 81 BD 64 BC 48>)
$$ ##END=
$$ 
$$ hash MD5
$$ DB 9F E1 A9 F8 58 B5 75 8B 8E D4 10 C1 1F 19 2B
##$RELAX= 
##$RELAX= 
##$RELAX= 
##$RELAX= 
##$RELAX= 
##$RELAX= 
$$ Bruker specific parameters
$$ --------------------------
##$DU= <F:/spectra>
##$EXPNO= 1
##$NAME= <H-F>
##$PROCNO= 1
##$TYPE= <nmr>
##$USER= <she>
##$AMP= (0..31)
100 100 100 100 100 100 100 100 100 100 100 100 100 100 100 100 100 100 
100 100 100 100 100 100 100 100 100 100 100 100 100 100 
##$AQSEQ= 0
##$AQ_mod= 1
##$AUNM= <au_zg>
##$AUTOPOS= <>
##$BF1= 200.13
##$BF2= 200.13
##$BF3= 200.13
##$BF4= 200.13
##$BF5= 200.13
##$BF6= 200.13
##$BF7= 200.13
##$BF8= 200.13
##$BYTORDA= 1
##$CFDGTYP= 0
##$CFRGTYP= 5
##$CHEMSTR= <none>
##$CNST= (0..31)
1 1 145 1 1 1 1 1 1 1 1 1 1 1 1 1 1 1 1 1 1 1 1 1 1 1 1 1 1 1 1 1 
##$CPDPRG= <>
##$CPDPRG1= <>
##$CPDPRG2= <>
##$CPDPRG3= <>
##$CPDPRG4= <mlev>
##$CPDPRG5= <mlev>
##$CPDPRG6= <mlev>
##$CPDPRG7= <mlev>
##$CPDPRG8= <mlev>
##$CPDPRGB= <>
##$CPDPRGT= <>
##$D= (0..31)
0 1.2 0 0 0 0 0 0 0 0.06 0 0.03 0 0 0 0 0.0002 0 0 0 0 0 0 0 0 0 0 0 0 
0 0 0 
##$DATE= 1577699259
##$DBL= (0..7)
120 120 120 120 120 120 120 120 
##$DBP= (0..7)
150 150 150 150 150 150 150 150 
##$DBP07= 0
##$DBPNAM0= <>
##$DBPNAM1= <>
##$DBPNAM2= <>
##$DBPNAM3= <>
##$DBPNAM4= <>
##$DBPNAM5= <>
##$DBPNAM6= <>
##$DBPNAM7= <>
##$DBPOAL= (0..7)
0.5 0.5 0.5 0.5 0.5 0.5 0.5 0.5 
##$DBPOFFS= (0..7)
0 0 0 0 0 0 0 0 
##$DE= 6
##$DECBNUC= <off>
##$DECIM= 24
##$DECNUC= <off>
##$DECSTAT= 4
##$DIGMOD= 1
##$DIGTYP= 9
##$DL= (0..7)
0 120 120 120 120 120 120 120 
##$DP= (0..7)
150 150 150 150 150 150 150 150 
##$DP07= 0
##$DPNAME0= <>
##$DPNAME1= <>
##$DPNAME2= <>
##$DPNAME3= <>
##$DPNAME4= <>
##$DPNAME5= <>
##$DPNAME6= <>
##$DPNAME7= <>
##$DPOAL= (0..7)
0.5 0.5 0.5 0.5 0.5 0.5 0.5 0.5 
##$DPOFFS= (0..7)
0 0 0 0 0 0 0 0 
##$DQDMODE= 0
##$DR= 18
##$DS= 0
##$DSLIST= <SSSSSSSSSSSSSSS>
$$ [...]
##$SUBNAM2= <"">
##$SUBNAM3= <"">
##$SUBNAM4= <"">
##$SUBNAM5= <"">
##$SUBNAM6= <"">
##$SUBNAM7= <"">
##$SUBNAM8= <"">
##$SUBNAM9= <"">
##$SW= 24.9337058887773
##$SWIBOX= (0..15)
0 0 2 0 0 0 0 0 0 0 0 0 0 0 0 0 
##$SW_h= 4990.01996007984
##$TD= 16384
##$TD0= 1
##$TE= 0
##$TE2= 300
##$TE3= 300
##$TEG= 300
##$TL= (0..7)
0 120 120 120 120 120 120 120 
##$TP= (0..7)
150 150 150 150 150 150 150 150 
##$TP07= 0
##$TPNAME0= <>
##$TPNAME1= <>
##$TPNAME2= <>
##$TPNAME3= <>
##$TPNAME4= <>
##$TPNAME5= <>
##$TPNAME6= <>
##$TPNAME7= <>
##$TPOAL= (0..7)
0.5 0.5 0.5 0.5 0.5 0.5 0.5 0.5 
##$TPOFFS= (0..7)
0 0 0 0 0 0 0 0 
##$TUNHIN= 0
##$TUNHOUT= 0
##$TUNXOUT= 0
##$USERA1= <user>
##$USERA2= <user>
##$USERA3= <user>
##$USERA4= <user>
##$USERA5= <user>
##$V9= 5
##$VALIST= <valist>
##$VCLIST= <CCCCCCCCCCCCCCC>
##$VD= 0
##$VDLIST= <DDDDDDDDDDDDDDD>
##$VPLIST= <PPPPPPPPPPPPPPP>
##$VTLIST= <TTTTTTTTTTTTTTT>
##$WBST= 1024
##$WBSW= 4
##$XGAIN= (0..3)
0 0 0 0 
##$XL= 0
##$YL= 0
##$YMAX_a= 385376
##$YMIN_a= -234984
##$ZGOPTNS= <>
##$ZL1= 120
##$ZL2= 120
##$ZL3= 120
##$ZL4= 120
##$ABSF1= 10
##$ABSF2= 0
##$ABSG= 5
##$ABSL= 3
##$ALPHA= 0
##$AQORDER= 0
##$ASSFAC= 0
##$ASSFACI= 0
##$ASSFACX= 0
##$ASSWID= 0
##$AUNMP= <proc_1d>
##$AZFE= 0.1
##$AZFW= 0.1
##$BCFW= 1
##$BC_mod= 2
##$BYTORDP= 1
##$COROFFS= 0
##$CY= 11.3945322036743
##$DATMOD= 1
##$DC= 2
##$DFILT= <>
##$DTYPP= 0
##$F1P= 16.9975609425685
##$F2P= -3.02152046262296
##$FCOR= 0.5
##$FTSIZE= 0
##$FT_mod= 4
##$GAMMA= 1
##$GB= 0.15
##$INTBC= 1
##$INTSCL= 1
##$ISEN= 128
##$LB= 0.24
##$LEV0= 0
##$LPBIN= 0
##$MAXI= 10000
##$MC2= 0
##$MEAN= 0
##$ME_mod= 0
##$MI= 1.114404
##$NCOEF= 0
##$NC_proc= 0
##$NLEV= 6
##$NOISF1= 3.799351
##$NOISF2= 2.8
##$NSP= 1
##$NTH_PI= 0
##$NZP= 0
##$OFFSET= 15.70392
##$PC= 1
##$PHC0= -10151.68
##$PHC1= 20.2008
##$PH_mod= 1
##$PKNL= yes
##$PPARMOD= 0
##$PSCAL= 0
##$PSIGN= 0
##$REVERSE= no
##$SF= 200.130013532006
##$SI= 16384
##$SIGF1= 3
##$SIGF2= 2
##$SINO= 400
##$SIOLD= 16384
##$SREGLST= <1H.CDCl3>
##$SSB= 0
##$STSI= 0
##$STSR= 0
##$SW_p= 3612.71676300578
##$SYMM= 0
##$S_DEV= 0
##$TDeff= 0
##$TDoff= 0
##$TI= <>
##$TILT= no
##$TM1= 0
##$TM2= 0
##$TOPLEV= 0
##$USERP1= <user>
##$USERP2= <user>
##$USERP3= <user>
##$USERP4= <user>
##$USERP5= <user>
##$WDW= 1
##$XDIM= 8192
##$YMAX_p= 0
##$YMIN_p= 0
$$ End of Bruker specific parameters
$$ ---------------------------------
##NTUPLES= NMR FID
##VAR_NAME=  TIME,          FID/REAL,        FID/IMAG
##SYMBOL=    X,             R,               I
##VAR_TYPE=  INDEPENDENT,   DEPENDENT,       DEPENDENT
##VAR_FORM=  AFFN,          ASDF,            ASDF
##VAR_DIM=   8192,          8192,            8192
##UNITS=     SECONDS,       ARBITRARY UNITS, ARBITRARY UNITS
##FACTOR=    0.0002004,     1,               1
##FIRST=     0,             0,               0
##LAST=      1.6414764,     0,               0
##MIN=       0,             -234984,         0
##MAX=       1.6414764,     385376,          0
$$ Real data points
##PAGE= N=1
##DATA TABLE= (X++(R..R)), XYDATA
0@%%%%%%%Qj6J6j6K1k9L2m0M8n6P2q7J03j20J38j61J88k18K50k85L24l68M17m68
31b47N26n94O65p42Q30r26J028j140J266j403J552j719J906k111K339k596K886
48A520l219L603m048M578n219O013p030Q380j0275J3151j8102K8972r5712Q1371
62C983J83927j15421j93798j13675R8028J45896L7182j34021j38986p836J44460
73i0261J51777M1764j00623j31995n7610N0667Q5466M5646l1193n8641q765P5256
85b8512Q7932J3791q2149j05989l8535O2259R2428L8391k4809k6428J2710L2033
97C3122k91m6955m7473L005L8651K1716p911N147M1938M2474j8705r0649q5434
110a11365J0765R5009P3671k3077p8420l2669O0520Q6403K919j03607j15133j8808
$$ y = [0, 0, 0, 0, 0, 0, 0, 0, 8, -8, 8, -8, 13, -16, 16, -24, 24, -32, 40, -47, 56, -64, 74, -87, 101, -117, 133, -152, 172, -196, 221, -247, 279, -315, 350, -392, 438, -488, 540, -600, 666, -737, 815, -904, 1002, -1109, 1230, -1366, 1520, -1699, 1904, -2144, 2434, -2785, 3228, -3802, 4578, -5697, 7454, -10648, 18324, -77388, 3983, 187910, 72489, -121309, -234984, -136956, 8940, 46122, -87899, -226885, -234721, -90261, 61516, 103280, 2657, -129338, -186948, -136281, -50815, -5169, -36362, -95003, -103768, -28512, 59420, 73211, -8938, -114927, -153462, -91203, 1225, 39616, 14807, -11621, 1089, 33122, 32831, -14124, -61597, -58592, -19941, 1775, -6136, -989, 40949, 83423, 64718, -25931, -111365, -100600, -5591, 68080, 45003, -33417, -66086, -5566, 80837, 83756, -19851, -134984, -153792]
122a53792Q9622J14521M3415n5677q8942l1985M7897O7997R376p4523r5936j2774
134a40801J06397J35965L8475r7897j37782m1130R1341J15262M743j04687q4449
145a14563M4063J39207R4456n1529j44237q9453M3725J09348N8231l6224o7411
156a4387r376O2315O2175p516o8924o5914j3754M1556N4376K5906q481k0565j3230
169B4181K96N238r133l0474k5764Q576L9716L7610M420k7219k6521j115L748k1597
183a8038l6721o464M3214N7187J4040m2575m8186M500M1253J0269n1012o0265
195i2798L835P7288Q1147K236p4163o6992N179N5384L4170k8185n7634j5216N5596
208b0153P6045K5127m5889p3981m0346K3797N7320L1273k0574m0129r180M2202
$$ y = [-153792, -64170, 50351, 93766, 38089, -50853, -82838, -34941, 33056, 42432, -32091, -128027, -140801, -34404, 101561, 140036, 42139, -95643, -136773, -45432, 69830, 74573, -30114, -114563, -70500, 68707, 163163, 111634, -32603, -122056, -78331, 31017, 89248, 53024, -14387, -23763, 38552, 100727, 93211, 24287, -41627, -55381, -13825, 40551, 66457, 57976, 37411, 24181, 24477, 29715, 20582, -9892, -35656, -27080, 12636, 50246, 54666, 27447, 926, -189, 3559, -18038, -54759, -61223, -18009, 39178, 53218, 10643, -37543, -33043, 8210, 18479, -32533, -92798, -88963, -11675, 69472, 71708, -2455, -69447, -64268, -8884, 25286, -2899, -60533, -75749, -20153, 55892, 81019, 35130, -38851, -79197, -55400, 1920, 33193, 12619, -27510, -36690, 5512]
220E512N7791R385o3844q2815k2524O0585Q1888K1932n4844o1883Q540O7198L9201
233F6122m4719q8107m0955N0544Q9542L5879m4537o2591j2167L7335L0723j8717
245a648n2131k8376K7521N5493L3581r442l5835l1021l295J5706R804r022j4534
258d3199K30K4821L6256J3641k5699m2986k0071J5968K8651Q749j5323r835K3266
271e531L7239P512l6159m6323j0507L2058L5296k074k8500n357L6648L9423p356
284D6369n4213m9890N135N1198L8465j2343l6896j0524L1576L7867k066m8763
296d085n0560m542M2613M8831J5781k5368l8985j0769K7083L0766o343m5603m4128
309f5309P770O3775O2817j705o3294n8363L308N5314L9998k5931o3221k2541N0991
$$ y = [5512, 63303, 72688, 8844, -73971, -96495, -35910, 45978, 67910, 13066, -48817, -40277, 26921, 66122, 21403, -66704, -107659, -57115, 32427, 68306, 23769, -38822, -50989, -13654, 17069, -1648, -53779, -82155, -54634, 859, 34440, 24998, -10837, -41858, -45153, -29447, -19643, -28665, -43199, -42969, -18148, 18108, 31749, 6050, -36936, -57007, -41039, -12388, -3639, -18962, -28797, -5531, 31708, 39220, 3061, -43262, -53769, -21711, 13585, 11511, -16989, -22346, 14302, 53725, 46369, -7844, -57734, -52599, -1401, 37064, 24721, -12175, -22699, 8877, 46744, 44678, -4085, -54645, -59187, -16574, 32257, 48038, 22670, -16315, -27084, -1, 30765, 24422, -21181, -65309, -57539, 6236, 69053, 67348, 4054, -54309, -51001, 4313, 44311, 18380, -44841, -67382, -16391]
322a6391P3928K2894n0867p2317k3135M1551N1466O940l4955k8636J3074M2852
334B6404K7086j7868m4970l0863M932K8724K7716P302j1825j1669K222R271K563
347A9025j2433k1140j1990J3794K6393J5576n045j1886l866M593l131k0233j7486
360b7829J0080L2867K1005j1264k7252q028K1733K3244j4468m6008k6813K6465
372b6268N6833L2737k3241n1935k4757K4930M0773O120l6767m0586m85M7605N2530
385E7489O031m4488n3011j4167L2389M4411R746l4070l8119L510M6301M4403n972
398E4453n7508n6257J649N5049N0903k769m6427l4969J6740M9100K1571l4109
410A7426n3931j8507L2997M8666J8186k2088l0170o004J5364J1877o959j7363
$$ y = [-16391, 57537, 80431, 29564, -42753, -65888, -24337, 27129, 34069, -886, -29522, -16448, 26404, 53490, 35622, -9348, -40211, -35279, -6555, 21161, 28463, 16638, 4969, 7191, 16462, 19025, 6592, -14548, -26538, -12744, 13649, 29225, 24180, 12294, 8428, 13021, 9890, -10343, -27829, -17749, 15118, 36123, 24859, -2393, -10421, 11312, 34556, 20088, -25920, -52733, -26268, 30565, 63302, 40061, -11874, -36631, -11701, 29072, 35192, -1575, -42161, -42646, 4959, 57489, 63520, 19032, -33979, -48146, -15757, 28654, 38400, 4330, -33789, -30279, 16022, 60425, 54453, -3055, -59312, -57663, -2614, 48289, 45520, -907, -35876, -19136, 29964, 51535, 17426, -36505, -55012, -22015, 26651, 44837, 22749, -7421, -13425, 1939, 13816, 6857, -10506]
422a0506r333Q982J9181J2525N02o463r560p695m625j769j94N201J1417J0192
436A7855J758q147j1431l864P256M298r982j6436k348K2492L1908R174k7566m0614
450b5647j2221K6992L2933J582l2644k9492J2686M7270L1601k1956n5053l5271
462e9220J7309M9394K9021j8419m0580j4265K5008L7883Q622l1941m4101j3575
474e4864L0057M4000J8768j9951l6128j5091K0977L1684M242k9950l2621O73L7478
487g26L8707R26l3586l0521J652K5213J6467r893k2342n581K1099K4082K509j8533
501I473j8898l217R989P061m757o140N778J3710P173p237j6153j0030M847J0179
515A778J169q520o104O926J5959J1097q494k3454j7675L346K0284J7394k379j8998
$$ y = [-10506, -19839, -10857, 8324, 20849, 21351, 14888, 5328, -2367, -6992, -8761, -8955, -3754, 7663, 17855, 19613, 11466, 35, -3829, 3427, 7725, -2257, -18693, -21041, 1451, 33359, 42533, 14967, -25647, -37868, -10876, 22057, 23639, -9005, -38497, -25811, 21459, 53060, 31104, -23949, -59220, -41911, 7483, 36504, 18085, -22495, -36760, -11752, 26131, 34753, 2812, -41289, -54864, -24807, 19193, 37961, 18010, -18118, -33209, -12232, 19452, 23694, -6256, -38877, -38204, -726, 37981, 38907, 5321, -25200, -23548, 1665, 18132, 8239, -14103, -19684, 1415, 25497, 28006, 9473, -9425, -12642, -2653, 4408, -349, -6489, -711, 12999, 20172, 12935, -3218, -13248, -8401, 1778, 2947, -5573, -11677, -4751, 11208, 22305, 13811, -9643, -27318, -23972, -3688, 13706, 11327, -7671]
529g671j3060J1423K5937R960k1085l4308j3904K4371M0057J3947k3317l2756
541b0406l816K6999K6632n490l4698k5230J2414L8809K6826q025l1768k1649Q705
554a0697K6142J2319j4077k3699p071J9632K8617R425j9227k7663j0414J3802
566b911K0323N749j4094j5639K900J9278J3862p486k3724j7171M946J9953J0867
579A6853p959j3508j226J2759J0097p492k0141j2843Q903J7427P161q287j1794
592a0050J144J2317P206r677j8549p458J0659J8298R186p639j4605l820J0153
605b835J1410k520j5219j3829L563K1356J9383j882j9526j6522K614J8598J2013
618A6604j0173k1919p808J8154K5670Q221j9457k7377p557J8578K1461N41k0425
$$ y = [-7671, -20731, -9308, 16629, 26589, 5504, -28804, -42708, -18337, 21720, 35667, 12350, -20406, -24222, 2777, 29409, 23919, -10779, -36009, -23595, 15214, 42040, 34015, 2247, -19402, -10697, 15445, 27764, 13687, -10012, -17083, 2549, 31166, 40591, 21364, -6299, -16713, -2911, 17412, 23161, 9067, -6572, -3672, 15606, 29468, 21982, -1742, -18913, -13967, 5986, 16853, 8894, -4614, -5840, 6919, 17016, 9524, -10617, -23460, -14557, 2870, 10031, 1744, -10050, -8906, 3411, 10617, 940, -17609, -25067, -14408, 3890, 13076, 5437, -9168, -12988, -2835, 8575, 6055, -9164, -22993, -19430, 1926, 21309, 19427, -99, -16621, -14007, 4591, 16604, 6431, -15488, -23296, -5142, 20528, 28749, 9292, -18085, -25642, -7064, 14397, 14938, -5487]
631e487j7520O271K4575J5908j1534k8499j6645R767K2739J1402j0480j9414m840
644b3757J4492J6144k60j7888j9379k206J6620J8012J658j3395j2927J105J3379
657h402R675p347j7256p480J1360J9097Q582r516j5058l193J0748R868l849j1881
671a4652n581R401J6156P451q912j2876k638R028P530j989j0184n291Q863J5307
685A1613N382r810j4584m899Q641J2382J039j2022r111M640J5443R722p128j9259
699g951j2856O485J7989R692p606j7118o438J2998J8574K502j9003k1501k501
712b6734J9305K1582J179j9624j7078M387J9466J3044q656k1564j1594J2325K3223
725I261J0803r829j8731q498R954J6401M585j2588j3741L69J4931J5677J012j4069
$$ y = [-5487, -23007, -16736, 7839, 23747, 12213, -16286, -32931, -23164, -425, 10977, 497, -18917, -23757, -9265, 6879, 6619, -11269, -30648, -32854, -16234, 1778, 3436, -9959, -22886, -21781, -8402, 1273, -6074, -23330, -30810, -19450, -353, 8229, -1287, -16345, -19538, -8790, 1078, -2771, -14652, -20233, -10832, 5324, 12775, 3863, -9013, -11651, -2623, 4907, 2918, -7266, -12557, -3694, 11613, 16995, 7185, -7399, -12298, -3657, 8725, 9764, -2258, -11369, -6729, 8714, 18436, 11308, -7951, -20807, -14322, 3667, 13359, 5753, -11365, -17803, -4805, 13769, 16271, -2732, -24233, -26734, -7429, 14153, 15332, -4292, -21370, -16983, 2483, 15527, 6871, -14693, -26287, -13962, 9261, 20064, 10235, -8496, -16994, -7040, 9361, 13946, 1358, -12383, -12014, 2917, 18594, 19606, 5537]
739E537j3693K19J2032Q641k276r782n409O857J1320K744q177j0127l000O323
753A209P467l17p021l788N165P483K9r733r429n15R751P038m045r420l834P539
769b421J0150Q18j2339j3933n32J3135J2404p26j2519j1076K524J5100R320p579
783B326j7003r825R234J9479J1071r630j9502q059J1237J7886M650j3488j8001
796a9625j322J7997J8347J150j6766j7282l36J5872J4553k836j5500j1162N876
809a1034J6412J0382p570j7107q447P226J3100O289o815j1284k873Q090Q662r89
823D042r009q013L1P878O557j231o099l083K850M632k79n971n503K150P223M068
839B43l945n834j033O148O340k087r600n842N617J1363O132n321j1451m344P731
$$ y = [5537, -8156, -7937, 4095, 12736, 10460, 678, -4731, 2126, 13446, 16190, 8013, -2114, -5114, 1209, 8676, 8359, 1338, -2450, 2715, 10198, 10227, 494, -8935, -9450, 301, 7339, 3294, -6126, -9960, -2421, 7729, 8547, -3792, -17725, -18257, -5122, 7282, 6556, -5963, -17039, -14515, 585, 9905, 2326, -14677, -24502, -15268, 4211, 15282, 5652, -13850, -21909, -10672, 7214, 11864, -1624, -19625, -20947, -2950, 15397, 16547, -219, -17501, -17837, -1965, 12588, 9752, -5748, -16910, -11034, 5378, 15760, 8190, -8917, -17364, -10138, 2962, 9251, 2436, -8848, -11721, -3631, 5031, 4042, -4967, -12980, -12949, -5071, 1486, 255, -5844, -8927, -6077, -1445, -1724, -7695, -13198, -11048, -3825, 243, -3702, -9536, -10569, -4421, 1919, -168, -9768, -15610, -9993, 1370, 7502, 2181, -9270, -13614, -5883]
854e883J1892K141r841j1527k75J3242J4430K01j4442j3018K036J4070J1755l643
868A1138j5106r628O691J6825Q987p932j6679q813Q704J6376O595r713j4230m639
882a1424J0212J4161K315j2378j4058r82J2360J1984K42j1879r799K531J0953
895D238O261m554j0230n317M919R748M027n024p640j420M584N760n51n555l972
910d726L118O518J878l295n429m92M712M242k410n884k015N289P035J650o115
925D076p666J24P128O521j997q189o029L826J0465O072n903j1953n219O843J1917
940A0016M097q607j2031j858J0150J1225j50j1683j1705R54J2426J0375k209j1949
954i49r163L121J2451P871n747j3010o781O373J2713N932p322j2439l573Q335
$$ y = [-5883, 6009, 8150, -1691, -13218, -13493, -251, 14179, 14380, -62, -13080, -11044, 3026, 14781, 11138, -3968, -13596, -6905, 9920, 18907, 10975, -5704, -14517, -5813, 10563, 17158, 7445, -6785, -11424, -1212, 12949, 15264, 2886, -11172, -12154, 206, 12190, 12432, 553, -9246, -6715, 4238, 10499, 5945, -4285, -9602, -4683, 5065, 9092, 4068, -3572, -4992, -408, 5352, 4801, -754, -4726, -1608, 4910, 6788, 3493, -1936, -2428, 2284, 6526, 4116, -1768, -3783, 1506, 8541, 10191, 4076, -3590, -3466, 3662, 10183, 8186, -3, -6032, -2206, 8259, 14331, 8428, -3525, -8744, -1901, 10016, 14113, 5506, -6525, -8383, 1767, 12992, 12842, 1159, -10546, -9592, 2834, 13209, 11000, -949, -10112, -6991, 5460, 13331, 7584, -5426, -12207, -5834, 6879, 12811, 5489, -6950, -10523, -2188]
968b188J0764J419q476r514r7Q947Q385j603q617o395J636Q024N456l384p149
983b792l115M934O152J645m908o162q6N497M171k191n023j845L242M914O80m743
999C70m844J214N649L004k567n820k387M167O501R72o158o526J77O600P243j454
1015F141q495o216L407R411M624m552j0202m363O351J0158L292p432j0014k094
1029i984Q147J0366K34r229r397N95R877Q937j738j1071q223L504J1012O309m253
1044E086j0522n683N708J0599L132o231r297k888O755Q381J831p262p611j98P074
1059a126O540q41p064n645K443P341L260l277o009k236L818N664N06m278l622
1074d526R93L903K763j682m651j242L083M300n7m017l322J198M451L148k788o029
$$ y = [-2188, 8576, 9995, 1519, -7995, -8092, 855, 9240, 7637, -980, -7375, -5739, 2285, 7741, 4357, -2792, -5907, -973, 5179, 6824, 1916, -4246, -4332, 1165, 5336, 3145, -1878, -3723, -481, 4433, 5113, 370, -4474, -3260, 2389, 5393, 2826, -2994, -5381, -1214, 5287, 6259, 101, -6425, -6248, 352, 7595, 6141, -2354, -8570, -5163, 4248, 8872, 4320, -5882, -10245, -3894, 6264, 9556, 2124, -7890, -9984, -1837, 8529, 8763, -466, -9863, -9268, 609, 9546, 7808, -3263, -11486, -7982, 3030, 9339, 5086, -5436, -11119, -5411, 5188, 8320, 2089, -7208, -10096, -3341, 5040, 6871, -391, -8002, -8200, -1126, 5414, 4573, -2491, -8136, -5693, 1648, 4908, 1631, -4378, -6614, -2796, 2868, 3374, -904, -4526, -3533, 370, 3133, 1451, -3200, -4442, -1359, 2941, 2884, -1133, -4455, -3257, 1194, 4342, 1554, -4475]
1090d475j584M592N852O26n538o088O66O689N338k403p260n019K996Q579M588
1105G559m642q915l263M874Q898L004o377r387j125P850Q483M17q562q842R18
1120i110R083P929j936q922o166K718R304N872l983r181m371M475Q745L957m573
1135C841q246k374N894P338O56n435o778M9O653N623j209n847l690J498N186K610
1151E769k557m801q91L040L687N46l653l284P78L555J147k119l696J0L351L191
1167D073o48m843k853K211M350J619l197m723j368N329N079j26o001n376N71O047
1183A44N758j665p194m949L771P296M444m052q942l322N485Q681K872n699q271
1198e643j822P054P757J93p318p602Q17P823P006n82q091o476K089P322M869k887
$$ y = [-4475, -6059, -1467, 4385, 5011, -527, -6615, -5949, 740, 6078, 3675, -3585, -8604, -5608, 2971, 7559, 2917, -5998, -9261, -4387, 4511, 7515, 1138, -8249, -9374, -1524, 6959, 7376, -1186, -10028, -9110, -27, 7902, 5966, -2956, -9122, -6404, 2900, 8772, 4789, -4392, -8763, -4288, 4457, 8414, 3841, -4405, -6779, -885, 6453, 7109, 1674, -5104, -5055, 1598, 7221, 6012, 165, -3525, -2027, 3159, 5769, 3212, -1589, -2480, 560, 4247, 4793, 1140, -2144, -1366, 2189, 3336, 1217, -2479, -2469, 882, 4073, 3425, -1418, -4271, -2060, 2290, 3909, 712, -4011, -5379, -50, 5029, 4903, -1098, -6474, -5903, 144, 5902, 4237, -2957, -7906, -4135, 3161, 7605, 3553, -5389, -8711, -3226, 5455, 8327, 2628, -5643, -7465, -411, 7346, 7539, 221, -7381, -6564, 1259, 8265, 7683, -408, -6884, -4795, 2527, 7396, 4509]
1214D509p595l965L622P777K633m394o525k758L765N870Q95m211m762L66M237
1229e36L487r49m518l312J432L733J741j933l127k09K847K748j665l584j420K238
1245c027K866J104k571k930J123L891K306k201m809j755L008M847K475l645m657
1260c975j000M651M735J98n486n691J141O709N882j905o527n269K402P305M024
1275G194l773p469l235M531P942K924n341p616k439N108O663J345n805o389J32
1290f228O630N706r21p111n387J092O336M450k081n374k666K323N381J796l362
1305E84m709j698L592L804J484k773l307L50L544J711j507l296j312K499L049
1320B015J129k178k286N76K753J172j982l377l55L292L504R6l105l422K10L642
$$ y = [4509, -3086, -7051, -3429, 4348, 6981, 2587, -3938, -6696, -2931, 2939, 3834, -377, -5139, -4773, -536, 2951, 2002, -2516, -5828, -4396, -663, 1078, -855, -3982, -4191, -1344, 1404, -261, -3845, -5265, -3027, -161, 943, -1628, -4558, -3435, 456, 2762, 561, -4248, -6003, -2995, 1852, 4327, 682, -3975, -4975, -324, 4411, 4609, -877, -6568, -5427, 1282, 7164, 5259, -1268, -6537, -4135, 3170, 7194, 3421, -4048, -7283, -2752, 5190, 8114, 2773, -4843, -7282, -2174, 4489, 5834, 29, -6360, -6228, 402, 6108, 5187, -1924, -7311, -6219, 117, 4567, 2486, -2888, -5554, -3231, 2150, 3946, 584, -4125, -5823, -2231, 1573, 3057, 284, -3023, -2673, 871, 2582, 1075, -2221, -3533, -1034, 2015, 3144, 966, -1320, -744, 2009, 3181, 1199, -2178, -2533, 759, 4263, 4359, 1254, -2168, -1958, 1684]
1336A684K611j858m794j745K844N454J974l791o002j927M454N247n7n133m293
1351e332P88N322M795j316o583m667J539N541M509k073n985l650L589O241K295
1366E013m745o223k061M556O635O77m170m864J06M315M245j056n088l481K085
1381d056M625L407j430m447k341K065L649O99k159l499J64L086L576j98l678k515
1397c052J127K332J332j849k685J57K503K649l59l288k249O09K819J746j979k949
1413c136n64K947L344P5m084m056N33M305L019j166m046j866K245M354J749m038
1429c85m738j115L944M690J141l592m345L33M453L487q92n064l903K128N849L591
1445E582j935n038k848K528M644J734l392m953l60M377N095L06m281m497J59L795
$$ y = [1684, 4295, 2437, -2357, -4102, -1258, 4196, 6170, 2379, -3623, -5550, -1096, 4151, 4094, -1039, -5332, -4544, 778, 5573, 4257, -2326, -6993, -5454, 87, 4596, 2523, -3462, -7112, -3523, 2718, 5013, 268, -5955, -8016, -3460, 3175, 3852, -318, -5182, -5076, -761, 3484, 2428, -2660, -6141, -4056, 569, 3976, 2546, -1901, -4242, -2177, 1472, 2171, 12, -3487, -3323, -237, 3339, 3141, -537, -3052, -1925, 407, 1739, -110, -2795, -2638, -135, 2514, 2155, -1133, -3382, -2773, 46, 1792, -187, -3136, -3700, -753, 2591, 2666, -1418, -5474, -4941, -636, 2383, 1217, -2829, -4695, -2450, 1904, 3653, -385, -5123, -6238, -2294, 2396, 3537, -55, -4400, -4067, 386, 3873, 2981, -2083, -5986, -3858, 1991, 5582, 3647, -1391, -4239, -1711, 2933, 4667, 1275, -3678, -4038, 339, 5434, 5740, 1459, -3038, -2879, 916]
1461I16L311r12m170k206J879M275K508l151m162j519K054L660R56k938k346O88
1477a157K569J867q99k968k515J154L150J509j680j910l14J782K057p98k917k280
1493c350J481K954K038j184k822q73K254K684o38l434k290J073M194K613j335
1508C365l948j899J711L473J028k627l858o86M376M278L79m476l974qM079L128
1524D341j271m540k296K667M644K337k638n428k518K892M321J896k861m022r94
1539c470L842M080n81m448l839M14M079L676m69l798k657J513L585J183k067l337
1555b294j308K370L175J069k115k261q22K120J888q17k512j102J529K659J053
1570B632j511k089m72J862R17j019j884m24J803K829O91k436k485n34J865K479
$$ y = [916, 4227, 3315, -855, -3061, -1182, 3093, 5601, 2450, -1712, -3231, -1177, 2483, 3439, 501, -1845, -1157, 1412, 3279, 2380, -588, -3103, -1949, 1201, 2710, 1030, -880, -1194, 588, 2645, 1847, -1070, -3350, -1869, 1085, 3123, 1939, -883, -1756, 498, 3182, 2544, -890, -3180, -2107, 2087, 4700, 3365, -583, -2482, -771, 2702, 3730, 1103, -2755, -3441, 935, 5213, 5592, 1116, -2858, -2866, 1213, 4341, 3070, -1470, -3766, -1099, 3545, 5882, 3244, -2184, -4702, -1810, 2511, 4407, 1546, -2476, -3470, 372, 4452, 3871, -577, -4416, -4002, 77, 3753, 3284, -514, -3171, -1658, 1927, 3110, 1043, -2294, -3602, -1232, 1943, 3012, 897, -1364, -2186, -66, 1822, 1005, -1507, -2609, -1080, 1579, 2632, 1121, -968, -1440, 422, 1339, 320, -1564, -1988, -185, 2644, 3335, 899, -1586, -2120, -255, 2224]
1586B224p30l013j600J782M028J716k808l901j760J922M484J050k963m190K73
1601c486L979L932n30m869m051M29M629L623m06l983l145J138M568K421k377m813
1617b941k532K922M815K343k584m314j084K338L086Q02l223k921o8L706L023l77
1633B991k999k639K30K420J542j288j686l22J476K108N02j990k135K17J521N30
1649D78o54j109M76J751J292o52k325j563J105J634J121j295j969k30K347K414
1665B821m19l014l279K13L596L197o03l455k101J279L752J724k409m696j336K501
1681b229M371K206k640m123j666K787M108P8k984l727k41L878M060j67l641l822
1697c752K46L212K754p66l346j509J974K977J597j813l048j294R28K830O44j261
$$ y = [2224, 1494, -1519, -3119, -1337, 2691, 4407, 1599, -2302, -4062, -2140, 2344, 3394, 431, -3759, -3486, 493, 4425, 3895, -974, -5025, -4596, 33, 3656, 3250, -733, -3878, -2740, 1828, 4249, 1872, -2941, -5473, -2551, 2264, 4607, 2023, -2291, -3375, -1037, 2049, 2851, -372, -3293, -3361, 345, 3368, 2991, -8, -2647, -2417, 3, 1545, 257, -1429, -1751, -275, 1833, 2335, 345, -1790, -1573, -52, 478, -176, -1285, -809, 942, 2234, 1582, -743, -2306, -1201, 433, 1554, 259, -1710, -1940, 407, 2821, 2402, -612, -3891, -3678, -82, 3115, 2512, -943, -3044, -1765, 1987, 3711, 1302, -3394, -4730, -2229, 2142, 4348, 1708, -2415, -4081, -1294, 2814, 2892, -92, -3819, -4060, -182, 3878, 3711, 70, -3752, -3506, -294, 2460, 1694, -1652, -3161, -1187, 1790, 3387, 1574, -1474, -2768, -1840, 990, 1634, 373]
1713C73j494q1J754J737p07k702j283J271J409J063j012r29J2J929K95r39k114
1730a418m84J291J980L90j245j640J85J786J664j088k856j571J138L608J521j845
1746A416k486j041J115L089L10k422l232L01L253L258j46l086l188r4K877K404
1762B328m36l192j886J794L186K266k190l899j499J593L642O69k057k263p2K358
1778C42K438m19k959k371N32K672J971o28j946r54J247J807M0j617k386J72J907
1795a52K130Pj804j351M99K003j98j107j589n12J828K181L8j859j559K34J718
1812E07R71j065j801j126K071K250J055j973k544q10J786J888j70j828j304Q01
1828a292K566J438j299k416j542Q34K395J147j271k084m45K291K084L6k892k394
$$ y = [373, -1121, -1202, 552, 2289, 1582, -1120, -2403, -1132, 277, 1340, 328, -601, -589, 1340, 1635, 696, -1418, -1902, -611, 1369, 1759, 514, -1126, -941, 845, 2509, 1421, -1435, -3006, -1868, 1740, 3261, 1416, -1070, -2111, -996, 2093, 2403, -19, -3251, -2950, 303, 3561, 3415, 329, -2859, -2953, -76, 2328, 1892, -1300, -3186, -1392, 1794, 4060, 1870, -2029, -3528, -1935, 1707, 2376, 319, -1944, -2016, 342, 2780, 2361, -598, -2969, -2437, 235, 2206, 1578, -368, -1322, -75, 1732, 1772, 155, -2231, -2059, -152, 1978, 1985, 181, -1170, -671, 1332, 1134, 27, -1562, -2074, -246, 1935, 1973, 114, -1445, -1211, 507, 1478, 413, -1388, -2514, -443, 1807, 2862, 889, -1655, -2465, -679, 1209, 1039, -789, -2093, -1292, 1274, 2712, 1413, -1003, -2545, -1711, 684, 1831, 560, -1524, -1969, 322, 2406, 2442, -450, -2844]
1844b844J86K656K107k22k381j597J449K188N66j944k474l08J814K864M12j981
1860D91j979L4J485K054j081k400j187Q91L101J361j274k755o14J274J681L02
1876A384j911j731N33K561J745o63k362j600L56J353J543o18j721m35J345K347
1892B126J4j771k320q0J605J515J93j498j134R46J721J45j273j601k49J238J769
1909A346K04j394j223O55J551P23j238k157o13J312K467O93j752j941K40J453
1925C26J691r02k514j215J326K488J469j081k543j084Q82K523O18j944k145j25
1941b230K308K462j16k431k489m9K696J854l09k320k029J332K621J051j067k786
1957a502j135J026K637P38j193j413n21J100J796J46j733j468rJ528J477l10j286
$$ y = [-2844, -2658, -2, 2105, 1883, -498, -2095, -646, 1542, 2108, 164, -2310, -2618, -804, 2060, 2472, 491, -1488, -1454, 31, 2085, 1004, -1396, -2583, -1692, 1409, 2770, 1496, -1259, -1873, -599, 1082, 1384, -527, -2258, -1725, 836, 2581, 1918, -444, -2044, -1688, -335, 1208, 590, -1131, -1566, -221, 2126, 2140, 369, -1951, -2031, -426, 1089, 1282, -216, -1350, -404, 1317, 1462, 189, -1412, -1661, -423, 1346, 1550, 156, -1067, -412, 1139, 1862, 624, -1533, -2146, -834, 1633, 2326, 574, -1367, -1127, 326, 2017, 1115, -1399, -2614, -1288, 1200, 2669, 1588, -955, -2039, -1157, 1366, 1984, 40, -2105, -2230, 78, 2540, 2424, -7, -2496, -2545, 151, 2005, 1696, -624, -2653, -1321, 1300, 2351, 1284, -1502, -2637, -1611, 1026, 1764, 571, -842, -1363, -263, 1533, 1679, -54, -1522, -1531, -3, 1474, 1164, -122]
1974a22m30M36Q07j08j075o83N03Q19J313m02j189o85R62O55k95j271r99P63K036
1993A035R36p07j828j175J076J864K42j641j873J47J918K454J05k582k177lK298
2010H9J721m02j917j727Q95K827J461j211l073j094O93K763J428j310k503l80
2026a740J318J992O84k024k435o03K350K189L10j884j335k92J789J088n50j501
2042f44q44P54J466P66m30j225r02Q01N81l66n03k8O97O30J0n07q76l48J006L94
2062D32l36j013l67J486J273K52j866j304j18J340J522k02j830p58M60K187J252
2079B410j189k501j153J186K264J073j201k011o60J589J938M15k042k218o08K190
2095e18K507K80j981k022L60J567J514o55j727j614Q67K193J109l73j986r63P43
$$ y = [-122, -552, -116, 691, 583, -492, -1175, -672, 147, 1460, 1058, -131, -816, 146, 801, 506, -765, -1764, -1001, 1035, 1971, 1264, -564, -1739, -663, 1201, 1443, -198, -2071, -1924, -6, 2448, 2553, -29, -2206, -2209, 89, 1810, 1408, -509, -2236, -1341, 1486, 2947, 1736, -1337, -2431, -1738, 1025, 2453, 1143, -1360, -1740, -422, 1570, 2254, 230, -2205, -2808, -458, 1731, 2041, 157, -1178, -1470, 319, 1407, 857, -644, -1488, -734, 732, 1498, 1068, -157, -1059, -258, 323, -43, -546, -574, 123, 753, 763, 256, -620, -968, 38, 432, 96, -917, -1284, 202, 1475, 1727, -139, -1443, -1561, -221, 1301, 1099, -731, -1489, -1029, 1158, 2410, 1221, -1280, -2433, -1247, 1017, 2090, 889, -1122, -1782, -193, 1745, 2160, 118, -2100, -2708, -518, 1989, 2269, 288, -1734, -1374, 193, 1707, 1052, -675, -2289, -1422, 771, 1880, 1507, -479, -1442, -699]
2112f99J230N42j002j065j61J296J273k88r41j265k4J622J47o64n67L14M71O40
2130H59k25j139k47K27L68N27No31o42J148Q41m2j595n73L4J326J138l84j744
2149g49n19R85J203P01j315j959l55J429K125J43j266j525o91J914J340n89j652
2166g80q85J38K237J116o85j702j002P52J416Q60j068j338k24R54J529M83j516
2183B85j382m98J402J012J27j173m34L41R23Q09o57j552l29O79J024N22j268n37
2201g06L8J272M05q18j092l54P23J120N48p61q62r6J058L79m23j176n74L98J152
2220B31J242p84j236j39N82Q05J99r12j085j21J464R23J33j020j510N25P62P71
2238H30l08j357j97P24J500O00j522j092o70J148J067J21j181q61J021R32P06
$$ y = [-699, 531, 1073, 71, -994, -1155, 141, 1414, 1126, 185, -1080, -1104, 518, 665, 1, -566, -252, 219, 859, 634, -505, -752, -525, -157, 370, 375, -256, -898, 250, 1091, 1049, -546, -1119, -1085, 241, 1379, 995, -749, -1268, -283, 920, 1621, 306, -1653, -2008, -579, 1546, 1689, 423, -1102, -1793, 121, 1461, 872, -780, -1665, -1527, 710, 1826, 1141, -561, -1563, -811, 605, 1465, 397, -941, -1165, -211, 1318, 1801, 285, -1097, -1595, -193, 819, 946, -227, -661, -320, 603, 1412, 755, -797, -1126, -447, 577, 1099, -169, -706, -668, 604, 1009, 191, -901, -1255, -532, 588, 1136, 375, -487, -583, 475, 854, 431, -745, -1319, -921, 231, 1473, 689, -547, -686, -104, 701, 900, -12, -1097, -1218, 246, 1169, 1302, 282, -1228, -703, 59, 830, 522, -835, -1032, -308, 1192, 1792, 270, -822, -1492, -344, 723, 844, -337, -1198, -177, 755, 1461]
2255A461n64j505n73N62R11Q84j170p64O2J371N70l48j275q19M88Q81J375m93
2273A054j192j039N14J573L23j418r72q6J229Q44L90j013r24j7R14P76m68j310
2291h22n09R02J305O08q15j221l99M99J002J44o36q33K82P57N42j38r59q56P98
2310c49M25J54J80q73j28O84Q33l11r10n52MQ85R45o84q36k11M68J453k59j245
2330c27q54M73R07J144p01j060r44J013J286Q9j190j068n6P66J574M84j389j215
2348a068J69J001J103q19q46p06K51R16J369k01j461q65Q5J430M65k68r07p12
2366a064P31J429P4r78j002o76J255Q22J57j170l62L21R94K51n01p82j76O23J56
2385A02L68o29m31M67N45J65n49k54m32O26O42K53p49o73N15K87M38l31j141j42
$$ y = [1461, 897, -608, -1181, -619, 292, 1176, 6, -758, -696, 675, 1245, 897, -378, -1197, -709, 172, 1547, 1054, -138, -1177, -663, 910, 1233, -185, -1157, -1243, -14, 830, 1220, 207, -717, -734, 180, 956, 488, -822, -1331, -429, 876, 1484, 669, -552, -951, -452, 550, 694, 58, -775, -493, 264, 806, 668, -291, -1147, -349, 76, 230, 410, -463, -591, 93, 926, 615, -295, -847, -843, 42, 987, 303, -533, -744, -276, 1177, 918, -327, -1181, -708, 199, 1343, 642, -418, -1362, -349, 937, 1026, -164, -1232, -1288, -522, 1052, 1536, 147, -1068, -899, 102, 1205, 386, -460, -1166, -915, 1, 1370, 1169, -292, -1157, -1072, 358, 823, 555, -352, -1064, -333, 1096, 1170, 192, -810, -1486, -231, 591, 748, -422, -784, -463, 531, 782, 281, -501, -677, -54, 102, 470, -159, -590, -123, 422, 587, 38, -216, -648, -22, 620, 873, 124, -549, -34, 253, 691, 360, -781, -923]
2405i23O04J050M90m74j193k14Q38O98J62j176j123J24J511J341o77j495p13L93
2423g77J590L38m95j132m48M34J417P89j624r13j36L31J337j51j89q96l0N42N57
2442E44M46j245p90L25N74Q07Kp70o07L72P28R6o57m51k10J266L97k66p38n0K30
2463CL63J42m37n60QQ60K86l97n24m80P90N27k6o84r84N62J032L88m57l40q06
2484g34K0J061L54n14o29m37M50P71J054q67j176o44Q03J120O95r38j321n8J287
2503B97M76k5j015j014M6J407J015p43q16l46K80P95K81o19p22M6N18P94P2p57
2523c0m26R4O07L74l13o99P3K26M88M04o67k23k68K00N48j00l58l01K61O50K3
2544E63K18j211l3M82L36J10q61j75m5J054N87o27p83m58P22N48K06p84n68K66
$$ y = [-923, -319, 731, 1221, 747, -446, -660, 178, 876, 1038, -138, -1261, -1137, 374, 1715, 1038, -457, -1170, -777, 813, 1151, 656, -476, -924, -490, 927, 1716, 92, -821, -957, -626, 711, 560, 371, -525, -555, -13, 544, 990, -255, -1045, -720, -146, 661, 663, -107, -714, -342, 386, 482, -175, -626, -836, 430, 827, 561, -177, -227, 3, 366, 508, 71, -489, -481, 379, 665, 268, -256, -736, 54, 581, 555, -129, -1113, -551, 481, 869, 412, 72, -734, -714, 347, 701, 187, -442, -879, -429, 342, 1396, 529, -647, -1291, -488, 632, 1327, 389, -932, -990, 297, 773, 748, -267, -1281, -1235, 172, 1187, 444, -372, -718, -438, 357, 638, 19, -703, -657, -139, 655, 727, -30, -456, -362, 245, 619, 306, -393, -320, -94, 394, 798, 131, -92, -360, -160, 388, 288, -70, -371, -110, 540, 563, 781, -430, -463, 19, 355, 465, -396, -571, -616, 438, 1025, 398, -385, -843, -121, 427, 633, -151, -719, -453]
2564d53Q15M63k87p39m88n5O42R31n04m01o68M17O97M07j82j170l57P11R53K04
2584I36m97p16l33N05P65L9o46o65K34Q89M09l51q58o03L89J073Lp71k82M6P53
2605C19O01m11o75j78j13N38L78l72j72m41O66%K40l63m59j59L93O22J0o49l36
2626e61J12Q03J76k74j187J11M42P36L25p94n12J2O19O91m14q31j41J46P81L71
2646F11m62n81j89M38O59l51k74o96L64O74K83K07r99j35P1N88J36m92J60l96
2666c84L99L75K60n51o44k57M64J039N4j248n41O75J015K31j081o75k91J090M76
2685D06J23q16k43K78K92N18m12o46k18K21N50N70m98l58k62O47j2J37k45n94
2705e62K30J40N38K38j38q93n1O60K53k69m35k3O7Q64K5q94j83k22O61M90j85
$$ y = [-453, 362, 825, 538, -201, -689, -744, -102, 829, 325, -76, -744, -327, 370, 777, 595, -575, -932, -221, 732, 936, 439, -277, -610, -105, 660, 699, 53, -612, -378, 511, 920, 569, -289, -892, -503, 570, 573, -198, -480, -434, 319, 920, 509, -166, -344, -457, 81, 459, 87, -85, -526, 140, 140, 380, 17, -442, -601, -208, 414, 424, -225, -561, -449, 354, 530, 256, -931, -820, -378, 358, 683, -111, -623, -611, 8, 699, 285, -546, -687, -541, 240, 611, 149, -432, -621, -183, 476, 125, -149, -845, -481, 193, 476, 683, -316, -451, -380, 208, 344, -148, 12, -384, 15, 390, 650, 99, -545, -802, -338, 701, 755, -493, -1034, -359, 656, 887, -194, -869, -1160, -70, 406, 529, -287, -530, -252, 40, 558, 146, -500, -718, -497, 53, 623, 125, -233, -495, 152, 140, 277, 32, -562, -332, -192, 346, 584, 446, -447, -498, 162, 415, 146, -289, -312, -245, 619, 644, -250, -433, -655, 6, 496, 311]
2726C11n69m09N24P40P9n00o69K32L87Q01m30p91j74N62J77O05l53j187r9J71
2746e92Q97M80n43q97j7L56R44j10l56o98q9M69P25j03l35p59M5P25O94n88q27
2767e79r3N45O05L93n67p88j75O96N66l14n21m48N94L85J39q2m54J04k07K78K44
2788C21l15j4k42L44m0L00l64l11jK47M78r5p81J40K20L51J27p42l59K47N48M71
2810E30k85m91l96M92O36q3l94p40L53M29N19j68o75m99J77N23Q12k30j014j31
2830f35J84Q84J23j55r85J15K29M17L00k77o31l57Q99N12J62o91o13J38N08L97
2850E24k05n61n4j31Q53J84l67p11P9L34L08l3o35L35j09K41K90m23LJ0K71K93
2872D96l04l11j74L33K34k12L0m00m3J11O24m0q0n08l37O15L18J71r33j84J76
$$ y = [311, -258, -667, -143, 597, 676, 176, -493, -261, 126, 927, 497, -294, -468, 94, 271, 876, 523, -664, -763, -592, 305, 785, 242, -655, -672, -316, 628, 518, 162, -536, -625, -156, 569, 466, 131, -628, -583, 142, 836, 248, -579, -672, -127, 478, 871, 304, -484, -659, 37, 603, 289, -232, -680, -86, 299, 438, 356, -98, 6, -201, 77, 321, 6, -8, -250, 94, 54, 354, -10, -321, -322, -75, 403, 308, -473, -333, -113, 238, 365, -377, -736, -489, 59, 530, 245, -246, -642, -150, 486, 403, 9, -731, -378, 51, 570, 402, -273, -772, -595, -72, 740, 510, -504, -635, -451, 433, 556, 401, -584, -469, -240, 177, 477, 200, -431, -788, 111, 623, 785, 94, -519, -381, 127, 524, 319, -242, -296, -427, 426, 610, 243, -468, -389, -55, 253, 220, -415, -80, -189, 52, 342, -81, -78, -68, 203, 496, 192, -119, -293, 40, 274, 62, 92, -308, -351, -240, 384, 344, 264, -244, -581, 34, 352, 523, -410, -594, -418]
2893d18N94O57m99p88j87M09Q08l7n28n11m2L31P79K4l81p36L4O51K42j99n77
2914c74j15L19N07o0P0m89o13L52P39K40l09n62k98K75O87K56l63p00Q5L73K49
2935B69J04m69k12L92L93j98l98J6R4K48J02J86j065j28M39P10k72r5n56J49M42
2956A51L13p70L12j07Q9KO2K02n28k05M69K30j47J28n28o6N38L69N8l99n49k83
2978f59J032K40l46m54k67K52L33N07m61n22k24M66O35j58l04l70N4N24L79k22
2998D35n95l33L44L56J07o5n32K1J86M58l36j11j63k81N08L09M3l70l57J12M71
3019B07K05l34k29j18K91L17K82n40o93K27O51K02j78q15j69N40M90j36k67j28
3039a95Q9k53O43k11k76m7Q6M74J81l40m98k09N53L50K2k80j67o7K01K7P8k18
$$ y = [-418, 176, 833, 334, -454, -641, -232, 576, 539, 11, -500, -542, -211, 568, 592, 211, -525, -491, 160, 402, 203, -374, -489, -170, 337, 277, 347, -142, -755, -403, 336, 576, 267, -295, -593, -318, 369, 625, 262, -438, -353, 20, 269, 373, -96, -308, 84, 477, 279, -119, -103, -9, 239, 341, 527, -538, -666, -227, 483, 211, 116, -440, -291, 151, 464, -306, 6, -101, -12, -10, 52, 254, -274, -479, -10, 220, 73, 201, -327, -393, 145, 514, 572, 173, -376, -659, 373, 613, 267, -187, -454, -202, 131, 638, 177, -345, -569, -103, 532, 374, 70, -300, -246, 278, 657, 435, -160, -493, -149, 207, 314, 249, -283, -262, -76, 382, 46, -65, -228, -509, -1, 308, 351, -19, -376, -264, 207, 412, 78, -151, -269, 22, 339, 621, 81, -612, -385, 266, 468, 290, -525, -694, -154, 336, 200, -67, -195, -106, -359, 284, 73, -203, -250, -164, 310, 491, 151, -347, -556, -3, 347, 369, 89, -78, -145, 56, 83, 161, -57]
3061e7m98J64N90J67l47l14k62L09O83r8k44o18L81K56L01L74p86m99K06O05N6
3082C69m95N5n37L05N17R6j59k37m72M11L94K2j21n75J69L15J79l4n87J04j43
3103d24K37J93N09p63k09L82J83K09l35m54K25M25j11j48k64R3R2K06J03qn00
3124c59J12J85M03o7k99k39N6K97K81k36m76K1K28M42j2k71m97N3L89L42k06l16
3146a69k4k03L06N94k65o57K0K51M29K93o28n58K90J53M75N5m44l94O9M16M16
3167D25k62l85J6j43N46J30m01k05j3M29P9K9j64n18J08L19Q3L32o16j23M7L07
3189B0M16l32j53l83K99PN74n22p9k58L16L19k10p7l50L48K70K40l26m66J97K20
3211G0N7k54j37J27k6K72Q4l29k08n1K09L29J3J0m92R0J93L08J9n03J12l7J92
$$ y = [-57, -555, -391, 199, 366, 19, -295, -557, -248, 435, 337, 93, -525, -144, 112, 413, 787, 1, -498, -292, 313, 369, -126, -71, -608, -303, 214, 310, 151, -86, -558, -147, 247, 269, 148, -427, -258, 57, 236, 202, -385, -281, -424, -187, 6, 515, -248, -457, -75, 108, 317, -18, -472, -247, 178, 67, -81, -345, -252, -160, 46, 149, 141, -359, -247, -62, 341, 274, -25, -264, -208, 89, 370, 134, -342, -321, -93, 349, 337, 66, -431, -378, 11, 353, 147, -169, -193, -396, -90, 504, 239, -418, -398, -147, 282, 575, -53, -611, -321, -168, 307, 362, -82, -476, -407, 9, 425, 163, -222, -206, -349, 197, 327, -74, -279, -292, 137, 216, 245, 81, -437, -329, -10, 73, 405, -211, -334, -287, 20, 436, 104, -49, -432, -133, -126, 448, -74, -153, -411, -95, 224, 14, -63, -413, -65, 205, 445, 119, -347, -150, 70, 127, -127, -264, -137, -163, 109, 193, -136, -344, -395, -186, 143, 156, 166, -326, -236, -43, 265, 284, -219, -107, -144, 48]
3234D8R1j4l49j93Q8N15L83k49n61J02j36N03L83p20l81J53L42L31k29k18k73
3255c84L13J88rL22q63J04K05O5L85k39j6m93K33J89K82m50K10l58P1K06k9m28
3277d96K7N57K56k72l55J66k23N46J50o03l1M8L75p4K18m09k30K03K02L01K8l86
3299bm71R7M30L02j48m45J21L19J89J0m71p4l15O01M84m63r1k03j82M21K52j45
3321B16l59k64Q4N87L25l63l89Q0J67K17M6m22l65K38K68M04l23k27k28J11M81
3342B84j12k59j2k07J12L85j54j87l27K80J38M08J4l42q8n7O53m17r6k65m8L34
3364C7L31k26k06l2k40M82J73o68L06l38K74K82J32j69m73K79r2L85j03l69m4
3385b79L9L24Q4L2m32k35j1P97P4k21n90K08p0N84k40l89N5q4N35j32M98o63l34
$$ y = [48, 139, 125, -224, -417, -329, 186, 569, 320, -241, -139, -275, 228, 611, -109, -490, -337, 5, 336, 107, -111, -384, -71, 117, 108, 430, -433, -329, -124, -59, 326, 87, 71, -422, -189, 0, 282, -168, 42, -316, -245, -39, -68, -496, -469, 88, 344, 72, -283, -117, -340, 206, 356, -247, -278, -230, 145, 71, 289, -120, -350, -147, 55, 356, 384, -2, -473, -376, 54, 356, 208, -237, -116, 203, 392, 402, -69, -143, -458, 143, 627, 164, 73, -130, -312, 109, 361, 216, -143, -407, -323, 264, 589, 226, -163, -83, 84, 301, 347, -75, -440, -202, 66, 470, 147, -80, -308, -197, 284, 172, -87, -99, -306, -194, 191, 37, -150, -477, -197, -59, 349, 363, 21, -67, -124, 529, 112, 16, -249, -297, 37, 368, 142, -64, -96, -336, 146, 319, -349, -43, -381, -107, 175, 307, 138, -335, -56, -148, 237, 134, -235, -279, -240, 84, 168, 200, -232, -467, -478, 319, 393, 172, -418, -210, -280, 304, 64, -325, -270, -354, 181, 49, 547, -116, -450]
3408d50M48Q0K24m33j50J77L7K21pj60n9k22L96M1k74N0j32J53K92j16M0m65K22
3431h7n6L37J64l17l07J21N46k74j62r1N3r5M75J27p21P3k11K98L30k83o7j6J97
3454C4j94K77J97o85Q0K78k6M04k92k58J74M9L76k71j79l26K9M23p6K8k73l4J18
3477a47J47K79l25J52l72J24J4K68K7n12j1O00J09O6m58m10L61M59j08k02j55
3498i4m57P11k20L18k81l26N53k34K30J15m66j64J94N76l92j86j87k9J06J21O98
3519E86o40j58m8M01J27K4j24k12l88N63J91l27j67J37J6K01nl62J9J55L25j24
3541A90o1l26j57M60K22j67j73m27K30mK93j62k0J5j95K99R6pl74m1L24J46Q2
3564B43j20j27j70%K46O3j70k30P0J41K05k03j52PJ55K73j60J4l66J59K18J94
$$ y = [-450, -2, 78, 302, -131, -281, -104, -67, 154, 147, -13, -72, -294, 102, 143, -131, -81, -213, -60, 232, 116, 156, -309, -87, -143, 194, 358, 41, -266, -145, 401, 127, -35, -126, -73, -168, 307, 434, -287, -214, -425, -127, 203, -80, -147, -163, 34, -160, 117, 314, -371, -291, -13, -39, 365, 73, -185, -11, 38, 414, 143, -36, -362, -333, 90, 14, 42, -231, -265, -147, 0, 279, -46, 106, -266, -142, -128, 140, 167, -345, -356, 244, 353, 419, -39, -449, -88, 371, 263, 61, -94, -551, 160, -60, 258, -23, -349, 204, -30, 200, 315, -151, -315, -121, 455, 63, -123, -310, -339, -233, -112, 586, -54, -212, -260, 141, 268, 292, 168, -44, -432, 131, 322, -5, -172, -35, -19, 182, 177, -185, -166, -11, 314, 190, 129, -197, -354, 106, 328, 161, -12, -439, -209, -213, 80, -82, -102, -87, -282, 17, 113, 106, -268, -309, 15, 161, 243, 123, -4, -174, -174, 72, 135, -35, -265, -195, -54, 151, -52, -204, -197, -42, 231, 71, 85, -281, -122, 96, 290]
3586B90q5j56j26j99M25Q1l18j84J68J46P6J40n1k00j32J75J04Lmm22l52Q09o0
3609A28l54qJ59R6J31j31J71l08k30M90j0K97p81J69O01l99Lkr6J4K29o3j29J59
3633A36o51L58K79K28n79P1q0k8M65k62J4k68K84l8K92j5P7o53j04L42L23j34
3655E7j10pl61M81L16k50m8n85L66j66K93j0o23L13RM79j26k98J5p4M35r5k57
3678b46M2m15Q9N50l9n24K40l3M74J45j43l53P6j51K71R9j26rm36M44M39k5l45
3701B4l09J64J21L11j23j48k66J14L77m1k43j94j75M31K00J00j36m54j81K81M10
3722B63j62l1l60o3N08j50j14J1p3j08N18J18l23o31N33l6j42M27m26m37N65Q4
3744b9J66M2l46k25J88M57k59j4l5k67K89J61j2j17k93lO63n91K53p6j07L65k5
$$ y = [290, 205, 49, -77, -276, 149, 230, -88, -272, -104, 42, 118, 258, 207, 7, -125, 50, 154, 157, 153, -269, -621, 188, 128, -226, -234, -75, 21, 152, 21, 192, -116, -346, 144, 134, 431, -350, -181, 420, 21, 24, 22, -74, -60, 169, 106, -23, 136, -515, -157, 122, 350, -229, -158, -238, -266, 199, -63, -49, -317, -33, -71, 221, 206, 283, -370, -474, -132, 191, 57, -53, -60, -421, 60, 376, 126, 78, -507, -141, -307, -14, -24, -647, -334, -325, 154, 28, -270, -255, -329, 106, 11, -246, -204, -619, -530, 20, -19, -543, -303, -336, 138, 283, 140, -213, -137, -288, -17, 82, -44, -53, -489, -45, 394, 369, 24, -285, -121, 0, 311, 188, 40, -226, -112, 265, 224, -19, -213, -388, 43, 243, 343, 207, -247, -428, -147, 263, 101, 70, -290, -353, 155, 5, -109, -98, -171, -279, 239, 357, 34, -597, -64, -100, -242, 185, -241, -678, -113, -29, 137, 179, -167, -392, -204, 253, -6, -20, -55, -322, -33, 128, 116, -1, -294, -297, 366, -225, 28, -48, -155, 210, 185]
3767A85k98j83L45k38L58K30No04o8L25J65L88k16l22m01K69J51J2l42J77J34
3788G2k2K39r3k37k39J23J65M60m40j44j99J10J40L54k52j91K1J18K17n6K32l77
3810Ak31L60M8j20k00P0l06O89k57j56j1K58l79M79j34j81l09L53J4L26l7j96
3832H1k80L25J35j81k36m1K55J22J66l62J76m6k57K35k4J52m90J00o2J67M18m82
3854a29Q7k46N4M96m61K54p4j78K35L64n49P9j58J74J66K9O1j67j30j45L32j14
3876b0J1k52L31j94O0R3j52Q9k45M24j7k18l61M40j4K4M50n79l3L03j81K17J0
3899A86k67J04p8K58kn59J97L1J50K7N87n11k32k5J78P3j85R0j39n8J87K6J02
3922A40j53j88K71M5J10k83j58j7K21l4J44L1l25J74J48j19n0n4O5jK36j04j97
$$ y = [185, -113, -296, 49, -189, 169, 399, 404, -200, -268, 57, 222, 610, 394, 72, -329, -60, 91, 103, -239, -62, 72, 50, 289, 196, -41, -280, -157, 8, 468, 28, -116, -315, -205, -65, 289, 37, -154, -133, -15, 202, 146, 378, 1, -230, 130, 178, 58, -142, -72, -378, 311, 54, -102, -113, 145, -234, 245, 111, -70, -379, -26, -12, 314, 277, 81, -199, 126, 261, 80, -156, -197, 58, 180, 346, -16, 160, 114, -143, 92, 68, 220, -270, -170, -232, -65, 353, -129, -42, -288, -234, 262, -199, 55, -19, -197, 38, 402, -147, -68, -226, -52, 114, 143, 204, 37, -93, -238, 94, -20, -9, -261, 70, -124, -64, 29, -123, -34, -279, 145, 128, -90, -451, -11, -25, -1, 449, -130, -163, 140, -41, 176, 186, -81, 23, -55, 203, 201, -358, -161, -130, 20, 47, 634, 123, -109, -134, 44, 117, -68, 22, -117, -175, 12, 38, 140, -13, -201, 70, 115, 225, -58, -216, -233, -12, -46, 98, 129, -196, -22, 126, 7, -43, -97, -32, -33, 203, 99, -98]
3945i8P1J61j68rj03L55m90L78m8n4K13j96nJ2L76n8n18N7k4M6L07j71k35j55
3969c56L94J00m8L8n12J74J94J73J28j81l73J97J62j66M76p55O3J80K25qj92M6
3991d1m26N20l93M17k51L2q5QJ09L33n30J78k18L88p9k69M00l91N97j9k88j7k57
4014b82J48M49l6n63L82n8k32K87Ml38J25M00J60n53J3J36k90o4N05k12J12k19
4036a26m6M17P6k49r8J05j55q1L55J5m69J68q9M49j4m11Q4m10M41K73q6K30q00
4059d21L3M42L12l31K15m40J41M42m31K58k51Rm7M46k37J45o11KP0L98J29j60
4081A13l0j27L3R2m8l30M23R4J01m03L29k74l6Qp9k1J44k08K40N0J0J68l57J48
4105D0m18N33n4M7j39K30o37M51n7M1k51K37K79r3m9k39k0j7L45j27j64K3j53
$$ y = [-98, -27, 134, -34, -43, -146, 209, -281, 97, 49, -5, 208, 12, 7, 19, 395, 337, -181, -124, -148, -102, 205, 34, -201, -356, 38, 138, 90, 128, -384, -210, -16, 157, 285, 104, -269, -72, 90, -76, 400, -355, -292, -112, 113, 105, -87, -41, -467, 53, -340, 77, -174, -142, -227, -219, -110, 223, -307, -129, -347, 41, -38, -307, 93, -298, 299, 280, -8, -25, -282, -134, 315, 279, -284, 98, 40, -192, 95, 99, -239, -114, 286, 446, -107, -94, 42, -248, -312, 193, -19, 93, -126, -172, 245, 321, 72, -26, 79, -76, -157, 198, 213, -256, -88, -177, 272, 258, -153, -69, -479, -38, 235, 149, 379, -421, -388, 54, 366, 35, 250, -190, -49, 393, -38, 220, -31, -22, -69, 377, 140, 285, -326, -324, -254, 144, 273, 113, 83, -44, -11, 81, 33, -297, 126, 220, 321, -82, 247, -27, -63, -55, -134, -155, -11, -219, 21, 71, 81, 249, -108, 40, -378, 155, 101, 148, 9, 239, -398, 53, -4, 37, -214, 23, 302, 209, 160, -79, -99, -116, 229, 102, -62, -39, -192]
4128a92J16R9J34j26k17Q1P1K83l36m1K18k53L28j83J98j52n4M02m50J0L56k62
4150C0l62K42pK47j78j91L29N4r1k85J12R5J81K28k48K16m98j39L87Q6r0l32j16
4173c30M72m0k45j0j60J53L43m10K59l81m2P4M12m3M1k94j16K61j5K06N4m33j4
4196b58K41j91K34K07r2m39M92N9j72p8j89J54J95J56n30J42Q3k99K52J04L8J56
4218B65m14R6J19o0K47m28J85j47l2L26l64L4p0M82r9k90k46Q2J54L28R2m39j9
4241a98L49k03L21l40qJ36k89K11Lj32l5l1K01m4p4K14k89L72j81j59K5KJ2lK77
4266A37j03m7r5K8R0j66J47p1M1L04n21M33j52j77J40m0o2k03K5oK20K00m15L60
4290F7l73NL51k08M72o45K55M1j28n1K26k51j16J98J44J74j11l07K0Q1J15pj55
$$ y = [-192, -76, 23, 157, 31, -186, -105, -34, 249, -87, -128, 90, -163, 165, -18, 180, 28, -26, 376, -74, -64, 292, 30, -332, -90, -97, 150, -28, -219, 110, 164, 73, -212, -100, -5, 176, 404, 156, 372, -126, -265, 122, 208, 118, -214, -330, 142, 102, -143, -153, -313, -160, 183, -227, 32, -349, -391, -317, 95, 52, 93, -201, -317, -56, -71, 135, 189, -244, -258, -17, -208, 26, 233, 141, -298, 194, 253, 81, 3, -186, -32, 163, 319, -211, -69, 14, -285, -33, 71, 109, 265, -149, -53, 66, 6, 253, -175, 10, -137, -169, 157, -207, -173, -243, 239, 140, -150, -396, -314, -160, 168, 260, -179, -198, 151, -52, 269, -71, -79, 57, -232, -21, -18, -150, -185, -216, -15, -59, -133, 81, -208, 164, -17, -176, -151, -149, -137, -140, 137, 34, -13, -108, -80, 10, -156, -9, -80, -39, 265, -256, 177, 25, -152, -12, -52, -114, -317, -292, -298, -78, 122, -293, 67, -306, -301, 50, -158, 314, -331, -76, -35, -163, -214, 12, -239, -355, -157, -13, 161, 50, -257, -237, -156, -41, -48, -203]
4313b03L5J27J0j2qR4k92k0L68l6l19j21K15J5M7K74L3o11M87M9j88l6J80o5j5
4338HL8q5q5L88n77K07K32p0n2rr8J68K16l55J23l05J04K59K08k11J67j68l41
4361b38N7J60j3j94L90o0r2K15n34R0J79Q2J58n41K84l23N92k20O1J68k14l3L67
4384C41k99k7K28j46p7M31l20j17J33l01r7K24L64j37l25p0L00j17J63o2j86L0
4406f7K00k64J87k57J6n5L76k98K57j43j27M30k93p5J29j31J59p3K45j05m88K90
4428h7k7J17K6k3m58M20L48q9P4m49k12L10R8pl38k1l9M80m0l15L42n5j34L30
4452B51m4kl24j10J71j48L19k74L7j06L74l08K75k89p2J48l17J29M56l51L25r9
4474D1L1L9j81MQ8l2k20M28l50K05l49N68k95J48m23R7L14k2q2n9R8o7nJ8p6J47
$$ y = [-203, -168, -41, -31, -43, -51, 43, -249, -269, 99, 63, -256, -377, -162, -147, -100, 174, 207, -404, 83, 132, -56, -92, 88, 23, 8, 46, -39, -124, 264, -313, -106, 126, 56, 4, -5, -103, 65, 281, -74, 49, -256, -152, 107, 315, 104, 271, 103, -238, -181, -21, -34, -228, 162, 102, 10, 225, -309, -219, -40, 42, 200, -341, -57, -380, 212, -8, 53, 221, 7, -26, 341, 42, 15, 243, 97, 20, 451, 131, 14, 147, -154, -251, -27, 337, 200, -125, -195, 105, -12, 151, 89, -97, -67, 133, -131, 56, -201, -185, -240, 136, -162, 95, -48, -175, 255, -38, -113, 16, -115, 44, -29, 216, 111, -377, -87, -114, 3, 29, 6, -452, -32, 316, 227, 301, -148, -360, -50, 48, 41, -297, -318, -357, 123, 83, -232, 110, 55, -79, 251, 207, 205, -119, -229, -58, -206, 113, -161, -124, -230, 144, -164, 111, -178, -250, -102, -419, -290, 166, -185, 140, 41, 72, 111, -70, -66, 22, -10, -230, 198, -152, 53, -296, 272, -23, 125, -298, -201, 113, 91, 9, -50, 48, -19, -24, -6, -82, 65]
4500F5l1k09o2j23M12j75j5J22K32J48l74r1L9O2K38n06K81j38M4M5J51j24j19
4523a28O0J82r7M00l04j38k79N3K97M11n88l7R2k45K21oJ26O8k87J73J83p3mj7
4547F3M3K4k21K80n60K83J43j37J28j19N9K30K7L5j45k25J9J42j7o6n4J00j8J84
4571A98j73j17K6j57K18J59P3j15k30j10K8J06K14q9k97K05K1M36o43Q7J15Q4
4593C9k07K71l0k30M10m03J15N9R6k78k48L10K33k80j41K84K53q6N7j77j32M3
4615d2k13J96O5l0j7q1J42n6k00L30j88N0k6J41l57J96K08m0K24j83n62L51o0
4638a52Q8J67k3M84p00j27J86oM5r8J45m9k4J23J08k73J97j08L8K9j07j9J70J8
4662A12j25J79k84K11p2J13o2M4j24j7o9P8J53o4l13M05j8r3M12o22j43M29k18
$$ y = [65, 34, -175, -237, -360, 52, -123, -138, -16, 216, 364, -10, -101, -62, 0, 238, -268, 13, -125, -81, -36, 115, -9, -128, -68, 114, 17, 417, 113, -25, -304, -251, 46, 457, -131, -168, -76, -321, -100, -106, 20, 88, -199, -26, 157, 84, 80, 63, 106, 130, -91, 189, -371, -88, 55, -82, 46, -73, -14, 216, 243, 278, 133, -92, -73, 69, 52, -14, -68, 32, 14, 198, 25, -92, -66, -223, -5, 154, 227, 112, -118, -228, -200, -94, 120, 31, -266, -61, -40, 396, -247, -160, -45, 39, -168, 103, 73, -157, 253, -150, -35, 24, 120, -158, -406, -96, 137, -143, -284, 0, 253, 167, 224, 47, -85, -42, -255, -59, 6, -24, -41, -122, 20, -36, -236, 94, -94, -44, -70, 71, -286, -90, 118, 78, 302, 119, -443, -92, -152, -64, 103, 80, 564, -136, -263, -77, -83, -38, -136, 9, -40, -64, 59, 167, -106, 91, -17, 21, 50, -57, -76, 94, 112, -13, 166, -118, 93, 21, 134, 72, 116, -8, -25, -94, -16, 137, 73, -240, 165, 147, 54, 466, -156, -299, 130, -88]
4685h8J54J80l80R5k13K73L45m38J37n1K1K82k46Q1j93j76M50j70j17q7K87j32
4707A4L21l54P1l73J96J4J40k18M52j98J64m6j74J13j75J46n3n7q6L46l51L13
4729B05l22L51o7J4j11J18l66J66J37J14k45J21m0j85oK72m5l3n5o3J95K7k64
4752h2k7L97n45J57j45J95O9j4j47k2K82k14J47n46M70l01J79L01M0k49k15Q6
4774a84p1M90l89j05K7K41R5l9rlk39K84l4j13j14J94j51O1k29M40k32K06k03
4797g7p6M03m17N6K3K3k3J26j12J93m69L66J30k6J1k26q8RK26n5j34L56o7o6N7
4822A43j12l02K15M0LL9m4K49l91J59K95k70m9J17K1J02j68l0j31K89J13j42m05
4845b59K14k17R9K35j31K52l74L9M14j80k6o3q4J32Mk10J86L8k05K86o3k96L43
$$ y = [-88, 66, 246, -134, -39, -252, 21, 366, -72, 65, 14, 35, 317, 71, 152, -41, -217, 233, 63, -54, -141, 146, 14, 335, -19, 52, -321, -125, -111, 29, -189, 263, 65, 229, 183, 9, 122, -53, 93, 40, -17, -103, 243, -108, 205, -117, 234, 167, 181, 70, 188, -178, -12, 125, 239, -6, 115, 75, -110, -116, 156, 111, 78, 23, -40, 155, 182, -82, -109, 288, -257, -100, -245, -50, 19, 5, -142, -164, 118, -96, 51, -495, -25, -326, -147, 154, 194, -55, -270, -184, -255, 235, -154, -259, -232, 9, 104, 65, 56, 53, -186, 98, 64, -49, -163, 31, -120, -59, -288, 152, -80, 126, -77, -153, 250, -167, -111, -88, -65, -88, 38, -74, 119, -350, 16, 146, 120, 131, -95, -183, -174, 52, -3, -137, 219, 152, 86, 143, 31, -271, -56, -16, -13, 26, -18, 231, -160, -1, 294, 24, -25, 92, 113, 215, 47, 17, -114, 175, 288, 146, -259, -45, -262, -163, 72, -59, 193, -181, -142, 272, 92, 66, 3, -81, 51, 55, -155, 31, 69, -136, 150, 87, -209, 134]
4868A34j52j88J87j17M48l57q7M6n9M91l96n3J09j75K48j65j62K66QJ01j15k21
4890b09K58K52n38K61J82p6j3j94J50j18J21n9j18p4J90j43R8j24M1K06K89j24
4912B58k78o1j58J86Q6J22j45j6l85O81l52P4MO5k77N76k78j99j67K72J59j52
4934A5J80k33Jl73M09P8N6l52K24M0j1J1J63l71N7K27r0k10K01J01k49k3L16j1
4958A56K0J9k75J54J80j72k25O70n35o8J30k9l96M74j24qJ18R3l64k0J69J15j85
4981a03J56j92J04j8J82l1j68m2n0j08K85p5l3Q5R5N3P9q8L7j28m7K30j10j49
5005c6k25R3K35q7J37K8k05J93j75k5O3J85p3l84K30J57J02j37k90L04k18K6J44
5028D2J26J24m55J25K82l14O2k19K6K32J95j21k06j0M23j83k01K38J0p1p7o8M
$$ y = [134, -18, -206, -19, -136, 312, -45, -132, -86, -145, 346, -50, -103, 6, -169, 79, -86, -248, 18, 26, 127, 12, -209, 49, 301, -237, 24, 206, 130, 117, -77, 73, -45, 76, 17, -101, -175, 15, -128, -30, -154, -113, 93, 382, 258, -20, -81, -239, -53, 33, 155, 10, -6, -391, 290, -62, 12, 16, 81, -196, 380, 102, -97, -264, 8, 167, 15, 195, -38, -37, -410, -1, 77, 133, -219, 5, 45, 34, 45, 208, -163, -106, 121, 31, -179, 22, 123, -126, -149, 167, 156, 176, 195, -80, 74, 254, 82, -143, 527, -8, -76, 54, 25, -371, 103, -21, -29, 89, 182, -182, -202, -33, 82, -103, 53, -139, -35, -53, 129, 98, -70, -112, -162, -270, 15, -60, -93, -8, 87, 140, 219, 131, 168, 40, -7, 223, 113, -36, -261, -168, 67, -20, 117, 145, -60, 133, -42, -67, -4, 181, 108, -276, -46, 111, 213, 76, -214, 90, -128, -102, 42, 168, 292, -163, -38, 244, -70, -8, -227, -201, 31, 226, 105, -101, -111, 312, 129, -72, 166, 176, 105, 28, -40, -36]
5051c6Q5j65K36k61J09M1j77L98j04k85K49p2j78L25M0M1l29r6M36k22K4j05j3
5074e9k1K6J43r9j82n5M61j29j08pj14K26P3k37o5J78j37L63k73q3J73N1%k49
5098a24J23j93J39M4nk87M38J48m69LJ83j86o7M71o4k9k60K36j97J95k6K55l24
5121Dj58J56M9j58K80l2m78K03K25j22J64m8l75L28l74N10k47K53n9m32M13j46
5143d4l0J09k01M34l47K58k52P7R7k11L07J54j40l41R8J39j0r0Oj45j23N9M65
5166B69m53P4J80j77J56j73j85M73k96k4M8j32L66l02L26J49l21J2Q4j31K20r9
5188F4j10J34j43r0J82N5J23j47p2J03k55L79k99ooN7O8J70l17P3M2p9R3J53L5
5213B07j54m32M75k23N0N5J03j08p5J6J46P0m9J21j72J50o6j98K49j12j22L65
$$ y = [-36, 49, -116, 120, -141, -32, 9, -168, 230, 126, -159, 90, 18, -160, 165, 205, 246, -83, -179, 257, 35, 59, -46, -59, -80, -54, 89, -10, -192, -247, 214, 85, -23, -30, -144, 82, 155, -82, -147, 31, -106, 257, -16, -99, 74, 125, 125, -124, -1, -194, -55, -11, -16, -303, 135, 283, -186, -183, 0, -186, -253, 218, 154, 125, -135, 101, -96, 99, 73, 328, 4, -154, 2, 51, -107, 173, 141, -337, -134, 91, -31, 133, 85, -290, 38, -336, 174, -73, 180, 121, -311, 102, -44, -74, 35, -166, 268, -79, 179, -73, 4, 101, -110, 197, 351, 211, -130, -32, 107, 97, 7, 13, -132, -255, -196, 269, -184, -110, 70, -107, 49, -124, -309, 164, -132, -156, -108, -240, 126, -176, 150, 299, -22, -10, 74, -57, 163, 64, -46, 88, -55, -145, 37, 92, 215, 68, -4, 99, -156, 223, -76, -82, -88, -31, 37, 207, -110, -37, 5, -74, 19, 172, 207, 53, -379, 96, -127, -77, -22, 81, -27, -102, -86, 60, 130, 81, 202, 30, 180, 114, -84, 165, 53, -69, 296]
5235B96m34K00J09j13j46j67N58j79j50J0j00L83j45l19J88J81j35K41l25m3L86
5256B96j79l18J95N1j90o7L38J85l39j66k9K85K05k56j71K88o3k7j85L17k89k3
5278a42P3J39j63n6R5j00N1P2p2L0j39K30r1K30Q2l75J4P2L14l13j53Q5n4K27
5302E6j59J60L4o2m9M9j01l76M65N9k2j83l3L09m79N29l55K84k44K01k20j89M44
5325A18j77J5J02N3k69K57J00l99Q0mJ8J18k10J50k24K67K47k73j15J69l8j24
5347a39oJ61j9K52j92j26j80J95j02o8K79k09k0J72J8n8L8l2K89m25J38l36L81
5370A1p8N9l8J87m26J52K29J48O2n25L43j58OK11j17n4J04oj1M9m21L22N1j30
5394c0J02P7k66L51l09n7K45l07K84l81K54K08J0k33Q4k52K70j73K5j57K62J98
$$ y = [296, -138, 62, 171, 58, -88, -255, 303, 124, -26, -16, -116, 267, 122, -197, -9, 172, 37, 278, -47, -90, 296, 117, -201, -6, 45, -145, -212, 126, 311, -28, -194, -223, 62, 267, 11, -160, 128, 65, 38, -147, 170, -119, -142, -69, 70, -93, -149, -54, -154, -103, -31, -103, -73, -212, 18, -73, 157, 239, -136, -122, -50, 264, -49, -202, -117, -171, 56, -103, 57, 91, 29, -20, 29, -72, -448, 17, 76, 54, -129, -162, 147, -332, 197, -158, 126, -118, 83, -137, -326, 118, -59, -44, 58, 111, -158, 99, 199, -200, -120, -124, -106, 12, -198, -48, -272, -5, 242, -31, -146, 23, -15, -139, -145, 16, -3, 249, 57, -69, -249, -54, -156, -224, 55, -154, -174, -2, 16, -42, -4, -36, 253, -172, -34, -370, 11, -67, -8, -46, 141, -285, -133, 96, 244, 306, -219, 124, -34, -28, 183, 66, 12, 116, 110, 99, 148, -273, 49, 100, -30, 72, 149, -117, 234, -75, -132, 113, -194, 90, -291, -37, 171, 181, -52, 32, -220, 50, -123, -98, -255, 7, 205]
5416B05j83J25j95j38K7R9J73J85j60j47J46P9j72O8K9j66K09j66K03k72m8l9
5438a38K58k97L41o2Rj11l1j11J10K25l32J87l01K48k40L92k62L50J17m43j85
5459b76K21J11J46l89L09j53r4L32l84K48p7J11P2k02N4j13O7K03k32j93K95J38
5481A94k72J05j78J86J32p3k54J61p2m8N3J20o4j6p4J81n6o1Q8R9J4m50L62l39
5505b62J27K06j83N3J2J87J00j9j10j07q7M98m36nL3J05l6j13K41m49K57n2K55
5528B15l33J22j36L41k6l14M00l17k8j84K95Lq0k9j71L33J30k21K63j32l9J3J35
5551B40j40k67k42L88j8j35J28J78l4k93P7K82n7q5Q9p8k64J52K35k38n0K93k19
5574e8K6P0lj90J59j96M18l40Q2K26k95L15p5j04j05j56M67j92M2k19k0K01j76
$$ y = [205, 22, 147, -48, -186, -159, -60, 113, 298, 138, -9, 137, 216, 44, 112, 141, -25, 184, 18, 221, -51, -99, -138, 120, -177, 164, 102, 111, 0, -31, -142, -32, 193, -139, 48, -253, -5, -245, 147, -115, 235, 352, -91, -276, -55, 56, 202, -187, 122, -31, -125, 207, -177, 71, -6, 105, 177, -25, 29, -84, -17, 186, -46, -239, 56, 194, -78, 27, -151, 35, 167, 94, -160, 1, -71, -119, -66, 54, -10, -26, -100, 81, 25, -36, 52, 151, 165, -285, 77, -262, -135, 71, -112, -59, -47, 140, 240, 221, 111, 4, -83, 415, -21, -26, 7, 112, 76, -37, 204, -245, 12, -40, 215, -118, 4, -132, 209, 183, -131, 269, -48, -76, -260, 35, 38, -42, -71, -242, 91, 221, 0, 263, 131, 92, 105, 240, 100, -167, -409, -21, -39, -174, -46, 132, 98, -195, -118, 164, 107, 22, 111, 33, -231, -79, 156, -82, -132, 161, -58, -32, 38, 35, -155, 4, -192, 226, -114, -32, 194, -101, 214, 139, 35, -70, -226, 241, 49, 91, -128, -148, 53, -123]
5597a23J70o8k32N12j6j74m3j03O1Q1Q7k46O2l03L08j42J68k46K58j17K91m78
5619b93K35K45j72j65J60k97L64j72J02kR1l22K57nj23l0Q8NK33l30J14J85L4
5642B02L3j17k53J43J31j63j07m4P5L43j35k12K37k50L52l89L85n13N38j97k28
5663a69M14l05K85l52L13l48K08r2K43j24j89L5J96O9m16L0%J9J31J16k34k3N8
5686a35K68k00m3K00K3j7k61K23j03Q9p9o1J16o8J26O4j97J36m4j83M58k50r5
5709c3k76N59k59K01j96n1k2K86j19k88J21Q9O8j19N8l17M31j80J21N0J9L9m82
5732c00J54PL0k1M26m62L40j34O7O6j1j55L70k80J03j47m4Q3J12p9k23J36J85
5755B23q4k53K57j77M36l12o6l7j05K23l87LO0K92j18J03l22K44r0L9m9r0J38
$$ y = [-123, 47, -21, -253, 259, 243, 69, 26, -77, -16, 65, 152, -94, -32, -335, -27, -169, -1, -247, 11, -106, 185, -293, -58, 187, 15, -150, 10, -287, 77, -95, 7, 5, 96, -226, 31, 26, -97, -127, -39, -34, 199, -131, -17, 168, 202, 235, 118, -135, 8, 139, -24, -131, -175, -100, 243, 108, -104, 133, -117, 235, -154, 231, -282, 256, 59, -169, 245, -60, 225, -127, 186, -162, 46, -46, 197, 73, -116, -81, 115, 184, -232, -202, -202, -183, -52, 64, -170, -193, -135, 133, -67, -110, 90, 113, 96, -165, 58, -45, 44, -35, -96, 20, -48, 78, 142, -55, 81, 37, -146, 312, 62, -33, -309, 250, -9, 192, -4, -55, -77, 209, 90, -198, -77, 12, 80, -39, 19, -298, 133, -47, 74, 124, 143, 182, -300, -146, -139, -109, -130, 296, -166, 174, 40, 107, 173, 162, 7, 377, 97, 200, 53, 9, 92, 204, 125, -98, 38, 223, 139, -114, 143, -34, 402, 90, 24, -13, -118, 105, -282, -279, -219, 73, -45, 58, -264, -20, -110, -71, -120, -210, -72]
5778g2J76j35k4k33L13K10o92M30J7J52j54q5O0K26m00L00l94M22k6k10J93j62
5800h8J02m8j41J48J28k52J84j76J26Jj04J24j6P0j15J45K9q2k7n2k91K69M01
5823C35k29j0j12kK10n8p6J2J38l1n6m21K64j89N40n48J18K07j55p9O1Qk43N7
5847b59K41J00o7J0k83L6R0J69j71Q7M2n6k45K07j25L18j47l9K24k51m4J46J59
5870A42l89P5K38R4k91J37J40mJ16l4j50M7M7l62L83m35L94m20L59J97m13M34
5892C05k57j73L56n12K28J69j84K14J0J94k60k16Q6j14M60l33K87r7k78J23l39
5913c31K32j9J08j29j49M17p4L7l25L11O2j53K36j41k79J62J24j72K57l43M51
5934B82j57j92n0J37r1M7n9J83k41K71J54k37KK27j88k34O7L85m14L37k55J86
$$ y = [-72, 104, -31, -55, -288, 25, 235, -457, -27, -10, 142, -12, -97, -37, 189, -211, 89, -305, 117, 91, -119, 74, -88, 14, -34, -175, -27, 101, -151, 33, -143, -17, -16, -120, 4, -12, 58, -57, 88, 117, 35, 8, -44, -335, -66, 335, 106, 96, -16, -18, 192, 134, 58, 70, 208, 177, 121, -300, -36, -225, 315, -233, -115, 92, -63, -142, -81, -73, -316, -259, -18, 82, 15, 25, -258, -222, -132, 37, -134, -47, -5, -61, -306, -99, -224, 94, -53, -92, 132, -119, -163, -17, 142, -247, -172, 66, 160, -131, 6, 146, 142, 258, 224, 74, 121, 168, -194, 189, -246, 148, -272, 87, 284, -129, 305, 48, -125, 231, -281, -53, 116, -68, 146, 156, 350, 90, -126, -40, -154, 306, -27, 260, 163, -115, 8, -331, -99, -118, -10, -139, -288, 129, 55, 92, -233, 78, 140, -13, 223, 82, -197, -35, 89, -83, 174, -169, 282, 125, -67, -117, 20, -71, -24, -83, 100, -141, 130, 284, 47, 49, 276, 88, -146, -79, 306, -108, 229, -26, 160]
5956A60Kk43J00n7J04n6R8j70N6L87k68j16J46J7p6P8l60M62r4m09L56j85J70
5979A02l11K90m1J52K7m15K93L07n06M07r8j26l13J59j80J01M9J88M4K15m71J34
6001GQ3N5k24k2R0k39N17l22MN0PN6j28J36q8M0j47P8K17j65l0K2K21l36J51J70
6027B03p1k2j22O8l68M07l21M28k1n99L93J16j85J67P3j10j29J9OJ14o0P5J58
6050B19l54J14M0M7j3k4J74k80L70j11J99m77M7q8j8R3J55Q9k45J56j82J42N0
6073A03P0k48j12m6J73P2l40L15k38K30n9J90j09j30L16q9j13J12j77J84o1N1
6095I4jj93L56l52j44l4L53K3J98l52L68k83J61o3j74L43k71j47P1l19M91m05
6117b80P5J61J26o3P4k85K60J62l79j60L54k0N8k09J56j49J08J48j37J04k38J39
$$ y = [160, 162, -81, 19, -38, 66, 10, 108, -62, -6, 381, 113, -3, 143, 160, 84, 162, -198, 264, 170, -239, 117, -68, 102, -209, 81, 40, 192, 219, -196, 97, 404, -102, 305, 207, 81, -232, -73, -253, -152, -103, 85, 129, 344, -127, 7, 90, 145, -79, -101, -11, -250, 267, -55, -51, -1, 6, 62, -66, 70, -18, 22, -125, -47, 170, 5, -25, -3, 218, -118, 33, 203, 132, 110, -12, 56, -312, 95, -226, 202, 181, -418, -25, 91, -94, 73, 146, 36, -93, -74, -68, 46, -14, 61, 219, -135, -21, 19, 66, 53, 29, 203, -77, 293, 182, 381, -96, -49, -137, -155, -62, 93, 182, -63, 93, -89, 53, 103, 173, -75, -187, -233, -60, 12, -328, -13, -251, -21, -80, 110, 1, -129, 187, 98, -15, 97, -80, 104, 43, 94, 93, -100, 256, -96, -240, -274, 79, 102, 300, -52, 316, 33, 194, 131, -43, 300, 29, -118, -47, -366, 125, -280, -205, -44, 82, 19, 93, -192, 68, 230, -149, -309, 45, 25, 83, -126, 30, -119, -11, 137, 0, 104, -134, 5]
6139EJ71j34l6lj58L82r3j29m49P13l66L41j15m22K44J92l69K50l8O9N1Q2k32
6162d4m6m1J69q4j24J96j15J29l2j36k3K34N1L0J3M0j50k63k6J92L22k92K30l42
6186a12K84lj47j81j4L66l32L5J34j10K05j46j58N0K1K06p3M7J8r9K64j57j61
6209f3K49l07k9K73J04j84J97j95J0j10Q5L13o91K55L33k81m3nj02L13j18o2m3
6232a01K02O8k12k26N12n62N07j13k49J14R0O0j50Q3Nk72J57J67l9J85l47M02
6254B81k44l30M04n6j77N5J19j26K57j91k11J6K93K55j04j6j0l76M16k32n5J15
6276H3j40n0K97k73j08J22N3P0qj49K88j04k04k00J41K52j2J18m3q0k08K56r9
6299BO3k12M0Q5m1J78j8J96l68K45l9l57J12k4K7LJ02j10r0L37j83K2j2J46k91
$$ y = [5, 176, 42, 6, 3, -155, 227, 134, 5, -444, 269, -97, 244, 129, -293, -49, 143, -226, 24, -14, 55, 106, 188, -44, -90, -131, 38, -46, -170, 26, -89, 40, 8, -128, -151, 83, 134, 164, 177, 217, 67, -196, -222, -30, 292, 0, 230, -112, 172, 169, 22, -159, -173, 193, -139, -104, 30, -80, 125, -21, -179, -129, -108, 98, 25, 72, 90, -9, 255, 98, -63, 186, -121, -150, 123, 227, 43, 240, 45, 55, -55, 30, 343, -348, -93, 240, -41, -84, -89, -191, 122, 4, -58, -101, 101, 169, -43, -269, 243, -319, 188, 75, -174, -60, 30, 90, -60, 23, 28, -244, -87, 80, 41, 226, -121, 281, 37, -293, 111, 55, -122, -67, 52, -74, 183, -8, -219, -203, 90, 345, 241, 225, 215, -161, 255, 23, -32, 83, -57, -107, 190, -83, -191, -69, -16, 54, 46, -103, 185, 81, -123, -323, -182, 70, 58, 176, 133, 53, -155, 101, 2, 65, -147, -107, -22, -63, 115, 97, 293, -75, 170, 131, -226, -114, -138, -111, -108, -6, -116, -206, 131, -52, -30, -42, 104, -187]
6324a87M7j39M17M8J45j71l58L35j26o6J7J72J73j90j29K7k60K64k85J63L9R2
6346B8j32J91n7P4k66K11R0j50O9n4J01m30N02q1q3N6m4J34J69k90m1N4J45j22
6370G4m7q6P0k83L59m48K32j18J39J10N0J07j23l24L42N9R7j72J89j24j30L7l14
6393c04N74n65M84j35q0J55p0R8l95M46J6l76J17pn8J33J39p9j32J86M8m10J60
6416e5O6j82J54n3R2J62j14p5J56N1K2l82J54N6k28j97N51l76L05L9j25j68L09
6439A62k05J45J61n93K93J95l1L0j35j30J62K58k09l38K34J26l25J06M3M3J65
6460A57K1j88j36K61k88J77l9J14rj41J03j12l2J82Q3m47Q9N58l00JO5j08p3k
6484f4K26j79J38K3j82j15M69m20J01k48J18N8K13R3j21l52N81n2k28k48K96l37
$$ y = [-187, -140, -279, 138, 186, 331, 160, -198, 137, 11, -55, -38, 134, 307, 117, -12, 15, -245, 19, -266, -103, -64, 28, -104, 87, 30, 104, -162, 49, 139, -11, 58, 4, 105, -325, 177, 96, 13, 69, 25, 159, 328, 38, -3, 51, 196, 74, 27, -59, 11, -272, 87, -361, -129, -247, -108, 2, 52, 159, 36, -288, 54, 113, 210, 38, 227, 103, -27, 10, -304, 270, -295, 189, 54, -26, 129, 59, 157, -238, 208, 224, -152, -35, -42, -100, 33, 172, 93, -39, 147, 195, -215, -55, 11, -171, -17, -70, 22, 184, 70, -5, 151, 202, 224, -158, -4, 52, -176, -373, 178, -198, 107, 146, 21, -147, 162, -43, 102, 263, -330, -37, 158, 127, 157, 22, -108, 54, 312, 103, -235, -1, 125, -200, -94, -51, -8, 157, 178, -10, -146, 115, -173, 4, -35, 79, 70, -71, 32, -80, -112, 70, 153, -294, -205, 353, 53, 54, 119, 11, -62, -64, 162, -17, 121, 144, -38, -153, 316, -104, -3, -251, -133, -75, 138, 231, 110, -242, 339, 287, 59, -189, 107, -230]
6506b30L54j64k56o0J92J65p0K68k73j7J48J94l21M7olK18l42R4j4J8K52k35J09
6530F8j97M1J52R7k44J7J04q0L8J28m27O74l17J7J99m07j06J03K91J4k57J35K91
6553C34l17L1m0m31O24k14%m0n2J24k9p3j4J02J29j14j6j75L06J21l35J06Q8J8
6577A33q6r4R0j28L52l57M05m92P7L9K57k8j44J38m48N36j57k1k1Q3j67j29N2
6600a10K12j6J65k33j02M17k70j63j25L33j19p6r4J23J99j31k6R9N0k88J91k04
6622a68K90l36J6L86j88J96k85N1l6J31m7j12K43l84J33nN3L22l2j40K9j71J0
6645d4J47j04j9n4K22j35K3L54m11R7Rj16J34k67N0J45k71K07K75p5O2m11L03
6668A21m85M14K37J18k99P1M7k74q5K73j04o3l90N13q3j12QJ28J44j30q2J81p5
$$ y = [-230, 124, -40, -296, -356, -164, 1, -69, 199, -74, -91, 57, 251, -70, -23, -29, -32, 186, -156, -62, -76, -58, 194, -41, 68, -129, -88, 64, 161, -83, -66, 38, -42, -4, 124, -303, 371, 54, 71, 270, -137, -243, -140, 151, 165, -92, 43, 334, 17, 48, 8, -423, 201, -13, -13, -53, -105, 19, -10, -83, -97, 5, 134, 20, 4, -171, 135, 256, -79, 27, 115, 133, 47, -47, 43, -85, 267, -90, 315, -177, -100, -61, 196, 168, 24, 162, -286, 250, 93, 72, 51, 134, -33, -162, -110, 102, 86, 251, 18, -84, 333, 63, -100, -225, 108, -11, -87, -181, -58, 141, 10, -16, 83, 133, -155, 36, -168, 122, -214, -198, 188, 0, 196, -89, -38, -74, 57, 10, -102, 141, -243, -110, -115, -62, 260, 228, 88, 117, -54, -44, 103, -1, -20, -74, 148, 13, 36, 390, -21, 76, 85, -31, 103, -164, -114, 31, -240, -33, 242, 167, 229, -182, 121, -364, 50, 287, 405, 106, 177, 224, -50, -135, 138, 34, -29, -419, 94, 11, -101, -93, 35, 179, 49, -33, 148, 73]
6691G3P7j60K0Q7j70l1L96l13L66j36l09O1J63j39j8N6n2J09Nj20K72k49p2K83
6715A99q7q1m59M69k49L55o8l38N13k39J0k12J84j01j74K07p8l6J6K19K68l43
6737b5p7R8M1N2j06n0K21m4O4m05J94J11J6m6nl05L11k60J50J5J11j66k29N04
6761A70j37l7R7J81l19j26L81m76K86j21q3p0M44J47n24M89J9l37J00l25K68k5
6783BM6l8J31m87M7M98l97RL51j45q6L77l24K9j41J23NJ85l98r5N36k50l9o7J
6808a27L71r7l71N38j11k93N2J75j09J59m8r5J72L4k52o0K75m37J92J95Q6l48
6830i9N9J23k65J28j99K86j40RJ49k90L80J85l4k73P1k58L55l30J78J55j83j67
6852a60r9K25r1L48J07l60j99J80P4j08J19J36j29k44J55l9O8L30k38K37k59k78
$$ y = [73, 150, -10, 10, 97, -73, -104, 292, -21, 345, 209, -100, -39, 124, -15, -33, 23, -29, 80, 85, -35, 237, -12, -84, 199, 112, 31, -428, 41, -208, 147, 79, -259, 254, 15, 25, -187, -3, -104, -278, -71, -149, -185, -169, 50, 318, -25, -102, -4, 37, 89, -17, -67, 154, 110, 174, -231, -37, 74, 90, 44, 39, -266, 45, -215, -65, -50, 61, -105, -334, 170, 33, -4, 93, 274, -45, -171, 210, -266, 20, -101, -184, -254, 190, 337, -187, 302, 321, -16, 84, -241, 27, 2, 48, 10, 141, -346, -299, 199, -198, -189, 162, 17, -69, 308, -16, 13, -128, -5, 0, 185, -213, -308, 228, -22, -61, -128, -127, 244, 147, -224, 314, 203, -90, -38, 137, 28, 187, 139, 44, 216, 250, -2, -62, 213, -224, -32, 163, 249, -99, -40, 83, -182, -54, -253, 33, -107, -98, 51, -239, 141, 326, 292, 19, 90, -168, 187, -143, 35, 190, 7, -160, -259, -34, -125, 223, 330, -30, -229, -49, 25, -83, 36, 172, 43, -201, -46, -85, -17, 313, 75, 312, 53, -225]
6874b25K30N3l77J06K76j07k6L00j48k01J02Pm3J2L66j86m62O9r1M38o2q6K5j64
6898a94K30j17J94k22K51j61m7N2K59j69O8l20K12k74m7L43j21J17P2m86N60n6
6920A44M7J68j09k7n4l66K87j4p0L30k91M03l65k58O7j67J41j27M21m56J52J28
6942a6k34N16P4j24l34k44K27K76R0m42K15K4j05J08J9L2j51N9j68MJ40J30j00
6965dmJ02j70Pj63j29K90M0O9k6R8j29J93k28p2J62m8J21K06k38P6j20N6l02K98
6990H5j07J14n3Q6L3j09J74l2O7l65jP3m3P3q1k81J33K48P9qn0k64N6Q6j7J35
7016C1j54p4K85q2j36L1K0o9J65j30j48J30K70l5k20J63J22P1j46L3o2k14J20
7039b9k00J15N5K29m64K66k2ROk18M64k18k64M67j4m04N69j83m4J25m64J10J66
$$ y = [-225, 5, 58, -319, -213, 63, -44, -70, 230, 82, -119, -17, -10, -53, -41, 325, 139, -323, -254, -345, 93, 31, -55, -30, -194, 36, -81, 113, -109, 142, -19, -66, -14, 245, 76, 144, -176, 36, -238, -285, 58, -63, 54, 126, -360, 200, 144, 191, 359, 250, 223, 169, -197, 90, 76, 6, 336, 45, 448, 83, -175, -108, -275, -134, -261, 160, -296, -144, -16, -250, 266, 340, 216, -118, -362, -135, 141, 231, -211, 4, 28, -77, 31, 50, 82, -69, -10, -178, -174, -34, 96, -4, -8, 94, -76, -69, -232, -361, -71, -31, 38, 12, 110, -19, 174, -54, -126, 36, -12, 109, 315, 77, 153, 33, 89, -213, 85, -22, 92, 39, 125, 158, 49, 223, 191, 258, -107, -108, -35, -78, -5, -86, -367, -234, 14, 93, 85, 35, -229, -173, -87, -104, 31, -123, -197, 88, 6, -130, -99, -79, -148, 17, -113, -261, -131, 139, 104, -116, 47, 169, 240, 94, 127, 65, -149, -29, -229, -114, -59, 170, -294, -28, -50, -41, -35, -253, 211, -7, -271, 196, 182, -222, 347, 164, 120, 245, -219, -109, 57]
7062E7n6J20J12l58k2j1n5K03N5k89K23K93l92L6j28J18J03L17q5k63n3N6l56
7085c75O39k55J46l56J25P0J15j36P0N9J55j15n12L47J34kn5j28m6J33r6r5L33
7108A55k08J54K6j57j59K11l3J31k35K19J5j41J45j28O7l1M6j5j04J57K13m24
7130i6J20l0m5k82K71L17k27k60M49j18k3K28m09j7J15q9N0o2K77j34k80J09L93
7153B57k66PK7n8j83R2K07M4k44j29K63p6l8j03L56j11j2k46J52J49Q9l67K7M2
7177a21R9k2k32L30k21J43j06j71L47K16m62J96K7j67K37k28mO2O8r6J37l34L25
7200B3J54l2ml63lK53K96lm14L32m36M76m98K27k40J97J08k23J97l4M6m3K0J2
7224D8J70k82L54l49J50n1j38J24j06L0j5n0P7k39L88K55m54J16O3j31o2k33N79
$$ y = [57, 1, 121, 233, -125, -147, -158, -213, -10, 45, -244, -21, 272, -120, -84, -212, -94, 9, 326, 241, -22, -75, -19, -375, 264, 9, 155, -201, -76, -6, 109, -27, 43, 102, 257, 142, -370, -23, 111, 109, 54, -74, -120, 13, -83, -178, 155, -53, 101, 127, -30, -189, 22, -11, 120, -115, 104, 119, -22, 123, -5, 62, 31, 77, 62, -42, 115, 328, -96, 24, -6, -51, -333, -62, 255, 28, -232, 217, 99, 76, 304, -105, -122, -7, -96, -46, -108, 169, 35, -245, -136, 257, -9, -2, 25, -33, -216, -124, 83, 127, -117, -246, 17, -59, -97, -200, 156, 45, 33, -213, -61, 88, 177, -190, -163, -121, -22, -44, -276, 54, -167, -24, -130, -301, 46, 262, -200, -4, 23, -144, 93, -135, -139, -77, -9, -105, 32, -302, 23, 177, 145, 141, -222, -225, 28, 324, 321, -93, 239, -197, 279, -219, 8, -232, -35, 73, -150, 47, 13, 59, 16, 36, 48, 218, -64, 290, -59, 91, 40, -98, 26, -80, -50, -65, -115, -38, -277, 111, 366, -88, 28, 91, -40, -102, -335, 244]
7247B44K0n71K40Q0Q0k5O9l0j21K24n8l2j80J26J38j62kN9J23j66j06j28M25l36
7271h9K63l00K95m72M36l53J13P2j29J70j73L89r1n9j62j49P9p4M54j99L13l80
7293d6p1J25J21m22J65R3m0j42J33J40j75J87O5m61J11K55j48L31l90Q3M9k92
7315c29K21K79r8k40O7L50k47j20p5l0L2K94j35j61L73k29J55Q0j33k3j92r0M48
7338A97n40K51K56O3k03O5J57m89J04K25J92n22M01j60j52N5J34Q9j75J96m5j98
7360i9K91j65k49N2q7K56k17L23m5k85K22L9J23q1j40j00k4L83M5l42j96K04K23
7383A31nj08j37K96l42L03q5l3l7K72l34J73k49J11k34L13o8j49K01k15L36k33
7405i3L90p34O52J10m76j42K02J46M2M0k20J11j16Q0j32K47J95l58K06j56L59
$$ y = [244, 264, -307, -67, 13, 93, 68, 137, 107, -14, 210, 152, 120, -60, 66, 204, 42, 40, 99, 222, 56, -50, -178, 247, -89, 174, -126, 169, -303, 133, -220, -107, -35, -164, 6, -167, 222, 131, 72, -90, -239, -160, -234, 220, 21, 334, -46, -117, 8, 129, -293, -128, -35, -75, -217, -84, 56, -119, 68, 133, -328, -217, 38, -110, 221, -169, -86, -37, -329, -108, 171, 73, -167, -100, 250, 3, -117, -192, -222, -190, 104, -31, -192, 181, -48, 107, 187, 54, 31, -161, -251, 197, -343, -92, 164, 227, 24, 89, 246, -243, -139, 86, 278, -244, 157, -3, -155, -100, 34, 123, -52, 144, 99, -99, 192, 27, -222, -170, -257, -1, -218, 105, 60, -225, -3, 36, 159, 78, -62, -162, -186, 197, 242, -100, -296, -92, 131, 126, 18, -119, 177, -165, 138, 53, 20, -17, 255, -79, 94, -155, -44, -278, 35, -33, -182, 19, -196, 140, -93, 297, -437, 215, 325, -151, -293, -91, 55, 97, 137, -83, 28, -88, -8, -140, 107, 302, -56, 150, -6, 353]
7426C53o04M4J3M76k17Q4k6j42k50L47N3M6k37pN7N5J11l09Q1K59k39j66J48Q5
7450A5R7j51jJ43l5j36N8K3J81m41R1K12j58K48q0r9J6J55j65L3R7j69R0o6l7
7475g9r0J3K51J83m75M34k03J10J14m08o9K81J6J06j63K90Q1l58m3J22k17M6J33
7498G5Rj20k1K73l40j9l9nM14l13j88L39l31R8P2J07j7Q2k00J13L0L6J87P5l43
7523b6L94l69k08L2J22K22l12K64j95K04k8k34K12Rk46RL75l37k3J99l9l5l9K04
7547A55j82mK43k37P2J17j24k66J25J34r0R9n3Q3J10k40j6j15P3N9N3J12k90N4
7571a28R7Q0n2k60r9J16L36O0k8K02k12l03K39l57L44j25R8L9j20m4J43R7K04
7594C27j76k61J99l51M9Q1J25K21j06k11P5r1L14m29M14k71n2mL19k80L74k49
$$ y = [353, -251, -207, -194, 282, 65, 149, 123, -19, -269, 78, 131, 177, -60, -67, -10, 45, 156, -153, -72, 187, -52, -218, -70, 15, 112, -39, -40, 103, 68, -68, -10, 13, 194, -247, -156, 56, -102, 146, 66, -33, -17, 138, -27, 6, 103, -66, 24, -42, -79, -169, -156, 95, 278, -197, 237, 34, 144, 258, -150, -219, 62, 78, 184, 21, 311, 392, 34, -9, 113, -104, -58, 75, 84, -36, -57, 216, -124, -143, -182, -187, 227, -86, -274, 65, -266, -168, -96, 11, -6, 76, -124, -11, 19, 55, 242, 317, -26, 368, -1, -209, -177, -55, 167, -145, 119, -76, 128, 100, -134, 78, 87, -159, -150, 225, -112, -135, 64, 25, -10, -49, 155, -27, -31, 212, -25, 47, 164, 40, -226, -101, 33, -57, 42, -11, 72, 182, -58, -74, -189, -116, -57, -4, 108, -182, -128, -31, 49, -3, -263, -362, -246, 90, 150, 122, 324, 112, -191, 48, -309, 35, -90, 8, 47, -73, -117, 26, 123, 327, 151, -110, 89, -262, -213, -132, -7, 214, 108, -103, -28, -119, 195, -234, 180, -91, -143, -147, 172, -108, 266, 17]
7616A7j22n1J3R0K18k44J3J03m80O51k77j36O4J21J45p0J34N5j75R7r8K23k00
7639I1op9j0pM4L9o1O1j70L00l77NJ96p0L25l32O1J12r3J39m0k28K18l55M42j45
7665F0J30M7m8j41N7j23L42l94l56K23K74k4j57q8K22k62L46l9K12k63k42L08
7687H4l29J64J50J51j17k68qm9K89j67j16K18L0n0q6o6K6J10L05j10j57O0p9k00
7711b15K81j23K63o64L74n8N9L3N6j5j08j3J82J00q5j80K01M1k92M9j3J40K15
7734B28j8r8l0j49j44J37m0K78l35j84L57K36k11n7k8L37l73j91L00p4J81j08
7756A4lN3J37Q6m63lJ92J15j46o0R6O0k15K36P9m59L50J4J13j28K11j72j93J13
7780B7Q9j90JR6M21n28J52l47J50J49R1k85N5L65k98%K9q9J09k12L5L30l4j86
$$ y = [17, -105, -156, -143, -53, 165, -79, -66, 37, -443, 208, -69, -205, -141, -20, 125, 55, 189, 244, 69, 166, 68, 291, 91, 85, 6, -4, -11, 33, 72, 11, 72, -98, 202, -175, -170, 26, -44, 281, -51, 10, 122, 29, 168, 128, -100, 118, -237, 205, 60, 190, 237, 189, 48, 105, -18, 324, -70, -426, -203, 71, 47, -110, -198, 24, -238, 108, 69, 281, 18, -224, 84, -245, -81, 69, 220, 103, -165, -173, -222, 67, -100, -216, 2, 32, -18, -104, -170, -144, -34, 271, 161, 4, 64, -15, -215, 66, -57, 206, -458, -84, -142, -83, -50, 6, -9, -117, -130, 52, 152, 67, -113, 88, 129, -163, -114, -127, 13, 228, 210, 112, 82, -67, -211, -74, -114, 164, -171, -355, 2, 238, 27, -30, -58, 279, -94, -285, 15, -59, 122, 14, 11, 64, 201, 287, -176, -179, 13, 128, -18, -78, 18, 78, -137, 99, 178, -281, 69, 83, 196, 68, 279, 107, -86, 27, 116, -74, -73, 23, 444, -84, 68, -279, -129, 20, 111, -174, -119, 246, -52, -52, -23, -112, -3, -215, -180, 150, 116, -70]
7804g0K34n7J33l05P7L2J1nN4Kj22L99j95k95l9L51l3k11Q4p8j98J8l9O8L12r7
7830C1r2J02n8nK7L7J9j82J59nJ7J64j77n7L42l23p6QK3LK66m0l30L78l48j29
7856b46L79m11J04K52q6M2K73o2m18L7Q8J85p4k05N18m26n5K08Kq3J13j18j74
7879a57J17j9J18l78K16r1K98k34Q1l6K0K36Ln7j40J80k32L85k94l37M70J33j85
7902I7k88L30k27K90j15j26M6J92p9K4j53k4O4l76L83L00n55J22l8K25K14j39
7924A67o7k85K70r9K43j90k82M15k67O8m6K46l02L86k39K80m01N2K53m10K69R0
7946A51l05L45k24nL38k15j27J17N1j98K21j17N4j79J93l54K46Mk54J94k64O10
7968B82k63j60K37n1P0k08J80m9o8L9j58J57J26l05R9J28j26o5r0l5K57J55p3
$$ y = [-70, 164, 107, 240, -65, 12, 44, 55, 50, 104, 106, -16, 383, 188, -107, -146, 205, 172, -39, 45, -33, -231, -213, -252, -184, 128, 31, -61, 41, -17, -22, 5, 42, 61, -121, 38, 33, 50, 214, 37, -20, 322, -1, -77, -69, -46, -43, 223, 183, -147, 231, -117, -246, 133, -278, -174, 78, -8, 34, 307, 245, -173, -136, -48, 137, 63, -142, 376, -50, -105, 103, 105, 22, 135, 17, -157, -40, -59, 59, -319, -103, -194, 104, -130, -49, -85, -65, 171, 174, 117, -23, 157, -75, 310, 16, -321, 149, 282, 97, -191, 139, -88, 202, 87, -39, 7, 199, 120, 144, -9, -33, 31, -345, 38, 338, -217, -95, -133, 92, 306, 167, 100, -185, 85, -14, 229, 39, -243, 172, -95, -27, -73, 173, -129, 257, 18, 298, -103, -51, 202, -208, 61, 151, -154, 191, -33, -38, 300, 85, -42, 75, 126, -72, 149, 32, 86, -93, 100, -254, -8, -4, -258, -64, -328, 282, 19, -141, 96, 45, 115, -93, 87, 38, -30, 9, -149, 8, 134, -171, -72, 56, -70, -135, -225, -260, -3, 152, 79]
7991G9j11k71J77L49k64M5K05j88K20l66J79j57J88j62M18p9l82K75q1j95l38
8012d59M93n1r6P0Q2j15K40m47M02k19P5K1j44m0K06J05k07L19k17m4r0Q2N7j97
8036a74L70j48j83K29k40M37k52J00j21m98N60k52J04P1O6j67N45j23k69l08R5
8057a58K62j20j14K71j89nJ68j48K69n47P1L47N7j71o8nn7J93K36l99k01P24n67
8080a51J18j74Q8K60l44N0l0Q9j36M48j87j18J43%r0J03J12m29J49R8Q9j58Q6
8103A6J84j27j81k8P2j02O7l7J52J38j58N7Q5r1n9R8L3j62n3J5K65j92o5M4k72
8128c01Q2L34j20L20k92%J8K1m8L01l68j24J21J94j54J31m1k10o9J17L08l68K24
8151G6k91K47j42j07M67k89K58j93N7K1k08J16j65r4J88j0o4P6KK51k04j18K32
$$ y = [79, -32, -303, -126, 223, -41, 4, 209, 21, 241, -125, 54, -103, 85, -77, 341, 262, -120, 155, 74, -121, -459, 34, -17, -113, -43, 39, -76, 164, -283, 119, -100, -25, -4, -148, -188, 18, 123, -84, 235, 18, -26, -116, -34, 23, -174, 196, 48, -135, 94, -146, 291, 39, 139, 18, -480, 80, -172, -68, 3, 69, -98, 447, 324, 55, -253, -158, 104, -16, -130, 141, -48, -53, 115, -33, 236, -311, -240, 107, 164, -7, -75, -80, -137, 56, 292, -107, -308, 416, -151, -33, -207, -119, 141, -203, -153, -183, -94, -230, 218, 31, -87, 56, 56, -34, 69, 181, -248, -99, -1, 88, -70, 16, 200, 73, -108, -136, -64, -166, -99, -136, 16, 154, -4, 53, 138, 47, -12, 86, 119, -43, -96, -81, 184, -8, -73, -29, -301, -219, 115, -5, 315, 23, 23, 41, 62, 14, 315, -53, -177, -56, 138, -16, 115, 74, -136, -205, -88, 220, -148, 76, -215, 32, -110, -217, 250, -39, 219, 26, 83, 104, -104, 12, -153, -247, -59, -69, -133, -57, -55, 196, -8, -126, 106]
8174A06Q6k82J77l40L7K15K0K82k10j43j6K05j35j64J78J60l4
$$ y = [106, 192, -90, 87, -253, -216, -1, 19, 301, 91, -52, -68, 137, 2, -162, 16, 176, 142]
8191A42
$$ Imaginary data points
##PAGE= N=2
##DATA TABLE= (X++(I..I)), XYDATA
0@%%%%%%Qj6J6j9K7l2M0n6O4p2R5j16J33j59J85k14K51k89L32l82M36m96N65o38
30c37P17q08R07j016J135j265J408j563J735j926K134k362K616k898L209l557
46a871L951m399M910n500O195p025Q034r295J0930j3137J6298k1252L0193n1450
60c3418J94023K24771k52296j87866m3941J67682J24811k0603j64114q7215O6266
71a1900J68864Q4110o0846j64482j13392P388J04785Q4424Q601o3750n4963Q549
83b612P1317M3267m4408j07578p1809K5570J03977Q5219j127o2020m0833J0129
95I092K2675j3519m3836k3949L2513N5300K1152j5358m941K1881R097m5925p8573
108e4391l3211O4249J08049M1229o0993q2999q862O9205N5861m1663j11877o5525
$$ y = [0, 0, 0, 0, 0, 0, 0, 8, -8, 8, -11, 16, -16, 24, -32, 32, -40, 55, -61, 72, -87, 98, -116, 135, -154, 178, -204, 232, -264, 301, -337, 380, -428, 479, -537, 598, -667, 741, -822, 913, -1013, 1121, -1241, 1375, -1523, 1686, -1871, 2080, -2319, 2591, -2909, 3286, -3739, 4295, -5000, 5930, -7207, 9091, -12161, 18032, -33418, 160605, 385376, 133080, -54786, -98727, 68955, 193766, 173163, 9049, -78166, -11900, 156964, 241074, 180228, 15746, -97646, -90258, 14527, 98951, 107552, 43802, -11161, -2612, 68705, 111972, 67564, -40014, -111823, -86253, 17724, 102943, 101816, 39796, -1037, 9092, 31767, 18248, -25588, -49537, -17024, 38276, 59428, 44070, 39129, 61010, 70107, 24182, -54391, -87602, -23353, 84696, 125925, 64932, -18067, -26929, 42276, 98137, 56474, -55403, -120928]
120a20928N2966J23807Q2431k5171j03103q6361K268O8896N0011k5503q1069n4523
132a16279M2519J18893Q1031m7708j43666j09315K5473J27647Q9466m3779j16397
143i2115m5636Q3750J22355K1706j14667j40686k5120J06956J19912K0445p2384
154a5484o7276J1940O8408L6543m2395p5740l3032L5458P0742M9994K11l3452
166E917l0401q081P519Q194m808j4781k202K9831M3283J8717k0778m0241k4465
179c2296O814J3132r240j4431J6967M9677L5848j9166n9591m0662J8648M2542
191H242Q34m8035l1852L6739Q0275M1539m6931r2695m5709L8160O7053J8639m1310
204a5051m5504J2259O5010N0175k1675p5428o1983J113N8653O1774J1444l7812
$$ y = [-120928, -67962, 55845, 138276, 113105, 10002, -76359, -74091, -5195, 44816, 19313, -61756, -116279, -73760, 45133, 126164, 78456, -65210, -174525, -149052, -21405, 68061, 24282, -92115, -137751, -54001, 68354, 90060, -24607, -165293, -190413, -83457, 36455, 56900, -15484, -82760, -70820, -2412, 34131, -8264, -84004, -117036, -81578, -10836, 39158, 39369, 5917, -24484, -32565, -25046, -16852, -21660, -36441, -38643, -8812, 34471, 53188, 32410, -7831, -32296, -25482, -12350, -21590, -36021, -19054, 30623, 66471, 47305, -12286, -52948, -34300, 8242, 9076, -38959, -70811, -34072, 46203, 87742, 40811, -51884, -97593, -59433, 7620, 26259, -15051, -60555, -48296, 16714, 66889, 45214, -30214, -92197, -91084, -32431, 29343, 40787, 2975]
216B975l6989P630M4894L3105k3810p1997m9728K8883Q8474O4564j6276p4426
228b701m7761L1546O6750J4090o1933o8215P216Q2517P8219n110p5915n9744J0865
241c0176N0542K2610k9447m3187k133M8172M9614L678m0006m6914j9370J4052
253b2565K5550R366j0342j0054Q006K2197J6939j1615m0702l6724J552L3323K9872
266A4803J093j9774q659J9435K1219j4135m4802l1381J5047M6063K9893j3165
278A5637l1022q62L2750J9441k8653n4452k3156L6060O0744K2955l0821l9722
290b1101n79L4780K2711k2059m9567k6322K8446N7760L4505j3410m3868l4846
302c3550M922L3812K0810j9582m1179j7051L5270O3742K9895m0781p5318l6225
$$ y = [2975, -34014, -26384, 18510, 51615, 27805, -44192, -93920, -65037, 23437, 88001, 71725, -2701, -50462, -18916, 47834, 61924, -9, -68224, -61008, 21509, 99728, 94618, 18703, -41041, -30176, 20366, 42976, 13529, -29658, -31791, 16381, 65995, 69673, 29667, -17247, -36617, -22565, 2985, 12351, 2009, -8045, -39, 22158, 39097, 27482, -13220, -49944, -48392, -15069, 14803, 15896, -3878, -12537, 6898, 28117, 13982, -30820, -62201, -47154, -1091, 28802, 15637, -15385, -16247, 16503, 35944, 7291, -47161, -70317, -34257, 26487, 49442, 18621, -21101, -21680, 13100, 35811, 13752, -35815, -62137, -33691, 24069, 58574, 45164, 1296, -33550, -28628, 5184, 25994, 6412, -34767, -51818, -16548, 47194, 77089, 36308, -39010, -75235]
314g5235L4445O3014K1653m2767n3300M828O4432N2485j8886p4347n7637J3141
326f8174O4404M6193j4523m4572j9393K4670L7991N346l6707m3196q290L0168
338b6083L8490J8704r403k2465j3496M630Q614j785j2273j2068M190K3018K4569
351B4642L031j7808j7847l167N058j957j1247l686K0933L0299O385k4714k7789
364a7867p11K3694J4352k0992l5404k370M4193M8578L484m7448m9895m208M1143
377c451L6306r500m0712k3619K3463N1673K9296k6161n8983l6510J6806M9477
389H085L5928j0468m1540k6099K2103M6346J9975l3341n9698k8318L5546O5881
401C4400L1061l0569n4161k0609L2803M4432P33m7131m1740J0288N0898M1022
$$ y = [-75235, -40790, 22224, 43877, 1110, -52190, -47362, 17070, 69555, 50669, -23678, -81315, -68174, -3770, 42423, 27900, -16672, -36065, -11395, 26596, 31942, -4765, -47961, -56251, -26083, 12407, 31111, 21708, -757, -14253, -9623, -1009, -2794, -15067, -27135, -22945, 73, 24642, 27673, 9865, -7982, -11149, -6091, -8048, -19295, -22981, -2048, 28251, 34636, 9922, -17867, -18578, 5116, 19468, -1524, -36928, -39298, 4895, 53473, 56957, 9509, -40386, -44594, -3451, 32855, 23355, -17357, -40976, -17513, 34160, 63456, 37295, -21688, -58198, -41392, 8085, 44013, 33545, -7995, -34094, -11991, 34355, 54330, 20989, -38709, -67027, -31481, 34400, 65461, 34892, -19269, -39878, -7075, 37357, 38090, -9041, -50781, -40493, 10405, 51427]
413E1427n407m0489l0865M906K2819R959j0735j4579L15J6367J7895L029j1049
426A3593j3844r066k826L135N496N341P506Q422L167p113j2016r269J313R885
440C724M592p895q436Q416K3762J8212j0632l6381k8908Q635L8467K6614j2630
453B7540l4552j5434K6234M1438P309m1925n0392p987M2055M9765Q728l6998l9050
466b3269L14L4791K6950j1317m0979l0393J1942M3952L4265n220l7833l3640j50
479c0587L0540K5379r701l3621j9252J9112M0813K1670k1867m2666k0515J8322
491b2373L0987R823j6619j9684L470K4346J6218j0808k5063j3720P295J6573Q136
504H581n411m948O635J0106m46j3436j4437k166J1767J2377l67r151k394Q828
$$ y = [51427, 46020, 5531, -25334, -20428, 2391, 12350, 1615, -12964, -12649, 3718, 21613, 24642, 13593, -251, -9317, -12143, -9008, -3512, 1829, 9335, 17757, 20924, 13811, 1795, -7474, -6161, 3724, 8316, 421, -8015, 401, 24163, 42375, 31743, -4638, -33546, -24911, 13556, 40170, 27540, -7012, -22446, 3788, 45226, 52535, 10610, -39782, -47769, -5714, 44051, 52779, 15781, -23269, -22955, 11836, 38786, 27469, -13510, -43903, -31961, 11991, 46256, 41036, 3203, -30437, -30587, -47, 25332, 15631, -17990, -37242, -18130, 22683, 44353, 22486, -20180, -40695, -22373, 8614, 18437, 1818, -17866, -14396, 9950, 26168, 15360, -9703, -23423, -16128, 445, 8581, 3170, -1778, 4857, 14963, 14517, 1081, -13356, -15522, -3755, 8622, 8255, -896, -3290, 5538]
518E538J0938J46j6419k0832n881J5515K3001Q640j2244k0794o393J5656J8920
531A5791l626k7576k5129N412L4731L0883n650l6893k7415Q741L1364J6211j8480
544a636l3806r315K7998L7564Q899k7034l4904r506K2327K7163L476k0734j8141
557b7649N535K5252K0400n633k7472k2237N039K4231J9750k026j7260j0718R591
570c197J9136N153j5654k1222n290J7601K2407N305j4170j2893L150J2710M963
583A7999j1999j7307k511J7096J7682P00j4486j0542L481J1391J973j3059j3866
596a3448K038J7241J5470r02j4607j4479Q62J2524P694p156j3850n152J2135K1111
610A9481R116j3317k2792r106J2594J9735O133j4618j7563L584K3546J9302o061
$$ y = [5538, 16476, 16622, 203, -20629, -26510, -10995, 12006, 20646, 8402, -12392, -18785, -3129, 15791, 12165, -15411, -40540, -35128, -397, 30486, 24836, -12057, -39472, -30731, 633, 16844, -1636, -35442, -44757, -16759, 20805, 29704, 2670, -32234, -41740, -19413, 7750, 11226, -9508, -27649, -22114, 3138, 23538, 17905, -9567, -31804, -26765, -2534, 17216, 15190, -2070, -12788, -3197, 15939, 21092, 5438, -15784, -21074, -3473, 18934, 24239, 10069, -2824, 326, 13036, 17999, 6000, -11307, -13818, 3278, 20960, 21660, 7174, -3368, 113, 11504, 13477, 418, -13448, -11410, 5831, 21301, 20399, 5792, -8687, -7825, 4699, 12393, 5237, -8613, -13765, -1630, 19481, 28597, 15280, -7512, -16618, -4024, 15711, 21844, 7226, -10337, -6753, 16793, 36095, 30034]
623C0034k5787k0245O928K6563J7807q285k1978q823J5316K3166M963k1593k5233
636g167k617K2037K3052K868j8059j7181J872J7670J0417r026k0150j0672Q341
649A385K1258J1846q654j8812r750O267J3328L741j2668j4764J35J5873J4581
662B3766k017j6900j4611J073J3730O498p420j1398pJ1404J2417k086j4207j1943
676a1701K197J1281O081m603q948n87J0927J1908k856j4343j1674K306J3692J0324
690A4004l508j2459m774R751J3182J942j3688j7149l409J5186J7760K686j4299
703E225j5120J53J5615J3183p546k2294j3554R526K3313J3019j0507k3354j1484
716b3825J2002J9284L780j6809j9151j654J9290J9404q83j9597j8074l43J5400
$$ y = [30034, 4247, -15998, -9070, 17493, 35300, 27015, 5037, -3786, 11530, 34696, 39659, 18066, -7167, -9784, 12253, 35305, 38173, 20114, 2933, 4805, 22475, 32892, 23866, 3716, -6956, 1385, 22643, 34489, 25835, 7023, -2727, 3540, 16868, 20609, 7941, -6823, -6688, 9185, 23766, 21749, 4849, -9762, -8689, 5041, 11539, 4119, -7279, -7286, 4118, 16535, 14449, 242, -11701, -9504, 1777, 7858, 3255, -5693, -6280, 4647, 16555, 13699, -644, -12318, -10012, 3680, 14004, 10496, -1963, -6737, 3014, 16196, 18138, 4450, -12699, -16108, -922, 16838, 19524, 5225, -9895, -9742, 5873, 19056, 11510, -10784, -24338, -14812, 8501, 21520, 11013, -12341, -23825, -11823, 7461, 11241, -5568, -24719, -26373, -7083, 12321, 11438, -8159, -26233, -26576, -11176]
729a1176J3853k347j5932r569P342J6616Q718p748j7164r367Q030J4587O423o775
743d509r616j050R799R278j799j1161p558L541R929P071k415o981j732O700N489
758D986l326r031m852N350J1194M697o843q932o5R354O743m768j3134q234P367
773i494J5477P109p642j4564o032Q156J3251L513j2480j5327j303J5907J6309
786A2880J088j7520j7751J103J6353J4677l273j7349j2151P736K0364J1299r754
799G702j9893j0923R346J9309R213r741j6296l983J2408J5944K654j3250j5942
812a3452l38J3947J3859L48j0960r841K073J0718O190m916r620m532N749R468
826H693L872m311p903j390M455L492k183n749l138M575P254R01o672n886J042
$$ y = [-11176, 2677, 330, -15602, -25171, -17829, -1213, 7505, -243, -17407, -26774, -18744, -4157, 2266, -4509, -14125, -15175, -5376, 3902, 2103, -9058, -16616, -13075, -3146, 3925, 1510, -5471, -7203, -503, 4986, 1660, -7371, -12223, -6873, 4321, 9018, 2175, -6757, -6822, 2532, 9275, 4507, -8627, -16861, -9494, 5983, 13092, 5450, -9114, -15146, -6990, 6261, 9774, -2706, -18033, -19336, -3429, 12880, 13968, -3552, -21303, -20200, -3847, 10830, 7557, -9792, -21943, -14207, 6157, 17456, 7702, -12191, -23114, -13768, 5541, 14754, 5013, -11283, -15266, -2858, 13086, 15740, 2490, -13452, -13790, 157, 14016, 14364, 3404, -6437, -4364, 6354, 12544, 7628, -1992, -6524, -775, 8693, 12565, 8254, 351, -1039, 3416, 6908, 4725, -1024, -4162, 413, 7667, 8568, 1896, -3990, -2948]
841b948O221L128m821q947j964Q730R457J7j0197j0458O46J0245R273l537j2415
856g570p209N864J4514Q027p700j6760p491R173J5443O089r718j4944l183J2899
870b566J5118J285j4151j4550m63J4501J4668q73j3997j2019K822J3758J0382
883A3915m386j5394r042O788J5045P633o675j3791n520P429J1018J987q366r551
897h910p73Q419Q557j94q707o529J114O471M078l080n492k172M374N459l20n775
913c480m198J607N271K670m048m635K23O504M340j773o934n295L344Q448L568
928E612m674q200j842P259R291J206r651r944J317J0291R866j435j1339q914M006
943g151J2506O872n723j2956n950O948J3898N492p947j2895m014Q240J2223K737
$$ y = [-2948, 3273, 6401, 1580, -7367, -9331, -601, 8856, 8873, -1324, -11782, -11136, -891, 8382, 4845, -7570, -14779, -8915, 5599, 13626, 5926, -10834, -18325, -9152, 6291, 12380, 2662, -12282, -15465, -2566, 12552, 13837, -314, -14864, -15327, -826, 13842, 12969, -1028, -13047, -10225, 3533, 13915, 9529, -5865, -14907, -8119, 6926, 14559, 7884, -5907, -11427, -3998, 7020, 9007, 641, -8910, -9683, -1264, 7293, 7099, -1608, -8137, -7023, -552, 3526, 446, -5046, -7218, -2844, 2615, 2295, -3480, -7678, -6071, -800, 1870, -2178, -6813, -6590, -86, 4254, 2481, -4453, -9748, -6404, 2044, 5612, 938, -7262, -9104, -1845, 7446, 8652, -999, -10943, -9626, 665, 10531, 9096, -2243, -11157, -7151, 5355, 12227, 6504, -6452, -12402, -5454, 8444, 13936, 5989, -6906, -10920, -2680, 9543, 12280]
957A2280j0726j1702n25J1210J0796l5j1129j0968J919J1652Q205l692j0840o149
971i704M125J0730N232o085r803k884N349Q301K089n563p425J68O923N474k214
986D713n887m469K588N738L020l854m937J82M334L966j514n451k980L830N460
1001D739Q38m383m828K76N129N119j873o863m036L544P453L788m660q439k925
1016g121O802Q322J017q098q042K51R026Q705k498r936o925L024R960O987m177
1031G297j1218n448N654J0648M461o362j1008l723P995J0626J584q275r635n35
1045g939Q932Q802r78r521p521J815R157O381k948r284n204M239Q116M067m597
1060C517p761k758N054O936P71n585n487p9N684M464j790n474k204K580M502J055
$$ y = [12280, 1554, -10148, -10673, 537, 11333, 11298, 169, -10799, -8880, 2772, 10977, 7285, -3555, -9704, -5579, 5151, 10383, 4298, -5505, -8389, -3040, 5261, 7350, 1787, -5638, -5470, 1453, 6927, 4713, -1174, -5643, -3055, 2683, 5703, 1849, -3088, -2906, 1428, 5394, 3880, -1571, -4551, -721, 4739, 5577, 1194, -3634, -3358, 1771, 6890, 5017, -1846, -5882, -2338, 5115, 8903, 4243, -4196, -7121, -319, 8003, 9020, 922, -7120, -6869, 2157, 10862, 8364, -1572, -8497, -5473, 4487, 11474, 7297, -3921, -9369, -3715, 6933, 11394, 5032, -5976, -9699, -1704, 8922, 10506, 2231, -7404, -7939, 993, 9795, 8817, -704, -8225, -6410, 2747, 9128, 6180, -3104, -8308, -4069, 4047, 8114, 3517, -4244, -7002, -1948, 4988, 5759, 174, -5313, -5392, 292, 4756, 2966, -2508, -4712, -2132, 2370, 3425]
1076C425l435l868M35M006L088j774m222k065K615M591J017m212m806J105N651
1091A551M265k061o412l779K987P948K088n294o747j521N743P676Q03p625p256
1106g634M20P976O806j427q577p040K803R797N424m313r657n754N488J0022M235
1121H569o857q978k833O512Q776J380p591q198k18P797P316k14p409o926J117
1136g757P966N358k487p284m031L393P217L513m365n906j843M238N147O41l790
1151A0l839J002M604K293j238l796k204K382L757O25l067k276J132L665K052k742
1167B360m297j280L995L969j55m214l536J438N129K969k917o205k860L658O137
1182D191K901m122p411j423N918O345M32o859p207J72Q465P123j526q203o135
$$ y = [3425, -10, -3878, -3443, 563, 3651, 1877, -2345, -4410, -1795, 2796, 3813, -399, -5205, -4100, 1551, 5816, 3755, -2657, -6436, -3449, 4499, 6587, 1293, -5454, -6975, -1232, 6444, 7247, -378, -7634, -7214, 762, 7568, 6141, -2436, -9476, -6673, 3124, 8548, 4235, -5422, -11176, -5688, 4334, 8569, 1712, -7266, -10099, -3587, 5189, 6569, -1022, -9220, -9438, -1641, 5675, 5461, -1948, -8874, -7757, 209, 5567, 3080, -4204, -8235, -4842, 2375, 5888, 1523, -4383, -6226, -1988, 3159, 3800, 10, -3829, -2827, 1777, 4070, 2832, -964, -3168, -786, 2971, 3596, 529, -1747, -615, 3050, 5102, 2360, -1937, -3217, 778, 4747, 4592, 378, -3158, -1720, 3409, 6378, 3461, -2744, -5604, -1946, 4191, 7092, 2970, -4441, -5864, 54, 6399, 6831, -28, -7235, -7063, 1402, 8525, 6999, -1204, -7339]
1197g339K286Q446N258l272q855l912M951Q655L646m888q526l023N696P570K235
1212H928n556o968o03O289O946m13o750n496Q99O030N059j981n352k974K562M873
1228E493J637k992m717j505L274L966j01k810k817J057K194J823k593l339m51
1243a881L194K417r37k887k067J612L427K55l454l608L69M055L688o14m923l525
1259d879J355M731L356k451o245k612M135O940K511m315p466j842N110P223N03
1274F054n903o412Q00O928O039q96p518o356J468P943M828j888o988m455L087
1289c269P369K940m374p502k444M320O754J978m559n639r25M444M161m88m977
1304b211m147J030M695L343j604l646k589J201L264R15k318l179L31L145K593
$$ y = [-7339, -5053, 3393, 8651, 5379, -3476, -7388, -2437, 6218, 9864, 4976, -3550, -6573, -877, 6693, 8928, 3372, -3596, -4199, 2090, 9036, 8623, 1873, -3623, -2724, 3306, 8365, 6384, 1032, -1942, 620, 5493, 7130, 4138, -579, -2084, 1190, 5156, 5055, 2245, -572, 485, 2679, 4502, 1909, -1430, -1881, 1313, 3730, 2793, -94, -2161, -549, 2878, 3133, -321, -3929, -3560, 495, 4183, 3569, -1354, -4879, -3524, 1207, 4563, 2112, -4133, -6745, -2610, 4330, 6841, 2526, -4940, -6782, -1672, 5551, 6054, 151, -6261, -5461, 1467, 7506, 6610, -908, -7264, -5796, 2147, 6975, 5087, -1901, -6356, -3269, 4100, 7040, 2666, -4836, -7280, -2960, 3794, 5772, 1213, -4426, -5351, -907, 3254, 2766, -2211, -6358, -5328, -633, 2710, 1106, -2540, -5129, -3928, -664, 251, -2067, -5246, -4915, -1770, 823]
1319H23q00l054k111J924K575k02k134j767J101L738K466j623m035j493J905L689
1335A002J278k955l887K04M770M289r92n217m073J384N711L302j961n565k160
1350d870L014N722K399m290o753j648M442O182J743m405n888p40N143N018r00
1365D169n955n299J906N877M998j874o169l339K171N182K302l232n292j184L911
1380a828N149Q17l672m250o49L094L674l11l325k091J866L936J544j904l974j240
1396c164K282K612N35j780k008J052L212J434k197l277r74J772L434N23k646k337
1412a527J054L000J963k047m199k015K280N125R90k811l937k70L067L442j128
1427B987m539l450J370M849L568j203n067l311K414M413J630l004m869j482M071
$$ y = [823, 23, -3031, -5142, -3218, -643, -845, -2979, -4746, -3645, 93, 2559, 936, -3099, -4592, -2687, 1002, 2280, -675, -4562, -4358, 412, 4701, 3709, -1508, -5581, -4197, 1514, 4816, 2855, -2710, -4870, -1856, 3866, 6265, 1975, -4778, -6426, -1984, 4198, 5941, 1536, -4352, -5092, 51, 5069, 4169, -1786, -7085, -5179, 698, 5696, 3822, -2347, -5686, -3515, 1667, 3969, 737, -4555, -5739, -1828, 3321, 4138, 466, -3784, -4433, -1339, 2335, 2024, -1301, -3392, -1526, 2410, 3954, 2050, -1924, -3164, -882, 1730, 2265, 485, -1523, -471, 2741, 4175, 1978, -1299, -2273, -501, 2933, 3456, 810, -1527, -473, 2527, 4490, 2443, -1756, -3771, -1491, 3634, 4624, 1813, -2124, -2394, 673, 4115, 2987, -1552, -5002, -3632, 1217, 4785, 3582, -1485, -4796, -2382, 2031, 3661, 657, -4212, -5694, -1623]
1442a623N625O63m285n252l79M265L922k79m615l104K076N202K729j926n428l234
1458e643K477M872J960k559l688p70L056M265j25m217l784K57M254L059r31l510
1474a027j892J730K876R97k728k803j97J984L152N78k419k374M53J974R21j683
1490d58k585j115L067L055J83k277k658KK628J746j776l041j048K699L789R23
1506C134k721m097k08K887L015n15l395k647J953M521K963k763n182k133K413
1521b775M524J909k574m249n94L771M213Om526m347k56N055M097p8m410l215Q47
1538b602M510K396j999n252k013K613N005K621l335l884j189K641K932Q1l016
1553d91l027M27L913K563n84l393j664M58K342J034j286k308J66K430J521o6k173
$$ y = [-1623, 4002, 4665, 380, -4872, -5251, -986, 2936, 2657, -1958, -5062, -2986, 2216, 4945, 3019, -2409, -5643, -3166, 1706, 3666, 1107, -2581, -3351, -295, 3970, 3845, -372, -4156, -3899, 355, 3414, 2483, -1027, -2919, -1189, 1687, 2684, -44, -2847, -3044, -1060, 2092, 2670, 251, -2123, -1670, 304, 1225, -458, -3043, -4158, -1091, 1964, 2147, -130, -2788, -2786, -158, 1588, -188, -3229, -4277, -1578, 2211, 3134, 413, -3684, -3892, -1005, 2010, 1495, -1900, -4547, -2594, 1927, 4890, 2127, -3055, -5188, -2775, 1749, 3658, 1084, -3165, -3759, 12, 4225, 4231, -295, -4642, -4898, 157, 4254, 4176, -234, -3449, -2602, 1908, 4304, 2305, -2947, -4960, -2347, 2658, 5279, 1944, -1940, -3129, -488, 2444, 2525, -491, -3518, -3091, 822, 3385, 2801, -592, -2256, -1798, 544, 1578, 292, -2016, -1850, 580, 2101, 2035, -138]
1570a38j714K47J730J125j381j479P37K189J323m34k976k057J356K172J742j296
1586A146k434o89K680L176l55l535l800L22M196L438n03m286k614J332M424K217
1602D715k620n027k045L499M728J953k772m093j921K689M161M83l509m015k46
1617d020M319M284N5m267m125Q12L586K441r36l264k295J980L634J588k057l396
1633a661j614J592L096R83j888j782M36J665J344m39k856j385J439J572Q09q80
1649D31j126P92J348N74j782k223m77K179K021r7j671j414O27K159J435k059k672
1666a955j788K107L687J916k034l849j027K504L189m1l531l430Q84L662M084q36
1682C542l531l580J60L738L101j335l759k339J863M223K382k163m536k263K209
$$ y = [-138, -1852, -1605, 125, 1250, -131, -1610, -873, 1316, 2639, 2205, -771, -2828, -1472, 700, 2442, 1146, -1288, -1977, 703, 3879, 3524, -11, -3811, -3489, 707, 4145, 3642, -644, -3258, -1926, 2498, 4715, 2095, -2932, -4977, -1478, 3250, 5203, 2431, -1662, -3583, -894, 3267, 3750, 241, -3774, -4020, 299, 4583, 4638, 371, -3754, -2942, 644, 3085, 2149, -1115, -3410, -1430, 2204, 3792, 1735, -1661, -3275, -1683, 1413, 2396, 508, -1274, -838, 827, 2171, 1732, -1124, -2509, -1070, 502, 1311, 431, -695, 97, 1445, 2019, 237, -1986, -2463, -284, 1737, 1640, -31, -1445, -818, 1341, 2776, 717, -1955, -3743, -1636, 2051, 3967, 1933, -1916, -2943, -439, 2750, 2709, -822, -4252, -3368, 294, 4378, 3542, 11, -3569, -3409, 329, 3430, 2095, -1664, -4003, -2140, 2083, 4465, 2302, -2234, -4497, -2288]
1697b288L877J437j835l440k72K792K664k99l186k696J53K746K442m2k103j729
1713a779J079J737O40j528k351j98K133J565N2j445r56Q07J508o68j298j250M00
1730a552K362J248n67j804j555R65J533P00j350k505j21K322L426J43k622l187
1746b564Q2K758J866p55k664j790J522L747J527j966l439j912J675L600J202k122
1762G67k591p82K653K909j48l224l224K64L302K634R6l016k254J342K775J258
1778B761j760k909j155J815K774J155j867k146k87J660J441l90k156j166J090
1793a140K298J380q74k551p95J196J530M2j711j251O38K399J375r47k169j112
1809a692J091J462N18j032k096J64K562J688o82k515k021O11K599J711j294k038
$$ y = [-2288, 1589, 3026, 1191, -2249, -2521, 271, 2935, 2636, -550, -3246, -3093, -347, 2095, 2053, -50, -1779, -700, 1037, 1677, 149, -2202, -2400, -267, 1298, 1350, -95, -1051, -244, 1264, 596, -702, -1952, -1552, 810, 2058, 1491, -313, -1868, -903, 630, 1330, -20, -2525, -2646, -324, 3102, 3245, 623, -2564, -2482, 276, 2142, 1387, -1277, -3067, -1545, 2202, 3729, 1763, -1676, -3588, -1913, 1687, 2889, 767, -1824, -2606, 47, 2956, 2808, -416, -3640, -3376, -74, 2560, 2656, -360, -2614, -1272, 1503, 2761, 1001, -1908, -3063, -1248, 1526, 2681, 814, -1332, -1619, 41, 1482, 1092, -1064, -2230, -1140, 1158, 2538, 1664, -887, -1682, -486, 1044, 1086, -625, -1876, -1238, 1161, 2536, 1589, -580, -1692, -601, 861, 1379, 347, -1749, -1585, 977, 2665, 1983, -532, -2553, -1942, 657, 2368, 1074, -964]
1825i64q05J631K557Pk435k638m09K734K180N8j918j339K12K205J407j575k812
1842a904j225J835K680R94j426k223n45J610J920m93k189j516P65K782J777j002
1858A840k394j644R36K301N81j193k417k15K157K529K33k662k223k65K508J744
1874A816o65j837j243J531K439M57j772k359r98J783J920M84j316j539J35J814
1890F50J273q47j956j604Q86K216J094p27j907m71J377J078k15j485j456N95J613
1907A14J822r27j616r06Q64J581k96j081j428M17J912J835p04k064j671Q15K092
1924G59R41j348j856p21K498K139L3k247k356j60K110K291m63k234j567J152K377
1941A348J643j218l406j287J207K922R98j159k373o61J811K228K4k339k152P1
$$ y = [-964, -1769, -138, 2419, 2426, -9, -2647, -3056, -322, 1858, 1916, -2, -1341, -1129, 1076, 2483, 908, -1904, -3129, -1294, 1386, 2380, 954, -1269, -1814, -204, 1716, 1223, -966, -2482, -1717, 1065, 2842, 1840, -554, -2198, -1262, 1039, 1620, 427, -1990, -2205, -48, 2481, 2714, 52, -2171, -2436, 72, 1816, 1151, -686, -1929, -398, 2041, 2498, 726, -1633, -2631, -848, 1072, 1556, 240, -1299, -1164, 650, 1923, 1076, -880, -2484, -1598, 618, 1712, 985, -922, -1393, -16, 1062, 847, -638, -2094, -1499, 114, 1936, 1009, -607, -1513, -649, 932, 636, -445, -1873, -1456, 456, 2291, 1587, -477, -2148, -1333, 759, 1700, 352, -1504, -2225, 273, 2412, 2445, 198, -2158, -2318, -208, 2083, 1620, -614, -2181, -1029, 1348, 2991, 1773, -1633, -2920, -1713, 1209, 2207, 1048, -1325, -1986, -175, 2053, 2077, -262, -2414, -2343]
1957b343K130K023J82k060j165L16J457J010j081j599r29J090K305M85j118j288
1973e85m85O39J322o72r10k56P37J093L95n89j167l14J132J55m32p33n28J084
1991a14J609M84j603j913m40J895J509N7k143j011P77K333R77j145k857r29Q23
2008a691K260J917j580k293m96J931J905O06k431k750k06K342K599Q7j874k646
2024b320O07K238J371p93k246j564J023K290J828o74k126j445P48J755O18j017
2040B93j640m2J378J572l24r56j432M3P95J092q25j97k28P89M93j65r81p76P32
2059c79N74K02j54n55j65J238J004r45j529r45N94J565Q97p17j490q48J427K063
2077A837j0j853j989k57K191K186q2j949j655M71J398J677n65k186j555J129K045
$$ y = [-2343, -213, 1810, 1992, -68, -1233, -917, 540, 1550, 469, -1130, -2059, -969, 1336, 1821, 703, -585, -1070, -431, 891, 219, -691, -947, -210, 883, 1278, 689, -478, -792, 340, 495, 63, -670, -1198, -114, 1495, 1979, 376, -1537, -1977, -82, 1427, 1484, -659, -1670, -893, 1440, 2417, 1272, -1585, -2514, -1691, 569, 2486, 906, -1387, -1883, 48, 1953, 2559, 128, -2622, -2828, -486, 2113, 2200, 326, -2320, -1713, 525, 1896, 1103, -1143, -2707, -1684, 606, 2434, 1760, -366, -1811, -1063, 692, 1310, 293, -1347, -1389, -11, 1561, 1237, 281, -1151, -1108, -313, 779, -46, -243, -471, 318, 811, 646, -335, -1111, -379, 195, 397, 243, -312, -477, 761, 1765, 820, -709, -1654, -1060, 505, 1402, 685, -805, -1653, -226, 1837, 1827, -26, -2015, -2272, -81, 2105, 2023, 74, -1581, -1110, 288, 1965, 1400, -786, -2341, -1212, 833]
2094H33J652m43k614j572P77K492Q17j721j497q40J956J979P7q85k443n8J245
2111b45J518%j031j457N16J543Q57j405q44r82N82J304L63o39k06P7L31P09o06
2130C85j343O7Q36Q65k45l06n02M9P33O91q42j523k12P58J509P18j103j489j39
2149a093J086J350k62j664j488J252J629J054m59j612j559P93J511Q73r32j890
2165a411m23J676J460L86j383j692m78J454J372Rr62j210L48J494R50o85j680
2182g75j187P73J308J292r81j147n21J097J139j4j219j090K11J448R07o44q71
2199b74o70P11R61J55j048j105M45J061J172m49r65q46O33M62N3k58r77n19J249
2218b09J381K90j158j235j47J192N39j3j400m90O07J438N30p38j413n70P68J088
$$ y = [833, 2485, 2042, -572, -2144, -1367, 1125, 1942, 221, -1276, -2116, -160, 1819, 1896, 1011, -1432, -1490, -245, 1273, 1273, 242, -1215, -699, 844, 1701, 296, -548, -1530, -948, 356, 719, 80, -126, -49, 282, 991, 385, -958, -891, -55, 810, 565, 259, -243, -194, 539, 1230, 388, -1135, -1347, -589, 920, 1638, 535, -954, -1093, -7, 1343, 1081, -583, -2071, -819, 810, 1864, 1405, -207, -1766, -973, 538, 1411, 479, -1411, -1834, -158, 1302, 1688, 305, -1387, -1865, -411, 961, 970, 8, -1202, -854, 640, 1590, 905, -775, -1962, -1189, 119, 1411, 430, -717, -1238, -141, 998, 984, -235, -1325, -1114, 334, 1241, 597, -274, -944, -233, 728, 883, -165, -1270, -825, 236, 1408, 959, -6, -852, -219, 243, 296, 38, -939, -1458, -209, 1172, 1462, 304, -931, -1078, 114, 653, 640, -760, -1250, -643, 795, 1325, 587, -826, -1396, -628, 460]
2236D60N54r05r34j41J348Q70k97j502j217M49J744R23p27q50q22J182P56q3j138
2255c30j000N7J362J090l25j071n23L77Q23M68q02j212l65J401R54L74q36j351
2273i09k41R46J113N8j654n07N59J231P31j18j787o92Q81Q01L04m83j330J89J331
$$ y = [460, 1014, 109, -825, -966, 382, 1252, 955, -547, -1764, -1315, 429, 1352, 625, -225, -1047, 135, 891, 808, -330, -1330, -1273, 89, 1179, 854, -217, -740, -363, 460, 928, 126, -1086, -1451, -50, 904, 1278, 442, -909, -1150, -204, 909, 967, -687, -1194, -635, 596, 1327, 1209, -578, -1270, -389, 412, 716, 233, -1097, -908, 423]
$$ [...]
8191F0
##END NTUPLES=NMR FID
##END=
