##TITLE=1H_CA-8668-2tfa
 CDCl3, 8 sc, 
 22.11.2019
##JCAMPDX= 6.0         $$ Bruker NMR JCAMP-DX V2.0
##DATA TYPE= NMR FID
##DATA CLASS= NTUPLES
##ORIGIN= UXNMR, Bruker Analytische Messtechnik GmbH
##OWNER= root
$$ XWIN-NMR		Version 3.5
$$ Fri Nov 22 13:59:41 2019 Russian Standard Time (UT+4h)  she@DPX200
##.OBSERVE FREQUENCY= 200.1315
##.OBSERVE NUCLEUS= ^1H
##.DELAY= (6, 6)
##.ACQUISITION MODE= SIMULTANEOUS
##.ACQUISITION SCHEME= undefined
##.AVERAGES= 8
##.DIGITISER RES= 18
##SPECTROMETER/DATA SYSTEM= spect
##.PULSE SEQUENCE= zg30
##.SOLVENT NAME= DMSO
##.SHIFT REFERENCE= (INTERNAL, DMSO, 0, 15.7039)
##AUDIT TRAIL= $$ (NUMBER, WHEN, WHO, WHERE, WHAT)
$$ ##TITLE= Audit trail, XWIN-NMR		Version 3.5
$$ ##JCAMPDX= 5.01
$$ ##ORIGIN= Bruker BioSpin GmbH
$$ ##OWNER= she
$$ F:/spectra/data/she/nmr/H-F/1/audita.txt
$$ ##AUDIT TRAIL=  $$ (NUMBER, WHEN, WHO, WHERE, WHAT)
(   1,<2019-11-22 13:58:02.06 +0400>,<she>,<DPX200>,
      <created by zg, POWCHK disabled, PULCHK disabled
       configuration hash MD5:
       00 E9 B6 7A A2 85 ED C7 34 08 36 98 17 FE 4E 26
       data hash MD5: 16K
       40 C9 1B 1F 00 2A E9 03 8F EF B9 28 9C 1A 8E 39>)
$$ ##END=
$$ 
$$ hash MD5
$$ 2F F4 02 DF 80 7E 32 C0 A5 8C 3E 08 55 F5 94 6B
##$RELAX= 
##$RELAX= 
##$RELAX= 
##$RELAX= 
##$RELAX= 
##$RELAX= 
$$ Bruker specific parameters
$$ --------------------------
##$DU= <F:/spectra>
##$EXPNO= 1
##$NAME= <H-F>
##$PROCNO= 1
##$TYPE= <nmr>
##$USER= <she>
##$AMP= (0..31)
100 100 100 100 100 100 100 100 100 100 100 100 100 100 100 100 100 100 
100 100 100 100 100 100 100 100 100 100 100 100 100 100 
##$AQSEQ= 0
##$AQ_mod= 1
##$AUNM= <au_zg>
##$AUTOPOS= <>
##$BF1= 200.13
##$BF2= 200.13
##$BF3= 200.13
##$BF4= 200.13
##$BF5= 200.13
##$BF6= 200.13
##$BF7= 200.13
##$BF8= 200.13
##$BYTORDA= 1
##$CFDGTYP= 0
##$CFRGTYP= 5
##$CHEMSTR= <none>
##$CNST= (0..31)
1 1 145 1 1 1 1 1 1 1 1 1 1 1 1 1 1 1 1 1 1 1 1 1 1 1 1 1 1 1 1 1 
##$CPDPRG= <>
##$CPDPRG1= <>
##$CPDPRG2= <>
##$CPDPRG3= <>
##$CPDPRG4= <mlev>
##$CPDPRG5= <mlev>
##$CPDPRG6= <mlev>
##$CPDPRG7= <mlev>
##$CPDPRG8= <mlev>
##$CPDPRGB= <>
##$CPDPRGT= <>
##$D= (0..31)
0 1.2 0 0 0 0 0 0 0 0.06 0 0.03 0 0 0 0 0.0002 0 0 0 0 0 0 0 0 0 0 0 0 
0 0 0 
##$DATE= 1574416681
##$DBL= (0..7)
120 120 120 120 120 120 120 120 
##$DBP= (0..7)
150 150 150 150 150 150 150 150 
##$DBP07= 0
##$DBPNAM0= <>
##$DBPNAM1= <>
##$DBPNAM2= <>
##$DBPNAM3= <>
##$DBPNAM4= <>
##$DBPNAM5= <>
##$DBPNAM6= <>
##$DBPNAM7= <>
##$DBPOAL= (0..7)
0.5 0.5 0.5 0.5 0.5 0.5 0.5 0.5 
##$DBPOFFS= (0..7)
0 0 0 0 0 0 0 0 
##$DE= 6
##$DECBNUC= <off>
##$DECIM= 24
##$DECNUC= <off>
##$DECSTAT= 4
##$DIGMOD= 1
##$DIGTYP= 9
##$DL= (0..7)
0 120 120 120 120 120 120 120 
##$DP= (0..7)
150 150 150 150 150 150 150 150 
##$DP07= 0
##$DPNAME0= <>
##$DPNAME1= <>
##$DPNAME2= <>
##$DPNAME3= <>
##$DPNAME4= <>
##$DPNAME5= <>
##$DPNAME6= <>
##$DPNAME7= <>
##$DPOAL= (0..7)
0.5 0.5 0.5 0.5 0.5 0.5 0.5 0.5 
##$DPOFFS= (0..7)
0 0 0 0 0 0 0 0 
##$DQDMODE= 0
##$DR= 18
##$DS= 0
##$DSLIST= <SSSSSSSSSSSSSSS>
$$ [...]
##$SUBNAM2= <"">
##$SUBNAM3= <"">
##$SUBNAM4= <"">
##$SUBNAM5= <"">
##$SUBNAM6= <"">
##$SUBNAM7= <"">
##$SUBNAM8= <"">
##$SUBNAM9= <"">
##$SW= 24.9337058887773
##$SWIBOX= (0..15)
0 0 2 0 0 0 0 0 0 0 0 0 0 0 0 0 
##$SW_h= 4990.01996007984
##$TD= 16384
##$TD0= 1
##$TE= 0
##$TE2= 300
##$TE3= 300
##$TEG= 300
##$TL= (0..7)
0 120 120 120 120 120 120 120 
##$TP= (0..7)
150 150 150 150 150 150 150 150 
##$TP07= 0
##$TPNAME0= <>
##$TPNAME1= <>
##$TPNAME2= <>
##$TPNAME3= <>
##$TPNAME4= <>
##$TPNAME5= <>
##$TPNAME6= <>
##$TPNAME7= <>
##$TPOAL= (0..7)
0.5 0.5 0.5 0.5 0.5 0.5 0.5 0.5 
##$TPOFFS= (0..7)
0 0 0 0 0 0 0 0 
##$TUNHIN= 0
##$TUNHOUT= 0
##$TUNXOUT= 0
##$USERA1= <user>
##$USERA2= <user>
##$USERA3= <user>
##$USERA4= <user>
##$USERA5= <user>
##$V9= 5
##$VALIST= <valist>
##$VCLIST= <CCCCCCCCCCCCCCC>
##$VD= 0
##$VDLIST= <DDDDDDDDDDDDDDD>
##$VPLIST= <PPPPPPPPPPPPPPP>
##$VTLIST= <TTTTTTTTTTTTTTT>
##$WBST= 1024
##$WBSW= 4
##$XGAIN= (0..3)
0 0 0 0 
##$XL= 0
##$YL= 0
##$YMAX_a= 413580
##$YMIN_a= -489681
##$ZGOPTNS= <>
##$ZL1= 120
##$ZL2= 120
##$ZL3= 120
##$ZL4= 120
##$ABSF1= 10
##$ABSF2= 0
##$ABSG= 5
##$ABSL= 3
##$ALPHA= 0
##$AQORDER= 0
##$ASSFAC= 0
##$ASSFACI= 0
##$ASSFACX= 0
##$ASSWID= 0
##$AUNMP= <proc_1d>
##$AZFE= 0.1
##$AZFW= 0.1
##$BCFW= 1
##$BC_mod= 2
##$BYTORDP= 1
##$COROFFS= 0
##$CY= 11.3945322036743
##$DATMOD= 1
##$DC= 2
##$DFILT= <>
##$DTYPP= 0
##$F1P= 16.9975609425685
##$F2P= -3.02152046262296
##$FCOR= 0.5
##$FTSIZE= 0
##$FT_mod= 4
##$GAMMA= 1
##$GB= 0.15
##$INTBC= 1
##$INTSCL= 1
##$ISEN= 128
##$LB= 0.24
##$LEV0= 0
##$LPBIN= 0
##$MAXI= 10000
##$MC2= 0
##$MEAN= 0
##$ME_mod= 0
##$MI= 1.114404
##$NCOEF= 0
##$NC_proc= 0
##$NLEV= 6
##$NOISF1= 3.799351
##$NOISF2= 2.8
##$NSP= 1
##$NTH_PI= 0
##$NZP= 0
##$OFFSET= 15.70392
##$PC= 1
##$PHC0= -9788.295
##$PHC1= 9.800862
##$PH_mod= 1
##$PKNL= yes
##$PPARMOD= 0
##$PSCAL= 0
##$PSIGN= 0
##$REVERSE= no
##$SF= 200.130013532006
##$SI= 16384
##$SIGF1= 3
##$SIGF2= 2
##$SINO= 400
##$SIOLD= 16384
##$SREGLST= <1H.CDCl3>
##$SSB= 0
##$STSI= 0
##$STSR= 0
##$SW_p= 3612.71676300578
##$SYMM= 0
##$S_DEV= 0
##$TDeff= 0
##$TDoff= 0
##$TI= <>
##$TILT= no
##$TM1= 0
##$TM2= 0
##$TOPLEV= 0
##$USERP1= <user>
##$USERP2= <user>
##$USERP3= <user>
##$USERP4= <user>
##$USERP5= <user>
##$WDW= 1
##$XDIM= 8192
##$YMAX_p= 0
##$YMIN_p= 0
$$ End of Bruker specific parameters
$$ ---------------------------------
##NTUPLES= NMR FID
##VAR_NAME=  TIME,          FID/REAL,        FID/IMAG
##SYMBOL=    X,             R,               I
##VAR_TYPE=  INDEPENDENT,   DEPENDENT,       DEPENDENT
##VAR_FORM=  AFFN,          ASDF,            ASDF
##VAR_DIM=   8192,          8192,            8192
##UNITS=     SECONDS,       ARBITRARY UNITS, ARBITRARY UNITS
##FACTOR=    0.0002004,     1,               1
##FIRST=     0,             0,               0
##LAST=      1.6414764,     0,               0
##MIN=       0,             -489681,         0
##MAX=       1.6414764,     413580,          0
$$ Real data points
##PAGE= N=1
##DATA TABLE= (X++(R..R)), XYDATA
0@%%%%%%qJ6j6K4l2L5m3M8n9P5q8J09j32J56j83K12k47K86l30L79m31M92n60O30
$$ 0 0 0 0 0 0 0 -8 8 -8 16 -16 19 -24 24 -35 40 -48 61 -71 85 -98 114 -133 153 -177 202 -229 263 -297 333
30C33p13Q04q99J008j127J257j399J555j730J918k122K351k601K880l192L536
$$ 333 -380 424 -475 533 -594 663 -736 819 -911 1007 -1115 1236 -1365 1515 -1677 1859
46A859l927M368m870N457o141O951p936R160j0733J2837j5817K0405k8473M6888
$$ 1859 -2068 2300 -2570 2887 -3254 3697 -4239 4921 -5812 7025 -8792 11613 -16860 30028
60C0028j65185o7911J39698j00841J08890L03568J65333k94320m04259j05833
$$ 30028 -135157 -203068 -63370 -164211 -55321 248247 413580 119260 -284999 -390832
70c90832K23665K08206R6556O9377M7501j42638k65643j31026J31272J97613J01437
$$ -390832 -167167 41039 137595 206972 254473 111835 -153808 -284834 -153562 44051 145488
81A45488L8753L7782p9208k44333k07509P3640K70411J78090l1016r1774n8739
$$ 145488 184241 222023 142815 -101518 -309027 -235387 35024 213114 182098 90324 31585
92C1585r7499j53523m2876J77587K53460Q6026j22661j78003j06477l1290L2129
$$ 31585 -65914 -219437 -262313 -84726 168734 254760 132099 -45904 -152381 -183671 -151542
103a51542J14113J59871R0917n2262j50463j43546o0852N1525J45179J57743N9415
$$ -151542 -37429 122442 213359 161097 10634 -132912 -193764 -142239 2940 160683 220098
114B20098q5411j62461j20681j8207O6094J08163J10262N6958m9490j45373j47689
$$ 220098 134687 -27774 -148455 -166662 -100568 7595 117857 174815 125325 -20048 -167737
125a67737l5990J06314J58196Q6048k5774p6253o8660o3941n7143J8799J38669
$$ -167737 -203727 -97413 60783 146831 121057 44804 -23856 -87797 -144940 -126141 12528
136A2528J64431K3162j46935j56471k3302O6852M4792K6293P3324P3134m8642
$$ 12528 176959 200121 53186 -103285 -126587 -59735 -14943 11350 84674 157808 109166
147A09166j60711j03285N3441J14019M8547M283K7885J864j04087j32313K261
$$ 109166 -51545 -154830 -101389 12630 61177 65460 93345 95209 -8878 -141191 -138930
158a38930J39568J07788j8038n4191l767j2480q6219o8776P0706J50350N5537
$$ -138930 638 108426 90388 36197 32430 19950 -66269 -135045 -64339 86011 141548
169A41548p8660q5355j2889j720l7077K33R4057R9707j6170j09390p6382N514
$$ 141548 62888 -22467 -35356 -37076 -74153 -73920 20137 119844 103674 -5716 -82098 -76584
181g6584K9165J9178M2792O3114J1481p2453q3346j6996L7376M0127L5103M3162
$$ -76584 -47419 -28241 14551 77665 89146 16693 -66653 -83649 -46273 -6146 28957 72119
193G2119J6067n4662q9163l3978M7158O5585L3439Q000l571l3169o2042m0028
$$ 72119 88186 33524 -55639 -89617 -42459 23126 56565 64565 60994 27825 -34217 -74245
205g4245K6383O5782M3908J014j8501k9254m7493l8885J6593O9058N5202n987
$$ -74245 -47862 17920 61828 62842 44341 15087 -32406 -71291 -54698 14360 69562 63575
217F3575m2506l3381j5720j4640k270L7358O0869K3688m1372o1701k5451J6475
$$ 63575 21069 -12312 -28032 -42672 -44942 -7584 53285 76973 35601 -26100 -51551 -35076
229c5076K5394J6641J9183K2503k274m4437n3978q783M4939M9950J0772k0205
$$ -35076 -9682 6959 26142 48645 46371 1934 -52044 -60827 -15888 34062 44834 24629
241B4629j6525n530j8338k9309J009N0858N2548n434n1250l6380N752J5282l24
$$ 24629 8104 2574 -15764 -45073 -44064 6794 59342 53908 2658 -33722 -27970 -12688 -13012
254a3012N514L0641K8292j8551n1102k8423J6520K9306J6955R842Q361j2237l4338
$$ -13012 -7498 23143 51435 32884 -18218 -46641 -30121 -815 16140 25982 34343 22106 -12232
267a2232k4744J0731K8267J2600J755J1189M686l0667m7116l524N0517M2300r577
$$ -12232 -36976 -26245 2022 14622 16377 27566 32252 1585 -45531 -49055 1462 43762 34185
280C4185l2318n914J1247j1761k9638L088M5860L6614j4299m2427k4377M521J5269
$$ 34185 1867 -4047 7200 -4561 -34199 -31111 14749 51363 37064 -5363 -29740 -25219 -9950
293i950J2455J0361O049k827r630j1584j4691j1101J2817L8917K5967k2874m6877
$$ -9950 2505 12866 18915 16088 6458 -5126 -19817 -30918 -18101 20816 46783 23909 -22968
306b2968j2822K8137K0091j5437j3306K5395L2799j6864n4927k2576L8069M5772
$$ -22968 -35790 -7653 12438 -2999 -16305 9090 41889 25025 -29902 -52478 -14409 31363
318C1363j120l0818r951J5531M527k1273j6242J5597L2075J3309j7957k6777j2489
$$ 31363 30243 -575 -10526 5005 9532 -11741 -27983 -12386 19689 32998 15041 -11736 -24225
331b4225P516J5855R767q03m247R53R51q039j5006n292J6307K6048P982j9613
$$ -24225 -16709 -854 8913 8110 3863 4816 5767 -2272 -17278 -22570 -6263 19785 27767 8154
345H154k6201m130J7135J2668n775q504Q877J8662m012l1049k1832J9075L7577
$$ 8154 -18047 -22177 -5042 7626 1851 -6653 2224 20886 16874 -14175 -36007 -16932 20645
358B0645J0324k4694k2139Q380J7259p437k1510L397L0742J8629j9411l1975o488
$$ 20645 30969 6275 -15864 -7484 9775 2338 -19172 -15775 14967 33596 14185 -17790 -24278
371b4278J8576J5676j690n923K427L517n167j1184o519M419J3622J4494J91j7686
$$ -24278 -5702 9974 8284 2361 4788 8305 3138 -8046 -14565 -10146 3476 17970 18161 475
385D75j8452K132J7111P744q999n712J1301J0311j3592k4142j225K5425J8222
$$ 475 -17977 -15845 1266 9010 11 -5701 5600 15911 2319 -21823 -23048 2377 20599
398B0599r460j8394j586R882M9j0273j728J2944J1345m218j2631o333J431L939
$$ 20599 11139 -7255 -8841 1041 1090 -9183 -10911 2033 13378 9160 -3471 -9804 -8373 -4434
412d434N080M964J411m829n725k68K519j141l357N136J1583K554j3588j2895L913
$$ -4434 646 5610 7021 2192 -3533 -3801 -1282 -2423 -5780 -644 10939 13493 -95 -12990 -9077
427i077J4224M419p479m721P587O303p901j3587R33J5065Q988n809r163m82M113
$$ -9077 5147 9566 2087 -2634 4953 11256 3355 -10232 -9299 5766 14754 8945 -218 -700 3413
442C413j675n693J760R973N199p991q423L7L720j043j298M203N303k083r011n647
$$ 3413 1738 -3955 -2195 7778 12977 4986 -3437 -3400 320 -723 -2021 2182 7485 5402 -3609 -9256
458i256L696N521o83q81K557J905n099o247j13N092M649P57n65j455k903k468
$$ -9256 -5560 -39 -722 -1603 954 2859 -2240 -8487 -8600 -3508 1141 1898 1333 -122 -3025 -5493
474e493J328M755J685k019J150L894j374p658l042O991R251l44p620k933M749
$$ -5493 -4165 590 2275 256 1406 5300 3926 -3732 -6774 217 9468 9124 1504 -1429 3320
489C320L551n057m502L894P381R77n909n556R7L985K300j470j774N24J742K24
$$ 3320 6871 1814 -2688 1206 8587 9564 3655 -1901 -1804 2181 4481 3011 1237 1761 3503 3727
505C727l623m963J85O955N622l787q333j420O027L109m444m566L689Q293N76q136
$$ 3727 104 -4859 -4674 2281 7903 4116 -4217 -5637 390 3499 -945 -5511 -1822 6471 7047 -1089
521a089p267K065Q012M761j966n492k531L226L446k976n998J234R190N969p493
$$ -1089 -8356 -6291 1721 6482 4516 -976 -3507 -281 3165 189 -5809 -4575 4615 10584 3091
536C091j2892j492J2169P772o582r345K576R830j55j1135o048Q605J2495p4j1249
$$ 3091 -9801 -11293 876 8648 2066 -7279 -4703 5127 4972 -6163 -12211 -3606 8889 8815 -2434
551b434o526N571P626O76m912k390M085O241r29p475m959M633J0032L144p402
$$ -2434 -8960 -3389 4237 4913 1 -2389 1696 7937 7008 -467 -5426 -793 9239 12383 4981
566D981r120K238R351K257q798n639O243Q966k923j1278m552P052Q590k423q611
$$ 4981 -4139 -1901 7450 9707 909 -4730 1513 10479 7556 -3722 -8274 -1222 7368 4945 -3666
581c666l046N085M717k356o743k375N506O658j680q243l814M986P804k12p879
$$ -3666 -6712 -1627 3090 734 -6009 -8384 -2878 3780 2100 -6143 -9957 -4971 2833 2621 -5258
596e258l829O879Q288k819r936k607R389P945l778q819j429Q298N733m630p721
$$ -5258 -9087 -2208 6080 3261 -6675 -9282 107 8052 4274 -4545 -5974 2324 8057 3427 -4294
611d294Q32P746M460m727p231r57O699N374l716p381r95P416M412n308q133K08
$$ -4294 -3462 4284 8744 4017 -3214 -4171 2528 7902 4186 -3195 -4190 3226 7638 2330 -5803 -5595
627e595Q907N174o605q816J539Q419L204o592n933K433P752K637o625o011K610
$$ -5595 3312 8486 1881 -6935 -5396 3023 6227 -365 -6298 -3865 3887 6524 -101 -6112 -3502
642c502O276K175m054m865J556N361K064m757n014J652O112K573m371n750K26
$$ -3502 2774 4949 895 -3970 -2414 2947 5011 254 -4760 -3108 3004 5577 1206 -4544 -4318
657d318N878K590n155m608L298N684p16o219l247L974N892n9n473k179K701L324
$$ -4318 1560 4150 -1005 -5613 -2315 3369 2653 -3566 -6813 -2839 3053 2994 -2479 -4658 -1957 1367
673A367j107l205j90L520L335j358m745j539L786M480k66l162j834J939K806r76
$$ 1367 260 -2945 -3135 385 3720 2362 -2383 -3922 -136 4344 4078 916 -918 1021 3827 2851
689B851l469k18M542K466l056m719k61L617K960k230l626P35K873k64l254j581
$$ 2851 -618 -836 3706 6172 3116 -1603 -1864 1753 4713 2483 -1143 -408 2465 2201 -1053 -2634
705b634K365K878l19l296k580J303K964O09k674p76J309J785n96k634o15L030
$$ -2634 -269 2609 2290 -1006 -3586 -2283 681 1290 -1384 -2160 -851 934 338 -2296 -2911 119
721A19K069j547k885l46L078J858j418k331p57L332J760j935k931J219L010J131
$$ 119 2188 641 -2244 -2590 488 2346 928 -1403 -2160 1172 2932 997 -1934 -715 2295 3426
737C426k800k875J226L691J442l085l537J011L793J579k796l191J091M120O64
$$ 3426 626 -2249 -1023 2668 4110 1025 -2512 -1501 2292 3871 1075 -2116 -1025 3095 3759
752C759m182l316K547N142L29m843k738K079M174N36l794k476L008L514j300m044
$$ 3759 -423 -3739 -1192 3950 4279 -564 -3302 -1223 2951 3487 -307 -2783 225 3739 2439 -1605
768a605j602L181M071r52m252k209L382L382r17l718j256K736L207j151m681j348
$$ -1605 -3207 -26 4045 3093 -1159 -3368 14 3396 2479 -1239 -2495 241 3448 2297 -2384 -3732
784c732M423L684j963m614j394M104L322k252m196j91M467K226k914l617J92M030
$$ -3732 691 4375 2412 -2202 -3596 508 3830 1578 -2618 -2809 1658 3884 970 -2647 -2455 1575
800A575K381k963l607K46M288J867k910l414K41M145J923k917l973J414M199J150
$$ 1575 3956 993 -2614 -2368 1920 3787 877 -2537 -2296 1849 3772 855 -3118 -1704 2495 3645
816C645l069l457R19M581R23l345l611J812M859N50m192l262K632L792J99l509
$$ 3645 576 -2881 -1962 2619 3542 197 -3414 -1602 3257 3807 -385 -3647 -1015 2777 2976 -533
832e33k374J997M012n63l775j738K431L336k04l729k081K988L693j674l661r00
$$ -533 -2907 -910 3102 2539 -1236 -2974 -543 2793 2589 -1140 -3221 -233 3460 1786 -1875 -2775
848b775L398K584j779l398m43L400K322j922l678k08L078K311j604l316k67L399
$$ -2775 623 3207 1428 -1970 -2413 987 3309 1387 -2291 -2499 579 2890 1286 -2030 -2297 1102
864A102J384k170l170P28M026Q76k437l353N89L893J872l103l197J132L695J037
$$ 1102 2486 316 -2854 -2126 1900 2776 339 -3014 -2425 1468 3340 237 -2960 -1828 1867 2904
880B904l728k779J914M340M61m228k825J996M136N10l362k595J948L809P6l797
$$ 2904 -824 -3603 -1689 2651 3112 -1116 -3941 -1945 2191 2701 -661 -3256 -1308 2501 2577 -1220
896a220k321L253L687r24m265j809L003L903l90m029j798K687K971q02l482j451
$$ -1220 -3541 -288 3399 2475 -1790 -3599 -596 3307 2917 -1112 -2910 -223 2748 1946 -1536 -2987
912b987K918L529j169m272j760L685L658j722l490j001K928K555j394l858oL411
$$ -2987 -69 3460 2291 -1981 -3741 -56 3602 1880 -1610 -2611 317 2872 1478 -2380 -2386 1025
928A025J861j779l357J86K342K371j843l315N51L067J055k336k283R37K806J405
$$ 1025 2886 1107 -2250 -2064 278 2649 806 -2509 -1958 1109 2164 -172 -2455 -1518 1288 2693
944B693k611k483P35L102Q71k285k510J094L214O30k793k527K249L208J38l506
$$ 2693 82 -2401 -1666 1436 2307 22 -2488 -1394 1820 2450 -343 -2870 -621 2587 2725 -781
960g81k136K206L586l09l630j650K508L216r23l265j412K939K845p15l828q07
$$ -781 -2917 -711 2875 2566 -1064 -2714 -206 3010 2087 -1178 -2590 349 3194 2479 -1349 -2156
976b156K934K519j413l278n50K568K323q60l269q98L172J859j479k759J15K279
$$ -2156 778 3297 1884 -1394 -1944 624 2947 2087 -1182 -2080 1092 2951 1472 -1287 -1172 1107
992A107J864j673l220M37L073J326j902k868N73K448J393k201k106N46L184N66
$$ 1107 2971 1298 -1922 -1485 1588 2914 1012 -1856 -1283 1165 2558 357 -1749 -1203 1981 2547
1008B547k790j479J046L041N26k881k195J522L116M20k917j727K244J971Q6k717
$$ 2547 -243 -1722 -676 2365 2891 10 -2185 -663 2453 2873 -44 -1771 473 2444 2530 -187
1024a87k040K581L134q03l269j214K057K888m75l197j082K354K303r39l486p27
$$ -187 -2227 354 3488 2685 -584 -1798 259 3147 2672 -525 -1607 747 3050 2111 -1375 -2102
1040b102L196K735j614l425j136L577K281j770l321K08K826J580k117k316j38
$$ -2102 1094 3829 2215 -1210 -2346 1231 3512 1742 -1579 -1371 1455 3035 918 -1398 -1536
1055a536L362J690k124l183P35L001Q60j654k561P56K390J213k446k174R03L214
$$ -1536 1826 3516 1392 -1791 -1056 1945 2805 1151 -1410 -654 1736 2949 503 -1671 -768 2446
1071B446R06k860k071M94L095Q74k371k016J202K953N7k751j983K014K851j35
$$ 2446 3352 492 -1579 -1085 2010 2884 513 -1503 -301 2652 2709 -42 -2025 -11 2840 2705
1087B705l030j630K027K836k75k852j682K361K042p62k743j250K673K366j151
$$ 2705 -325 -1955 72 2908 2633 -219 -1901 460 2502 1740 -1003 -2253 420 2786 1635
1102A635k670q50K408K140q66l225m8J984K121j323k566l60K611J798j707k872
$$ 1635 -1035 -1885 523 2663 1797 -1428 -1476 508 2629 1306 -1260 -1620 991 2789 1082 -1790
1118a790L84K747J477k032k370K38K523J735k221k707Q07K966P17k387k007R93
$$ -1790 -1406 1341 2818 786 -1584 -1346 1177 2912 691 -2016 -1209 1757 2474 87 -1920 -927
1134i27K500O48k140k121R20K811N54k664j544J288K245J65k105j365J001K459
$$ -927 1573 2221 81 -2040 -1120 1691 2245 -419 -1963 -675 1570 1735 -370 -1735 -734 1725
1150A725P6k857q86J548K231n0k235j822J897K382p63k667m70K079J986r15k732
$$ 1725 1801 -1056 -1942 -394 1837 1787 -448 -2270 -373 2009 1246 -1421 -1891 188 2174 1259 -1473
1167a473j008K402K316r59l095m75K320J508q23k970k54K808J494k147k367M01
$$ -1473 -2481 -79 2237 1278 -1817 -2292 28 1536 713 -2257 -2511 297 1791 -356 -2723 -2322
1183b322K813Q78j055k815K66K704J407k346k049J315K132P90k181j631N17K438
$$ -2322 491 1369 314 -2501 -2235 469 1876 -470 -2519 -1204 928 1718 -463 -2094 -1577 861
1199H61Q34k066j472L80K662M77k132j986J294K292N26k536j560J598K160j46
$$ 861 1695 -371 -1843 -1463 1199 1676 -456 -2442 -1148 1144 1670 -866 -2426 -828 1332 1186
1215A186k419j488J718K150m72k570o90J949J424m45k477n60J627K204p92k319
$$ 1186 -1233 -2721 -1003 1147 675 -1895 -2585 -636 788 343 -2134 -2694 -1067 1137 345 -1974
1231a974n30J851J359r29j709l01J643J963j255k401j68K332J470j159k156N7
$$ -1974 -2504 -653 706 -223 -1932 -2233 -590 1373 118 -2283 -2451 -119 1351 192 -1964 -1907
1247a907K070J309j554k302N76J761J198j572k090P32J868J145j738j855Q61K409
$$ -1907 163 1472 -82 -2384 -1808 -47 1151 -421 -2511 -1779 89 1234 -504 -2359 -1498 911
1263I11L8j780j591J180J902J47j970j461J722J762r6j817r37R28J709P5k172
$$ 911 949 -831 -2422 -1242 660 807 -1163 -2624 -902 860 764 -1053 -1990 -1062 647 722 -1450
1280a450o58J113J931j59k343k79J366J573n19k042j143K322J284q15k153j45
$$ -1450 -2108 -995 936 777 -1566 -1845 -479 1094 575 -1467 -2610 -288 996 181 -1972 -2117
1296b117J854J485j339k133l18K496J488j719j896M98K268Q28j674k029Q5K366
$$ -2117 -263 1222 -117 -2250 -2568 -72 1416 -303 -2199 -1701 567 1395 -279 -2308 -2223 143
1312A43J132j914j486P37K014N86j719j703R02K117O27j872j774J303K041L62
$$ 143 1275 -639 -2125 -1388 626 1212 -507 -2210 -1308 809 1436 -436 -2210 -907 1134 1496
1328A496k214j586J005K397K11k471j128J353K081j82k333q50J663J973r12k137
$$ 1496 -718 -2304 -1299 1098 1309 -1162 -2290 -937 1144 962 -1371 -2221 -558 1415 503 -1634
1344a634m73J661J770o99j865o39J564J989r91k418l6K048J287j055j899l95J680
$$ -1634 -2107 -446 1324 625 -1240 -1879 -315 1674 683 -1735 -1771 277 1564 509 -1390 -1785 -105
1361a05J890q96k150l57K127J199j140j802l47K429J213j335k924Q73K333Q19
$$ -105 1785 889 -1261 -1618 509 1708 568 -1234 -1581 848 2061 726 -2198 -1325 1008 1827
1377A827j668k157N01K239O68j188k078O44K521K50j985j563R13K354M59k503
$$ 1827 159 -1998 -1497 742 1410 222 -1856 -1212 1309 1559 -426 -1989 -1076 1278 1737 -766
1393g66j298J286K087K84j891j268P58K095R3j901j386J055K537m05k057q29R43
$$ -766 -2064 -778 1309 1593 -298 -1566 -808 1287 1380 -521 -1907 -852 1685 1280 -777 -1606 -663
1410f63K178k01k584k83J554K030q51k273l80J734J604o01k064m24J624J617j047
$$ -663 1515 1314 -1270 -1553 1 2031 1180 -1093 -1473 261 1865 1264 -800 -1224 400 2017 970
1427I70j882O7J265J252o46j901l44J966J199r61k060j94J793J322j200j684M5
$$ 970 -912 -845 420 1672 1026 -875 -1219 747 1946 985 -1075 -1269 524 1846 646 -1038 -993
1444i93K068N49j687j475M55K163P5j443j471O36K024K72j807j328Q96J675O24
$$ -993 1075 1624 -63 -1538 -1083 1080 1155 -288 -1759 -1123 901 1173 -634 -1962 -1066 609 1233
1461A233j630j443J192J541J98j891j029J169J708j23j798n81J042J868m68j575
$$ 1233 -397 -1840 -648 893 1091 -800 -1829 -660 1048 925 -873 -1454 -412 1456 988 -587
1477e87o99J034J742m66j578m78J383J211n00j700j38J452Q70o06j510k16J194
$$ -587 -1286 -252 1490 1024 -554 -1032 351 1562 1062 -638 -776 676 1546 940 -570 -786 408
1494D08J450r06j730j20J928P21j342j300k64J725P57r59j350L1J432N30j485
$$ 408 1858 952 -778 -898 1030 1751 409 -891 -1155 570 1327 368 -982 -951 481 1011 -474
1511d74j144J133R58J09j196j333R09J732l8j169j233M12J678R2j269j065J385
$$ -474 -1618 -485 473 582 -614 -1947 -1038 694 656 -513 -1746 -1334 344 436 -833 -1898 -513
1528e13R30K01j512o24J108J413p7j831k81J097J209m11j293k55R29J346k26j833
$$ -513 417 618 -894 -1518 -410 1003 926 -905 -1186 -89 1120 709 -584 -839 90 1436 1210 -623
1546f23n28J719J275q04j749m39J710O86q17j515J91J960K05j015j285L83J338
$$ -623 -1151 568 1843 1039 -710 -1149 561 1247 430 -1085 -894 1066 1271 256 -1029 -646 692
1563F92Q74j216j439K10J498N64q95j414J03K022L05j757j227Q21J609K46j667
$$ 692 1566 350 -1089 -879 619 1183 288 -1126 -1023 999 1304 -453 -1680 -859 750 996 -671
1580f71q50N56J568K90j778r63J099J332j5j840p22J331J452m31j567q42J471
$$ -671 -1521 -965 603 893 -885 -1848 -749 583 568 -1272 -1994 -663 789 358 -1209 -2051 -580
1597e80J552o10j604k83J377J107l58j288p39J656J219p06j365l93J646J186r66
$$ -580 972 362 -1242 -1525 -148 959 601 -687 -1426 230 1449 743 -622 -1015 631 1817 851
1614H51j232j60J717J123j111j821J87J162J042p83j634K59J140Q85j425j514
$$ 851 -381 -541 1176 2299 1188 -633 -446 716 1758 975 -659 -400 740 1625 200 -1314
1630a314Q28J047O80j519j411O89J362K99j222j284L96J628N27j453j439R07K024
$$ -1314 -486 561 1241 -278 -1689 -1000 362 661 -561 -1845 -1449 179 706 -747 -2186 -1279 745
1647G45J07j781r96J037J458j87r89p31R88J348j86j308q88J339J557k36j614
$$ 745 852 -929 -1925 -888 570 383 -606 -1337 -349 999 813 -495 -1383 -44 1513 1277 -337
1664c37j060J164J510l24j707o86J758P92l88j415l40J247J193r38j447K15J000
$$ -337 -1397 -233 1277 953 -754 -1440 318 1110 722 -693 -1033 214 1407 469 -978 -763 237
1681B37J257r30j380m7J237R86r43j317J52J712N10r77r90k29J599Q53j254r92
$$ 237 1494 564 -816 -863 374 1360 417 -900 -748 964 1474 497 -493 -722 877 1730 476 -516
1699e16N7J423J1r85r59M84J497L0j134j000J88J601M0j517r84N46J904n16j452
$$ -516 -459 964 975 -10 -969 -485 1012 1042 -92 -1092 -904 697 737 -780 -1764 -1218 686 170 -1282
1718a282l53Q85J087l13j091l64P81J475j31j636l70J350Q63m4j556p9J081R79
$$ -1282 -1635 -750 337 24 -1067 -1431 -650 825 694 -942 -1312 38 901 857 -699 -778 303 1282
1736A282R0j823j64J412J289j341j119j32J491L66l53j450M0J377L65r22j185
$$ 1282 1372 -451 -615 797 2086 745 -374 -506 985 1351 998 -452 -412 965 1330 408 -777
1753g77L25P71J167j110j580K83J535L43j203j087O23J110K98j121q06N05J465
$$ -777 -452 319 1486 376 -1204 -921 614 957 -246 -1333 -710 400 698 -423 -1229 -724 741
1770G41K52j217j128N88J322L00j221p58M57J380L8j506k85P74J165l03j186m69
$$ 741 993 -224 -1352 -764 558 858 -363 -1121 -664 716 754 -752 -1037 -263 902 599 -587 -1056
1788a056Q13J098kj526l34P38J466p40j240m86J054J305o92j378p4J274N50p32
$$ -1056 -243 855 853 -673 -1007 -269 1197 457 -783 -1269 -215 1090 398 -980 -1054 220 770 38
1806C8q06l44J223Q94q57r56j2J446O14j004j025L74J063N66j104j038L89J242
$$ 38 -768 -1112 111 1005 148 -808 -820 626 1240 236 -789 -415 648 1214 110 -928 -539 703
1824G03M14r94q34L69J118L12j106j117Q01R12qr18q93Q53Q49J56r51q39R61R98
$$ 703 1117 123 -711 -342 776 1088 -18 -1135 -334 578 570 -348 -1241 -388 461 617 -334 -1173 -212 786
1844G86p8j137q45R00J216l00j101n57P90J118j03j164n41J112O61k69j325K1
$$ 786 708 -429 -1274 -374 842 542 -559 -1116 -326 792 689 -475 -1016 96 757 488 -837 -816
1862h16J064P87n86j091k82J043J185j031j303r7J188P94p51j040j16J461L51
$$ -816 248 1035 449 -642 -924 119 1304 273 -1030 -1127 61 855 104 -936 -1052 409 760
1879G60m68j348L46R58O44j141o52N25J041M1q89o48L2J469J85j030r34O54J379
$$ 760 292 -1056 -710 248 892 -249 -901 -376 665 706 -183 -831 -799 670 855 -175 -1109 -455 924
1898I24J26j203q64P90J231k79j203j94M76R44o5p42n32M70J072l44j155P7K85
$$ 924 1050 -153 -1017 -227 1004 725 -478 -672 -196 748 683 -59 -591 -121 951 607 -548 -471 -186
1917a86J019l22r92l72Q41R60m58r94k45P90R11n10j032k22J314M98r86j394L36
$$ -186 833 511 -481 -853 -12 948 490 -504 -749 41 952 442 -590 -812 502 1000 14 -1380 -1044
1936a044J420M07n96j016k32J258O91j020r04nJ243L87p67r93L94J063N56p81
$$ -1044 376 783 187 -829 -1061 197 888 -132 -1036 -1041 202 589 -178 -1171 -777 286 842 61
1954F1j141O31J303j73m94j064M01J452K5j167l13O04R39k7j141m44Q56O87J10
$$ 61 -1080 -449 854 681 187 -877 -476 976 1001 -166 -479 125 1064 1037 -104 -548 308 995 1105
1973A105j462j16P51Q31k45j100p44J086P61k16j186k11P26P87l48j201k01J033
$$ 1105 -357 -473 278 1109 864 -236 -980 106 867 651 -535 -746 -20 767 419 -782 -983 50
1991E0M97m45j209K0R34R20n88r81J08M51Q46n76j007k28J291N39o09j007L00
$$ 50 547 102 -1107 -1087 -153 767 179 -802 -694 -243 603 27 -980 -1208 83 622 13 -994 -694
2010f94Q45P45j056o72M68J212j2q91n24P9J073L29p87o43L42Q97L94j171m00
$$ -694 151 896 -160 -832 -364 848 836 -55 -579 -500 573 902 115 -528 -186 711 1105 -66 -466
2029d66L31P69J4n64n78L52J124J94j217k61M49P28l84p47m8J62J083l01j303
$$ -466 -135 634 648 84 -494 -142 982 1176 -41 -302 147 875 491 -256 -304 -142 941 640 -663
2048f63R3P02N96n55p25k47Q33N00n97o24l31R77N89q14m79j86R21L10j56j212
$$ -663 -570 132 728 173 -552 -799 34 534 -63 -687 -1018 -41 548 -266 -745 -931 -10 300 144 -1068
2068a068L22O31O33n68j130N72R99J05o99o23L18Q09M05j132m48N54R91l8p82
$$ -1068 -746 -115 518 -50 -1180 -608 391 496 -203 -826 -508 301 706 -426 -874 -320 671 633 -149
2087a49n32L40P71K1l50p82P03P07k38o42n63P65P31k74p28k34R14M74n62p64
$$ -149 -681 -341 430 451 101 -681 22 729 491 -151 -714 51 782 508 -220 -454 460 934 372 -392
2107c92k73R80N06m96r29l1Q26N85l67j268J63P76L66k51j106l8J020L52q01q42
$$ -392 -665 315 821 325 -604 -635 191 776 409 -859 -696 80 446 195 -911 -949 71 423 -378 -1220
2127a220M81P20K17p57q50M39J347r7r62n75N43Q43K75p20n99P62P79j99m98r24
$$ -1220 -739 -19 198 -559 -1409 -970 377 280 -682 -1257 -714 129 404 -316 -915 -153 626 427 -71 -995
2147i95O88J009J18r32l65L96J071l0j071p31Q52J341m10j271r7R89O79n14j246
$$ -995 -307 702 820 -112 -477 -81 990 960 -111 -842 10 1351 941 -330 -427 562 1241 727 -519
2166e19l06O02J418p54j202q2Q50P77p89p48j94R87N01l94r18j22J028M47m63
$$ -519 -825 -223 1195 441 -761 -843 7 784 -5 -753 -947 40 541 147 -771 -893 135 582 119
2185A19j071k43J342N31n22q97l7J309M21o67j391O19J048K51r70o18pJ106N45
$$ 119 -952 -1195 147 678 156 -741 -778 531 952 285 -1106 -487 561 812 -158 -776 -783 323 868
2204H68p54j272O01Q46N12r54q12M21Q50N61p57j067L10J510J11r18p20L31J232
$$ 868 114 -1158 -557 289 801 -153 -965 -544 306 867 110 -957 -647 863 974 56 -664 -333 899
2223H99r0o60p28N17R86l6q30n19N35J206j07j127n49N91Q09m9j014k93O57P95
$$ 899 809 149 -579 -62 924 888 58 -461 74 1280 1173 46 -503 88 897 848 -166 -459 198 993
2243I93Pj436k21Q19N32l22j108k97J000P08p80m95l30P70O66k02p28k51L82R02
$$ 993 1000 -436 -657 162 694 372 -736 -1033 -33 675 -105 -600 -930 -160 506 304 -424 -675 -293 609
2263F09l38p54j23Q60L54l73o00Q1O30O43m99q06J53P82K80n60l52k77J115K14
$$ 609 271 -483 -606 254 608 235 -365 -284 346 989 490 -316 -163 619 899 339 -13 -290 825 1039
2283A039o97n09j93R11K61p61j08J99K25N06r94m68M13N90j41l21N7j80O01j20
$$ 1039 342 -167 -360 551 812 51 -57 142 367 873 -121 -589 -176 414 273 -48 9 -171 430 310
2303C10m18m85R12L44l53k99l88O89J95q9j65j38Q9N11n15j47Q4K68J20k90m17
$$ 310 -108 -593 319 663 310 11 -377 312 507 418 253 115 204 715 200 53 137 405 525 235 -182
2324a82L94j54K18k08l78K44L14K00n70K12j67M25k7l16k10O1Q05m96l12j40M93
$$ -182 212 58 276 68 -310 -66 248 448 -122 90 -77 348 321 5 -205 -144 661 165 -147 -287 206
2345B06K43j75m24J27J96k2J29l27O2K75L70k13p17L97O02k17l04p37M55O50R9
$$ 206 449 274 -150 -23 173 151 280 -47 15 290 660 447 -270 127 729 512 208 -529 -74 576 675
2366F75o29m66P79M41j24o71n63N75M26J35p32l90L76R19l42p98m08Q84P95l50
$$ 675 46 -420 359 800 676 5 -558 17 443 578 -154 -544 -168 751 409 -389 -797 87 882 532
2386E32n19m99O67P42m49p42l58P04N61L0j169j06Q96O28o0j343j97M42J163l91
$$ 532 13 -486 181 923 474 -268 -626 78 639 669 -500 -606 290 918 858 -485 -682 -240 923 532
2406E32j037k08O75J056p28q94l05J201O83m57j213k10J147P21n70j189q4J230
$$ 532 -505 -713 -38 1018 290 -604 -909 292 975 518 -695 -905 242 963 393 -796 -880 350
2424C50P34o16j257q9J216P95j010j177L19R76Q96j009q02N2J400L23r22j074
$$ 350 1084 468 -789 -878 338 1133 123 -1054 -735 241 1137 128 -674 -622 778 1101 179 -895
2442h95L74J086J49n23q97J42J233O31j141r15L26J191L09r45j003L58J607j63
$$ -895 -521 565 714 191 -706 -564 669 1300 159 -756 -430 761 1070 125 -878 -520 1087 924
2460I24q49j143N28J290N49j292j165O54J207K73j353o47L38J451r8r66r84L30
$$ 924 75 -1068 -540 750 1299 7 -1158 -504 703 976 -377 -1024 -686 765 667 -299 -1283 -953
2478i53J532jo77j315P94J178L38j340n82N54J183K6j498l61P21J530m04j143
$$ -953 579 578 -99 -1414 -620 558 896 -444 -1026 -472 711 737 -761 -1122 -401 1129 725 -418
2496d18o26Q01J046j98j058j46L21R23n0q05o90P33J180m33j122l85P78R04k67
$$ -418 -1044 -243 803 605 -453 -599 -278 645 595 -210 -900 -167 1013 580 -542 -927 -149 755 488
2515D88r96j87P50J115l64r58m83O65P01j31o54o06O78O16j53r67l40O40Q60l83
$$ 488 -508 -695 55 1170 806 -152 -635 30 731 600 -54 -660 18 634 481 -486 -826 -186 674 291
2535B91p08k64P43L48m7q55l16P27L65q5o42M6N62K68n76l49j73P17K01j37o11
$$ 291 -417 -681 62 410 363 -492 -808 -81 284 199 -443 -397 165 433 -143 -492 -665 52 253 116 -495
2556d95K17K76L18j21m20k2L92M12n56j79j37N72L5L7n99N0O03k61j03J4j31L48
$$ -495 -278 -2 316 195 -225 -247 145 557 1 -178 -315 257 292 329 -270 -220 383 122 19 33 -98 250
2578B50j04j5LJ1L70m15j10L7r7j66K67j88P6Q9Q4j80M6MJ75m17R6M62j3p6k84
$$ 250 146 131 134 145 515 100 -10 27 -70 -236 31 -157 -81 8 92 -88 -42 -38 137 -280 -184 278 265 189 -95
2603i5k83L78l7J28L5p49L79N55l87m69L82J18L09k44l02R5K23K33k85m28m6O39
$$ -95 -378 0 -37 91 126 -623 -244 311 -76 -545 -163 -45 264 20 -282 -187 36 269 -16 -444 -490 149
2625A49L40l58m88L03M55J40q4p37n34J078N72l71r81J76O44J46k17l58l03O45
$$ 149 489 131 -357 -54 401 541 457 -280 -814 264 836 465 -516 -340 304 450 233 -125 -428 217
2645B17O95n57p94M26J60Q39m58r32l33J082L61n79q49P8Q24J69k06j110L00Q18
$$ 217 912 355 -439 -13 147 986 528 -404 -737 345 706 127 -722 -644 180 349 143 -967 -667 151
2665A51L31o18p37M98Q26M3p12n29m3J165K32q25o81M26J175K30q07j316O73Q03
$$ 151 482 -136 -873 -375 451 494 -218 -747 -790 375 607 -218 -899 -473 702 932 125 -1191 -518 285
2685B85M63p58n36K20J084l4m38j378O09J209j62n87r37O02P20N93q92j030N59
$$ 285 748 -10 -546 -326 758 724 286 -1092 -483 726 564 -23 -960 -358 362 955 63 -967 -408
2704d08J220K73j227r49P76R54L15r67p89N09J163L16j284j106Q69J198p5j002
$$ -408 812 1085 -142 -1091 -315 639 954 -13 -802 -293 870 1186 -98 -1204 -335 863 788 -214
2722b14p59Q43P92p2p81r23R34P39J65j041o12P56J293k75j469m52R03J185o25
$$ -214 -973 -130 662 590 -191 -1114 -180 559 724 -317 -929 -173 1120 845 -624 -1076 -173 1012 387
2741C87p64q57R67J196l97j360l62J081J020j72j478n03P44J166M2j198n40P02
$$ 387 -377 -1234 -267 929 532 -828 -1190 -109 911 739 -739 -1242 -498 668 710 -488 -1028 -326
2759c26J082l25j022l2P18P52o3j388mO83Q02m73q04j89O26R51n10r19j96P15
$$ -326 756 431 -591 -623 95 847 784 -604 -608 75 877 404 -400 -589 37 988 478 -441 -637 78
2779G8P97m99p68j32N58O09l79q81p3O72L26Q8o98l53L72J099q80q20K44P23N13
$$ 78 875 376 -392 -524 34 643 264 -617 -690 -18 308 396 -302 -655 -283 816 -64 -884 -640 83 596
2800E96l38o30J49J32N25j37q34j02Q47k29J7o4m35N39K13j14j29n48N56N05j49
$$ 596 258 -372 -223 -91 434 297 -537 -639 208 -21 -4 -68 -503 36 249 135 6 -542 14 519 370
2821C70r78K91L63K27k94j38J26J69K36l49j75K44M6j67L83o19K09mJ31J66l82
$$ 370 -608 -317 46 273 -21 -159 -33 136 372 23 -152 92 138 -29 354 -265 -56 -60 71 237 -145
2842a45R1L22L0j86n08N20n1j03qm8j53K70O9k83J72J26j48M4M06l24j17j18j10
$$ -145 -54 268 298 112 -396 124 73 -30 -38 -86 -239 31 100 -183 -11 115 -33 11 417 93 -24 -142 -252
2865b52N26k90j17K66m65N38k61J40J12n04M6K43J53o34L41J27K45l68l82L97
$$ -252 274 -16 -133 133 -332 206 -55 85 197 -307 -261 -18 135 -499 -158 -31 214 -154 -536 -139
2885a39J24J82Jo28J33L97K57j84k60o7L72K12l72k11k6N80k3j14o96K96L55L50
$$ -139 -15 167 168 -460 -327 70 327 143 -117 -184 188 400 28 -183 -209 371 348 234 -462 -166 189 539
2907E39k11q04q3Q29L6k22k62K18K88M89p07o03J63P59L5k48j101M33R77Q7p58
$$ 539 328 -476 -559 270 306 84 -178 40 328 817 110 -493 -330 429 464 216 -885 -452 525 612 -146
2928a46n77M91L90M13q26j64K5R27M10r86n46K94N63L38p54k53L72K73N61q79
$$ -146 -723 -232 158 571 -255 -419 -394 533 943 -43 -589 -295 268 606 -148 -401 -29 244 805 -74
2948g4p60P46P56O7j093k12M61P78j64q86m89N80Q46K1q09n35L46R60O3p10q65
$$ -74 -834 -88 668 735 -358 -570 -109 669 505 -381 -870 -290 556 577 -232 -767 -421 539 602 -108 -973
2969i73N38J221j97p08p11N30Q54k42n41p62P93P34p4q61k93N36Q80j22r23k63
$$ -973 -435 786 589 -119 -830 -300 554 312 -229 -991 -198 536 462 -399 -692 -156 724 602 -321 -584
2989e84M54P27k06m78m39N50K92m9r48J12R57L28j35j069J97P10K91l71o02o04
$$ -584 -130 597 391 -87 -526 24 316 267 -681 -569 388 716 581 -488 -291 419 710 339 -263 -867
3009h67J038O33l69j137j01J059M64n27m10j29K73N41m20k91k72N96M69m96m64
$$ -867 171 804 435 -702 -803 256 720 193 -217 -346 -73 468 48 -243 -515 81 550 54 -410
3028d10k92Q87O22q15m98K41M55N37m39r90L35P28J80o63k92o0P80K12o08m78
$$ -410 -702 185 807 -8 -506 -265 190 727 288 -702 -367 361 541 -122 -414 -474 306 518 -90 -568
3048e68L29O78j05l84k82K0N38N8l96k79M8P07K00o82n78M49J85L51k95m79J02
$$ -568 -239 439 334 -50 -332 -312 226 284 -112 -391 -343 364 564 -118 -696 -247 -62 289 -6 -485 -383
3069c83L15L96n43j70m1N10ml33N7j33O47n19J17o6m5N57j43j36j88J05Q6L64
$$ -383 -68 328 -215 -385 -426 84 80 -253 -196 -329 318 -201 -84 -150 -195 362 219 83 -105 0 86 450
3091D50o63PJ85L53kl39j84L39L10m22j98L2M7m1j54L31j93L71K17j94n49O7L37
$$ 450 -213 -206 -21 332 330 -9 -193 146 456 34 -164 -132 -85 -126 -280 51 -142 229 446 252 -297 -230 107
3114A07L8l84J53K68j18M00n34p4J04L45l10k03M57m47J79J45m21J34Q1K24M5
$$ 107 145 -239 -86 182 64 464 -70 -144 -40 305 -5 -208 249 -198 -19 126 -295 -161 -80 144 189
3135A89k42L46k68J89l36j36R3J57K05k49K6j8K05jk95l61M31L07j39m71K42K91
$$ 189 -53 293 25 214 -122 -258 -165 -8 197 -52 -26 -44 161 160 -135 -496 -65 242 103 -368 -126 165
3157A65r3r1j7j47J37M31j10m52j90M49L38n2l83k20J88M67p5o18n6N12L57m30
$$ 165 72 -19 -36 -183 -46 385 275 -177 -367 82 420 368 -15 -235 -47 420 345 -273 -329 183 540 110
3179A10n23oO59J14k78l29p6P00k60J03m94j37O61J02k57k84P9M10K79n73n68
$$ 110 -413 -419 240 354 76 -253 -329 371 111 214 -280 -417 244 346 89 -195 -116 294 573 0 -568
3200e68M00M98j95l43l1J72L19q7l91k30L67L89n2j70m58J65N66L3q68P8L37K51
$$ -568 -168 330 135 -208 -239 -67 252 165 -226 -456 -89 300 248 78 -380 -215 351 384 -484 -406 -69 182
3222A82K01n05l37P98N3j81o79N3K39N58k9p26K17K34M11k83n14k83P53J80l44
$$ 182 383 -122 -459 339 392 211 -468 -415 -176 382 353 -373 -156 78 489 206 -308 -591 162 342 -2
3243bo55L77L12K38M2o47O8O4O27m03l63m5K78N50k18n54J18N15J22l81m99L8
$$ -2 -657 -280 32 270 312 -335 -267 -203 424 21 -342 -387 -109 441 223 -331 -213 302 424 43 -456 -418
3265d18M55N88p78k0l69R66k2m55l76J22O56k42j00l03l5N44L47l18l90J80K91
$$ -418 37 625 -153 -173 -542 424 402 -53 -429 -307 349 107 7 -296 -331 213 560 242 -148 32 323
3286C23K57n80n15M57L08J05k86m59K71M86j46m67r3L5L74K69k71o13K34O05j30
$$ 323 580 0 -515 -58 250 355 69 -390 -119 367 221 -246 -339 -304 70 339 68 -545 -311 294 164
3307A64k33k36J44K63L9l32k63M83K59k01n48oM02K30k6n98J73O29r2j83k36J41
$$ 164 -69 -305 -161 102 141 -191 -454 29 288 87 -461 -467 -65 165 139 -459 -286 343 251 68 -168 -27
3329b7K16k77N9r1P6p5L03On03N8K87K59p54J66j36N74p1j11n08L18L73P1k71
$$ -27 189 -88 -29 -120 -44 -119 184 190 -313 -255 32 291 -463 -297 -433 141 70 -41 -549 -231 142 213 -58
3352e8J7j51O35l08j09l91K84M38n23J48l63J99L10j47m5K33j72K51j86P4l59
$$ -58 -41 -192 443 135 26 -365 -81 357 -166 -18 -381 -182 128 -19 -64 169 -3 248 62 136 -223
3373b23L55K12n3l68l76P55Rk32L8n05N05mR5n65K92o4N97m48l41M34m22K89j63
$$ -223 132 344 291 -77 -453 302 311 79 117 -388 117 113 208 -357 -65 -129 468 20 -321 113 -309 -20 -183
3396a83P2k10L80j74L0Pj78O04k4n49j0K60M39n98J75k51k5K58J4l02r6N31j3
$$ -183 -111 -321 59 -115 -85 -78 -256 348 324 -225 -235 25 464 -134 41 -210 -235 23 37 -265 -361 170 157
3419A57k99nk02k5O06k11j74m12K11N21k99k16j00L19O71o13j18j55M95R8Q2m97
$$ 157 -142 -147 -349 -374 232 21 -153 -565 -354 167 -132 -348 -448 -129 542 -71 -189 -344 151 249 331 -166
3441a66rJ47M29Ol94j89L17J38j62m49K04L44J56l79k13r2N12k20j93j9pL18L62
$$ -166 -175 -28 401 407 13 -176 141 279 117 -332 -128 216 372 -7 -220 -312 200 -20 -213 -232 -239 79 441
3464D41n49n18O85J58O8m78l83L09O25j62j94j98j1M56j30k65k05L02J27K41m68
$$ 441 -108 -626 59 217 285 -193 -576 -267 358 196 2 -196 -207 249 119 -146 -351 -49 78 319 -149
3485a49J03K41p1j01k27Q1J31L32j22k18m70M12M05l96m8l03K39L50k57k7l52
$$ -149 -46 195 124 23 -204 -123 8 340 218 0 -470 -58 347 -49 -97 -400 -161 189 -68 -95 -447
3506d47O30J88j26l49Q7n6M29j01n37N24j94R9k22m39M89L67R9m33m04K29L22
$$ -447 183 371 245 -104 -17 -73 356 255 -282 242 48 147 -75 -514 -25 342 441 8 -396 -167 155
3527A55K35m79m9j04R7L82l09k5K0L64j66j23l03J33K72k7j35k16M7L60j65j24
$$ 155 390 -89 -138 -242 -145 237 -72 -97 -77 287 121 -2 -305 -172 100 73 -62 -278 -231 129 -36 -160
3549a60j53K80L18l33o3j01M03J0M2l17ML14P2j15l52L7J17N08m54j57R5J09J21
$$ -160 -313 -33 285 -48 -111 -212 191 201 243 -74 -70 244 316 201 -151 -114 3 511 57 -100 -5 104 225
3572B25l72J1N9l7K01m3j22j51K84M11m02n12M34J78n7o3m28J62N32K49p97L1
$$ 225 -147 -136 -77 -114 87 44 -78 -229 55 466 64 -448 -14 164 107 44 -384 -222 310 559 -238 -207
3594b07P2L37j7q8l47J53J51J86k35m21K58L99kl52k0p7N36o4l81m9J72O4n9J73
$$ -207 -135 202 185 97 -250 -97 54 240 5 -416 -158 241 239 -113 -133 -210 326 262 -119 -168 4 68 9 182
3618A82n59M21K21K72q34J36L59j88L26m68K46K7qJ6k69p9K41K27Q2l67k14L35
$$ 182 -377 44 265 537 -297 -161 198 10 336 -132 114 141 133 149 -120 -199 42 269 351 -16 -230 105
3640A05J30k46J1k09N43j39l37R1k21M34L76o88J58k54J99K50n38L47k16k1L15
$$ 105 235 -11 0 -209 334 195 -142 -51 -272 162 538 -150 8 -246 -47 203 -335 12 -204 -225 90
3661I0J83o15P3M95j4o63QK16K36J24l24L2q5L83L33m95j77j88Q20p5n22j90M65
$$ 90 273 -342 -269 226 212 -451 -443 -227 9 133 -191 -159 -244 139 472 -23 -200 -388 432 357 -165 -355 110
3684A10m1K31k5m34p5M96j68k44L6j13P06m22J3j57J23L4K29j83l57K56J33n1
$$ 110 69 300 275 -159 -234 262 94 -150 -114 -227 479 57 70 -87 36 70 299 116 -241 15 148 97
3706I7k70o4L34L31k74j89J4n1K14k70K02n28N23J16m94l36L95N51M6m97p1K47
$$ 97 -173 -237 97 428 154 -35 -21 -72 142 -128 74 -454 69 185 -309 -645 -250 301 347 -150 -221 26
3728B6l20N16l10l56J85J75K49k83n7r6L35J96l13j89O3J20J19L3l07J86n6n6
$$ 26 -294 222 -88 -444 -259 -84 165 -118 -175 -271 64 260 -53 -242 -179 -59 60 93 -214 -28 -84 -140
3750a40J16j81L22k07k0j96M1K14L34j95q9J34j77M08k3l74P5P4P5l55j83J69
$$ -140 -24 -205 117 -90 -110 -306 -265 -51 283 88 -1 133 -44 364 341 -33 42 116 191 -164 -347 -178
3772a78K17M30m46l06L61K46P4m00p3j24L00J33n07J60j20K39J56Q4p24J02Q28
$$ -178 39 469 23 -283 78 324 398 -2 -75 -199 101 234 -273 -113 -233 6 162 246 -478 -376 452
3793D52m34k82P8R1J94o5r2k91L34J09J54n03k29L65L87J33n65k5J47o8K97m10
$$ 452 18 -264 -186 -95 99 34 -58 -349 -15 94 248 -255 -484 -119 268 401 -164 -189 -42 -110 187 -223
3815b23o8M77p3J82o64j1L84M15l55k67k19L60N41l43j19k28J67L31l41J89k57
$$ -223 -291 186 113 295 -369 -380 4 419 64 -203 -422 -62 479 136 17 -211 -44 287 -54 135 -122
3836a22K53l4p9o9o9N0L67l15l28Q44p8k60l28K43l35N33k47Mm1j6N0r5j90k05
$$ -122 131 97 18 -51 -120 -70 297 -18 -346 498 420 160 -168 75 -260 273 26 30 -11 -27 23 -72 -262 -467
3860d67N38m9Q3k69j2N9K54k51R8k09J91L15n3l66P2J02J74k28j00jk1K43n3k43
$$ -467 71 22 105 -164 -176 -117 137 -114 -16 -225 -34 281 228 -138 -66 36 210 -18 -118 -119 -140 103 50 -193
3884a93O6K92N60n72j86j91L88K24m74j06L7K10N2n2j47J13J8L09l89j73K60J41
$$ -193 -127 165 725 153 -33 -224 164 388 -86 -192 -155 55 107 55 -92 21 39 348 -41 -214 46 187
3906A87l1o9k62K2L30j5K6q7l06L40L3k04j70J59m0N5O8k55L8M57k87l41o0L77
$$ 187 156 87 -175 -153 177 162 188 101 -205 135 168 -36 -206 -47 -87 -32 36 -219 -181 276 -11 -352 -412 -35
3930c5J81j71o15N10J04P0R0m16L72O9k19n0J20j64L59m7j92o04O43J70L5j26
$$ -35 146 -25 -640 -130 -26 44 134 -282 90 159 -60 -110 10 -154 205 158 -34 -638 5 175 210 84
3952H4l72K01J23K47l43R0j55J59K53j73n55M22Q4m1j47J37p2J12M68o46q5O1
$$ 84 -288 -87 36 283 -60 30 -125 34 287 114 -441 -19 65 24 -123 14 -58 54 522 -124 -209 -148
3974a48J57J41m10L52k88O12k96k43J61n9P6J75M1o66N62m1p8ml40J09M79l27
$$ -148 9 150 -260 92 -196 416 120 -123 38 -21 55 230 271 -395 167 126 48 44 -296 -187 292 -35
3996c5P8m11M00K34l68j8j59J73L69l04k02j45M68J42l77M2j8o0O27n08l00K40
$$ -35 43 -368 32 266 -102 -120 -279 -106 263 -41 -243 -388 80 222 -155 -113 -131 -191 436 -72 -372 -132
4018a32K99J28l80R2k57J24L76l60j85R4K13M7m3L36m38M69k02j58k50M67l52
$$ -132 167 295 -85 7 -250 -126 250 -110 -295 -201 12 59 16 352 -86 383 181 23 -227 240 -112
4039a12N31n00j98J82l2O14k11n70K18J14N1K40m52O9K20j08j51k98K46M82n5
$$ -112 419 -81 -279 -97 -129 485 274 -296 -78 36 87 327 -125 -56 164 56 -95 -393 -147 335 280
4060B80j60m29K70J47k44n9o4K16N4N3k58K9J36L05j77k50p7J52L56n03L6L72
$$ 280 120 -309 -39 108 -136 -195 -259 -43 11 64 -194 -165 -29 276 99 -151 -228 -76 280 -223 -187 185
4082A85j85M51k32n20K74K80r9o0l76J99K58J5j39k67l7PK61k57J81q4L59o4p2
$$ 185 0 451 219 -301 -27 253 154 94 -282 -83 175 190 51 -216 -253 -246 15 -242 -61 -145 214 150 78
4105G8k37j31L46L3n5o0l9P3K18P8n27L08P8K08k72k08K94j0j46Q0k02K30K29
$$ 78 -159 -290 56 89 34 -26 -65 8 226 304 -223 85 163 371 99 -109 185 175 29 109 -93 137 366
4128C66j04l70j43P3L06n3n83M52O3j54J05N0rq9M85r2o93J51l1L41j29k88L58
$$ 366 262 -108 -251 -178 128 75 -508 -56 7 -147 -42 8 -1 -90 395 303 -390 -239 -270 71 -58 -346 12
4151A2o2J36j31m6j46K2L98pj9k37L89j59k20l13L2N29L46n22J26m8J51k10j52
$$ 12 -50 86 -45 -91 -237 -215 183 176 157 -80 309 150 -70 -383 -351 178 524 2 128 80 231 21 -131
4174a31j20M01J10Lk41L3RO3o7k8Pk9r7L8l26L12L48j44j13l69K81K88J51l08
$$ -131 -251 150 260 263 22 55 64 127 60 32 39 10 -87 -49 -375 -63 285 141 28 -341 -60 228 379 71
4198G1l66J24K91m2o3j21Q2J7l4O3j73J07M59j77k83K13qK6j72L4m74N42j59O6
$$ 71 -295 -171 120 78 15 -106 -24 -7 -41 22 -151 -44 415 238 -45 168 160 186 14 48 -426 116 -43 23
4222B3L5k14J06J05k57K27j80o8L03J18n48K00R7j9K79j04l37J65M08k33j87p
$$ 23 58 -156 -50 55 -202 25 -155 -223 80 198 -350 -150 -53 -72 207 103 -234 -69 339 106 -81 -88
4244h8J44K65n93K47j70qN37l04j25r3OP6J56J59j31M9L24l93p1j64L07n9J69
$$ -88 56 321 -272 -25 -195 -203 334 30 -95 -188 -182 -106 50 209 78 127 451 58 -13 -177 130 71 240
4267B40n64M1N65q3Q7m14M5L82l46m8N1L55k90J64k55P0K42l65K37k4m69M84l41
$$ 240 -324 -283 282 199 286 -128 -83 299 -47 -95 -44 311 21 185 -70 0 242 -123 114 90 -379 105 -236
4290b36L15J1r6j39L8J23J20k60R0L31j01l91j17J58J83J60l32Pj33M00J54l81
$$ -236 79 90 -6 -145 -107 16 136 -124 -34 297 196 -195 -312 -154 29 189 -143 -136 -269 131 285 -96
4312i6o9O4J5K01n30M69j18L56j53j47J33QP9j78j9j57K26O3k95j99L86k8K47
$$ -96 -165 -101 -86 115 -415 54 -64 292 139 -8 125 133 212 34 15 -142 84 147 -148 -347 39 11 258
4335B58n03m8k77P36J83j93l31l9L70k29L33l47l13K84K47j08j23Q0K2l8L28l82
$$ 258 -245 -293 -570 166 349 156 -175 -214 156 -73 260 -87 -400 -116 131 23 -100 -20 2 -36 292 -90
4357i0J30J94k39j2l99K87N77l36j04j64L24j36P4j16j92j61M67k17j31K16j7
$$ -90 40 234 -5 -17 -416 -129 448 112 8 -156 168 32 106 -10 -202 -363 104 -113 -244 -28 -45
4378d5J41L7k13K6m1K07R0k42J19l13M74j1m22K97P5J60k87Kl4p5J63l1o1j89
$$ -45 96 133 -80 -54 -95 112 202 -40 79 -234 240 229 -193 104 179 339 52 54 20 -55 108 77 16 -173
4402a73J72K1o4J91l34N19n01J36j98L48J32j6k26M0l34L20J47l81J08%KK30j49
$$ -173 -1 20 -44 147 -187 332 -169 -33 -231 117 249 233 7 47 -287 33 180 -201 -93 -93 -91 139 -10
4425a0j98J56L45r0k70K91k87J58n3j18N5J32k59L38l74K78l09M0K49j23j48j24
$$ -10 -208 -52 293 203 -67 224 -63 95 42 -76 -21 111 -148 190 -184 94 -215 -175 74 -49 -197 -321
4447c21M39j15r2JL35j17J42l64j68K12J99R2k81j23P1R3j42P9j33O13k64k75
$$ -321 118 3 -89 -88 247 130 272 -92 -260 -48 151 243 -38 -161 -90 3 -139 -60 -193 420 156 -119
4469a19k5Q8R0j65O7k7M6K74j78J59m80K47k6O8nk72K79L4J48j98Qj03Q7K4j6
$$ -119 -144 -56 34 -131 -64 -91 -45 229 51 210 -270 -23 -49 19 14 -258 21 55 203 5 13 -90 -3 21 5
4494EJ69j74P5k49O0m7J2M19k87l64J74J56l6K76j65M1p0J02j9n4k05J69J69k48
$$ 5 174 0 75 -174 -114 -161 -149 270 -17 -381 -207 -51 -87 189 24 65 -5 97 78 24 -181 -12 157 -91
4518i1L1k33R9O19l28J00j53K67r5r9l24r9L47K37l98J35M2j9Mm3Q7k88L43j06
$$ -91 -60 -293 -194 425 97 197 44 311 216 117 -207 -306 41 278 -120 15 57 38 42 -1 86 -202 141 35
4542C5K72j70j97J33q7J54j83j0O9J79j68r3k2j23L58l76J44M24l17K0K8k79r5
$$ 35 307 137 -60 73 -14 140 -43 -53 16 195 27 -66 -88 -211 147 -229 -85 339 22 42 70 -209 -304
4565c04L63K30k74j14K16p3j99o0J14Q0L4OJ7p6K97l28n9OJ63j14N18l23m66J74
$$ -304 59 289 15 -99 117 44 -155 -215 -101 -21 13 19 36 -40 257 -71 -130 -124 39 -75 443 120 -346 -172
4589a72N03l10K23l72rL40P3l04q9o7M05k25k9q9J74%L0r8q9O5K24J24n20J66
$$ -172 331 21 244 -128 -137 203 276 -28 -117 -184 221 -4 -33 -122 52 52 82 -16 -105 -40 184 308 -212 -46
4613d6P3J9N3l99M15l79M84m8k06k45L18J6j66N9j47L38Q7k91k36k6P6K72K83
$$ -46 27 46 99 -300 115 -264 220 172 -34 -279 39 55 -111 -52 -199 139 226 -65 -301 -327 -251 21 304
4636C04l79m8K30r8J13k57L31j88j07J29n3k13n9L68l2K84l49J37O7k51J45k82
$$ 304 -75 -123 107 9 122 -135 196 8 -99 30 -23 -236 -295 73 41 325 -24 113 180 -71 74 -208
4658b08M30k05k17J8M14k09J58K06p64J8M24K22o34M69j69R1K78l40k60J4L23
$$ -208 222 17 -200 -182 232 23 181 387 -377 -359 65 287 -347 122 -47 44 322 -18 -278 -264 59
4679E9j99n2L95L3O1k40J54n14L11l1k23L05m78L42j6J42%l44K71n8j95L16k21
$$ 59 -140 -192 203 236 297 57 211 -303 8 -23 -246 59 -419 -77 -93 49 49 -295 -24 -82 -277 39 -182
4702a82J54q1M7J66j07p6L67m57K01m13M77p0m6N2O6l25K28J58k23n1J73k17J09
$$ -182 -28 -109 -62 104 -3 -79 288 -169 32 -381 96 26 -20 32 98 -227 1 159 -64 -115 58 -159 -50
4725e0JQ8j33J7r8J18k81M32O3n7l84K67K60l05r4R3m4K16r8j9o6k3k1j04L9R5
$$ -50 -49 39 -94 -77 -175 -57 -338 94 157 100 -284 -17 243 -62 -156 -63 -107 109 11 -8 -74 -97 -118 -222 -183 -88
4751h8l9M6j14N7J43J89k88L51n82L28N7k18L87l67J91R2j3l42L17N5l27M42k96
$$ -88 -127 -81 -195 -138 5 194 -94 257 -325 3 60 -158 229 -138 53 145 132 -210 107 162 -165 277 -19
4774a9k12L38j30OO4r3Jj11J91M1j73K39J04k10p1j59K50R1K52m44j63K79L45
$$ -19 -231 107 -23 -17 47 -46 -45 -156 35 76 -97 142 246 36 -35 -194 56 147 399 -45 -208 71 416
4797D16j61l39J18Kl3j63n4K15j42j02N05n12l1M20J83m11j49J71M2K71J38m39
$$ 416 255 -84 34 36 3 -160 -214 1 -141 -243 262 -250 -281 139 322 -89 -238 -67 -25 246 384 -55
4819e5rP3L87m90r4M7j26n0M14l86j33N47J20k88J38j86No7J62j31N7J29J71l88
$$ -55 -64 9 396 -94 -188 -141 -267 -317 97 -289 -422 125 245 -43 95 -91 -86 -153 9 -122 -65 64 235 -153
4843a53j57L77j78M82n73k2K14L47k42j29p1Q7K16r7p6j1J6N9k74J15j21L61J8
$$ -153 -310 67 -111 371 -202 -224 -10 337 95 -34 -105 -18 198 101 25 14 30 89 -185 -70 -191 170 188
4866A88j22K72o89M31j92K7ln7Q7J65n5j82M8j73L39J14rl69L80r1j20k43L35
$$ 188 66 338 -351 80 -112 -85 -88 -145 -58 107 52 -130 -82 -255 84 198 189 -180 200 109 -11 -254 81
4889H1j05K53l16M7L45m07L89l04N8Q8j98N3lk43L72j37J70j00J50j93J61m74
$$ 81 -24 229 -87 -40 305 -102 287 -17 41 129 -69 -16 -19 -262 110 -27 143 43 193 0 161 -313
4911c13K88n8J52J3K2o1j88k5L17j34P9j92k1J08O2j51r6K47J21j02k01l88M26
$$ -313 -25 -83 69 82 104 43 -145 -170 147 13 92 -100 -121 -13 49 -102 -198 49 170 68 -133 -521 -95
4934i5K61o8P8K8M0k18K9k83K40k46J31k1l2K0Q4J40j20K51l13J3K91m66L35N6
$$ -95 166 98 176 204 244 26 55 -228 12 -234 -103 -124 -156 -136 -52 88 -32 219 -94 -81 210 -256 79 135
4958A35q9J28n0m04M56k6oM03n57q0j14K69M3k02R2K10k89Q5j59K17J28m26J57
$$ 135 46 174 124 -280 176 150 144 547 -10 -90 -204 65 108 -94 -2 208 -81 4 -155 62 190 -236 -79
4981g9l75K71K27k6n4j56J17m9K23p5l12J56K1J16J19j45J97j75J87j80j37K82
$$ -79 -454 -183 44 18 -36 -192 -75 -124 99 24 -288 -132 -111 5 124 -21 176 1 188 8 -129 153
5003A53j81K04l77K01K78k86J46j25K60k41Q6q5l7j13j1K75k95j2j27O15l67K51
$$ 153 -28 176 -201 0 278 -8 138 13 273 32 118 33 -4 -117 -128 147 -148 -160 -287 328 -39 212
5025B12m36Q2J85L0j57j36K06J82O4j87k27J38R2j95j28J32p2K43j48j16J08P9
$$ 212 -224 -142 43 73 -84 -220 -14 168 232 45 -182 -44 48 -147 -275 -143 -215 28 -120 -236 -128 -49
5047d9L80n10Q6r1K46k82L54r9j88L05K2K85m84q9q9L74m54J15L2Q9K24l49K16
$$ -49 331 -179 -93 -184 62 -220 134 35 -153 152 174 459 -25 -114 -203 171 -283 -168 -136 -47 177 -172 44
5070D4k76K26K38k98m4L22j53N0q2J9j43K93J5j69q8L92n13P5L6nk28N24m7k38
$$ 44 -232 -6 232 -66 -110 212 59 109 27 46 -97 196 211 42 -46 346 -167 -92 -56 -61 -289 235 188 -50
5094e0l36L89m7L15l29kN2j9L85p63K34O5K13Q8j26p2J71K5J03l38k25J46K21
$$ -50 -386 3 -44 271 -58 -60 -8 -27 358 -405 -171 -106 107 195 69 -3 168 193 296 -42 -267 -121 100
5117A00k63J74J78r4O7j90j45j73Q3M28K6k45q3L15l0j30J90l16J74L49l87k01
$$ 100 -163 11 189 95 162 -28 -173 -346 -263 165 191 -54 -137 178 148 18 208 -108 66 415 28 -173
5139a73J30p0K00Mj3k54j22N80n57J0J39N46j16l78j84nK99O6j0j42o2l08P49
$$ -173 -43 -113 87 91 78 -176 -298 282 -275 -265 -126 420 304 -74 -258 -263 36 102 92 -50 -112 -420 329
5162C29m14n4J17M4K5j29j21J16j50M88n11K59k58L13L7m9j22j71M61j22J05j51
$$ 329 -85 -139 -22 22 47 -82 -203 -87 -237 251 -260 -1 -259 54 91 42 -80 -251 210 88 193 42
5184D2p4m1P4J6K52r1l24o6K56l20j27L48J29k39N54k41J10m56J12M6R7K60l89
$$ 42 -32 -73 1 17 269 178 -146 -212 44 -276 -403 -55 74 -165 389 148 258 -198 -86 -40 57 317 -72
5207g2K04k59K00k06K14j16k72L14m4K8J8l6j03N2J75Q8P7j79n9M0m70K69J01
$$ -72 132 -127 73 -133 81 -35 -307 7 -37 -9 9 -27 -130 -78 97 185 262 83 24 64 -406 -137 -36
5230c6Q2p0J34K2r5k52K40L5j93L06j52k01J57n8K12j78J7Q9Q4l71O7n5J96J62
$$ -36 46 -24 110 132 37 -215 25 60 -133 173 21 -180 -23 -81 131 -47 -30 59 143 -228 -161 -216 -20 142
5254A42M5l63N50k45l36L91k03k9k5J31k41M7J79j15K47J37l91Q2OJ00J64m82
$$ 142 187 -176 374 129 -207 184 -19 -48 -73 58 -183 -136 43 -72 175 312 -79 3 9 109 273 -209
5276b09K98R1L2k1k00O6l06K98L59m97M6j6j21L49k12k58L26j0M2j69Q8j05jO8
$$ -209 89 180 212 191 -9 57 -249 49 408 -89 -43 -59 -180 169 -43 -301 25 15 57 -112 -24 -129 -130 -62
5300f2R2l43L72m9K13m12J67O0O5n3l9r0J90J90n34L10k7J05K2j7k93K42J28l08
$$ -62 30 -313 59 10 223 -189 -22 38 103 50 11 -79 111 301 -233 77 50 155 177 160 -133 109 237 -71
5324g1Q3r6J7n2Q7j21J08n0K84N3m81J19nL48j92k37Q0o4N03l71K03p1l41L70
$$ -71 12 -84 -67 -119 -32 -153 -45 -95 189 242 -239 -120 -125 223 31 -206 -126 -190 313 -58 145 74 -267 103
5348A03J12m9j61j73L38jm34K4P2J91j22J57k32R9J69N7o5m14M44J04j09j0m5
$$ 103 215 166 5 -168 170 169 -265 -241 -169 22 -100 57 -175 -76 93 150 85 -329 115 219 110 100 55
5371E5j54L37p0N1l30J64J87k05k34K96n3O3J31j89m17M9O08n20j50L03K46k01
$$ 55 -99 238 168 219 -111 53 240 35 -199 97 44 107 238 49 -368 -319 289 -231 -381 -78 168 -33
5393c3J00k26J79J73Kj86L1j66K58N3j85J06j37K7J93n1k54l5K17J7P3j31m06
$$ -33 67 -159 20 193 195 9 40 -126 132 185 0 106 -31 -4 189 138 -116 -151 66 83 156 25 -381
5416c81O19o6o5j92rP8k0K20k87m7o0N3L07n74M72l4r5Q9J4j24M55J8o13L71K0
$$ -381 238 172 107 -85 -94 -16 -36 184 -103 -150 -210 -157 150 -424 48 14 -81 8 22 -102 353 371 -242 129 149
5441A49n6o3n1o3K16m00K40k1L17k77J93j03j36Q0l4J43n6j60k26O20l97J55J02
$$ 149 93 30 -21 -84 132 -268 -28 -49 268 -9 184 81 -55 25 -9 134 78 -82 -308 312 -85 70 172
5464A72m4l28N34n57L37m87J86J80J52k19N9o4q2M05k43j48K25k05k6M20m65K65
$$ 172 128 -200 334 -223 114 -373 -187 -7 145 -74 -15 -79 -161 244 1 -147 78 -127 -153 267 -198 67
5486F7L00l83L0N4j97L0o4K03j15j83K86qj66j35L0J64O9q8J30k17L14j75j2K48
$$ 67 367 -16 14 68 -129 -99 -163 40 -75 -258 28 20 -146 -281 -251 -87 -18 -106 24 -193 121 -54 -66 182
5510A82q0P0m09L22l92K84L2j62O5j29j5L13oJ35k11o3J21J88k00J61k25J00J26
$$ 182 102 172 -237 85 -307 -23 9 -153 -88 -217 -232 81 75 210 -1 -64 57 245 45 206 -19 81 207
5533B07r7k25j13L31n6l91J45K46j14J40m1j02Q2Q1o1Lj55J56j80K61k72J90j31
$$ 207 110 -115 -228 103 47 -344 -199 47 -67 73 32 -70 12 93 32 35 -120 36 -144 117 -155 35 -96
5556i6J60m1j09L73l85J72j99J72K4J30j63j01j64O0J49K5j19K01m8K21m28k9
$$ -96 64 23 -86 287 -98 74 -125 47 71 201 38 -63 -227 -167 -18 7 -112 89 41 262 -166 -195
5578a95M16k26l27N15l01J03p5r0J80j41K98k32K22m11L08J58j48j64J58R4Mo2
$$ -195 221 -5 -332 183 -118 -15 -90 -180 0 -141 157 -75 147 -264 44 202 54 -110 48 142 146 84
5600H4oj30J5K96j42l28J57j00M33m91J18R2Q9m3k6N4j10K04J4k22J45r1m7k4
$$ 84 78 -52 -37 259 117 -211 -54 -154 279 -212 -94 -2 87 44 18 72 -38 166 180 -42 103 12 -35 -59
5624e9N6o9J13k34L87n26K90K1M9R6K95m74k27K14N7Q1m88K93J92j6n03L84J0
$$ -59 -3 -72 41 -193 194 -332 -42 -21 28 124 419 -55 -282 -68 -11 70 -418 -125 67 51 -452 -68 -58
5647e8K79j10j68%j38j9L09Q6q0o6j70L18k42J79k84L45l32L12r3r1K02j51M8
$$ -58 221 111 -57 -57 -195 -214 95 181 101 35 -135 183 -59 120 -164 181 -151 161 68 -23 179 28 76
5670G6j00l1PK99k00m8J11k27J53K28m26R3L21k83J98k39o9P3n0j38L04J50l56
$$ 76 -24 -55 -48 251 51 3 114 -113 40 268 -158 -65 256 -27 171 -68 -137 -64 -114 -252 52 202 -154
5693a54K74k25J31j86K21K44k35J61j98j3J11j31j00M24l77Mm2K2R5l16L36pj68
$$ -154 120 -105 26 -160 61 305 70 231 33 20 131 0 -100 324 -53 -49 -91 -69 26 -290 46 39 -129
5716a29K57P9k79J30O1M8k65J98j97k1N98l47P2j25J6k08L40n24N12k27k2J52
$$ -129 128 207 -72 58 119 167 -98 100 -97 -118 480 133 205 80 96 -112 228 -296 216 -11 -33 119
5738A19L9m57K10J95j53P7l32M00K3j22j54L46l80K00J99k63l1M1J57K32l92J79
$$ 119 158 -299 -89 106 -47 30 -302 98 121 -1 -155 191 -189 11 210 -53 -84 -43 114 346 -46 133
5760A33r5j44l3k16K55J29Q1k49J06k7J71o2j87K36nJ74l28J89p5k36K77jL3m7
$$ 133 38 -106 -139 -355 -100 29 110 -139 -33 -60 111 49 -138 98 93 267 -61 128 53 -183 94 93 126 79
5784G9k59L53m27pJ72Q0J05l55j0M03j02O5j5j88K41J4O8l74J24nJ68j29k1P8
$$ 79 -180 173 -254 -261 -89 -9 96 -259 -269 134 32 97 82 -106 135 149 217 -157 -33 -38 130 1 -20 58
5808E8O9j74J69P2j42J40j50l5k02K47J2k2n7J41j97Q3q9J59J10r5j86J39m15
$$ 58 127 -47 122 194 52 192 42 7 -195 52 64 42 -15 126 -71 12 -77 82 192 97 -89 50 -365
5831c65M64j75P6J3p6K10k39J27L6J47l97o8L39k75M58l24j86J94j04L80j87k8
$$ -365 99 -76 0 13 -63 147 -92 35 71 218 -179 -247 92 -183 275 -49 -235 -41 -145 235 48 20
5853B0L72k51o1m0j02J46j07%K19K2m71M88r1J35j37k43L10j53k74O2J25K82j65
$$ 20 392 141 80 40 -62 84 -23 -23 196 218 -253 235 144 279 142 -101 209 56 -218 -156 -31 251 86
5876H6k40M31n0j73K2k45Q9M15m51N87q88L90j07J35J5j92Q9J55R3k64l63J18
$$ 86 -154 277 227 54 76 -169 -80 335 -116 471 -417 -27 -134 1 16 -176 -87 68 161 -103 -466 -348
5898c48M38j07L1q0j50J75K60l23L67l43K95K08o58o2L51J1j28k35M17m90L48
$$ -348 90 -17 14 -66 -216 -41 219 -104 263 -80 215 423 -235 -297 54 65 -63 -298 119 -371 -23
5919b3o4J19R3J38q5Q0n44Q4K91J12j91q3j0J58o7OP0Mr7j6K30K3m69Q7M25k70
$$ -23 -87 32 125 263 178 258 -286 -202 89 201 10 -73 -83 75 8 14 84 88 -9 -25 205 228 -241 -154 271 1
5945AK35l91J64N5k7J74k11L3r3J26j28o8K5K23O1j12n5k43Q5K47j38J21qk14
$$ 1 236 -155 9 64 37 211 0 33 -60 66 -62 -130 -105 118 179 67 12 -231 -146 101 -37 84 76 -138
5969a38K70j73n3L7k21K29k5P0N3n25N60n1m04L12k4J8j0j31K53K53j88k68j03
$$ -138 132 -41 -94 -57 -278 -49 -74 -4 49 -476 84 33 -371 -59 -83 -65 -75 -206 47 300 112 -156 -259
5992b59M11k11J56M8l14K53n4j40m1J2L29k5l52j07O24k19l01l97O70J70o3M5
$$ -259 152 -59 97 145 -169 84 30 -110 -151 -139 190 165 -187 -294 330 111 -190 -587 83 253 190 235
6014B35j55p8Lq4K25j82o8K06K74k06Nk51K50m4j80m7j68j6K96k15%k59L91r9
$$ 235 80 2 5 -79 146 -36 -104 102 376 170 175 -76 174 130 -50 -97 -265 -281 15 -200 -200 -459 -68 -167
6038a67J60k75J27j14J47L63j56k09j29L47o0J35m47J94K27J47k25q3K7J71l22
$$ -167 -7 -282 -155 -269 -122 241 85 -124 -253 94 34 169 -278 -84 143 290 65 -18 9 180 -142
6059a42J89j77J85j24j93L66Qm27P3L11k06L74k64j00K84m05L22P0j3n5l28M48
$$ -142 47 -130 55 -69 -262 104 112 -315 -242 69 -137 237 -27 -127 157 -248 74 144 131 76 -252 196
6081A96l75P6J5o2J3L49j05J67k73J7NK5m17K48o8K34M33o81K24J67j85N5j89
$$ 196 -179 -103 -88 -150 -137 212 107 274 1 18 23 48 -369 -121 -189 45 478 -203 21 188 3 58 -131
6104a31R7m18K10L95l42J84K84l55k37N25n73N73mm48K95k10P3J77J91m03k17
$$ -131 -34 -452 -242 153 -189 -5 279 -76 -313 212 -361 212 208 -240 55 -155 -82 95 286 -117 -334
6125c34M66j76n7o3K77k5j68J35k08J52n7p3M00k37k04J64J61Q5k59L89m06K11
$$ -334 132 -44 -101 -164 113 88 -80 55 -153 -1 -58 -131 269 32 -172 -8 153 238 -21 368 -38 173
6147A73l18K10j18q5p4PL87o2r7k63M31k43L47m5j47j60K27j04L3p0k48P1J71
$$ 173 -145 65 -53 -138 -212 -205 182 120 23 -240 191 -52 295 250 103 -57 170 66 99 29 -219 -148 23
6170B3j85K40r2J85n13K54J12J82n6N1j30m6k06M3J87r7J23J3J56l19K48n3j89
$$ 23 -162 78 -14 171 -342 -88 24 206 150 201 71 25 -181 -138 49 -48 75 88 244 -75 173 120 -69
6193f9J3J62j3j18k19J33M59m21J2L05k96R1j10J60k10P2L9j09r2O0J67k76L54
$$ -69 -56 106 93 -25 -244 -111 348 -73 -61 244 -52 39 -71 89 -121 -49 -10 -119 -211 -151 16 -260 94
6216I4k23J53j37J07l5O4Qj84P1J61J21l52N8k1O6M39l98L32j82j9j31N5p5o4
$$ 94 -129 24 -113 -6 -41 23 31 -153 -82 79 200 -152 -94 -115 -49 390 -8 324 142 123 -8 47 -28 -92
6240i2L34m99L41r9q5p0j95M16p2O1l49L87j14J21l72O47j04k37L90n98Q3J62
$$ -92 242 -257 84 -15 -100 -170 -365 51 -21 40 -309 78 -36 85 -287 360 256 19 409 -189 -106 56
6262E6k32K08K0MQ6k91K97k78M9L1J37q0J36j49J27k3j24K34j22M4q1Q2M7m21
$$ 56 -176 32 52 56 142 -149 148 -130 -81 -50 87 7 143 -6 121 98 -26 208 86 130 49 131 178 -243
6286b43J76L11m3k61LO0N1J01J73m92K32O7j96n2n7M75k35R4m86J61P0rk0L2Q5
$$ -243 -67 244 201 -60 -57 3 54 155 328 -164 68 135 -61 -113 -170 305 70 164 -322 -161 -91 -100 -120 -88 -3
6311cN9k53J75Q4k14K93n6j50J58j93k5K65R2k15j15n7L75j2m57P0L64j76J18
$$ -3 56 -197 -22 62 -152 141 85 -65 93 -100 -125 140 232 17 -98 -155 220 208 -249 -179 185 9 127
6334A27rM0k14J24pN0j23q5J71O2n03L46J7O5rm61M10q5J54k8p8O3j47k0J85J53
$$ 127 118 158 -56 68 61 111 -12 -97 74 136 -367 -21 -4 61 52 -409 1 -84 70 42 -36 27 -120 -140 45 198
6360A98k65J84m6m17M50N9k55j9J55r1k30L35l04L61m48J96K64L1l49J17K5K24
$$ 198 -67 117 71 -346 104 163 -92 -111 44 -47 -277 58 -246 115 -333 -137 127 158 -191 -74 -49 175
6382A75R4o85K08J81l15L44kj90J79J22m54K99J31J33o22K95n2n5K88k54L35k20
$$ 175 269 -416 -208 -27 -342 2 0 -190 -11 111 -343 -44 87 220 -402 -107 -159 -214 74 -180 155 -65
6404f5K40l1l25L8M49l21P7l9O2j05p1Q7j36K53q5j40M08q3o3q7j12K0k18P7j20
$$ -65 175 144 -181 -143 306 -15 62 23 85 -20 -91 -4 -140 113 28 -112 296 213 150 63 -49 -29 -247 -170 -290
6429b90K46P8k70J90k3J12Q2k07k87L58l2K5Ro4J19j75j9K9p7Q5K32k69J40j47
$$ -290 -44 34 -236 -46 -69 43 125 -82 -369 -11 -43 -18 -9 -73 46 -129 -148 -119 -196 -111 121 -148 -8 -155
6453a55O7J03j8j88K12k59M31j45N9K5l7l83L23k39j9Q3M15j19l26N02l23N4p8
$$ -155 -88 15 -3 -191 21 -238 193 48 107 132 95 -288 35 -204 -223 -140 275 156 -170 332 9 63 -15
6476a5N2j92j66L27j49K33N8l45J81mL41m29o3J86l1J90r1j50L26j52j4k06J48
$$ -15 37 -155 -321 6 -143 90 148 -197 -16 -20 321 -108 -171 15 -16 174 83 -67 259 107 93 -113 35
6499C5j9L8K23l14L09l49L01l35j41L40m3l57L35j25M33l96K53k47j7K18Nk62
$$ 35 16 54 277 -37 272 -77 224 -111 -252 88 45 -312 23 -102 331 -65 188 -59 -76 142 147 -115
6521a15J7L82m34K92j26j78M8j53L27p2j67J40q5J3P3m2r0J00J3M7q2L8r6J4K26
$$ -115 -98 284 -150 142 16 -162 -114 -267 60 -12 -179 -39 -124 -111 -38 -80 -170 -70 -57 -10 -92 -54 -150 -136 90
6546I0j07q5r8L17j23l6j02j01K17J66J17m00Q3k09L45j34J70n5j15K93j87l27
$$ 90 -17 -102 -200 117 -6 -42 -144 -245 -28 138 255 -145 -62 -271 74 -60 110 55 -60 233 46 -281
6568b81J39L38m23K62l7L8r1P5k18R3J00K21k2o3q6P2o9k3J09p4k70J10lpj89
$$ -281 -142 196 -227 35 -2 36 -55 20 -198 -105 -5 216 194 131 45 117 48 25 134 60 -210 -100 -103 -110 -299
6593b99M19J1j24K59l16m7O9j09J82M7j41K60%J74l66j19K1m8M1J45k71K34k33
$$ -299 120 131 7 266 -50 -97 -28 -137 45 92 -49 211 211 385 19 -100 -79 -127 -86 59 -212 22 -211
6616b11N13l26M5J34p9P2O7j66J18l96J79k2J86j76L19k33j58J82j91K9rK23R5
$$ -211 302 -24 21 155 76 148 215 49 167 -229 -50 -72 114 -62 257 24 -134 48 -143 -114 -123 100 195
6639A95J33k59k1L02k13l51J80o0K1l44M04n8J34k2N0k10L14p2l51J15J8Q7J09
$$ 195 328 69 48 350 137 -214 -34 -94 -73 -417 -13 -71 63 41 91 -119 195 123 -228 -113 -95 -8 101
6662A01l09l0M4K54j11j81K94o3nMk14J24p6J55J36q7r1J34J16j84L3N5j59L3
$$ 101 -208 -238 -194 60 -51 -232 62 -1 -6 -2 -216 -92 -168 -13 123 36 -55 79 195 11 44 99 -60 -27
6686b7o4J03Q4j94MJ85N2j78J17k38P6L15n9k89J16K8l6J30m48K60K6K2kj33O8
$$ -27 -91 12 96 -98 -94 91 143 -35 82 -156 -80 235 176 -113 3 31 -5 125 -323 -63 -37 -15 -17 -150 -82
6711h2J63j43K75m33L3L44j42k32K65j5o2P9l74Q3K86p9k1J39j42L7k87J96J12
$$ -82 81 -62 213 -220 -187 157 15 -217 48 33 -29 50 -324 -241 45 -34 -55 84 -58 -21 -308 -112 0
6734@J0k18L08k24q7K99J7j2k21oJ36K57n72O7K26l53K52M7L4N6J53l53K78K27
$$ 0 10 -208 100 -124 -211 88 105 93 -128 -134 2 259 -313 -246 -20 -373 -121 -74 -40 16 169 -184 94 321
6758C21N6m34k31L36k21K87k16j83O6L32k42J21n1j29K54J4q1J99l01K3J01K84
$$ 321 377 -57 -288 48 -173 114 -102 -285 -219 113 -129 -8 -59 -188 66 80 -1 198 -103 -80 21 305
6780C05l91K6j30J48K9N7j77J05p3O6K13l84L44j91O4J42r7p9K57j29k55p1M50
$$ 305 -86 -60 -190 -42 -13 44 -133 -28 -101 -35 178 -206 138 -53 11 153 56 -23 234 105 -150 -221 229
6803B29k14MJ91j78O6j7l1q5j84L96k12JM9K06m05M07j73m6j38m6K45j65q3J77
$$ 229 15 19 210 32 98 81 50 -35 -219 177 -35 -34 15 221 -184 223 50 4 -134 -180 65 -100 -183 -6
6827fN3j01O0j34P4p4P2L3Q1n0j48J03k29M30j87l67N68p5N16p93J85P0m7J2j42
$$ -6 47 -54 6 -128 -54 -128 -56 -23 58 8 -140 -37 -266 164 -23 -390 178 103 619 -174 11 81 34 46 -96
6852i6K18j56O8q2r2O7l07J12L34j39k5L3p7M2K46k04M7q3q7l3J91J24j11K4l0
$$ -96 122 -34 34 -48 -140 -73 -380 -268 66 -73 -98 -65 -142 -100 146 -58 -11 -94 -181 -214 -23 101 -10 14 -16
6877a6o2L14j45N6j21k61L70j31k0k59L01j18K11m9r2P5p4J25n2J51j49l4K16
$$ -16 -78 236 91 147 26 -235 135 4 -16 -275 26 -92 119 70 -22 53 -21 104 52 203 54 20 236
6900B36l08K25J10p0m25J94L03q1l8j49m2O8l1J7K24p8p2o8j07R7j55J38J62r7
$$ 236 -72 153 263 193 -232 -38 265 184 146 -3 -45 23 -8 9 233 155 83 15 -92 5 -150 -12 150 53
6924E3J8r2J5l2K0O0k96K14L07m98K57o6j21J41n7j01K60k1k02J94q4P0N2O3m2
$$ 53 71 -21 -6 -38 -18 42 -254 -40 267 -231 26 -40 -161 -20 -77 -178 82 61 -141 53 -31 39 91 154 112
6949A12ol2l51L24L05m73l3J94O8j27N5k42J29K18k28K24k8j85R3j57K04m7O0
$$ 112 106 74 -277 47 352 -121 -154 40 108 -19 36 -206 -77 141 -87 137 109 -76 17 -140 64 17 77
6972G7k00J14j65K7L20j03q9J84k20J61O8k46Q7R8j76J69k58l5J01P9j15P9R7
$$ 77 -123 -9 -174 -147 173 70 -19 165 -55 106 174 -72 15 113 -63 106 -152 -187 -86 -7 -122 -43 54
6995E4R1j95MN4R1k87L36l05J79J65k31QJ01n6m31J27L25J05l01j38M66j43K87
$$ 54 145 -50 -46 8 99 -188 148 -157 22 187 -44 -36 65 9 -422 -295 30 135 -166 -304 162 19 306
7018C06n50K28P2n3j84k8L59k37M7J03k60K86r2q3j17N6K23qO1l60M54l68K22
$$ 306 -244 -16 56 3 -181 -209 150 -87 -40 63 -197 89 -3 -86 -203 -147 76 68 129 -231 223 -145 77
7041G7k83K55m8Q2l06K08o4n5j9O44l55j44PQ4j70j35M57Qk66K25k40q2j98L80
$$ 77 -206 49 1 83 -223 -15 -79 -134 -153 491 136 -8 -1 83 -87 -222 235 243 -23 202 -38 -120 -318 62
7065F2n4J93m02K45j19M4p0L21l84K63Jo7L4o13O91j30j13P2J26j39J48l65Q9
$$ 62 8 201 -201 44 -75 -31 -101 220 -164 99 100 33 67 -546 145 15 -98 -26 100 -39 109 -256 -167
7088a67J07m1M12m32J30r7j30N63j50k19Q9j18N3O3j15L0L92p6k32o2r5J37M9
$$ -167 -60 -101 311 -121 9 -88 -218 345 195 -24 65 -53 0 63 -52 -22 370 294 62 0 -95 42 91
7111I1p2N1K01j86k62L27l37K30j23K06j99p5K87q1l01L65R7j2j91O3J9n1j47
$$ 91 19 70 271 85 -177 150 -187 43 -80 126 -73 -148 139 58 -243 122 219 207 16 79 98 47 -100
7134a00j82K61j60L02k42k06K82L52m35M55k71j87P2L9j07j51M11p2j40K1J49
$$ -100 -282 -21 -181 121 -121 -327 -45 307 -128 327 56 -131 -59 -20 -127 -278 133 61 -79 -58 91
7155I1J36j68r7j21K33k28J83q7J34J49l23P5j6J58k1k00Po5L0j11M45m46J28
$$ 91 227 59 -38 -159 74 -154 29 -58 76 225 -98 -23 -39 119 98 -102 -95 -160 -130 -241 204 -242 -114
7178a14J60p9M7J17k31J30K5K15m88M99k05j5J09r7J55j64j03r0P1J94L0j97J06
$$ -114 46 -33 14 131 -100 30 55 270 -218 281 76 61 170 73 228 64 -39 -129 -58 136 166 -31 75
7201G5qQ2l37K46o2j24Q8R2k30K50K67l42k56J91J51j91L1NJ12p3L4L1J25l9l55
$$ 75 67 149 -188 58 -4 -128 -40 52 -178 72 339 -3 -259 -68 83 -108 -77 -72 40 -33 1 32 157 118 -237
7226b37M51k72R8%k95K26J64R7j79J54l01K0J5K06j45m7N0q8j01N10j71l8N9j00
$$ -237 214 -58 40 40 -255 -29 135 232 53 207 -94 -74 -59 147 2 -45 5 -83 -184 326 155 117 176 76
7250G6k22K17j82j71M6N6J78M2m56K98no1L84r4k19K51j16p5J71k30L04l51L05
$$ 76 -146 71 -111 -282 -236 -180 -2 40 -416 -118 -123 -184 200 106 -113 138 22 -53 118 -112 192 -159 146
7273A46k17K12j61J61Q1j03k44J86L1j5j42K15j96K27N5k00k25N5M1J04j56L36
$$ 146 -71 141 -20 141 222 119 -125 61 92 77 -65 150 -46 181 236 36 -189 -134 -93 11 -145 191
7295A91J99n31K97j99K95m48L60j50j8j00j0K1O5L17j80l04K97n3k86L54j04P6
$$ 191 390 -141 156 -43 252 -196 164 14 -4 -104 -114 -93 -28 289 109 -195 102 49 -237 117 13 89
7317H9k84qL83k74l37N45j40R4j51M6j26J79j1J7J09m24L69j98Q1r5J76l09P6
$$ 89 -195 -203 180 -94 -431 114 -26 68 -83 -37 -163 16 5 22 131 -293 76 -122 -41 -136 40 -269 -193
7340a93M23j94j04Q0K19J20k09l55L98m16R4K93m89L11K07j36p2n9J17m6j84J57
$$ -193 230 36 -68 12 231 351 142 -213 185 -231 -137 156 -333 -22 185 49 -23 -82 35 -11 -195 -38
7362c8K60p6n55K42l2J36K66p8j14k23L57j16J32k47N7J36Jr3L2l9j64o8L53k01
$$ -38 222 146 -409 -167 -199 -63 203 125 11 -212 145 29 161 -86 -29 107 108 15 47 8 -156 -224 129 -72
7386g2n1Q1J11m2j35k62K41J67j06l3m3J33o4L44n96O42l99o4n8N7o7L55M8k84
$$ -72 -123 -42 69 27 -108 -370 -129 38 -68 -101 -144 -11 -75 269 -327 315 -84 -148 -206 -149 -216 139 187 -97
7410i7M05k48o5J25k81n6J63J12Q2K04m03J50j48l07J10K91pj58R6k8o5J70q9
$$ -97 308 60 -5 120 -161 -217 -54 58 140 344 -59 91 -57 -364 -254 37 30 -128 -32 -60 -125 45 -44
7433d4L37j51L1k85JK70j28O7j61J30P4k5l73M16l0k17J37m3J70N5k11K14K5l05
$$ -44 293 142 173 -112 -111 159 31 98 -63 67 141 116 -257 159 129 -88 49 6 176 231 20 234 259 -46
7457d6jj44K05j41K87l09JK80n6k43K34j02J77k51n9K33j78J10j53p8N45l41o4
$$ -46 -47 -191 14 -127 160 -149 -148 132 76 -167 67 -35 142 -109 -168 65 -113 -3 -156 -234 311 -30 -94
7480i4K49l51J97j56M38k29L4j94K06j82L14k79O3l01K57J39k96J93k5K80j13
$$ -94 155 -196 1 -155 283 54 88 -106 100 -82 232 -47 16 -285 -28 111 -185 8 -17 263 150
7501A50k06J95R7L0k75N1k43J33q9J42J46j18j4R0Q7m50J82L14j9l03K88l08J68
$$ 150 -56 139 236 266 -9 42 -201 -68 -157 -15 131 13 -1 89 176 -274 -92 222 203 -100 188 -120 48
7524D8q0J5J94k26R8p6K66m95K96R2k31K97j53k28K51k30O0J82j68j4R2j86M23
$$ 48 -32 -17 177 -49 49 -27 239 -256 40 132 -99 198 45 -183 68 -162 -102 80 -88 -102 -10 -196 227
7547B27l12M8m5p7K99n6J11j98J44l2j55J4M4J49j80K68l0k53m8J88m0o1J3J15
$$ 227 -85 -37 -82 -159 140 84 195 -3 141 109 -46 -32 12 161 -19 249 219 -34 -82 106 66 5 18 133
7571A33jj63l7p0N2K90j84K9l6k9k4l3K82Qj23j1mk91K27N7n3L1j50k3K10k81
$$ 133 132 -31 -68 -138 -86 204 20 49 13 -16 -40 -73 209 217 94 83 79 -212 15 72 19 50 -100 -123 87 -194
7597a94M6K53J6j61j83P9K93Lj44K67j65M2p0ql46K43L52j71J39m43K77j78J59
$$ -194 -148 105 121 -40 -223 -144 149 152 8 275 110 152 82 74 -272 -29 323 152 291 -152 125 -53 106
7620A06k43J11l8R1o7J32k07K7j3J54k28P7K63l93K18j59K45J24j70J5m69K19
$$ 106 -137 -26 -64 27 -40 92 -115 -88 -101 53 -175 -98 165 -228 -10 -169 76 200 30 45 -424 -205
7642b05l0K73l00J68J6L12l79L53j36m44M20j67K89j75j97K06J57k3J46j18k03
$$ -205 -235 38 -262 -94 -78 234 -145 208 72 -372 48 -119 170 -5 -202 4 161 138 284 166 -37
7663c7k08K61N2O2l68J25J38k65K08j05J36j0J03j36N4J29j07k81K05j05n1K13
$$ -37 -245 16 68 130 -238 -113 25 -240 -32 -137 -1 -11 92 -44 10 139 32 -249 -44 -149 -200 13
7685A3J83k41j00K57Q1j67n9K97m29n1K54k94J62J53k68M48j72jJ10Q1j97J16
$$ 13 196 -45 -145 112 193 26 -33 264 -165 -216 38 -256 -94 59 -209 239 67 66 176 257 60 176
7707A76n83N39J15j46l93L27q9J76m2j45M05l90k56J74l8K0O9q1L17k17J52k5
$$ 176 -407 132 247 101 -292 35 -54 122 80 -65 340 -50 -306 -132 -170 -150 -81 -162 155 -62 90 65
7729F5J23k65K8p4J97j56P7M9k98K46Q8l47O95m83j31N38n04K52l41L22k1J9R3
$$ 65 188 -77 -49 -123 74 -82 -5 44 -254 -8 80 -267 428 -55 -186 352 -152 100 -241 81 60 79 172
7752A72L4l96K2J45M41k94k80J37k9M1k21K99p6K51j72l89L31q9k15J63M9M35
$$ 172 206 -190 -168 -23 418 124 -156 -19 -48 -7 -228 71 -5 246 74 -315 16 -73 -288 -125 -76 359
7774C59n77J5j02L79j59j1L80q2l06N8N1j15K97k70l4L54m63L88l05P3O5k44K02
$$ 359 -218 -203 -305 74 -85 -96 284 202 -104 -46 5 -110 187 -83 -117 237 -226 162 -143 -70 -5 -249 -47
7797d7N8J34j48M6l21L32J86mm34L65k51K12j72L57k24k34l6j5J54p2J8L94ln59
$$ -47 11 145 -3 43 -278 54 240 236 -198 167 -84 128 -44 313 89 -145 -181 -196 -42 -114 -96 298 295 -264
7821b64%K87J89k29l8J52L8j94J12j28j26J78j64K87l44K22l28M24j20K42k54
$$ -264 -264 23 212 -17 -55 97 135 -59 53 -75 -201 -23 -187 100 -244 -22 -350 74 -46 196 -58
7842e8N2J29Jj19j39K91k14K02j18LK6j24J53k73j28J68J3q6K40J2J71pk3l14
$$ -58 -6 123 124 5 -134 157 -57 145 27 30 56 -68 85 -188 -316 -148 -135 -221 19 31 202 195 172 -142
7866a42K78q7j25k2J70l0k67K29P2k97K59r8k32K12M51j61m45J99Qn7J75k6j9
$$ -142 136 49 -76 -98 72 42 -225 4 76 -221 38 -60 -292 -80 371 210 -235 -36 -28 -85 90 64 45
7889D5k8r3K50j07j47p5L71M9l40Q3J0M8R0p0N5j61M1K84k88J55k26j44L37k17
$$ 45 17 -76 174 67 -80 -155 216 265 -75 8 18 66 156 86 141 -20 21 305 17 172 -54 -198 139 -78
7913g8j94J11J30j07J81K02oj93J88m89K16L02k85r5J7K73r0j72j01K05R2K2M5
$$ -78 -272 -161 -31 -138 43 245 239 46 234 -255 -39 263 -22 -117 -100 173 83 -89 -190 15 107 129 174
7936A74l57J3J38j25K49j0L6l3j62q7p5K80j55J26j9n7J21m1O9j22j20M92o88
$$ 174 -183 -170 -32 -157 92 82 118 85 -77 -164 -239 41 -114 12 -7 -64 57 16 85 -37 -157 335 -353
7959c53O65l61j67K92L8O8k44R9M6M8j72p2Q3j31M3q4q1M04M3l5j31J27j70j8
$$ -353 312 -49 -216 76 114 182 -62 37 83 131 -41 -113 -30 -161 -118 -202 -283 121 164 129 -2 125 -45 -63
7983f3J8J31k72J99J42k41l9J51k46J36J75j07n9J51o0M0q9j96J11J34j20p8P5
$$ -63 -45 86 -186 13 155 -86 -125 26 -220 -84 91 -16 -75 76 16 56 -33 -229 -118 16 -104 -182 -107
8006a07J27l18K32j81L30L3l10j8J98K87j15k53lJ10N4k41K59mj19j98K73j12
$$ -107 20 -298 -66 -247 83 116 -194 -212 -14 273 158 -95 -98 12 66 -175 84 80 -39 -237 36 -76
8028g6j3K1j5K37k47J02k72J67j27J18K21k19j06P8L19j12k34M13l09L30m01O5
$$ -76 -89 -68 -83 154 -93 9 -263 -96 -223 -105 116 -103 -209 -131 188 76 -158 255 -54 276 -125 -60
8050f0J98O9n5p0l03J64J01l12N8J23K38k12j9m0J99k0Q1ll28R8K2J10OQ4m7j62
$$ -60 138 207 152 82 -221 -57 44 -268 -210 -87 151 -61 -80 -120 79 59 140 137 -191 -93 -71 39 45 129 82 -80
8076h0K94n18M27k4k57J01j88K35K42m01n4K62J70p9j27K23j07l1k42MM06j71
$$ -80 214 -304 123 99 -158 -57 -245 -10 232 -169 -223 39 209 130 3 226 119 88 -154 -150 256 85
8098H5k2J36j08PJ76j67l79L00j12K19j39J10l48L02j48J01j69J78j30J12p4J44
$$ 85 63 199 91 98 274 107 -272 28 -84 135 -4 106 -242 60 -88 13 -156 22 -108 4 -70 74
8120G4K33l03l6J39r9j27K46l42j2K15L0P0k98J31J41k5o1K8J81k18o9j40L12
$$ 74 307 4 -32 107 8 -119 127 -215 -227 -12 18 88 -210 -79 62 37 -24 4 185 -33 -102 -242 70
8143G0k6L81l50P1o6l8m88N56k94r3K22L6J41q2O8l23J43r3K65l26K48j79L33
$$ 70 44 425 75 146 80 42 -446 110 -184 -277 -55 -19 122 40 108 -215 -72 -165 100 -226 22 -157 176
8166A76j82L12k98k61N4K47r1k01K27J42J23p6q6l62K4L11k58J50O2L0k41L03
$$ 176 -6 306 8 -253 -199 48 -43 -244 -17 125 248 172 86 -276 -252 59 -199 -49 13 43 -198 105
8188A05m0P8k92
$$ 105 65 143 -149
8191a49
$$ Imaginary data points
##PAGE= N=2
##DATA TABLE= (X++(I..I)), XYDATA
0@%%%qJ6j6J6k4L2l5M3n6P2q8J07j31J57j89K26k66L13l64M22m89N61o45P40q38
$$ 0 0 0 0 -8 8 -8 8 -16 16 -19 24 -32 40 -48 59 -72 85 -104 122 -144 169 -195 227 -262 299 -346 394 -444
28d44R50j076J213j365J529j712J915k134K376k641K931l252L601l986M413m887
$$ -444 506 -570 643 -722 807 -905 1010 -1124 1252 -1389 1542 -1710 1891 -2095 2318 -2569
44b569N417o004O665p418Q277r273J0442j1832J3524j5639J8364k2028K7254l5378
$$ -2569 2848 -3156 3509 -3909 4368 -4905 5537 -6295 7229 -8410 9954 -12074 15180 -20198
58b0198M9855q3449K98024J37162o45907k25168K21734M04345Q9596l2427o55
$$ -20198 29657 -53792 244232 381394 -264513 -489681 -267947 136398 225994 193567 192912
69A92912p474k51439k77214n469L08887K64617N6960q5951j15911k00448j94888
$$ 192912 185438 -66001 -343215 -348684 -39797 224820 281780 195829 79918 -120530 -315418
80c15418J3448K87687K79830L0213j66509j38651q2565r7760m9720J59454K89027
$$ -315418 -301970 -14283 265547 295760 129251 -9400 -91965 -189725 -239445 -79991 209036
91B09036J33842j60505k59401j23697K8084O5022Q2695J33773J15325m0636j93308
$$ 209036 342878 182373 -77028 -200725 -172641 -107619 -24924 108849 224174 183538 -9770
102i770j82852l1005J06252J50369J19995L8796p1334j43314j17617j7427P6070
$$ -9770 -192622 -223627 -117375 32994 152989 191785 120451 -22863 -140480 -157907 -81837
113h1837J13138J00510M7756m3859j31797j36231l3728R0844J35666Q2026m287
$$ -81837 31301 131811 179567 135708 3911 -132320 -166048 -75204 60462 142488 138201
124A38201o2678q1099p9561n2851K1751J19118J43972L8321j11234j51045n4447
$$ 138201 75523 -5576 -85137 -137988 -116237 2881 146853 185174 73940 -77105 -131552
135a31552M8977N7138K8732N5921Q5547J229j43367j56608q4J38262J11179R804
$$ -131552 -82575 -25437 3295 59216 144763 145992 2625 -153983 -154067 -15805 95374 105178
147A05178j8922o032n6512j22466o0097R9382J54900M1798p0428n8226j6065n1704
$$ 105178 86256 80224 23712 -98754 -158851 -59469 95431 137229 66801 8575 -7490 -59194
159e9194p5306K6208J51638J16288n2234j35781n9530K3491P181r561O2629J15246
$$ -59194 -134500 -108292 43346 159634 107400 -28381 -87911 -64420 -57239 -66800 -4171 111075
171A11075K5730j14095j23606o947P2417M6459J5114L7236L5727m4134j07284
$$ 111075 136805 22710 -100896 -107843 -35426 11033 26147 63383 99110 54976 -52308
182e2308n4579M7505P9909M0046Q623o48l3424p4108n2271L1156Q0522M7544p270
$$ -52308 -106887 -59382 20527 60573 69196 68548 35124 -38984 -91255 -60099 20423 67967 60697
195F0697k1004j9423m1375m8716K306O6167O6725Q276l6855l8366k9847k5378
$$ 60697 39693 20270 -21105 -69821 -67515 -1348 65377 73653 36798 -1568 -31415 -56793
207e6793J138M8762O2434J4859l9744m5763j9956p775k673K4857N6239L7322k6766
$$ -56793 -55655 -6893 55541 70400 30656 -15107 -35063 -42838 -45511 -20654 35585 72907 46141
220D6141o6258m0316J1960K9436J9126J9420K5898L509m2869n9013j7668M0453
$$ 46141 -20117 -60433 -48473 -19037 89 19509 45407 48916 6047 -52966 -70634 -30181
232c0181N5968K1627j3829j9050j3075k2596k7671J472M8066N6935O099m9680
$$ -30181 25787 47414 33585 14535 1460 -21136 -48807 -47335 731 57666 63765 14085
244A4085m9540m867K0548Q341M023K6639L3311j0460n7766m6105J4099M8919K7779
$$ 14085 -35455 -40322 -19774 -11433 -7410 19229 52540 42080 -15686 -61791 -47692 1227 29006
257B9006k818n227k082j9890l3538r250L1135L6643J1068q402j2463j9909k9076
$$ 29006 26188 20961 18879 -1011 -34549 -43799 -12664 23979 35047 26645 14182 -5727 -34803
270c4803q699L3618M5035N416l2005j9176P391k635k5121n596M2390M5310r517
$$ -34803 -43502 -9884 35151 40567 8562 -10614 -3223 -5858 -30979 -36575 5815 51125 41608
283D1608n3520l1280J7003K5649J050m435J3975J6632r717l0534k1027N035K3842
$$ 41608 -11912 -43192 -26189 -540 510 -3925 10050 26682 16965 -13569 -34596 -29561 -5719
296e719K6060J1751j3123k8582j6253J0667J5895l885p169J9131K8800j0953n1544
$$ -5719 20341 32092 18969 -9613 -25866 -15199 696 -3189 -10358 8773 37573 26620 -24924
309b4924k9202L1662N0521N187l3907j3907K1799R377k9889k8352K0918M8200
$$ -24924 -54126 -22464 28057 33244 -663 -14570 7229 16606 -13283 -41635 -20717 27483
321B7483J6730l0113l6125m797J8140J1330k002M85R583O034q435j9564j5100
$$ 27483 44213 14100 -22025 -26822 -8682 2648 646 1131 10714 16748 8313 -11251 -26351
334b6351N083K3859K2699k64k0958k0210j686J2606P954l063p88J2012J0418j1582
$$ -26351 -21268 2591 25290 25026 4068 -16142 -17828 -5222 2732 -331 -1119 10893 21311 9729
348I729k8114j3495K0171L3489Q095k3443k1485P589J6699n890k0469J187L0459
$$ 9729 -18385 -31880 -11709 21780 29875 6432 -15053 -7464 9235 3345 -17124 -15937 14522
361A4522K0766k0198l6898o971K6516K0008r957j4727O326J4254l804k0868j0776
$$ 14522 35288 15090 -21808 -28779 -2263 17745 7788 -6939 -613 13641 9837 -11031 -21807
374b1807J2632K0368O309r040j2281o654J838O806L772l630p79R186P525j0426
$$ -21807 -9175 11193 17502 8462 -3819 -10473 -8635 -1829 1943 -1687 -2466 6720 14245 3819
388C819k1617m634K1360K0544n541j9848l706J3754L205j5199r191J5753K0810
$$ 3819 -17798 -22432 -1072 19472 13931 -5917 -9623 4131 7336 -7863 -17054 -1301 19509
401A9509j246j9891j2541O280R735J060k259M429M404l582q290m388J137M053
$$ 19509 18263 -1628 -14169 -7889 1846 2906 647 5076 9480 5898 -2392 -6780 -5643 -1590
415a590O683O477Q17r511j2121k45J1320P273m780l903N396N577q303j4166j280
$$ -1590 5093 11570 12387 2876 -9245 -9490 1830 9103 4323 420 5816 11393 3090 -11076 -12356
430a2356J5919J3774n428j4677l177O623K024o856k120R074Q808m515j2874m628
$$ -12356 3563 17337 11909 -2768 -5945 678 2702 -4154 -6274 2800 11608 7093 -5781 -10409
444a0409N862N085j684m77M783J774o921q284J380P255L369k039r65L332r34o645
$$ -10409 -4547 538 -1146 -1623 3160 4934 -1987 -10271 -8891 -1636 1733 -306 -1271 2061 1127 -5518
460e518m074N504P689J217l127j560J054j961k586J774M522L535o4j493j552l733
$$ -5518 -9592 -4088 3601 4818 1691 131 1185 -776 -3362 -1588 2934 6469 6405 4912 3360 -373
476c73l130L555Q368K257o062m898K507K597l850n168L350R532K632r211r140
$$ -373 -3503 52 8420 10677 4615 -283 2224 4821 971 -4197 -847 8685 11317 2106 -7034
491g034J143O370K060k502j016J972J016k936n520j293M177O065K248l959n781
$$ -7034 -5891 479 2539 37 -979 993 2009 -927 -6447 -7740 -3563 2502 4750 791 -4990
506d990j895M346L957k197l440L188O345j004q670n578N587R725J995p640n242
$$ -4990 -6885 -2539 1418 -779 -4219 -1031 5314 4310 -4360 -9938 -4351 5374 7369 -271 -5513
521e513K524M613O1m098k217K953N816J417o269p387J396Q806N393n887r006K241
$$ -5513 -2989 1624 1685 -2413 -4630 -1677 4139 5556 -713 -8100 -6704 2102 7495 1608 -7398 -5157
537e157J0311K534j0185p863P878J1943n46j1788n130Q245Q986l100j0156j200
$$ -5157 5154 7688 -2497 -10360 -2482 9461 8915 -2873 -8003 242 9228 6128 -4028 -5228
551e228Q969O547m302q533k521N681O306m05o694l338L666N867j166q637m735
$$ -5228 3741 10288 5986 -2547 -5068 613 6919 6514 -180 -3518 148 6015 4849 -3788 -8523
566h523O572J0190j512j2200n926P348Q240k659q968j377Q242M744o322r471R35
$$ -8523 -1951 8239 6727 -5473 -11399 -4051 4189 1530 -7438 -8815 -573 4171 -2151 -11622 -10687
581a0687R455N825l546p275j702N339M773j811n208j03P814N044m396r152j253
$$ -10687 -1232 4593 1047 -6228 -7930 -2591 2182 371 -4837 -4940 2874 7918 3522 -5630 -6883
596f883R175Q369l611r613j086Q275M375o505p345K770R593L247q092q806J960
$$ -6883 2292 10661 7050 -2563 -3649 4626 9001 2496 -4849 -2079 7514 10761 2669 -6137 -4177
611d177Q045K946n352n908J615N974J957o130o854K265R285L533o851q172J715
$$ -4177 3868 6814 1462 -4446 -2831 3143 5100 -1030 -7884 -5619 3666 7199 348 -7824 -6109
626f109Q393K988o627o365M936Q689j96q814n186M996Q573J037p107m744L591
$$ -6109 2284 5272 -1355 -7720 -2784 5905 5709 -3105 -8291 -3295 5278 6315 -792 -5536 -1945
641a945N438l02n494k145L526N132j88n843m846L336O263J397m893m494K284N760
$$ -1945 3493 3191 -2303 -4448 -922 4210 4022 -1821 -6667 -3331 2932 4329 -564 -5058 -2774 2986
657B986O9n980l248N490N737j896o405k108N048M836j420m871r61M582K967k616
$$ 2986 3055 -2925 -6173 -683 5054 3158 -3247 -5355 -307 4529 3109 -1762 -2723 1859 4826 2210
673B210l943N40L781K600k281l925o45M584K318k109m044m31L490J882j929l765
$$ 2210 -1733 -1193 2588 5188 2907 -1018 -1663 2921 5239 3130 -914 -1345 2145 4027 2098 -1667
689a667k2L688J617l589l769J678M105O70l770l203J329L988j39l139j332K739
$$ -1667 -1689 1999 3616 27 -3742 -2064 2041 2711 -1059 -4262 -2933 1055 916 -2223 -3555 -816
705h16K288j359l005r48L063K991o09l266j075K335J772l70j635J48K378R81k221
$$ -816 1472 113 -2892 -3840 -777 2214 1605 -1661 -2736 -401 1371 1001 -634 -486 1892 2873 652
722F52l063J107L623K143k571k968j42K726J180j846k458J825K678R6l863k316
$$ 652 -2411 -1304 2319 4462 1891 -1077 -1219 1507 2687 841 -1617 208 2886 2982 -881 -3197
738c197K200L808N47l528k556J404L292L78l526k029K638L737m45m863k645L962
$$ -3197 -997 2811 3358 -170 -2726 -1322 1970 2348 -1178 -3207 -569 3168 2723 -2140 -4785 -823
754h23M663j093m674j624L238L564j300l834j477L657L064j587m522l87L595K976
$$ -823 3840 2747 -1927 -3551 -313 3251 1951 -1883 -3360 297 3361 1774 -2748 -3135 460 3436
770C436k062m467m22M252K619k323l932l53L383L135k018m409K4M144K390k914
$$ 3436 1374 -3093 -3515 737 3356 1033 -2899 -3252 131 3266 1248 -3161 -3137 1007 3397 483
786D83m491R01M577K232l232m050J228M099J526l754k609J484M260M14l338l631
$$ 483 -4008 -3107 1470 3702 470 -3580 -2352 1747 3273 -481 -3090 -1606 2654 3068 -270 -3901
802c901J771M277J301l925k945J727L765R26l690l030K341L912L2m303k169K569
$$ -3901 -2130 2147 3448 -477 -3422 -1695 2070 2996 -694 -3724 -1383 2529 2561 -1742 -3911 -1342
818a342L713L20l972k704K857M262p58m779j714M018L252j111m047j846L171L438
$$ -1342 2371 2691 -1281 -3985 -1128 3134 2376 -2403 -4117 -99 3153 2042 -2005 -3851 -680 2758
834B758j506l404r61L324K621j456l904q28M137K577k331l731k7L541J653k192
$$ 2758 1252 -2152 -3113 211 2832 1376 -2528 -3356 781 3358 1027 -2704 -2731 810 2463 271
850B71l261K49L871J848k760l492O60L947J151k577k804Q81L391Q55l167k291
$$ 271 -2990 -2741 1130 2978 218 -3274 -2614 1333 2484 -93 -2897 -2016 1375 2230 -937 -3228
866c228J982L460J20l167k620J516L872P27l513k356J742M015m54l774j742K851
$$ -3228 -1246 2214 2334 -833 -3453 -1937 1935 2662 -851 -3207 -1465 2550 2096 -1678 -3420 -569
882e69M020r45m229k005L125L868q37m086j567K815L695q05m866j074M354L194
$$ -569 3451 2506 -1723 -3728 -603 3265 2428 -1658 -3225 -410 3285 2480 -2386 -3460 894 4088
898D088k256m400p42L897L332j887m221n98L045K995j703l774q0L163K450j876
$$ 4088 1832 -2568 -3310 587 3919 2032 -2189 -2787 258 3253 1550 -2224 -2304 859 3309 1433
914A433l947m32L884K677k814l420J47L551J800k497l045Q94L704Q44k831k922
$$ 1433 -2514 -2946 938 3615 801 -2619 -2472 1079 2879 382 -2663 -1769 1935 2779 -52 -2974
930b974R82L695J426l119k551J482K992L98l000j727J819K559n1k386k070K120
$$ -2974 -1992 1703 3129 10 -2541 -1059 1933 2331 -669 -2396 -577 1982 1931 -455 -2525 -405
946d05K803k27k869j551K094K490J55l398j265K340K941j028l311j235K852K899
$$ -405 2398 2171 -698 -2249 -155 2335 2490 -908 -2173 167 3108 2080 -1231 -2466 386 3285
962C285j136l345j248L123K951j848l894k3L307K311j883l346m43L332J845k022
$$ 3285 2149 -1196 -2444 679 3630 1782 -2112 -2135 1172 3483 1600 -1746 -2189 1143 2988 966
978I66l013L43K913J220j520l058K18L178J381j887k503K84K635J045k117k459
$$ 966 -2047 -1704 1209 2429 909 -2149 -1931 1247 2628 741 -1762 -1478 1157 2202 85 -2374
994b374J160K879J226l124k120J290K773M88k489j768J179K977j97l163j241K772
$$ -2374 -1214 1665 2891 -233 -2353 -1063 1710 2198 -291 -2059 -880 2097 1900 -1263 -2504 268
1010B68K475n69l332j430K544K416n52k719q06K103K054j363k490q76L009K270
$$ 268 2743 2174 -1158 -2588 -44 2372 1820 -899 -1705 398 2452 1089 -1401 -2277 732 3002
1026C002j701l444k17K896K181j770k756j84K522J698j478l463M26L558J286k233
$$ 3002 1301 -2143 -2360 536 2717 947 -1809 -1993 529 2227 749 -2714 -2288 1270 2556 323
1042C23l276M66L315J663k404k966Q92L583O60k979k005J346L091J111l302k390
$$ 323 -2953 -2487 828 2491 87 -2879 -1987 1596 2256 -723 -2728 -1382 1709 2820 -482 -2872
1058b872J124L462L15k674j851J097K933J73k540j756J497L064n35k541j854J812
$$ -2872 -1748 1714 2029 -645 -2496 -1399 1534 1707 -833 -2589 -1092 1972 1437 -1104 -2958 -1146
1074a146K749J18l062j831K135K684o49k632j233K192K287r50k913j040K570K429
$$ -1146 1603 1721 -1341 -3172 -1037 1647 998 -1634 -2867 -675 1612 662 -2251 -3291 -721 1708
1090A708j134k694q39K317K406j474k910m39L043J725j837k720K48K662J485j376
$$ 1708 574 -2120 -2959 -642 1764 290 -2620 -3059 -16 1709 -128 -2848 -2600 62 1547 171
1106A71k990M54K594J425k013k265O21K469J178k095k164L07L425M30k678k010
$$ 171 -2819 -2365 229 1654 -359 -2624 -2003 466 1644 -451 -2615 -2308 1117 1547 -1131 -3141
1122c141R55L099K77k231k089J077L024J0k709j614J800K551j41k621j469J883
$$ -3141 -2186 913 1190 -1041 -3130 -2053 971 981 -1728 -3342 -1542 1009 868 -1753 -3222 -1339
1138a339K334n42k564j133K207J936m52k451p59K005J876q01k826n98K359K136
$$ -1339 995 453 -2111 -3244 -1037 899 447 -2004 -2763 -758 1118 317 -2509 -3107 -748 1388
1154A388r23k844p90K411J995j298k482j69K033J770j460k557N8K575J530j503
$$ 1388 465 -2379 -3169 -758 1237 -61 -2543 -2712 -679 1091 -369 -2926 -2868 -293 1237 -266
1170b66k843N89K411J293k192k004M31L104P92k067k341R96L077M76k405j896
$$ -266 -3109 -2520 -109 1184 -1008 -3012 -2581 523 1315 -752 -3093 -2097 980 1456 -949 -2845
1186b845J374K523M27k621j582J718K491l43k377j234J429K429O4k758j125J453
$$ -2845 -1471 1052 1479 -1142 -2724 -1006 1485 1142 -1235 -2469 -1040 1389 1453 -1305 -2430 -977
1202i77K059j22k101j314J268K199j36k565j294K215J974o22k851l47J838J738
$$ -977 1082 960 -1141 -2455 -1187 1012 876 -1689 -2983 -768 1206 584 -2267 -2614 -776 962
1218I62n44k641m16K168J437j214k063P5K330J362j155k449J83K132J366j376
$$ 962 418 -2223 -2639 -471 966 -248 -2311 -2236 94 1456 301 -2148 -1965 167 1533 157
1234A57j828o7K198J242j239k245R3K356J096j782j863N08K242O82k072j719J116
$$ 157 -1671 -1738 460 1702 463 -1782 -1689 667 1763 -19 -1882 -1374 868 1550 -522 -2241 -1125
1251a125K431j8k213j169J036K205J29k185j170J397K152n53k029p49J567J793
$$ -1125 1306 1288 -925 -2094 -1058 1147 1276 -909 -2079 -682 1470 917 -1112 -1861 -294 1499
1267A499l47k104j065J921J606j065j657l2J292J066n36j618n26J668J454r84
$$ 1499 1152 -952 -2017 -96 1510 445 -1212 -1244 48 1114 578 -1040 -1566 102 1556 572
1283E72j990N0J953R49j360j306m51K073R55j033k202L51K120J371j779k207P99
$$ 572 -1418 -1368 585 1534 174 -1132 -1583 490 1445 412 -1790 -1439 681 2052 273 -1934 -1135
1300a135K439O78j823j797J080K162L12k286j098J063K076L71k608j160J505K065
$$ -1135 1304 1982 159 -1638 -558 1604 1916 -370 -1468 -405 1671 2042 -566 -1726 -221 1844
1316A844j84j699j279J232K182m51k251r75J517K119m02k331j010J393K737q67
$$ 1844 1660 -39 -1318 -86 2096 1645 -606 -1581 -64 2055 1653 -678 -1688 -295 2442 1575
1332A575k554m96J865J764j325k153n4K010J521j104k464L65K035J200j166k073
$$ 1575 -979 -1475 390 2154 829 -1324 -1378 632 2153 1049 -1415 -1050 985 2185 1019 -1054
1348a054p6K047J288j360k249K32K148J143j708j558k38K631Q27j169k167L4K621
$$ -1054 -1130 917 2205 845 -1404 -1172 976 2119 411 -1147 -1385 1246 2073 904 -1263 -1229 1392
1365A392P25j783j756N60K000N98j583j975J212K381K38k335j225P27K356K03
$$ 1392 2117 334 -1422 -862 1138 1736 153 -1822 -610 1771 2009 -326 -1551 -824 1532 1735
1381A735j894j762J495K209n39j765j218J810J732k21k115j115J647J991o93k105
$$ 1735 -159 -1921 -426 1783 1244 -521 -1739 71 1803 1582 -533 -1648 -1 1990 1297 -808
1397h08m50J369J679j98k353q04K042J591p27k351k56J921J575q39k259n65K193
$$ -808 -1258 111 1790 1592 -761 -1565 477 2068 1341 -1010 -1266 655 2230 1391 -868 -1433 760
1414G60J385j238j907p2K010J095j293k014m1K209R54j573j661L92J937O90j491
$$ 760 2145 907 -1000 -1072 938 2033 740 -1274 -1315 894 1848 275 -1386 -994 943 1633 142
1431A42j581M97J916N28j586j477P35J878J96j642j391P65J792L30j804r07P10
$$ 142 -1439 -942 974 1502 -84 -1561 -826 1052 1248 -394 -1785 -1020 772 1102 -702 -1609 -899
1448h99K011k50j420j187J001K400n31j668j144J391J748k42j708j083J614J358
$$ -899 1112 862 -558 -1745 -744 1656 1125 -543 -1687 -296 1452 1210 -498 -1581 33 1391
1464A391r0k151k28J220J411l47j803o20J341J711p91j982K9J597R25o25j886
$$ 1391 1301 -850 -1078 142 1553 1206 -597 -1217 124 1835 1044 -938 -909 688 1613 988 -898
1481h98L64J095J198j184j888M50J200J184j526j256J90J403J000j404j646L85
$$ -898 -534 561 1759 575 -1313 -863 337 1521 -5 -1261 -1071 332 1332 -72 -1718 -1333
1497a333J889K44j151j533O85J779L13j496j167O04J738k89r53q50N97J525M24
$$ -1333 556 800 -351 -1884 -1199 580 893 -603 -1770 -1166 572 283 -670 -1520 -923 602 1026
1514A026j886r80J492J383q0j598o39R62J773l99j477p55J698J145p59j459k81
$$ 1026 -860 -1840 -348 1035 955 -643 -1282 -320 1453 1054 -423 -1178 520 1665 906 -553 -834
1531h34J275J024m13j490k31J521Q03q73j481o9J091J427j382j268K48J772L59
$$ -834 441 1465 1052 -438 -669 852 1655 782 -699 -768 323 1750 368 -900 -652 1120 1479
1548A479j086j277k17J644O81j148j349K58J670L65j330r11N42J084N21j337j178
$$ 1479 393 -884 -1101 543 1224 76 -1273 -1015 655 1020 -310 -1221 -679 405 926 -411 -1589
1565a589O76J516K01j435p83Q57J218L11j967n74J064J368k79j583q12J072J636
$$ -1589 -913 603 804 -631 -1414 -557 661 972 -995 -1569 -505 863 584 -999 -1811 -739 897
1582H97l47j694l90J377J100m01j611j19J655J175o51j792n8J302R95k81j627
$$ 897 550 -1144 -1534 -157 943 542 -1069 -1188 467 1642 991 -801 -859 443 1438 1157 -470
1599d70p0J440R48q04j853M14J609J001j297j752M09J909K30j074j744O87J769
$$ -470 -540 900 1848 1044 -809 -395 1214 2215 918 -834 -425 1484 1714 640 -1104 -417 1352
1616A352O2j605r76N94J374K19j259j361K42J667M08j459j175R52J496m37j346
$$ 1352 1414 -191 -1167 -573 801 1020 -239 -1600 -1358 309 717 -742 -1917 -965 531 94 -1252
1633a252m66N13J614q1j273n06P45J677l2j492q47J089J918j48j947n42J201J586
$$ -1252 -1718 -1205 409 328 -945 -1451 -706 971 939 -553 -1400 -311 1607 1459 -488 -1030 171 1757
1651A757o67j471l63J570J016n18j559m85J293J268j001j653J56J229J292j364
$$ 1757 1090 -381 -744 826 1842 1324 -235 -720 573 1841 840 -813 -657 572 1864 500
1667E00j366l6J661J013j392j264O9J194J202j397j535L56J913K24r82j145L83
$$ 500 -866 -902 759 1772 380 -884 -815 379 1581 184 -1351 -995 918 1142 160 -985 -602
1684f02J582M86j351j259Q48J427J52j380p83K31J571J91j378j219R33J352L5
$$ -602 980 1466 115 -1144 -296 1131 1283 -97 -880 -649 922 1113 -265 -1484 -551 801 836
1701H36j411r99Q48J239O8j645q29J248J020n1j026p54J123J422l26j498o66J396
$$ 836 -575 -1574 -726 513 581 -1064 -1893 -645 375 324 -702 -1456 -333 1089 763 -735 -1401 -5
1719eJ122k92j295j75J415R04p67j328R8J003J397j466j016O9J443N22o64j338
$$ -5 1117 825 -470 -645 770 1674 907 -421 -323 680 2077 611 -405 -336 1107 1629 965 -373
1737c73r5J551M86j310j318K98J231N11r94j582P46J397N15j747r07O18J367K01
$$ -373 -468 1083 1569 259 -1059 -761 470 981 -13 -1595 -849 548 1063 -684 -1591 -973 394 595
1755E95j323p58Q70J312j82j215n54R98R67j62r49q95J013J246l38j192o97J161
$$ 595 -728 -1486 -616 696 514 -701 -1255 -257 710 548 -401 -1296 -283 963 625 -567 -1264 -103
1773a03J586o29j080o58J018Q56n28j232k22J143R27n22j257l12J172J232p78
$$ -103 1483 854 -226 -884 134 990 462 -770 -992 151 1078 556 -701 -1013 159 1391 613
1790F13j731J06J226Q18j009j052j40J497P57q02j359J86J493M83q13j480M29
$$ 613 -1118 -1012 214 1032 23 -1029 -1169 328 1085 283 -1076 -890 603 1086 273 -1207 -778
1807g78J340O67q67j524R40Q10L79j124p86P34R13M06j203j043M32J721l02j309
$$ -778 562 1229 362 -1162 -222 588 967 -157 -943 -209 704 1110 -93 -1136 -704 1017 715 -594
1825e94m45R55Q51O7j208p12Q87P65O1j246j21N73Q84Q9j181p91J088J198n12
$$ -594 -1039 -84 767 834 -374 -1086 -199 566 627 -619 -740 -167 717 806 -375 -1166 -78 1120 608
1844F08j266j70J109R46n32j409k60J125J043q07j110j23J347M03m85r50p8J003
$$ 608 -658 -828 281 1227 695 -714 -974 151 1194 387 -723 -846 501 904 419 -531 -609 394
1862C94P16j007r29J60J176Q09r97j511P00R64N57j234p08P22J037K63j169q46
$$ 394 1110 103 -826 -666 510 1319 322 -1189 -489 475 1032 -202 -910 -188 849 1112 -57 -903
1880i03O59J181l6p48r20N84J068q0r11n47P16J213p02q72m51N54J325m25j129
$$ -903 -244 937 901 153 -767 -183 885 805 -106 -653 63 1276 574 -298 -749 -195 1130 705 -424
1899d24n55J122O78l1j145o06Q34Q70l13q89l31R70J019p66j140p3R62Q02o94
$$ -424 -979 143 821 790 -355 -961 -127 743 430 -459 -790 180 1199 433 -707 -780 182 984 290
1918B90p69m54J108Q91j157p59j02J156O90r56r03K82O11J066j000j082P06O33
$$ 290 -479 -933 175 1066 -91 -850 -952 204 894 -62 -965 -683 -72 994 -6 -1088 -382 251
1936B51N99p73j235O09J310J59r28p88P88Q62N8j035p00Q49J247l03q16q97J039
$$ 251 850 77 -1158 -549 761 920 -8 -796 -8 854 912 -123 -823 26 1273 970 154 -743 296
1955B96P73j20q82q06Q68R50j08j141n35J039P02k20r28l93N19Q93n12j619K88
$$ 296 1069 949 67 -739 129 1079 971 -170 -705 334 1036 816 -112 -505 14 907 395 -1224 -936
1974i36J155N31p33q88LR69N11m77r10l77J149M10m33p53m13J029Q15n80j035
$$ -936 219 750 17 -871 -868 101 612 135 -775 -1152 -3 407 -26 -779 -1192 -163 652 72 -963
1993i63M07R25N30r47o99p6J104M37n48r31M60J167P2r69n74N09Q86J68j005l50
$$ -963 -556 369 899 -48 -747 -823 281 718 170 -761 -301 866 938 -31 -605 -96 790 958 -47 -397
2013c97K37J030j24o53m78M30R84J88j403m17O49R83l14j041m58O76J062m02j077
$$ -397 -160 870 746 93 -385 45 1029 1217 -186 -603 46 1029 715 -326 -784 -108 954 552 -525
2032e25q6Q41L11Jj208M1N23Q85l36j087m29J056L85k23r21j42P56N64o70o76
$$ -525 -611 230 541 542 -666 -625 -102 783 447 -640 -1069 -13 372 149 -772 -914 -158 406 -264 -940
2052i40l07J290M65n71o81Q2R76o8j93n99J55Q58J49m31j115M15J357j20q37m17
$$ -940 -1247 43 508 -63 -744 -662 314 246 53 -546 -391 467 616 185 -930 -515 842 722 -115 -532
2072e32M08Q88K43j208l13R20N83k44p31o73Q22Q51l19p69m49N83N62k0q55k10
$$ -532 -124 764 1007 -201 -514 406 989 745 14 -659 163 1014 695 -74 -523 60 622 602 -253 -463
2092d63R35M03l85j128K60P86K23p51m18K9N00N91n71q22J42J189l42m30p38J13
$$ -463 472 875 490 -638 -378 408 631 -120 -538 -509 -9 582 11 -811 -669 520 178 -252 -990 -877
2112h77Q45L30o59m86K0J079L62r96o57M99J034k46o94p08P67Q37J38p65n00N18
$$ -877 -32 298 -361 -847 -827 252 614 -382 -1039 -540 494 248 -446 -1154 -387 450 588 -177 -677 -159
2132a59R13j6o93n94Q73R72n00o42p41J237Q57n09j001m76P18J223j84r87n39
$$ -159 754 738 45 -549 324 1296 796 154 -587 650 1507 998 -3 -479 239 1462 1278 291 -248
2151b48K65J242o42j184j40P35J110p79j270J3J246L72l27j256p0R72Q50p92j034
$$ -248 17 1259 617 -567 -707 28 1138 359 -911 -898 348 720 393 -863 -933 39 889 97 -937
2170i37j25J189P79r40j087O18P74L88q92o46M55J095K69n84j211L63J160P05
$$ -937 -1062 127 906 -34 -1121 -503 271 659 -233 -879 -424 671 940 356 -855 -492 668 1373
2188A373r62j034M82P46P09r27j025L29J520l46j116m62M33J192N1q65j129O75
$$ 1373 411 -623 -141 605 1314 387 -638 -309 1211 865 -251 -713 -280 912 963 98 -1031 -356
2206c56J236N9j034o96O91J083O3j360p38J493P61j43j100o87Q36J041p4r76q45
$$ -356 880 939 -95 -791 -100 983 1046 -314 -1052 441 1202 1059 -41 -728 108 1149 1075 99 -746
2225g46J125R09k59r49o48J001N70j47j241l35Q16P21o36r27k44Q47P65l67j113
$$ -746 379 1288 1029 80 -568 433 1003 856 -385 -720 96 817 181 -746 -990 -143 622 255 -858
2244h58l40J199N39l24p76j92Q01P34m97q09J06N14O81j96j185JJ080M10l14j075
$$ -858 -1198 1 540 216 -560 -752 49 783 286 -523 -417 97 778 582 -603 -602 478 888 574 -501
2264e01L48R44R6n78p84M72Q88J71n80r86J58J360m03o06k96K63P75j53n99l04
$$ -501 -153 791 887 309 -475 -3 885 1056 476 -510 -352 1008 605 -1 -297 -34 741 588 -11 -315
2284c15K75L61P5m55m54J28P54L4m87o66N81N60J08q82j74N37O00m28m06K23L62
$$ -315 -40 321 396 -59 -513 -385 369 403 -84 -750 -169 391 499 -383 -557 -20 580 152 -254 -31 331
2305C31L2p8l21k55L74J58J68n97Q4K39J58j33j37n01Q46r0l57l16M25J00L09
$$ 331 363 285 -36 -291 83 241 409 -188 -104 135 293 160 23 -478 368 278 -79 -395 30 130 439
2326D39r74L46K90J03j64k90j48M95j31l9j0l30M36L80m47j84P8M35r1j80k62
$$ 439 -535 -189 101 204 40 -250 -398 97 -34 -73 -83 -413 23 403 -44 -228 -150 285 194 14 -248
2347b48j11M25K52j95n26K47K82J64n81l18K81Q88k00q15j16L63O15k3o49l44
$$ -248 -359 66 318 123 -403 -156 126 290 -291 -609 -328 560 360 -455 -571 -208 407 384 -265 -609
2367f09L88N80R3r61j28N09P1M47r14J3N99O46k80q48J10L02N54m72n51k93R19
$$ -609 -221 359 452 -509 -637 -128 -57 390 -524 -511 88 734 454 -394 -284 18 572 100 -451 -744 175
2388A75P47n88j154K42R24K29l74j057J79P63N87p10q14k8R55Q07q19p07l59J238
$$ 175 922 334 -820 -578 346 575 201 -856 -677 86 673 -37 -851 -879 76 883 64 -643 -1002 236
2408B36L17l79j185K15J315L47p21r06J66Q18P68r80r42J50J469K20j224o54L83
$$ 236 553 174 -1011 -796 519 866 145 -761 -595 223 991 11 -931 -781 688 908 -316 -970 -587
2427e87J016N43j137j267R22J387j34p84j026M63J269K86r74j346R25J490j2j717
$$ -587 429 972 -165 -1432 -510 877 743 -41 -1067 -604 665 951 -23 -1369 -444 1046 1034 -683
2445f83l76N30J282J05j457k86K52J825k87j164q95O62J373l17r23j010R91J052
$$ -683 -1059 -529 753 858 -599 -885 -633 1192 905 -259 -1154 -492 881 564 -359 -1369 -378 674
2463F74J1j249n82O73J602o48j266o15R11J358k48j172m80P73P50n3j202m82J290
$$ 674 685 -564 -1146 -473 1129 481 -785 -1400 -489 869 621 -551 -1031 -258 492 439 -763 -1245 45
2482D5R52m95j185L4N57J202l65j563J3P99J146n11j467J15O30J203m41j432j21
$$ 45 997 502 -683 -649 -92 1110 745 -818 -805 -6 1140 629 -838 -723 -93 1110 669 -763 -884
2501h84J084R60m73j215j26P47R44o50r59j09N94P50n32n57k48O24N99k28q74
$$ -884 200 1160 687 -528 -654 93 1037 387 -572 -681 -87 663 131 -426 -674 -50 549 321 -553
2520e53j87R85L29n43p87N3R46O26q17q36K94L96P66n04q04o4O65P00n77p07j81
$$ -553 -740 245 574 31 -756 -703 243 869 52 -784 -490 -94 672 168 -636 -700 -35 665 88 -619 -800
2541h00J080K81n37o61N3P36O06n95n78K3O50M03m31m92j03M30L26l40m00M17
$$ -800 280 561 24 -637 -584 152 758 163 -415 -392 258 661 230 -262 -365 65 391 51 -349 68
2561F8J98J61m00K3oK60l06M67j058M44O15n40M08m87K62j58j07K52m77J31N21
$$ 68 266 427 27 50 44 304 -2 465 -593 -149 466 -74 334 -153 109 -49 -156 96 -381 -250 271
2582B71l92J58q4k42j37M76L3k36J97l00J27j85K54k85J70l23K91Q7J41k23P3
$$ 271 -121 37 -47 -289 -426 50 83 -153 44 -256 -129 -314 -60 -345 -175 -498 -207 -120 21 -202 -129
2603a29K7L94m40j01M58j26J11o5m30K3J86L19l89J85l65O40j15n11n8j0N29N05
$$ -129 -102 292 -148 -249 209 83 194 129 -301 -278 -92 227 -162 23 -342 298 183 -328 -386 -396 133 638
2625F38n04n92L28L63K30k50l73k2N40K09m94o43M5O78N36o23o68K92N24K78n53
$$ 638 134 -458 -130 233 463 213 -160 -182 358 567 73 -570 -525 153 689 66 -602 -310 214 492 -61
2646f1m62J20O90K89o42r31J47J178k8l37p26K4J330j32q15n47L22J072M9q18
$$ -61 -523 -403 287 576 -66 -997 -850 328 300 -37 -763 -739 591 459 -356 -903 -581 491 540 -278
2666b78n13J78J115J31q17p08N66R16L17j289n35P53J093k19q35o18N94P33j10
$$ -278 -791 -613 502 633 -184 -892 -326 590 907 -382 -917 -164 929 710 -125 -743 -149 584 474
2685D74q21q57J225Q52p6r37o89P09J070k19j142n97Q92J138j98j131o71P00J313
$$ 474 -347 -1204 21 873 797 -140 -829 -120 950 731 -411 -1008 -116 1022 824 -307 -978 -278 1035
2704A035m98j095o52J074J057l40j165l36P48J256l91r84p63Q79J217l73j162
$$ 1035 537 -558 -1210 -136 921 581 -584 -920 -172 1084 693 -291 -1054 -175 1042 669 -493
$$ [...]
8191I5
##END NTUPLES=NMR FID
##END=
