##TITLE=1H_CA-8668-2
 DMSO, 8 sc, 
 21.11.2019
##JCAMPDX= 6.0         $$ Bruker NMR JCAMP-DX V2.0
##DATA TYPE= NMR FID
##DATA CLASS= NTUPLES
##ORIGIN= UXNMR, Bruker Analytische Messtechnik GmbH
##OWNER= root
$$ XWIN-NMR		Version 3.5
$$ Thu Nov 21 16:11:26 2019 Russian Standard Time (UT+4h)  she@DPX200
##.OBSERVE FREQUENCY= 200.1315
##.OBSERVE NUCLEUS= ^1H
##.DELAY= (6, 6)
##.ACQUISITION MODE= SIMULTANEOUS
##.ACQUISITION SCHEME= undefined
##.AVERAGES= 8
##.DIGITISER RES= 18
##SPECTROMETER/DATA SYSTEM= spect
##.PULSE SEQUENCE= zg30
##.SOLVENT NAME= CDCl3
##.SHIFT REFERENCE= (INTERNAL, CDCl3, 0, 15.7039)
##AUDIT TRAIL= $$ (NUMBER, WHEN, WHO, WHERE, WHAT)
$$ ##TITLE= Audit trail, XWIN-NMR		Version 3.5
$$ ##JCAMPDX= 5.01
$$ ##ORIGIN= Bruker BioSpin GmbH
$$ ##OWNER= she
$$ F:/spectra/data/she/nmr/H-F/1/audita.txt
$$ ##AUDIT TRAIL=  $$ (NUMBER, WHEN, WHO, WHERE, WHAT)
(   1,<2019-11-21 16:10:34.01 +0400>,<she>,<DPX200>,
      <created by zg, POWCHK disabled, PULCHK disabled
       configuration hash MD5:
       00 E9 B6 7A A2 85 ED C7 34 08 36 98 17 FE 4E 26
       data hash MD5: 16K
       E9 7F ED 33 42 80 D9 D4 E6 1A 05 68 E6 EA F0 67>)
$$ ##END=
$$ 
$$ hash MD5
$$ 00 54 E7 87 94 E8 C5 74 05 83 17 9F CE D2 BB 97
##$RELAX= 
##$RELAX= 
##$RELAX= 
##$RELAX= 
##$RELAX= 
##$RELAX= 
$$ Bruker specific parameters
$$ --------------------------
##$DU= <F:/spectra>
##$EXPNO= 1
##$NAME= <H-F>
##$PROCNO= 1
##$TYPE= <nmr>
##$USER= <she>
##$AMP= (0..31)
100 100 100 100 100 100 100 100 100 100 100 100 100 100 100 100 100 100 
100 100 100 100 100 100 100 100 100 100 100 100 100 100 
##$AQSEQ= 0
##$AQ_mod= 1
##$AUNM= <au_zg>
##$AUTOPOS= <>
##$BF1= 200.13
##$BF2= 200.13
##$BF3= 200.13
##$BF4= 200.13
##$BF5= 200.13
##$BF6= 200.13
##$BF7= 200.13
##$BF8= 200.13
##$BYTORDA= 1
##$CFDGTYP= 0
##$CFRGTYP= 5
##$CHEMSTR= <none>
##$CNST= (0..31)
1 1 145 1 1 1 1 1 1 1 1 1 1 1 1 1 1 1 1 1 1 1 1 1 1 1 1 1 1 1 1 1 
##$CPDPRG= <>
##$CPDPRG1= <>
##$CPDPRG2= <>
##$CPDPRG3= <>
##$CPDPRG4= <mlev>
##$CPDPRG5= <mlev>
##$CPDPRG6= <mlev>
##$CPDPRG7= <mlev>
##$CPDPRG8= <mlev>
##$CPDPRGB= <>
##$CPDPRGT= <>
##$D= (0..31)
0 1.2 0 0 0 0 0 0 0 0.06 0 0.03 0 0 0 0 0.0002 0 0 0 0 0 0 0 0 0 0 0 0 
0 0 0 
##$DATE= 1574338233
##$DBL= (0..7)
120 120 120 120 120 120 120 120 
##$DBP= (0..7)
150 150 150 150 150 150 150 150 
##$DBP07= 0
##$DBPNAM0= <>
##$DBPNAM1= <>
##$DBPNAM2= <>
##$DBPNAM3= <>
##$DBPNAM4= <>
##$DBPNAM5= <>
##$DBPNAM6= <>
##$DBPNAM7= <>
##$DBPOAL= (0..7)
0.5 0.5 0.5 0.5 0.5 0.5 0.5 0.5 
##$DBPOFFS= (0..7)
0 0 0 0 0 0 0 0 
##$DE= 6
##$DECBNUC= <off>
##$DECIM= 24
##$DECNUC= <off>
##$DECSTAT= 4
##$DIGMOD= 1
##$DIGTYP= 9
##$DL= (0..7)
0 120 120 120 120 120 120 120 
##$DP= (0..7)
150 150 150 150 150 150 150 150 
##$DP07= 0
##$DPNAME0= <>
##$DPNAME1= <>
##$DPNAME2= <>
##$DPNAME3= <>
##$DPNAME4= <>
##$DPNAME5= <>
##$DPNAME6= <>
##$DPNAME7= <>
##$DPOAL= (0..7)
0.5 0.5 0.5 0.5 0.5 0.5 0.5 0.5 
##$DPOFFS= (0..7)
0 0 0 0 0 0 0 0 
##$DQDMODE= 0
##$DR= 18
##$DS= 0
##$DSLIST= <SSSSSSSSSSSSSSS>
$$ [...]
##$SUBNAM2= <"">
##$SUBNAM3= <"">
##$SUBNAM4= <"">
##$SUBNAM5= <"">
##$SUBNAM6= <"">
##$SUBNAM7= <"">
##$SUBNAM8= <"">
##$SUBNAM9= <"">
##$SW= 24.9337058887773
##$SWIBOX= (0..15)
0 0 2 0 0 0 0 0 0 0 0 0 0 0 0 0 
##$SW_h= 4990.01996007984
##$TD= 16384
##$TD0= 1
##$TE= 0
##$TE2= 300
##$TE3= 300
##$TEG= 300
##$TL= (0..7)
0 120 120 120 120 120 120 120 
##$TP= (0..7)
150 150 150 150 150 150 150 150 
##$TP07= 0
##$TPNAME0= <>
##$TPNAME1= <>
##$TPNAME2= <>
##$TPNAME3= <>
##$TPNAME4= <>
##$TPNAME5= <>
##$TPNAME6= <>
##$TPNAME7= <>
##$TPOAL= (0..7)
0.5 0.5 0.5 0.5 0.5 0.5 0.5 0.5 
##$TPOFFS= (0..7)
0 0 0 0 0 0 0 0 
##$TUNHIN= 0
##$TUNHOUT= 0
##$TUNXOUT= 0
##$USERA1= <user>
##$USERA2= <user>
##$USERA3= <user>
##$USERA4= <user>
##$USERA5= <user>
##$V9= 5
##$VALIST= <valist>
##$VCLIST= <CCCCCCCCCCCCCCC>
##$VD= 0
##$VDLIST= <DDDDDDDDDDDDDDD>
##$VPLIST= <PPPPPPPPPPPPPPP>
##$VTLIST= <TTTTTTTTTTTTTTT>
##$WBST= 1024
##$WBSW= 4
##$XGAIN= (0..3)
0 0 0 0 
##$XL= 0
##$YL= 0
##$YMAX_a= 463779
##$YMIN_a= -287373
##$ZGOPTNS= <>
##$ZL1= 120
##$ZL2= 120
##$ZL3= 120
##$ZL4= 120
##$ABSF1= 10
##$ABSF2= 0
##$ABSG= 5
##$ABSL= 3
##$ALPHA= 0
##$AQORDER= 0
##$ASSFAC= 0
##$ASSFACI= 0
##$ASSFACX= 0
##$ASSWID= 0
##$AUNMP= <proc_1d>
##$AZFE= 0.1
##$AZFW= 0.1
##$BCFW= 1
##$BC_mod= 2
##$BYTORDP= 1
##$COROFFS= 0
##$CY= 11.3945322036743
##$DATMOD= 1
##$DC= 2
##$DFILT= <>
##$DTYPP= 0
##$F1P= 16.9975609425685
##$F2P= -3.02152046262296
##$FCOR= 0.5
##$FTSIZE= 0
##$FT_mod= 4
##$GAMMA= 1
##$GB= 0.15
##$INTBC= 1
##$INTSCL= 1
##$ISEN= 128
##$LB= 0.24
##$LEV0= 0
##$LPBIN= 0
##$MAXI= 10000
##$MC2= 0
##$MEAN= 0
##$ME_mod= 0
##$MI= 1.114404
##$NCOEF= 0
##$NC_proc= 0
##$NLEV= 6
##$NOISF1= 3.799351
##$NOISF2= 2.8
##$NSP= 1
##$NTH_PI= 0
##$NZP= 0
##$OFFSET= 15.70392
##$PC= 1
##$PHC0= -9785.934
##$PHC1= 9.200859
##$PH_mod= 1
##$PKNL= yes
##$PPARMOD= 0
##$PSCAL= 0
##$PSIGN= 0
##$REVERSE= no
##$SF= 200.130013532006
##$SI= 16384
##$SIGF1= 3
##$SIGF2= 2
##$SINO= 400
##$SIOLD= 16384
##$SREGLST= <1H.CDCl3>
##$SSB= 0
##$STSI= 0
##$STSR= 0
##$SW_p= 3612.71676300578
##$SYMM= 0
##$S_DEV= 0
##$TDeff= 0
##$TDoff= 0
##$TI= <>
##$TILT= no
##$TM1= 0
##$TM2= 0
##$TOPLEV= 0
##$USERP1= <user>
##$USERP2= <user>
##$USERP3= <user>
##$USERP4= <user>
##$USERP5= <user>
##$WDW= 1
##$XDIM= 8192
##$YMAX_p= 0
##$YMIN_p= 0
$$ End of Bruker specific parameters
$$ ---------------------------------
##NTUPLES= NMR FID
##VAR_NAME=  TIME,          FID/REAL,        FID/IMAG
##SYMBOL=    X,             R,               I
##VAR_TYPE=  INDEPENDENT,   DEPENDENT,       DEPENDENT
##VAR_FORM=  AFFN,          ASDF,            ASDF
##VAR_DIM=   8192,          8192,            8192
##UNITS=     SECONDS,       ARBITRARY UNITS, ARBITRARY UNITS
##FACTOR=    0.0002004,     1,               1
##FIRST=     0,             0,               0
##LAST=      1.6414764,     0,               0
##MIN=       0,             -287373,         0
##MAX=       1.6414764,     463779,          0
$$ Real data points
##PAGE= N=1
##DATA TABLE= (X++(R..R)), XYDATA
$$ [...]
$$ plain form
1913 -155 120 47 -45 16 80 184 46 -366 -89 -48 195 75 -236 -208 113 -99 -347 116 -4 6 35 53 -208
1936 -208 -78 -215 124 87 -72 -48 -64 -201 -41 -262 127 -88 -79 -356 -165 -11 19 -49 100 4 180 157 221
1959 221 -152 192 -147 -4 -87 -96 -13 62 167 253 185 160 311 -122 -34 160 311 -139 -71 -204 -125 72 0 130
1983 130 178 -156 81 1 144 -105 247 223 -46 -240 23 -58 86 62 -19 -183 88 -63 -472 90 -33 134
2005 134 75 82 -239 90 -178 227 50 135 -94 257 95 -84 -89 -102 245 160 107 -282 -88 361 253 3 383
2028 383 22 -158 -95 168 298 25 5 87 -196 222 66 86 -162 111 72 -38 -94 -23 42 -152 -63 -3 -59 66
2052 66 118 85 -144 -80 112 -40 -47 -18 -212 223 -161 120 -8 227 276 -70 -230 -114 217 92 -33 186 -6
2075 -6 -255 43 -24 -104 -131 -168 11 -123 30 7 -4 -99 14 172 -21 100 106 -194 11 115 66 -82 126 -75
$$ packed form
1913a55K75p3r2O1O4J04j38m12K77M1K43j20l11K8L21k12k48M63j20J0K9J8k61
1936b08J30j37L39l7j59K4j6j37J60k21L89k15Rk77J91J54L0o8J49r6J76k3O4
1959B21l73L44l39J43q3rQ3P5J05Q6o8k5J51m33Q8J94J51m50O8j33P9J97p2J30
1983A30M8l34K37q0J43k49L52k4k69j94K63q1J44k4q1j64K71j51m09N62j23J67
2005A34n9Pl21L29k68M05j77Q5k29L51j62j79nj3L47q5n3l89J94M49j08k50L80
2028C83l61j80O3K63J30k73k0Q2k83M18j56K0k48K73l9j10n6P1O5j94Q9O0n6J25
2052F6N2l3k29O4J92j52pK9j94M35l84K81j28K35M9l46j60J16L31j25j25K19j92
2075fk49K98o7q0k7l7J79j34J53k3j1r5J13J58j93J21Ol00K05J04m9j48K08k01
$$ plain form
2099 -75 -36 -137 78 197 -79 -85 166 241 -137 61 79 40 -259 -332 120 266 173 -146 290 -206 86 -29 -194
2122 -194 -147 -218 50 -101 -250 -8 32 -8 -152 97 50 63 224 160 126 -10 215 127 -75 -195 256 -18 -76
2145 -76 29 -31 -58 75 89 -17 141 -50 7 0 55 -44 127 152 -27 2 145 2 150 124 242 283 188 62 -317
2170 -317 207 10 -152 -112 188 30 139 150 -157 22 78 119 -26 -109 -40 -144 99 -290 4 42 -23 -133 -460
2193 -460 -161 -23 -47 75 112 46 172 37 128 21 169 -221 -63 134 -101 -126 -139 -160 -259 9 -190 22 249
2216 249 79 178 -108 26 -69 142 105 45 -125 -8 -229 17 -60 219 -34 -113 -273 -203 87 -52 -105 323 294
2239 294 112 -39 -246 156 -210 -175 23 -40 52 283 -147 128 -142 69 41 -159 -138 -133 38 101 -148 -373 -212
2262 -212 252 57 115 -82 -210 -23 242 -119 -201 174 -22 -34 -96 -269 -10 244 192 -235 105 -73 120 56
$$ packed form
2099g5L9j01K15J19k76oK51P5l78J98J8l9k99p3M52J46r3l19M36m96K92j15j65
2122a94M7p1K68j51j49K42M0m0j44K49m7J3J61o4l4j36K25q8k02j20M51k74n8
2145g6J05o0k7J33J4j06J58j91N7pN5r9J71K5j79K9J43j43J48k6J18M1r5j26l79
2170c17N24j97j62M0L00j58J09J1l07J79N6M1j45q3O9j04K43l89K94L8o5j10l27
2193d60K99J38k4J22L7o6J26j35R1j07J48l90J58J97k35k5j3k1r9K68j99K12K27
2216B49j70R9k86J34r5K11l7o0j70J17k21K46p7K79k53p9j60P0K90j39n3M28k9
2239B94j82j51k07M02l66L5J98o3R2K31m30K75k70K11k8k00K1NJ71O3k49k25J61
2262b12M64j95N8j97j28J87K65l61q2L75j96j2o2j73K59K54n2m27L40j78J93o4
$$ plain form
2284 56 45 196 436 180 9 -123 -132 117 131 -77 -98 92 116 -9 -208 324 -77 66 16 -123 -52 124 -346
2307 -346 -100 -200 -188 62 -122 44 199 -66 -236 -5 6 -37 -247 -254 -39 -333 -167 144 -3 -111 -90 220
2329 220 -147 -438 1 200 181 -38 2 83 -179 101 37 108 -399 -135 46 -16 -169 -210 -5 -446 99 -153
2351 -153 -39 -50 -67 163 -135 245 62 254 188 195 23 -62 -29 50 -133 -133 -84 64 7 -20 -34 174 200 -202 -59
2376 -59 -58 69 64 -66 -87 -243 429 19 -285 191 103 110 152 -96 182 -158 -100 -39 127 128 -15 68 97 -78 -7 -62
2402 -62 -120 384 21 -161 260 194 -114 -10 118 128 -59 99 -42 124 -231 338 -50 214 -120 -69 -201 100
2424 100 207 -141 110 131 -20 170 -54 77 237 98 198 -285 -201 -74 373 114 74 -39 -245 -415 -427
2445 -427 316 -88 -18 -122 116 -14 -259 -343 -26 -37 206 26 -48 -206 150 -139 166 154 67 234 -56 -128
$$ packed form
2284E6j1J51K40k56j71j32rK49J4k08k1J90K4j25j99N32m01J43n0j39P1J76m70
2307c46K46j00J2K50j84J66J55k65j70K31J1m3k10pK15k94J66L11j47j08K1L10
2329B20l67k91M39J99j9k19M0Q1k62K80o4P1n07K64J81o2j53m1K05m41N45k52
2351a53J14j1j7K30k98L80j83J92o6Pj72q5L3P9j83%M9J48n7k7j4K08K6m02J43
2376e9JJ27nj30k1j56O72m10l04M76q8PM2k48K78l40N8O1J66Jj43Q3K9j75P1n5
2402f2n8N04l63j82M21o6l08J04J28J0j87J58j41J66l55N69l88K64l34N1j32L01
2424A00J07l48K51K1j51J90k24J31J60j39J00m83Q4J27M47k59m0j13k06j70j2
2445d27P43m04P0j04K38j30k45q4L17j1K43j80p4j58L56k89L05j2q7J67k90p2
$$ plain form
2467 -128 -201 325 -47 19 -43 106 164 -39 -139 -1 -29 82 13 -98 -28 28 180 -98 -40 -321 -55 47 -52
2490 -52 180 26 57 -103 139 -161 48 260 -49 5 -38 158 -113 29 -6 186 -11 82 105 -60 25 -145 60
2513 60 -97 65 -6 159 -136 145 -244 -76 118 -464 -88 8 -28 -170 62 364 73 -73 -200 208 -24
2534 -24 -111 215 28 13 -91 -152 -32 99 -264 -111 217 126 -191 -36 104 -281 49 105 -110 -59 -25 -336 186
2557 186 -56 -40 403 -9 -134 147 -145 130 75 345 -21 -3 241 -112 52 136 -167 -53 -308 -207 -3
2578 -3 230 210 -18 174 172 -100 61 129 -174 -40 -142 -7 6 -75 7 -304 106 -69 106 131 -54 -27 39 107
2602 107 24 103 127 61 147 76 269 199 74 -93 -130 45 -83 -322 -166 91 -175 -88 268 -124 -80 198 -19
2625 -19 54 -7 -185 -38 -107 -256 -54 19 61 155 -54 23 -72 -252 -205 -61 -31 -218 -285 -48 53 -159 -106 187
$$ packed form
2467a28p3N26l72O6o2J49N8k03j00J38k8J11o9j11P0N6J52k78N8k81K66J02r9
2490e2K32j54L1j60K42l00K09K12l09N4m3J96k71J42l5J92j97R3K3j65Q5j70K05
2513F0j57J62p1J65k95K81l89J68J94n82L76R6l6j42K32L02k91j46j27M08k32
2534b4q7L26j87j5j04o1J20J31l63J53L28r1l17J55J40l85L30N6k15N1L4l11N22
2557A86k42J6M43m12j25K81k92K75n5K70l66J8K44l53J64Q4l03J14k55J01K04
2578cK33k0k28J92kk72J61O8l03J34j02J35J3q1Q2l11M10j75J75K5j85K7O6O8
2602A07q3P9K4o6Q6p1J93p0j25j67l7J75j28k39J56K57k66Q7L56l92M4K78k17
2625a9P3o1j78J47o9j49K02P3M2R4k09P7r5j80M7J44L0j87o7K37J01k12N3K93
$$ plain form
2649 187 75 17 2 -28 193 -52 165 -127 -52 109 63 -90 -223 217 -214 -106 168 52 -125 -47 161 416
2671 416 -112 157 24 34 319 39 193 120 37 -20 -87 245 90 249 -8 -8 82 -35 1 39 -138 -94 99 218
2695 218 7 -105 -202 52 21 -179 -64 56 155 131 -18 -229 -75 57 200 58 167 339 -59 56 -21 4
2717 4 -165 -100 4 -50 -194 -8 368 -86 -336 -127 153 -96 -88 -63 -264 -287 202 188 153 -133 -203 33 126 -39
2741 -39 57 -93 -24 6 18 -67 -61 -410 -117 -57 37 -178 188 229 2 -67 15 -164 143 -114 -227 -163 -374 115 -294
2766 -294 227 65 -42 152 -214 -48 135 23 49 246 -147 -64 -187 41 -64 -50 -241 37 101 -248 119
2787 119 71 -33 4 -251 28 47 69 -103 -107 -109 -180 9 107 54 -208 -169 -130 136 164 -128 58 152 62 226 -147
2812 -147 -73 -128 21 -32 -181 94 -25 210 -30 79 -258 -37 55 156 222 -171 -80 -122 93 186 56 -44 -168
$$ packed form
2649A87j12n8j5l0K21k45K17k92P5J61m6j53j33M40m31J08K74j16j77P8K08K55
2671D16n28K69j33J0K85k80J54p3q3n7o7L32j55J59k57%R0j17L6L8j77M4J93J19
2695B18k11j12r7K54l1k00J15J20R9k4j49k11J54J32J43j42J09J72l98J15p7K5
2717Dj69O5J04n4j44J86L76m54k50K09K80k49QK5k01k3M89j4l5k86p0K36R3j65
2741c9R6j50O9L0J2q5Ol49K93O0R4k15L66M1k27o9Q2j79L07k57j13O4k11M89m09
2766b94N21j62j07J94l66J66J83j12K6J97l93Q3j23K28j05J4j91K78O4l49L67
2787A19m8j04L7k55K79J9K2j72mkp1J89R8n3k62L9L9K66K8k92J86R4r0J64l73
2812a47P4n5J49n3j49K75j19K35k40J09l37K21R2J01O6l93R1m2K15R3j30j00j24
$$ plain form
2835 -168 -4 132 -99 153 -2 331 279 -46 -132 80 -247 52 189 -187 -211 131 17 -151 -27 75 499
2856 499 131 -128 -79 -5 298 -14 -140 156 -224 112 150 87 12 343 279 -37 -26 -221 159 -176 8 -59 -10
2879 -10 -8 -206 134 -56 -178 276 -132 5 -16 -27 149 349 -284 -66 204 243 -3 5 70 -255 9 -41 70
2902 70 193 -277 -39 21 -125 -76 -60 -230 86 88 -13 136 99 -52 519 93 -52 -61 -24 -230 -55 126 201 -15
2926 -15 -116 -54 -73 136 -27 -92 -82 3 6 -37 81 -1 -176 -233 -18 240 167 -129 -109 -90 45 27 160 -135 308
2951 308 -148 -41 84 -19 -8 -65 13 31 28 -77 121 -63 -250 219 51 -14 261 -188 86 68 139 24 77
2974 77 183 -297 -197 -121 221 -331 20 -58 -272 97 119 -339 307 103 -194 -32 -60 90 74 -28 89 261
2996 261 -114 74 -103 -133 -261 68 -8 -196 -169 -127 -53 -256 -49 -176 70 -101 190 179 303 385 -335 -298 -128
$$ packed form
2835a68J64J36k31K52j55L33n2l25q6K12l27K99J37l76k4L42j14j68J24J02M24
2856D99l68k59M9P4L03l12j26K96l80L36L8o3p5L31o4l16J1j95L80l35J84o7M9
2879a0Kj98L40j90j22M54m08J37k1j1J76K00o33K18K70L9k46QO5l25K64n0J11
2902G0J23m70K38O0j46M9J6j70L16Kj01J49l7j51N71m26j45rL7k06J75J81P5k16
2926a5j01O2j9K09j63o5J0Q5Lm3J18q2j75n7K15K58p3k96K0J9J35j8J33k95M43
2951C08m56J07J25j03J1n7P8J8lj05J98j84j87M69j68o5K75m49K74j8P1j15N3
2974G7J06m80J00P6L42n52L51p8k14L69K2m58O46k04k97J62k8J50j6j02J17J72
2996B61l75J88j77l0j28L29p6j88K7M2P4k03K07j27K46j71K91j1J24Q2p20L7J70
$$ plain form
3019 -128 105 -37 -176 21 -160 -14 96 -112 -64 -72 -106 -72 47 9 191 188 360 -16 160 112 -43 346 -143
3042 -143 167 24 -159 66 19 -257 50 144 -188 59 161 -138 -56 -53 -211 -60 174 -49 29 55 233 121
3064 121 -25 -5 148 225 113 -91 42 27 72 -87 152 68 225 -169 13 75 98 -48 -278 129 54 243 -136
3087 -136 133 -347 228 113 9 -229 -60 65 524 -129 -227 -47 -333 164 -103 136 244 21 -197 83
3107 83 -207 10 -125 114 -51 286 -136 266 2 -4 -181 -227 -249 370 -235 -75 -100 -215 -339 -68 48 2
3129 2 193 -114 -85 -184 31 4 270 17 222 -44 203 -329 50 174 -238 107 51 -118 -229 147 80 -75
3151 -75 -19 -62 160 -66 115 56 145 -7 -35 10 -41 -159 -191 -116 -69 190 121 87 -52 346 -365 -398 -244 -76 -176
3176 -176 155 -154 83 -39 -16 -78 190 29 49 221 -134 -17 -75 -75 358 -67 -255 199 -165 138 184 -23
$$ packed form
3019a28K33j42j39J97j81J46J10k08M8ql4L4J19l8J82lJ72l76J76m8j55L89m89
3042a43L10j43j83K25m7k76L07R4l32K47J02k99Q2Lj58J51K34k23P8K6J78j12
3064A21j46K0J53P7j12k04J33j5M5j59K39q4J57l94J82O2K3j46k30M07p5J89l79
3087a36K69m80N75j15j04k38J69J25M59o53r8J80k86M97k67K39J08k23k18K80
3107H3k90K17j35K39j65L37m22M02k64oj77m6k2O19o05J60k5j15j24K71J16m6
3129BJ91l07K9r9K15k7K66k53K05k66K47n32L79J24m12L45n6j69j11L76o7j55
3151g5N6m3K22k26J81n9Q9j52k8M5n1j18l2P5M7K59o9l4j39L98p11l3J54J68j00
3176a76L31l09K37j22K3o2K68j61K0J72l55J17n8%M33m25j88M54l64L03M6k07
$$ plain form
3198 -23 -31 5 -254 -306 116 -273 175 95 -189 -273 -238 -26 -168 -203 160 -104 300 -122 -44 289 -222 -80 28
3221 28 139 -20 -63 117 275 -44 157 52 -236 -255 -215 -158 -11 108 -96 -161 -8 -408 -248 -85 56 -86
3243 -86 126 174 163 120 111 91 45 35 19 110 -49 191 -13 -197 62 55 -189 -107 108 -6 -266 89 -307 299 37
3268 37 2 16 375 13 -118 360 149 -116 170 20 206 -93 -164 79 -187 209 77 21 33 -227 -139 -273
3290 -273 30 112 201 -197 8 246 185 72 -16 -317 111 -174 -234 56 -196 145 229 27 -222 -97 -46 25 -15
3313 -15 -185 68 -127 -67 2 -116 8 371 -180 -116 -188 -21 105 -100 -142 -249 -41 -50 62 -72 -36 -78 88
3336 88 131 -108 -248 -95 -116 355 -152 274 52 -133 -55 21 16 -64 -111 115 -50 -266 91 53 182 -11 -132
3359 -132 244 -15 189 64 -26 74 -49 -56 -142 282 41 278 -18 52 -11 -124 228 -33 -61 67 30 17 -37
$$ packed form
3198b3qL6k59n2M22l89M48q0k84q4L5K12j42l5L63k64M04m22P8L33n11J42J08
3221B8J11j59m3J80J58l19K01j05k88j9M0N7J47J19k04o5J53m00J60J63J41j42
3243h6K12M8j1m3rk0m6j0j6R1j59K40k04j84K59pk44Q2K15j14k60L55l96O06k62
3268C7l5J4L59l62j31M78k11k65K86j50J86k99p1K43k66L96j32n6J2k60Q8j34
3290b73L03Q2Q9l98K05K38o1j13q8l01M28k85o0K90k52L41Q4k02k49J25N1P1m0
3313a5j70K53j95O0O9j18J24L63n51O4p2J67J26k05m2j07K08rJ12j34L6m2J66
3336H8M3k39j40J53k1M71n07M26k22j85P8P6nq0m7K26j65k16L57l8J29j93j21
3359a32L76k59K04j25r0J00j23pq6M24k41K37k96P0o3j13L52k61k8J28l7j3n4
$$ plain form
3382 -37 49 0 -45 100 221 -57 -240 -330 40 -180 -57 -130 -11 -168 -241 -312 263 -269 -133 -132 -123 9 -226 -320
3406 -320 -205 153 -45 -174 200 -15 21 -221 -262 -54 -24 -27 -95 78 47 89 -116 138 -152 169 -65 -14 45
3429 45 -233 282 72 -16 -21 -334 85 -207 -171 -53 -11 289 -276 -59 148 -130 274 -57 19 -33 -39 38 -4 -18
3453 -18 312 -4 -9 -97 355 -59 -31 280 -7 -24 147 138 56 -209 9 94 232 -173 250 134 104 -272 -321 179
3477 179 -41 57 -324 85 230 47 228 -349 -202 -183 222 155 201 55 23 73 -54 251 50 -18 -11 -9 0 397
3501 397 -7 176 198 174 381 -110 157 117 58 -90 47 196 -16 -19 -30 -312 -79 126 -242 -119 -181 -200 160
3524 160 135 185 -94 109 21 -204 197 -96 -163 -155 58 244 24 393 -196 6 -143 -126 -26 59 140 -43 -214
3547 -214 112 -34 -31 -83 -62 -359 -145 29 -290 -272 189 196 -246 -39 -28 -88 280 197 452 220 -37 326 -129
$$ packed form
3382c7Q6m9m5J45J21k78j83r0L70k20J23p3J19j57p3p1N75n32J36JRJ32k35r4
3406c20J15L58j98j29L74k15L6k42m1K08L0lo8J73l1M2k05K54k90L21k34N1N9
3429D5k78N15k10q8nl13M19k92L6J18M2L00n65K17K07k78M04l31P6n2oP7m2j4
3453a8L30l16nq8M52m14K8L11k87j7J71rq2k65K18Q5J38m05M23j16l0l76m9N00
3477A79k20R8l81M09J45j83J81n77J47J9M05o7M6j46l2N0j27L05k01o8PKRL97
3501C97m04J83K2k4K07m91K67m0n9j48J37J49k12lj1k82K33K05l68J23o2j9L60
3524A60k5N0k79K03q8k25M01k93o7QK13J86k20L69n89K02j49J7J00Q5Q1j83j71
3547b14L26j46Ln2K1k97K14J74l19J8M61Pm42K07J1o0L68q3K55k32k57L63m55
$$ plain form
3570 -129 -119 -40 -68 188 219 -177 151 -93 -133 11 -112 79 -181 -59 176 -109 39 68 227 -5 -51 -14 -108
3593 -108 -56 -83 20 471 2 55 132 -87 -52 -25 259 50 209 -19 50 -291 -2 32 450 -84 -116 27 48
3616 48 19 -173 119 -22 -133 -227 337 265 -12 16 -162 -270 -14 77 86 39 153 -2 -273 101 -174 226 129
3639 129 -95 145 313 -114 -198 -82 -70 -100 -159 -78 37 -133 194 64 -164 -81 -58 -235 350 146 -78 149
3661 149 217 -48 232 17 181 -191 -246 -170 15 -3 -257 20 -378 -100 64 -76 41 -360 -151 172 227 207
3683 207 190 -189 -117 139 -79 116 318 343 107 42 -281 -95 93 -205 -39 -104 -91 -64 -141 -315 -87 -27 -397
3706 -397 -14 -68 51 179 5 170 174 116 -118 -221 8 -22 -131 -23 -266 -25 209 56 -226 -72 -221 -23
3728 -23 86 -120 -97 121 -5 263 75 5 -5 -36 -103 206 21 -43 220 54 124 -64 7 -120 140 203 62
$$ packed form
3570a29J0P9k8K56L1l96L28k44m0J44j23J91k60J22K35k85J48K9J59k32m6L7r4
3593a08N2k7J03M51m69N3P7k19L5K7K84k09J59k28O9l41K89L4M18n34l2J43K1
3616D8k9j92K92j41j11r4N64p2k77K8j78j08K56R1Rm7J14j55k71L74k75M00r7
3639A29k24K40J68m27q4J16J2l0n9Q1J15j70L27j30k28Q3K3j77N85k04k24K27
3661A49O8k65K80k15J64l72n5P6J85j8k54K77l98K78J64j40J17m01K09L23N5k0
3683B07j7l79P2K56k18J95K02K5k36o5l23J86J88k98J66o5J3K7p7j74K28O0l70
3706c97L83n4J19J28j74J65Mn8k34j03K29l0j09J08k43K41K34j53k82J54j49J98
3728b3J09k06K3K18j26K68j88p0j0l1o7L09j85o4K63j66P0j88P1j27K60O3j41
$$ plain form
3751 62 -343 205 37 91 -41 -28 194 182 -42 -5 61 93 -118 139 434 -148 228 -48 -1 -81 -62 190 338
3774 338 -138 262 -149 14 67 -153 200 -239 -133 -540 -227 215 108 313 -398 62 344 -109 235 -411
3794 -411 274 98 177 -238 72 33 -59 -102 -85 83 -213 -106 339 61 -170 175 -108 -123 -75 223 292 11 184
3817 184 152 -11 110 -87 -27 -164 -263 -137 -352 -137 -145 -723 158 98 -63 -31 -204 -113 77 202 -42 -108 55
3840 55 -143 323 -106 -25 -309 -191 -16 -96 -114 11 -110 141 -175 -27 -117 211 230 -107 327 -56 -130 -104 -221
3863 -221 -77 32 200 258 -237 -122 -223 -100 83 122 37 -79 51 229 251 -149 49 -83 226 -176 -3
3884 -3 -37 343 -150 -235 -125 -121 35 -49 63 -120 -39 -146 -90 -218 109 -283 128 323 60 -164 -83 -28 -311 -196
3908 -196 160 -406 -32 -201 140 297 -94 -62 -31 -275 -218 -80 -6 178 51 -40 167 -42 218 -121 487 81
$$ packed form
3751F2m05N48j68N4j32J3K22j2k24L7O6L2k11K57K95n82L76k76M7q0J9K52J48
3774C38m76M00m11J63N3k20L53m39J06m07L13M42j07K05p11M60K82m53L44o46
3794d11O85j76P9m15L10l9r2m3J7J68k96J07M45k78k31L45k83j5M8K98O9k81J73
3817A84l2j63J21j97O0j37r9J26k15K15qn78Q81o0j61L2j73R1J90J25k44o6J63
3840E5j98M66m29Q1k84J18J75q0j8J25j21K51l16J48r0L28J9l37M34l83p4K6j17
3863b21J44J09J68N8m95J15j01J23J83L9q5j16J30J78K2m00J98j32L09m02J73
3884cl4L80m93q5J10MJ56q4J12j83Q1j07N6j28L27l92M11J95k63k24Q1N5k83J15
3908a96L56n66L74j69L41J57l91L2L1k44N7J38P4J84j27r1K07k09K60l39O08m06
$$ plain form
3930 81 48 12 -30 262 -35 -35 -168 -279 190 1 103 52 -126 151 -11 280 250 -20 64 -142 -45 -343 -51
3953 -51 104 -148 178 44 127 -254 -11 -37 44 -159 -250 125 10 -16 65 -240 4 111 -79 -249 -276 -218 -298
3976 -298 51 0 -288 -53 84 99 65 56 -262 41 -44 -294 113 50 -63 144 -8 -169 -165 26 -34 -163 -200 42
4000 42 60 -21 -81 -220 224 -321 -148 -242 -49 -242 -90 -103 -112 117 258 -82 -115 159 -98 55 -55 144 -79
4023 -79 -66 -60 -39 -225 34 -66 -168 103 99 51 273 -226 205 68 10 128 -259 11 27 88 -251 -48 -224 133
4047 133 -118 73 51 -59 83 226 312 -101 -130 -209 -14 91 -300 108 243 77 0 -362 166 -78 -66 179
4069 179 4 19 121 -167 -10 35 196 120 -220 -120 95 -50 -317 188 -33 164 26 6 1 143 131 -236
4091 -236 -32 -140 36 144 86 -196 -113 -205 2 159 19 250 -47 -161 9 -14 -30 129 137 79 -29 -113 122
$$ packed form
3930H1l3l6m2K92k97%j33j11M69j89J02n1j78K77j62K91l0k70Q4k06R7k98K92
3953e1J55k52L26j34Q3l81K43k6Q1k03r1L75j15k6Q1l05K44J07j90j70k7N8q0
3976b98L49n1k88K35J37J5l4rl18L03q5k50M07o3j13K07j52j61MJ91o0j29l7K42
4000D2J8q1o0j39M44n45J73r4J93j93J52j3rK29J41l40l3K74k57J53j10J99k23
4023g9J3OK1j86K59j00j02K71mm8K22m99M31j37n8J18l87K70J6O1l39K03j76L57
4047A33k51J91k2j10J42J43Q6m13k9p9J95J05l91M08J35j66p7l62N28k44J2K45
4069A79j75J5J02k88J57M5J61p6l40J00K15j45k67N05k21J97j38k0nJ42j2l67
4091b36K04j08J76J08n8k82Q3r2K07J57j40K31k97j14J70k3j6J59Qn8j08q4K35
$$ plain form
4114 122 34 -205 -190 197 -230 -206 47 22 -110 204 -100 109 244 263 -30 -53 -70 -56 89 0 -74 74 -230
4137 -230 -241 108 28 42 -192 -255 -157 -95 -354 -130 7 45 9 92 -154 -211 157 -160 -14 175 -118 -206 -308 -58
4161 -58 -50 -137 96 184 50 160 49 -46 -8 -32 365 37 -99 16 -20 160 -29 -16 -71 2 -133 13 151 161
4185 161 -5 190 33 109 54 -24 150 -129 -68 -61 -114 22 -100 6 42 6 222 -74 -32 -62 63 -116 81 161
4209 161 -14 -270 -133 -308 -129 116 3 -233 -65 -48 7 -60 150 -108 106 -218 -31 101 -232 102 -2
4230 -2 220 110 137 82 -83 -33 206 -109 -317 -155 16 -138 249 -192 20 48 -78 -15 45 7 113 -94 -220
4253 -220 29 -13 106 102 -254 24 40 -44 41 -217 74 -11 8 -6 128 -59 -34 62 -11 -246 94 52 59 -28 141
4278 141 133 -215 19 -92 48 6 116 -227 -95 32 90 -49 -400 -267 -165 -31 -144 -297 112 61 214 77
$$ packed form
4114A22q8k39J5L87m27K4K53k5j32L14l04K09J35J9k93k3j7J4J45q9p4J48l04
4137b30j1L49q0J4k34o3R8O2k59K24J37L8l6Q3k46n7L68l17J46J89k93q8j02K50
4161e8Qq7K33Q8j34J10j11r5L8k4L97l28j36J15l6J80j89J3n5P3j35J46J38J0
4185A61j66J95j57P6n5p8J74k79O1Pn3J36j22J06L6l6K16k96M2l0J25j79J97Q0
4209A61j75k56J37j75J79K45j13k36J68J7N5o7K10k58K14l24J87J32l33L34j04
4230bK22j10K7n5j65N0K39l15k08J62J71j54L87m41K12K8j26O3O0l8J06k07j26
4253b20K49m2J19ml56K78J6q4Q5k58K91q5J9j4J34j87K5R6p3k35L40m2Pq7J69
4278A41ql48K34j11J40m2J10l43J32J27N8j39l51J33J02J34j13j53M09n1J53j37
$$ plain form
4300 77 -36 155 32 -202 -29 169 42 43 -9 -150 -119 87 -9 157 -362 -164 -119 -144 40 -58 44 87 -150
4323 -150 -174 12 -157 265 72 -18 2 -135 82 290 55 -189 81 -254 7 -139 -345 -37 137 367 402
4344 402 -195 -313 -269 -153 129 72 290 161 13 18 -16 195 238 59 113 -111 326 -258 221 136 -152 327 -30
4367 -30 170 -52 -32 -110 40 180 193 185 -102 -64 148 245 -398 99 -20 -146 -64 45 32 -78 70 -125 55
4390 55 176 197 -287 34 -55 418 -3 -209 -250 -57 -1 241 109 -128 -131 -198 85 98 33 228 148 33 -251 -188
4414 -188 -145 -329 -34 -52 -50 182 -63 -40 485 306 -245 150 -29 -6 9 102 -121 60 -109 -28 242 -106 82
4437 82 -8 91 -130 -120 -86 -98 -21 177 -281 -197 91 -93 -72 -51 -30 -127 26 72 -175 21 -24 -249 166 -351 -25
4462 -25 -80 133 -255 162 -93 -92 -64 -88 44 -148 25 -16 -40 -156 -94 13 183 -30 -276 -160 118 335 -186
$$ packed form
4300G7j13J91j23k34J73J98j27Jn2j41L1K06r6J66n19J98M5k5J84r8J02M3k37
4323a50k4J86j69M22j93r0K0j37K17K08k35k44K70l35K61j46k06L08J74K30L5
4344D02n97j18M4J16K82n7K18j29j48Nl4K11M3j79N4k24M37n84M79q5k88M79l57
4367c0K00k22K0p8J50J40J3qk87L8K12R7o43M97j19j26Q2J09j3j10J48j95J80
4390E5J21K1m84L21q9M73m21k06m1J93N6K42j32k37lo7K83J3o5J95q0j15k84O3
4414a88M3j84K95j8KK32k45K3N25j79n51L95j79K3J5R3k23J81j69Q1K70l48J88
4437H2r0R9k21J0L4j2P7J98m58Q4K88j84K1K1K1r7J53M6k47J96m5k25M15n17L26
4462b5n5K13l88M17k55JK8k4J32j92J73m1k4j16O2J07J70k13k46J16K78K17n21
$$ plain form
4485 -186 236 239 574 108 -286 -161 -131 37 -36 217 -261 151 65 61 120 100 191 144 -95 -127 19 51 461 -118
4509 -118 386 -29 -82 60 -188 -223 22 -152 -170 61 81 64 -166 -168 -69 162 22 47 -187 111 155 96 213 -25
4533 -25 -38 -221 81 -33 -278 38 245 53 -244 -221 36 157 -3 -45 -5 284 -40 310 50 -14 166 -217
4555 -217 134 -144 -80 -48 -192 -231 -119 197 -177 -36 35 17 113 -354 45 -214 -165 -24 37 -122 233 2 -67
4578 -67 -41 -134 -80 -65 388 29 95 -56 -115 -87 -37 535 190 9 134 33 -71 -21 -43 239 -68 221 -200 197
4602 197 41 -175 -244 -243 -78 23 113 102 -225 30 -78 12 -15 -299 -24 74 1 329 321 -33 -77 300 -185 -39
4626 -39 -157 -17 110 -161 103 -213 -103 177 -171 248 110 179 -333 -67 -52 5 -448 -77 87 -175 28
4647 28 24 -102 118 -61 36 30 27 198 -26 -229 94 6 -228 -15 -34 -19 213 80 -61 184 -226 -56 20 186
$$ packed form
4485a86M22LL35m66l94J25L0J68p3K53m78M12q6mN9k0R1m7k39l2J46L2M10n79
4509a18N04m15n3J42k48l5K45j74j8K31K0j7k30kR9K31j40K5k34K98M4n9J17k38
4533b5j3j83L02j14k45L16K07j92k97K3K57J21j60m2M0K89l24L50k60o4J80l83
4555b17L51k78O4L2j44l9J12L16l74J41P1j8R6m67L99k59M9J41O1j59L55k31o9
4578f7K6r3N4J5M53l59O6j51n9K8N0N72l45j81J25j01j04N0k2K82l07K89m21L97
4602A97j56k16o9JJ65J01R0j1l27K55j08R0k7k84K75R8p3L28ql54m4L77m85J46
4626c9j18J40J27k71K64l16J10K80l48M19j38O9n12K66J5N7m53L71J64k62K03
4647B8mj26K20j79R7olJ71k24k03L23q8k34K13j9J5K32j33j41K45m10J70P6J66
$$ plain form
4671 186 245 -158 203 77 -62 315 148 127 -57 -151 152 11 223 249 257 77 19 -189 -46 14 -7 37 -191
4694 -191 55 131 346 19 -9 338 116 -135 85 121 -183 -30 -36 -96 288 -137 52 -244 -4 131 -72 -95
4716 -95 -248 -339 310 0 -45 170 37 1 70 202 242 -55 199 -54 78 49 -165 249 83 148 -155 360 -61
4739 -61 98 -179 -179 -149 58 110 175 -215 -12 -70 110 4 -46 22 110 -43 -208 96 171 7 181 -72 -53 -57 -50
4764 -50 -426 -124 -268 -75 23 -272 -8 165 57 -56 -31 -52 -139 -32 111 -43 93 176 -132 51 186 -211
4786 -211 30 -194 142 -37 -375 15 93 -334 138 429 -255 45 -165 48 9 143 -118 -292 -105 178 154
4807 154 78 -306 -243 -157 95 -72 -195 149 -125 -154 -151 186 -55 17 -48 -57 -64 -37 73 -26 -88 -71 27 157 24 142
4833 142 -100 -159 -352 -88 -54 60 -88 -37 -31 -196 -155 95 247 20 190 -359 -195 175 -79 -81 -342 171 123
$$ packed form
4671A86N9m03L61j26j39L77j67k1j84r4L03j41K12K6Qj80n8k08J43O0k1M4k28
4694a91K46P6K15l27k8L47k22k51K20L6l04J53oo0L84m25J89k96K40J35k03k3
4716i5j53r1O49l10m5K15j33l6O9J32M0k97K54k53J32k9k14M14j66O5l03N15m21
4739f1J59k77%L0K07N2O5l90K03n8J80j06n0O8Q8j53j65L04P5j64J74k53J9mP
4764e0l76L02j44J93R8k95K64J73j08j13K5k1q7J07J43j54J36Q3l08J83J35l97
4786b11K41k24L36j79l38L90P8m27M72K91o84L00k10K13l9J34k61j74J87K83k4
4807A54p6l84O3Q6K52j67j23L44k74k9LL37k41P2o5rpK7J10r9o2J7R8J30j33J18
4833A42k42n9j93K64L4J14j48N1Oj65M1K50J52k27J70n49J64L70k54kk61N13m8
$$ plain form
4856 123 -19 76 149 39 157 104 345 122 -26 6 -589 25 -44 -16 -166 34 -20 72 228 -292 -211 -139 34
4879 34 36 25 42 100 -227 -101 57 -264 -189 -324 -203 -134 -145 83 -3 364 97 -2 -70 115 -191 -97 -130 -10 184
4904 184 116 280 -158 124 -41 24 172 55 -136 -231 15 45 129 -53 -73 -149 -231 132 103 -160 140 -25 40
4927 40 -9 211 41 38 -122 169 326 -87 -121 281 -252 -10 -99 154 -143 -10 265 62 72 310 222 23 48
4950 48 16 53 -272 7 -316 137 -106 -119 131 -98 -66 -366 -62 98 53 -224 -91 -120 -200 -183 -123 84 60 -304
4974 -304 154 -5 -149 -3 13 -2 177 48 147 357 -272 100 92 -89 -200 59 58 -24 45 90 61 115 -72 182
4998 182 -153 72 10 -142 -361 49 273 -188 -207 -62 19 -208 -188 -221 224 -181 92 -149 155 68 244 -246
5020 -246 -156 159 -120 217 -98 -40 -148 -70 -38 -51 -23 -114 -175 -74 58 -44 115 -49 -62 56 -242 -96 -261
$$ packed form
4856A23j42R5P3j10J18n3K41k23j48L2n95O14o9K8j50K00n4R2J56n20Q1P2J73
4879C4Kj1J7N8l27J26J58l21P5j35J21O9j1K28q6L67k67r9o8J85l06R4l3J20J94
4904A84o8J64m38K82j65O5J48j17j91r5K46L0Q4j82k0p6q2L63k9k63L00j65O5
4927D0m9K20j70lj60K91J57m13l4M02n33K42q9K53k97J33K75k03J0K38q8j99K5
4950D8l2L7l25K79l23M53k43j3K50k29L2l00L04J60m5k77J33k9q0J7O0K07k4l64
4974c04M58j59j44J46J6j5J79j29R9K10o29L72qj81j11K59jq2O9M5k9N4j87K54
4998A82l35K25o2j52k19M10K24m61j9J45Q1k27K0l3M45m05K73k41L04q7J76m90
5020b46R0L15k79L37l15N8j08P8L2j3K8r1o1J01J32j02J59j64j3J18k98J46j65
$$ plain form
5043 -261 9 -54 117 22 8 -190 92 15 -44 72 -111 178 -187 335 -2 -186 -68 -140 158 -46 185 130
5065 130 -23 20 -88 313 -59 -11 10 -89 104 -134 139 -178 -44 -191 -74 -16 -91 124 85 79 53 -221 209
5088 209 -144 62 -99 -140 61 4 188 -6 -85 24 87 -251 103 -204 -135 71 -74 -210 -80 -238 79 199
5110 199 -171 343 -62 -65 27 -95 267 194 93 -95 227 16 237 -49 293 -337 12 282 26 124 -49 -157
5132 -157 221 -24 169 21 114 -55 35 -182 115 -350 56 362 -47 -45 47 151 -61 269 194 -258 14 9 132
5155 132 207 225 -156 92 -193 133 131 301 -59 -202 -54 -165 187 291 176 -396 -34 49 85 -92 -67 264
5177 264 334 -8 -330 -95 -296 48 -173 116 -112 135 -94 -198 -15 -131 12 -19 172 118 -307 -113 -110 -112
5199 -112 -99 24 153 -67 -173 113 -46 76 5 -102 -145 58 -122 -231 134 50 -83 -300 149 112 108 82 -23
$$ packed form
5043b61K70o3J71r5j4j98K82p7n9J16j83K89l65N22l37j84J18p2K98k04K31n5
5065A30j53M3j08M01l72M8K1r9J93k38K73l17J34j47J17N8p5K15l9ok6k74M30
5088B09l53K06j61m1K01n7J84j94p9J09O3l38L54l07O9K06j45j36J30j58L17J20
5110A99l70N14m05lR2j22L62p3j01j88L22k11K21k86L42o30L49K70k56R8j73j08
5132a57L78k45J93j48R3j69R0k17K97m65M06L06m09KR2J04k12L30p5m52K72nJ23
5155A32P5J8l81K48k85L26kJ70l60j43J48j11L52J04j15n72L62Q3L6j77K5L31
5177B64P0l42l22K35k01L44k21K89k28K47k29j04J83j16J43l1J91n4m25J94Lk
5199a12J3J23J29k20j06K86j59J22p1j07m3K03j80j09L65q4j33k17M49l7mk6j05
$$ plain form
5222 -23 39 -129 -311 -79 39 180 -14 320 -147 -140 70 -63 -130 -3 -75 127 -33 -53 179 72 -189 160
5244 160 56 8 -54 37 -148 100 7 166 -221 -14 -118 -71 -114 15 158 -91 165 175 250 117 7 -86 297
5267 297 430 -109 135 -55 322 267 15 -16 -8 -37 77 212 198 140 14 163 -128 -97 59 228 -40 271 216
5290 216 210 -40 35 -49 -54 204 -131 -70 -141 -16 2 -311 -114 53 -247 173 87 -132 -134 14 41 55 -30 -358 -36
5315 -36 -9 -46 -206 -24 136 -180 -24 103 -128 -160 31 -45 -86 -216 9 25 12 160 -224 296 -80 -147 -42
5338 -42 55 -30 77 -71 147 -42 111 39 24 -30 -157 61 144 -36 318 259 68 -183 59 136 145 52 -236 -11
5362 -11 332 -141 -201 -217 196 -148 -51 -9 75 -182 -21 91 -115 212 101 212 73 48 129 -165 68 -12 139
5385 139 157 -169 244 28 -179 -110 50 -297 -199 -102 85 -100 -149 248 -298 9 131 333 324 -41 -326 162
$$ packed form
5222b3O2j68j82K32J18J41j94L34m67PK10j33o7J27p2K02j60k0K32j07k61L49
5244A60j04m8o2R1j85K48r3J59l87K07j04M7m3J29J43k49K56J0P5j33j10r3L83
5267B97J33n39K44j90L77n5k52l1Qk9J14J35j4n8j26J49k91L1J56J69k68L11n5
5290B16ok50P5q4nK58l35O1p1J25J8l13J97J67l00M20q6k19kJ48K7J4q5l28L22
5315c6K7l7j60J82J60l16J56J27k31l2J91p6m1j30K25J6j3J48l84N20l76o7J05
5338d2R7q5J07j48K18j89J53p2j5n4j27K18Q3j80L54n9j91k51K42P7Rr3k88K25
5362a1L43m73o0j6M13l44R7M2Q4k57J61J12k06L27j11J11j39k5Q1k94K33q0J51
5385A39J8l26M13k16k07O9J60l47R8R7J87j85m9L97n46L07J22K02rl65k85M88
$$ plain form
5407 162 1 81 -161 -43 -25 -60 -156 -339 51 -112 -94 169 16 -47 143 -106 275 -241 4 -21 67 99 -115
5430 -115 275 129 -74 -12 299 32 195 153 78 101 -172 171 -280 381 -115 172 129 -492 146 24 292 -335
5452 -335 88 -20 -22 176 -34 344 210 -81 -108 27 -53 189 104 72 -237 -195 -297 245 361 122 -168 -247 -63
5475 -63 -35 -246 -100 -91 41 55 291 -28 50 193 -149 273 -44 -45 83 -70 -114 13 449 -47 -223 177 -50
5498 -50 -208 301 -200 84 36 66 66 -28 -250 -157 81 175 -11 -51 89 184 280 81 319 -86 124 -193 197 -283
5522 -283 -86 318 99 -42 -319 66 51 -126 8 -262 336 146 159 36 -2 82 -184 -54 -77 -283 253 110
5544 110 -58 -83 -50 -110 -3 156 -183 -324 160 44 260 -259 10 -138 -231 -114 -59 -20 -222 -184 -31 110
5566 110 99 254 -16 230 171 -145 -79 38 -233 -163 -83 -106 536 84 191 -205 -267 -163 -81 -313 -41 -63 279
$$ packed form
5407A62j61Q0k42J18J8l5r6j83L90j63J8K63j53o3J90k49L81n16K45k5Q8L2k14
5430a15L90j46k03O2L11k67J63m2p5K3k73L43m51O61m96K87m3o21O38j22K68o27
5452c35M23j08kJ98k10L78j34k91k7J35q0K42q5l2l09M2j02N42J16k39k90p9J84
5475f3K8k11J46RJ32J4K36l19P8J43l42M22l17jJ28j53m4J27M36m96j76M00k27
5498e0j58N09n01K84m8L0%r4k22R3K38R4j86m0J40R5R6j99K38m05K10l17L90m80
5522b83J97M04k19j41k77L85j5j77J34k70N98j90J3j23l8Q4k66J30k3k06N36j43
5544A10j68k5L3o0J07J59l39j41M84j16K16n19K69j48r3J17N5L9k02L8J53J41
5566A10j1J55k70K46n9l16O6J17k71P0Q0k3O42m52J07l96o2J04Q2k32K72k2L42
$$ plain form
5589 279 76 -39 -60 165 -138 309 24 -312 -154 -122 -100 -126 126 -9 79 197 119 69 15 208 11 11 332
5612 332 20 228 15 -95 176 -51 -397 19 164 401 8 289 -139 -208 -41 -6 22 -173 205 52 -80
5633 -80 -77 14 -20 132 83 -33 -119 -14 -74 -23 -37 135 229 149 119 224 45 -11 -93 -59 -175 -133 -369 -169 150 -200
5659 -200 36 -128 -31 150 67 17 -139 2 -181 -86 -104 -399 57 -59 196 -9 -227 260 -130 -42 105 -203
5681 -203 130 142 87 277 159 -129 99 49 97 -11 160 37 222 289 156 24 3 309 312 201 299 80 -28
5704 -28 -232 -200 -41 -78 130 -114 432 137 50 -100 433 -62 -26 40 211 83 91 -14 -23 198 -303 -43 -218
5727 -218 -86 -26 -188 -27 -81 -127 62 102 11 16 -29 -32 -207 61 -67 -265 -253 -337 -199 -72 82 122 -57 84
5751 84 179 -133 70 -5 -172 37 -37 -152 -217 12 -76 305 232 -144 337 277 46 88 51 -94 -11 68 -153 -221
$$ packed form
5589B79k03j15k1K25l03M47k85l36J58L2K2k6K52j35Q8J18p8n0n4J93j97%L21
5612C32l12K08k13j10K71k27l46M16J45K37l93K81m28o9J67L5K8j95L78j53j32
5633h0LR1l4J52m9j16q6J05o0N1j4J72R4q0l0J05j79n6q2L4j16M2k36K00L19l50
5659b00K36j64R7J81q3n0j56J41j83R5j8k95M56j16K55k05k18M87l90Q8J47l08
5681b03L33J2n5J90j18k88K28n0M8j08J71j23J85O7j33j32k1L06Lj11R8k19j08
5704b8k04L2J59l7K08k44N46k95q7j50N33m95L6O6J71j28Qj05rK21n01K60j75
5727b18J32O0j62J61n4m6J89M0r1Nm5lj75K68j28j98J2q4J38J27J54M0j79J41
5751H4R5l12K03p5j67K09p4j15o5K29q8L81p3l76M81o0k31M2l7j45Q3P9k21o8
$$ plain form
5775 -221 166 -96 179 74 35 13 -73 140 -42 86 31 364 37 -175 14 -143 -57 0 -131 40 -41 263
5797 263 -330 181 192 -4 -227 18 -43 164 -56 456 -112 -194 172 254 212 -201 127 -8 109 192 136 66 172
5820 172 143 -3 -80 167 -77 -148 -7 -142 114 -229 -341 -19 -27 -267 303 -78 -127 55 59 401 -246 52 255
5843 255 196 94 -222 44 -66 57 -2 55 -107 -47 376 -15 50 159 -49 -152 316 58 3 -133 407 -133
5865 -133 -286 83 145 64 41 98 111 207 0 6 117 -41 -23 53 13 -189 -64 -378 79 18 -155 -27 195 70
5889 70 114 -140 66 397 13 -101 366 18 95 -27 -234 119 -179 -55 77 -331 -176 133 205 -32 111
5910 111 -49 -205 -51 97 168 226 69 -62 -55 168 17 -115 -161 -266 55 18 -37 62 105 -295 -14 45 -84
5933 -84 105 208 27 -150 209 389 234 56 -16 113 -262 123 70 -174 -79 -161 -46 -208 270 -128 261 268
$$ packed form
5775b21L87k62K75j05l9k2q6K13j82J28n5L33l27k12J89j57Q6N7j31J71q1L04
5797B63n93N11J1j96k23K45o1K07k20N12n68q2L66Q2m2m13L28j35J17Q3n6p0J06
5820A72k9j46p7K47k44p1J41j35K56l43j12L22qk40N70l81m9J82ML42o47K98K03
5843B55n9j02l16K66j10J23n9N7j62O0M23l91O5J09k08j03M68k58n5j36N40n40
5865a33j53L69O2q1k3N7J3R6k07OJ11j58J8P6m0k02J25l14M57o1j73J28K22j25
5889G0M4k54K06L31l84j14M67l48P7j22k07L53k98J24J32m08J55L09P2k37J43
5910A11j60j56J54J48P1N8j57j31PK23j51j32m6j05L21l7n5R9M3m00K81N9j29
5933h4J89J03j81j77L59J80j55j78p2J29l75L85n3k44R5q2J15j62M78l98L89P
$$ plain form
5955 268 188 -109 -23 42 -248 -49 -57 63 28 -4 -62 -119 25 220 -75 52 348 72 -83 131 -138 -74 -235
5978 -235 -16 244 216 104 -267 -64 -154 -7 -120 -164 -184 -269 -242 96 133 25 3 -50 -105 161 3 0 -45 -189
6002 -189 165 -75 -225 32 66 -292 41 -103 250 -115 28 234 20 -38 -261 58 152 467 -87 -150 57
6023 57 9 -322 5 -240 237 -241 -169 38 -120 167 366 107 -151 203 135 -22 32 -456 74 219 -133 -40
6045 -40 -144 130 -201 -58 270 32 -10 8 3 192 192 47 -271 194 -403 60 -192 122 -283 -211 221 -222 200
6068 200 -56 92 -140 -25 -143 226 90 91 -117 -21 -140 -8 145 130 -40 -54 -2 117 -34 -156 288 -110
6090 -110 -230 -18 57 11 -130 -251 217 57 -9 147 -44 220 177 -117 43 76 283 135 99 29 11 61 -317
6113 -317 -41 30 210 65 136 314 -133 -204 -27 44 -196 114 -208 99 17 145 -2 -112 99 124 65 -221
$$ packed form
5955B68q0k97Q6O5k90J99qJ20l5l2n8n7J44J95k95J27K96k76j55K14k69O4j61
5978b35K19K60k8j12l71K03r0J47j13m4k0q5K7L38L7j08k2n3n5K66j58lm5j44
6002a89L54k40j50K57L4l58L33j44L53l65J43K06k14n8k23L19R4L15n54o3K07
6023E7m8l31L27k45M77m78P2K07j58K87J99k59k58L54o8j57N4m88N30J45l52R3
6045d0j04K74l31J43L28k38m2J8nJ89%j45l18M65n97M63k52L14m05P2M32m43M22
6068B00k56J48k32J15j18L69j36Jk08R6j19J32J53j5j70j4N2J19j51j22M44l98
6090a10j20K12P5m6j41j21M68j60o6J56j91K64m3k94J60L3K07j48l6p0j8N0l78
6113c17K76P1J80j45P1J78m47p1J77P1k40L10l22L07q2J28j47j10K11K5n9k86
$$ plain form
6135 -221 37 174 -9 -215 -99 -58 354 -198 -57 -17 74 -118 44 36 232 149 -197 -19 -203 74 115 -15
6157 -15 -24 -73 150 170 -116 45 244 254 -12 291 -54 94 -21 162 -183 -42 -36 54 -210 -139 -222 5 -88 -49
6181 -49 -68 -78 -66 185 -238 -112 45 -239 125 -95 -75 73 351 -36 198 -50 9 232 200 197 108 84 106 139
6205 139 183 -119 -75 235 -41 -366 -192 62 -209 237 56 -278 231 219 -33 193 101 65 129 216 53 -82
6227 -82 -56 109 -3 -153 3 140 20 -114 -138 159 102 -14 200 108 383 133 69 288 -56 145 -32 -43
6249 -43 -12 122 -190 -32 -58 -180 91 -154 -1 -29 -106 -149 206 7 -30 234 -37 4 -202 -5 -102 149 11
6272 11 -25 10 -261 197 -365 46 -293 -95 -11 160 144 -217 195 102 -294 46 -228 -197 -49 69 -32 -191
6294 -191 -156 72 151 158 -66 51 -67 -39 166 194 27 -76 148 -100 80 -315 85 303 -134 131 178 31
$$ packed form
6135b21K58J37j83k06J16M1M12n52J41M0R1j92J62qJ96q3l46J78j84K77M1j30
6157a5rm9K23K0k86J61J99J0k66L03l45J48j15J83l45J41OR0k64P1q3K27r3L9
6181d9j9j0J2K51m23J26J57k84L64k20K0J48K78l87K34k48N9K23l2lq9k4K2L3
6205A39M4l02M4L10k76l25J74K54k71M46j81l34N09j2k52K26r2l6O4Q7j63j35
6227h2K6J65j12j50J56J37j20j34k4K97n7j16K14r2K75k50o4K19l44K01j77j1
6249d3L1J34l12J58k6j22K71k45J53k8p7m3L55j99l7K64k71M1k06J97r7K51j38
6272A1l6L5k71M58n62M11l39J98Q4J71j6l61M12r3l96L40k74L1J48J18j01j59
6294a91L5K28P9Pk24J17j18K8K05K8j67j03K24k48J80l95M00K18m37K65M7j47
$$ plain form
6316 31 -58 26 -56 19 217 30 134 222 -69 117 232 -37 -252 218 -187 -157 -151 73 78 4 -204 -247 -123 63
6340 63 -156 -258 130 -92 -447 -72 -175 277 -37 -242 -97 65 -78 97 -16 13 67 -166 8 97 326
6361 326 -161 137 -68 317 472 245 279 31 213 -10 -20 108 106 266 -5 -127 178 289 99 -76 225
6382 225 -42 139 150 -224 346 105 134 -53 -12 -13 -20 368 -244 -99 56 -87 182 -21 -114 136 38 258 207
6405 207 38 95 -165 -147 -351 -104 -142 241 -115 278 173 125 263 9 216 33 -139 -154 -75 -118 0 -138
6427 -138 66 -189 43 114 -13 -83 -14 -11 -16 111 -34 202 125 98 82 -102 204 -63 84 77 107 -62 85 0 -102
6452 -102 -370 89 252 -262 205 59 -185 -264 -176 -146 -134 240 -154 -17 2 136 121 46 -305 238 116 -104
6474 -104 95 -156 47 114 -47 88 -301 -144 34 84 -251 273 82 164 -72 182 506 63 167 84 -43
$$ packed form
6316C1q9Q4q2P5J98j87J04Q8k91J86J15k69k15M70m05L0OK24Np4k08m3J24J86
6340F3k19j02L88k22l55L75j03M52l14k05J45J62j43J75j13K9N4k33J74Q9K29
6361C26m87K98k05L85J55k27L4k48J82k23j0J28kJ60k71j22L05J11j90j75L01
6382B25k67J81J1l74N70k41K9j87M1jpL88o12J45J55j43K69k03r3K50r8K20n1
6405B07j69N7k60J8k04K47l8L83l56L93j05m8J38k54K07j83j72j5P9m3J18j38
6427a38K04k55K32P1j27p0O9LnJ27j45K36p7k7j6j84L06k67J47pL0j69J47q5j02
6452a02k68M59J63n14M67j46k44p9Q8L0J2L74l94J37J9J34j5p5l51N43j22k20
6474a04J99k51K03O7j61J35l89J57J78N0l35N24j91Q2k36K54L24m43J04q3j27
$$ plain form
6495 -43 -325 298 49 -240 -200 -275 -39 -125 -1 -168 -58 -263 99 -12 -219 5 111 92 -212 -212 -96 -202
6517 -202 -73 -100 40 -118 -57 209 75 40 24 175 39 240 67 292 66 5 -40 -31 162 58 17 83 236
6540 236 -23 32 -136 -142 116 51 18 -64 161 181 258 -42 -121 33 281 -78 -90 240 -137 258 213 -3 -61 57
6564 57 140 -102 4 318 281 183 94 47 -200 -57 10 131 -94 -76 -195 150 12 163 -179 -21 -113 91 -63
6587 -63 -39 -49 11 -35 160 -7 -23 144 48 170 78 22 -89 128 -63 -54 -67 -125 83 -50 -32 42 89 -53 -433
6612 -433 -74 119 -26 -235 128 104 -36 -16 -253 102 65 291 175 159 379 -15 -136 -364 167 -145 138
6633 138 -45 108 -208 -28 -197 43 237 39 47 -122 -270 -51 228 -257 242 297 -167 80 40 189 -27
6654 -27 61 25 273 163 107 -156 81 155 -61 44 98 138 -49 -47 8 -78 133 19 266 -83 -61 39 -12 -251
$$ packed form
6495d3k82O23k49k89M0p5K36q6J24j67J10k05L62j11k07K24J06j9l04%J16j06
6517b02J29k7J40j58O1K66j34l5j6J51j36K01j73K25k26o1m5RJ93j04m1O6J53
6540B36k59N5j68oK58o5l3q2K25K0P7l00p9J54K48l59j2L30l77L95m5k16n8J18
6564E7Q3k42J06L14l7r8q9m7k47J43O7J21k25J8j19L45j38J51l42J58r2K04j54
6587f3K4j0O0m6J95j67j6J67r6J22r2n6j11K17j91Rj3n8K08j33J8P4M7j42l80
6612d33L59J93j45k09L63k4j40K0k37L55l7K26j16j6K20l94j21k28N31l12K83
6633A38j83J53l16J80j69K40J94j98Qj69j48K19K79m85M99N5m64K47m0J49k16
6654b7Q8l6K48j10n6k63K37P4k16J05N4M0j87KN5q6K11j14K47l49K2J00n1k39
$$ plain form
6678 -251 -241 218 20 -291 -293 -209 157 -75 69 -114 62 293 -11 -125 -49 -14 12 -12 -181 226 99 162 -47
6701 -47 -133 -75 156 209 168 237 16 -334 11 -122 115 -10 134 -24 -22 -18 28 50 42 -430 -214 51 -237 139 -15
6726 -15 -495 -67 -40 -367 -24 -166 275 -57 -260 -63 -111 -132 -130 -167 323 -114 -95 162 -157 -297 -112 -12 -77
6749 -77 -115 -65 -78 47 -115 283 64 -74 3 -105 -73 11 41 -53 -145 -135 -116 -203 -21 -208 -67 70 -57 26 -250
6774 -250 -171 -43 113 333 59 -90 -206 60 136 -9 -341 40 70 -373 -181 -9 185 28 -189 -85 150
6795 150 -22 -23 100 -15 73 -30 -267 154 -80 99 -10 -232 84 -81 -142 -13 51 211 218 241 -157 -186 221
6818 221 -1 -187 -40 -62 -29 -191 -10 20 -27 -330 175 -10 -94 -160 -177 137 -75 201 -113 318 37 39 96
6841 96 157 -152 -72 103 -95 11 192 70 -1 90 143 -74 190 99 165 7 186 91 195 -180 -165 198 51
$$ packed form
6678b51J0M59j98l11kQ4L66k32J44j83J76K31l04j14P6L5K6k4j69M07j27O3k09
6701d7q6N8K31N3m1O9k21l50L45j33K37j25J44j58KMM6K2qm72K16K65k88L76j54
6726a5m80M28K7l27L43j42M41l32k03J97m8k1Kl7M90m37J9K57l19j40J85J00o5
6749g7l8N0j3J25j62L98k19j38P7j08L2Q4L0r4r2J0J9q7J82j87J41J37j27Q3k76
6774b50P9J28J56K20k74j49j16K66P6j45l32L81L0m43J92J72J94j57k17J04K35
6795A50j72jJ23j15Q8j03k37M21k34J79j09k22L16j65o1J29O4J60PK3l98k9M07
6818B21k22j86J47k2L3j62J81L0m7l03N05j85q4o6j7L14k12K76l14M31k81KN7
6841I6O1l09Q0J75j98J06J81j22p1R1N3k17K64r1O6j58J79r5J04l75J5L63j47
$$ plain form
6864 51 131 30 101 37 44 -168 141 -104 25 -207 -11 2 -134 -124 35 306 -402 -149 -92 -181 -52 -214 -219 136
6888 136 124 148 53 -34 211 -102 61 -92 95 26 -25 -242 -76 97 -137 -164 -63 163 -208 -367 -69 -225
6910 -225 -79 -211 252 -94 9 136 82 -31 222 -4 19 23 198 193 150 31 222 171 -44 43 -110 -174 249
6933 249 26 136 -257 155 13 90 138 52 42 -97 -228 -315 -189 274 -34 120 -11 212 20 372 122 -358
6955 -358 124 -18 180 165 -311 -12 203 111 -103 3 157 78 -141 -88 110 -88 -75 96 256 177 197 193 -188
6978 -188 117 -37 -194 76 151 -12 -60 247 183 198 180 -265 218 129 -312 -209 63 117 -157 -143 -152 -77 -116 14
7002 14 -23 -6 95 -160 59 -163 -408 116 -40 -137 29 182 -131 96 -55 5 68 25 -95 -169 82 211 203
7025 203 177 -159 107 190 -346 -80 313 -133 -244 89 127 -281 50 -108 -119 -49 263 264 -224 230 -92 217
$$ packed form
6864E1Q0j01P1o4Pk12L09k45J29k32J96J3j36J0J59K71p08K53N7q9J29j62nL55
6888A36j2K4r5q7K45l13J63j53J87o9n1k17J66J73k34k7J01K26l71j59K98j56
6910b25J46j32M63l46J03J27n4j13K53k26K3MJ75nm3j19J91n1k15Q7j53o4M23
6933B49k23J10l93M12j42P7M8q6j0j39j31q7J26M63l08J54j31K23j92L52k50m80
6955c58M82j42J98j5m76K99K15r2k14J06J54p9k19N3J98j98J3J71J60p9K0ml81
6978a88L05j54j57K70P5j63m8L07o4J5j8m45M83q9m41J03K72N4k74J4rP5l9J30
7002A4l7J7J01k55K19k22k45N24j56r7J66J53l13K27j51O0O3m3j20p4K51J29q
7025B03k6l36K66Q3n36K66L93m46j11L33L8m08L31j58j1P0L12Jm88M54l22L09
$$ plain form
7047 217 -216 -6 50 241 119 -81 23 -50 182 -319 66 174 332 -54 41 206 100 -76 166 30 -59
7068 -59 156 148 90 -41 -76 65 -113 -120 -11 -573 117 -95 81 159 187 41 -280 -74 112 -144 199 161 -95
7091 -95 154 -83 66 177 57 -376 -331 -100 -181 121 326 -13 95 199 345 -25 242 -136 -51 22 -31 -69
7113 -69 2 238 93 151 -287 -16 -32 123 -116 -318 142 -100 80 115 85 152 -115 98 188 -4 -349 -143 -138
7136 -138 51 190 -276 -82 83 -161 -132 -228 45 -116 131 50 -189 -5 -121 -199 -43 -63 80 -208 -101 -256
7158 -256 37 263 -18 4 9 111 -231 142 216 -1 150 -107 218 -34 -105 46 -55 50 187 25 157 340
7180 340 -44 14 -89 36 -10 113 71 -217 -190 165 -26 -47 -45 -108 20 42 -59 -81 -98 91 -134 -39 -305 355
7204 355 207 89 172 -55 129 -345 106 -33 137 141 27 60 33 -284 -72 -178 -119 -153 152 -36 -22 327 -289
$$ packed form
7047B17m33K10N6J91j22k00J04p3K32n01L85J08J58l86R5J65j06j76K42j36q9
7068e9K15qn8j31l5J41j78pJ09n62O90k12J76P8K8j46l21K06J86k56L43l8k56
7091i5K49k37J49J11j20m33M5K31q1L02K05l39J08J04J46l70K67l78Q5P3n3l8
7113f9P1K36j45N8m38K71j6J55k39k02M60k42J80L5l0O7k67K13R0j92l45K06N
7136a38J89J39m66J94J65k44K9r6K73j61K47q1k39J84j16p8J56k0J43k88J07j55
7158b56K93K26k81K2NJ02l42L73P4k17J51k57L25k52p1J51j01J05J37j62J32J83
7180C40l84N8j03J25m6J23m2k88K7L55j91k1Ko3J28K2j01k2j7J89k25R5k66O60
7204C55j48j18Q3k27J84m74M51j39J70Mj14L3k7l17K12j06N9l4L05j88J4L49o16
$$ plain form
7227 -289 -107 213 -77 -31 236 -175 -63 -16 -343 -296 273 4 142 249 76 -87 -182 -51 -50 63 283 -114
7249 -114 -126 -229 -29 111 -86 -91 -33 38 -285 -403 218 -254 455 29 -194 -163 -253 102 -108 -85 72 15 205
7272 205 -244 356 -42 3 -36 89 -133 -141 106 -252 -207 166 36 19 -88 16 49 213 104 -24 161 72 1
7295 1 274 202 40 -173 -349 -222 -145 -2 -60 -279 161 27 -192 -57 78 -206 -77 -56 105 -82 29 269
7317 269 -24 87 45 -140 83 -90 -381 -154 -230 163 214 235 -210 -91 -169 -96 -76 48 -67 58 -79 151
7339 151 -51 -159 -131 184 -80 168 96 -164 224 156 50 52 -69 -267 217 -77 -52 134 39 69 -123 188 78
7362 78 31 -44 -236 -132 149 293 -115 -59 -183 -295 192 -88 260 -197 -205 333 110 -155 32 -149 143 -102
7384 -102 -292 -176 -286 -251 -24 62 8 -111 -65 118 108 -324 155 253 106 -21 -111 -37 -41 -111 -133 -215 29 190
$$ packed form
7227b89J82L20k90M6K67m11J12M7l27M7N69k69J38J07j73j63r5J31JJ13K20l97
7249a14j2j03K00J40j97nN8P1l23j18O21m72P09m26k23L1r0L55k10K3J57n7J90
7272B05m49O00l98M5l9J25k22qK47l58M5L73j30j7j07J04L3J64j09j28J85q9p1
7295AK73p2j62k13j76J27P7J43n8k19M40j34k19J35J35k84J29K1J61j87J11K40
7317B69k93J11m2j85K23j73k91K27p6L93N1K1m45J19p8P3K0J24j15J25j37K30
7339A51k02j08K8L15k64K48p2k60L88o8j06Kj21j98M84k94K5J86r5L0j92L11j10
7362G8m7p5j92J04K81J44m08N6j24j12M87k80L48m57qN38k23k65J87j81K92k45
7384a02j90J16j10L5K27Q6n4j19M6J83j0m32M79R8j47j27r0P4mp0k2q2K44J61
$$ plain form
7408 190 213 48 -8 142 -36 -55 229 -52 45 11 76 173 -195 -203 12 59 -192 -62 -38 -74 258 -64 169 -63
7432 -63 -29 124 -23 66 368 33 -289 -276 -18 -108 281 -129 -13 182 -310 154 -125 305 8 167 -16 34
7454 34 -156 56 -109 -122 -14 -2 27 60 42 6 -223 38 95 103 -283 245 -53 126 22 -128 206 219 -320 139
7478 139 199 -173 107 138 265 183 -51 -105 58 -103 -120 -107 57 -267 -134 -137 91 262 -119 6 73 -111 -1
7501 -1 77 -68 146 100 30 47 255 248 222 -197 84 49 6 90 72 205 88 98 314 -81 144 251 169 -133 -58
7526 -58 -47 -23 250 -147 102 -91 -70 -152 101 -139 -50 -9 3 -156 70 88 -291 -53 57 -26 61 23 52 -66
7550 -66 -91 -233 -170 15 -142 -156 -160 -158 58 210 190 131 -147 -232 -30 -74 334 -70 121 -145 189 -121 -85 163
7574 163 55 26 173 -87 -102 -104 -27 155 -83 -213 7 -175 257 110 -209 45 180 -71 -311 260 -197 41
$$ packed form
7408A90K3j65n6J50j78j9K84k81R7l4O5R7l68qK15M7k51J30K4l6L32l22K33k32
7432f3L4J53j47Q9L02l35l22J3K58r0L89m10J16J95m92M64k79M30k97J59j83N0
7454C4j90K12j65j3J08J2K9L3j8l6k29K61N7Ql86N28k98J79j04j50L34J3n39M59
7478A39O0l72K80L1J27q2k34n4J63j61j7J3J64l24J33lK28J71l81J25O7j84J10
7501aP8j45K14m6p0J7K08pk6m19K81l5m3Q4j8J33j17J0K16l95K25J07q2l02P5
7526e8J1K4K73l97K49j93K1q2K53k40Q9M1J2j59K26J8l79K38J10q3Q7l8K9j18
7550f6k5j42O3J85j57j4mKK16J52k0n9k78q5K02m4M08m04J91k66L34l10L6K48
7574A63j08k9J47k60j5kP7J82k38j30K20j82M32j47l19K54J35k51k40N71m57K38
$$ plain form
7596 41 -194 38 -41 53 -54 324 100 -25 24 187 8 -420 132 -132 156 16 -1 -21 135 -217 -278 -230 -76
7619 -76 270 14 85 114 82 -112 118 235 -31 78 -15 -220 178 -200 29 306 290 41 110 63 56 118 240 83
7643 83 230 156 9 136 69 227 74 70 -83 184 65 202 -142 -24 -182 207 56 147 202 36 -348 103
7665 103 44 -145 -253 33 -25 -149 -109 20 -13 -29 -96 -297 -216 -116 -210 -15 -76 275 2 113 -65 148 -314
7688 -314 69 9 -78 121 70 -239 111 -18 -172 211 258 -242 -230 120 -217 -68 -196 49 11 155 -265 -308
7710 -308 2 -103 -6 240 -89 57 136 72 -321 5 48 -153 1 -72 -134 127 41 277 -100 -131 -18 -196 62
7733 62 -13 -75 -118 -100 -238 -146 -123 42 -175 -27 -63 96 83 -194 -2 -190 83 60 56 -3 -24 -232 -11 -101 -102 128
7759 128 -277 -340 -38 -72 -9 195 94 -92 -300 -10 48 -53 -90 -64 -42 123 -54 -287 -85 -61 15 35 42 -50
$$ packed form
7596D1k35K32p9R4j07L78k24j25M9J63j79m28N52k64K88j40j7k0J56l52o1M8J54
7619g6L46k56P1K9l2j94K30J17k66J09r3k05L98l78K29K77j6k49O9m7pO2J22j57
7643H3J47p4j47J27o7J58j53mj53K67j19J37l44J18j58L89j51R1N5j66l84M51
7665A03n9j89j08K86n8j24M0J29l3j6o7k01Q1J00r4J95o1L51k73J11j78K13m62
7688c14L83o0q7J99n1l09L50j29j54L83M7n00J2L50l37J49j28K45l8J44m20m3
7710c08L10j05R7K46l29J46P9o4l93L26M3k01J54p3o2K61q6K36l77l1J13j78K58
7733F2p5o2m3J8j38R2K3J65k17J48l6J59j3k77J92j88K73k3mn9k1k08K21r0jK30
7759A28m05o3L02l4O3K04j01j86k08K90N8j01l7K6K2J65j77k33K02K4P6K0Pr2
$$ plain form
7783 -50 75 -28 53 33 60 -110 331 74 -418 114 41 104 45 119 -33 193 188 153 -208 -115 -10 -311 54 -24
7807 -24 69 56 -79 91 32 -296 195 -38 -108 119 2 -243 -371 -135 -80 273 157 -218 102 -106 -165 -28
7829 -28 -156 -27 -217 233 49 362 -77 -127 281 -346 187 101 -214 185 23 -105 165 175 308 -1 -93 89
7851 89 -97 53 41 -35 -26 36 -148 -92 187 -114 104 13 -80 -108 137 -138 89 88 -314 37 101 -135 -118 -40 190
7876 190 42 -25 39 -84 -64 -27 20 140 -24 74 311 -132 -5 -31 -189 -82 66 -16 -68 -41 18 30 -186 54
7900 54 27 -237 155 -143 122 -96 -158 77 -134 -184 89 168 319 39 -175 -84 78 61 -224 -35 290 -132
7922 -132 -61 -85 -180 -189 -121 -223 -96 67 14 -46 -173 -121 261 93 -186 -106 -96 -107 10 23 55 162 193 12 302
7947 302 407 166 -56 -29 -82 -120 -131 186 10 22 132 195 -60 -127 228 -17 55 -55 -102 17 224 97 151
$$ packed form
7783e0J25j03Q1k0K7j70M41k57m92N32p3O3n9P4j52K26nl5l61R3J05l01L65p8
7807b4R3j3j35J70n9l28M91k33p0K27j17k45j28K36N5L53j16l75L20k08n9J37
7829b8j28J29j90M50j84L13m39n0M08o27N33q6l15L99j62j28K70J0J33l09r2J82
7851H9j86J50j2p6RO2j84N6K79l01K18r1r3k8K45k75K27jm02L51O4k36J7P8K30
7876A90j48o7O4j23K0L7M7J20j64R8K37m43J27k6j58J07J48q2n2K7N9J2k16K40
7900E4k7k64L92k98K65k18o2K35k11n0K73P9J51k80k14R1J62j7k85J89L25m22
7922a32P1k4r5rO8j02J27J63n3o0j27N2L82j68k79Q0J0j1J17J3L2J07L1j81K90
7947C02J05k41k22K7n3l8j1L17j76J2J10O3k55o7L55k45P2j10m7J19K07j27N4
$$ plain form
7970 151 -111 -116 -114 -1 -120 -126 252 -24 1 -43 238 63 201 254 4 -262 107 -10 132 -217 -164 18 -44 -218
7994 -218 -496 -17 -29 133 -10 220 -257 -60 -2 134 -112 179 -85 -25 110 -258 -186 -237 -115 -366 -126 80
8016 80 -30 76 177 101 134 316 -164 204 -101 -175 150 14 142 334 154 -165 -60 -232 -88 195 -173
8037 -173 -227 236 -189 225 5 -179 -58 -114 -14 177 295 90 -287 119 -21 -288 -153 -223 -57 -116 -48 36
8059 36 -79 91 130 -160 -286 48 197 -33 -364 -98 -36 168 398 -67 -72 103 -202 -93 208 194 173 103 -162
8082 -162 44 -151 -199 -174 -3 130 -119 64 291 -237 3 410 150 -51 141 -243 130 22 -196 101 97
8103 97 -90 75 -18 129 186 70 217 25 -150 -109 -125 87 -295 32 -32 -160 -100 115 58 34 62 242 -52
8126 -52 -18 -139 98 109 -28 -86 -24 -5 122 -114 145 -128 -113 53 272 60 12 -205 -49 -67 -46 -252 139
$$ packed form
7970A51k62nKJ13j19oL78k76K5m4K81j75J38N3k50k66L69j17J42l49N3J82o2j74
7994b18k78M79j2J62j43K30m77J97N8J36k46K91k64O0J35l68P2n1J22k51K40K06
8016H0j10J06J01p6L3J82m80L68l05p4L25j36J28J92j80l19J05j72J44K83l68
8037a73n4M63m25M14k20j84J21n6J00J91J18k05l77M06j40k67J35p0J66n9O8Q4
8059C6j15J70L9k90j26L34J49k30l31K66O2K04K30m65nJ75l05J09L01j4k1p0k65
8082a62K06j95m8K5J71J33k49J83K27n28K40M07k60k01J92l84L73j08k18K97m
8103I7j87J65r3J47N7j16J47j92j75M1j6K12l82L27o4j28O0K15n7k4K8J80k94
8126e2L4j21K37J1j37n8O2J9J27k36K59k73J5J66K19k12m8k17J56j8K1k06L91
$$ plain form
8149 139 -7 -32 -22 -40 77 326 93 6 25 5 -211 170 -342 113 -236 -33 -41 -118 31 87 213 -111 -66 5
8173 5 90 78 -200 66 78 238 7 32 286 -50 -4 -132 12 -79 -86 -158 84 -100
$$ packed form
8149A39j46k5J0j8J17K49k33q7J9k0k16L81n12M55l49K03qp7J49N6J26l24M5P1
8173EQ5j2k78K66J2J60k31K5K54l36M6j28J44r1pp2K42j84
8191a00
$$ Imaginary data points
##PAGE= N=2
##DATA TABLE= (X++(I..I)), XYDATA
$$ plain form
0 0 0 0 0 -8 8 0 8 -8 16 -16 24 -24 32 -40 48 -61 72 -88 103 -120 138 -162 186 -218 247 -282 322 -366 414
29 414 -470 528 -594 664 -744 831 -923 1026 -1143 1267 -1402 1554 -1721 1904 -2110 2338
45 2338 -2594 2883 -3213 3594 -4036 4558 -5188 5965 -6950 8243 -10029 12666 -16962 25168
59 25168 -46543 217983 463779 -57974 -287373 -121415 136761 68374 -29347 61472 202590
70 202590 67458 -156428 -161424 51217 145276 72836 12161 36430 -20112 -128542 -92549
81 -92549 109495 184059 16411 -150262 -79623 68594 52702 -63151 -43044 79238 80300
92 80300 -59170 -113182 -7609 81363 36708 -23323 558 26312 -24852 -54347 22235 93930
104 93930 33841 -64386 -39764 57291 56068 -32540 -42077 48421 75720 -15880 -74876 -1731
$$ packed form
0@%%%qJ6qQj6K4l2M0m8N6p2Q8j09J33j60J91k23K58l00L48m04M65n29O04o88P80
29D14q84R98j122J258j408J575j754J949k169K410k669K956l275L625m014M448
45B338m932N477o096O807p630Q594r746J1153j2915J5193j8272K2695k9628M2130
59B5168p1711K64526K45796n21753k29399J65958K58176o8387r7721R0819J41118
70B02590j35132k23886m996K12641R4059p2440o0675K4269n6542j08430L5993
81i2549K02044P4564j67648j66673P0639J48217j5892j15853K0107J22282J062
92H0300j39470n4012J05573Q8972m4655o0031K3881K5754n1164k9495P6582P1695
104I3930o0089r8227K4622R7055j223q8608r537R0498K7299r1600n8996P3145
$$ plain form
116 -1731 80156 38948 -47167 -34435 40653 40346 -26282 -34608 31213 54086 -5841 -47168 -4822
129 -4822 45379 28504 -12513 -5346 22493 11544 -13780 4909 42283 31356 -13468 -17021 24035
142 24035 38658 3297 -17505 14886 46250 20868 -26893 -26279 18326 43610 21130 -14239
154 -14239 -24601 -8015 14151 17851 -2134 -23012 -13598 14901 15865 -22326 -46559 -10405 40284
167 40284 27283 -37696 -59187 -3659 44047 14619 -39707 -32265 22379 34233 -14174 -42765
179 -42765 -3619 43216 25591 -24181 -27951 14780 33862 5172 -18802 -412 27973 18311
191 18311 -12325 -14432 13753 26798 5776 -13912 -3520 15557 11450 -6606 -9149 6116 12313
204 12313 -1474 -12118 -2074 9113 1599 -11310 -7389 6056 5629 -8096 -12108 488 7928
$$ packed form
116a731Q1887m1208q6115J2732P5088l07o6628q326O5821K2873n9927m1327M2346
129d822N0201j6875m1017P167K7839j0949k5324J8689L7374j0927m4824l553M1056
142B4035J4623l5361k0802L2391L1364k5382m7761O14M4605K5284k2480l5369
154a4239j0362J6586K2166L700j9985k0878R414K8499R64l8191k4233L6154N0689
167D0284j3001o4979k1491N5528M7706k9428n4326P442N4644J1854m8407k8591
179d2765L9146M6835j7625m9772l770M2731J9082k8690k3974J8390K8385r662
191A8311l0636k107K8185J3045k1022j9688J0392J9077m107j8056k543J5265O197
204A2313j3787j0644J0044J1187p514j2909L921J3445m27j3725m012J2596P440
$$ plain form
217 7928 -2586 -13340 -5368 8361 4827 -9427 -11534 -818 4575 -845 -4479 -2009 -2374 -6184
231 -6184 -4329 2554 1530 -8267 -9295 3595 7198 -9589 -19711 -2716 17821 7377 -20357
244 -20357 -22168 5090 18356 -2024 -20450 -7136 13182 6331 -14447 -13173 6186 10644 -2590
257 -2590 -7493 447 899 -7994 -2841 14421 12212 -13617 -22178 6950 27393 2137 -28978 -10936
271 -10936 29797 23514 -24836 -38191 9298 43411 10106 -38479 -26656 22878 29422 -12634
283 -12634 -32127 -572 27211 7885 -23917 -19426 8387 15995 -353 -9853 -5261 -2214 -3409
296 -3409 2051 6762 -2417 -12371 -2621 13100 4428 -17830 -13969 14223 22124 -6502 -27033 -5867
310 -5867 21888 11716 -16105 -14375 11215 14359 -8870 -15838 4719 15043 -2013 -14650 916
$$ packed form
217G928j0514j0754P972J3729l534j4254k107J0716N393n420l634K470l65l810
231f184J855O883j024r797j028J2890L603j6787j0122J6995K0537j0444k7734
244b0357j811K7258J3266k0380j8426J3314K0318o851k0778J274J9359M458j3234
257b590m903P940M52q893N153J7262k209k5829q561K9128K0443k5256l1115J8042
271a0936M0733o283m8350j3355M7489L4113l3305m8585J1823M9534O544m2056
283a2634j9493L1555K7783j9326l1802M491K7813P608j6348r500M592L047j195
296c409N460M711r179r954R750J5721q672k2258L861K8192P901k8626k0531K1166
310e867K7755j0172k7821J730K5590L144k3229o968K0557J0324j7056j2637J5566
$$ plain form
323 916 14934 -683 -18925 -3698 21302 10052 -20893 -19178 14316 24405 -5963 -26633 -4338
336 -4338 22998 11327 -17316 -16047 9699 15690 -3228 -12742 -979 8237 1727 -3572 2007 2883
350 2883 -6211 -6257 8930 13766 -4057 -16968 -730 19507 8467 -15772 -12557 14438 20364 -6001
364 -6001 -21983 -2291 21523 13079 -11486 -13052 5176 12113 -386 -7961 103 7542 3033 -2871
378 -2871 -2763 -1548 -1892 2776 9003 3977 -10864 -12694 5438 16101 -54 -16922 -6116 15609
392 15609 10814 -15072 -19918 5624 23019 4555 -20748 -14743 9558 14024 -4940 -13980 -523
405 -523 10314 1955 -10137 -6652 4552 5437 -1414 -3029 1026 -268 -4735 -1621 6064 5733 -3393
420 -3393 -6141 1508 7032 2020 -4458 -623 6631 5022 -2099 -2941 2959 4976 996 461 3576 2525
$$ packed form
323I16J4018j5617j8242J5227K5000j1250l0945J715L3494J0089l0368k0670K2295
336d338K7336j1671k8643J269K5746N991j8918r514J1763R216o510n299N579Q76
350B883r094m6J5187M836j7823j2911J6238K0237j1040k4239L215K6995N926k6365
364f001j5982J9692K3814q444k4565j566J8228O937j2499p575Q064P439m509n904
378b871J08J215l44M668O227n026j4841j830J8132J0663j6155j6868J0806K1725
392A5609m795k5886m846K5542J7395j8464k5303O005K4301M466j8964r040J3457
405e23J0837q359j2092L485J1204Q85o851j615M055j294m467L114P685l31r126
420c393k748P649N524n012o478L835P254j609p121q42N900K017l980n35L115j051
$$ plain form
436 2525 -2444 -1572 5147 6213 -2245 -7478 775 9489 2780 -9613 -7643 5648 8456 -4852 -12311
451 -12311 -2044 8862 2695 -11889 -10912 3229 8057 -3135 -11475 -5014 3779 1506 -6074 -5961
465 -5961 1069 3225 -1397 -4684 -3554 -1184 828 2803 2777 -2035 -7058 -2265 6802 5695 -4416
480 -4416 -6943 3732 10378 -200 -12335 -5706 11326 12869 -3798 -13656 -2903 10449 5930
493 5930 -6061 -6542 3510 7392 -925 -7461 -2908 4363 5148 818 -1760 -2403 -1829 337 3919 3073
509 3073 -1596 -2876 1473 3871 -760 -4606 82 6609 3577 -5681 -6599 1527 5270 -1055 -5791
524 -5791 -1355 3285 -1109 -7400 -5138 2685 2648 -4984 -7698 -1581 2473 -2612 -7004 -2848 3203 427
540 427 -6053 -5321 901 3516 -1003 -4259 -1041 2909 2055 -1371 -840 2322 3161 2099 847 947 1268
$$ packed form
436B525m969Q72O719J066q458n233Q253Q714o709j2393J970J3291K808j3308p459
451a2311J0267J0906o167j4584R77J4141M828j1192q340O461Q793k273p580J13
465e961P030K156m622l287J130K370K012J975k6m812n023M793R067j107j0111
480d416k527J0675O646j0578j2135O629J7032J543j6667r858J0753J3352m519
493E930j1991m81J0052L882q317o536M553P271P85m330k578o43N74K166L582q46
509C073m669j280M349K398m631l846M688O527l032r258r18Q126L743o325m736
524e791M436M640m394o291K262P823l7p632k714O117M054n085m392M156O051k776
540D27o480P32O222K615m519l256L218L950q54l426N31L162Q39j062j252J00L21
$$ plain form
557 1268 3180 4137 2947 -40 -610 3241 6161 2709 -3124 -1984 4473 5645 -844 -5947 -965 5774
573 5774 3373 -5185 -7538 320 6274 1286 -6567 -5698 793 3491 -1488 -5343 -2864 2178 2381 -1909
589 -1909 -5178 -2205 2153 2973 -133 -3229 -2739 536 2671 436 -2339 -1508 2275 2998 -857 -4327
605 -4327 -1762 3713 4398 -1348 -4952 -1067 3766 2024 -3038 -3336 1533 3878 -173 -4429 -2557 2590
621 2590 3808 -607 -2927 -447 2359 1861 -839 -357 1511 2506 830 -809 497 2035 1735 1003
637 1003 819 1196 1354 772 252 762 959 1342 379 -783 -955 78 660 -113 -1792 -2122 -247 557 -1713
656 -1713 -3526 -2157 1345 1142 -3021 -4706 -1783 2239 538 -3518 -4125 369 2721 -482 -4027 -2246
672 -2246 1943 3262 -459 -3272 -1085 2643 2866 -351 -2242 -102 2778 2121 -420 -2019 210 2843
$$ packed form
557A268J912R57j190k987n70L851K920l452n833J140O457J172o489n103M982O739
573E774k401q558k353P858N954m988p853Q69O491K698m979l855K479N042K03m290
589a909l269K973M358Q20l106l096M90L275K135k235k775Q31L783P23l855l470
605d327K565N475O85n746l604L885M833j742n062k98M869K345m051m256J872N147
621B590J218m415k320K480K806m98k700M82J868R95j676j639J306J538l00p32
637A003j84L77J58n82n20N10J97L83r63j162j72J033N82p73j679l30J875Q04k270
656a713j813J369L502k03m163j685K923M022j701m056o07M494K352l203l545J781
672b246M189J319l721k813K187L728K23l217j891K140K880o57k541j599K229K633
$$ plain form
688 2843 2660 -624 -2808 -342 2544 2711 -1126 -3106 -194 2293 1232 -2783 -2993 1248 3316 156
704 156 -3484 -2434 1542 2064 -721 -2776 -755 1974 895 -1846 -2173 211 1534 532 -1582 -1589 66
721 66 1017 26 -698 -945 -289 515 -199 -1542 -1100 784 1203 -377 -2139 -1786 941 1317 -1074 -2309
739 -2309 -659 1463 324 -2705 -1892 1163 2442 -621 -3061 -1396 1817 2000 -1066 -2074 513 2267
755 2267 727 -1804 -1066 1457 1997 192 -1624 -744 1153 1363 145 -1192 -324 823 1296 -93 -1128
772 -1128 -595 919 1294 -673 -2008 -1007 1170 1800 -842 -1817 -587 1585 704 -2120 -1777 856 2248
789 2248 -311 -2663 -1694 1955 2281 -447 -2468 -854 1341 855 -1037 -1613 861 2124 344 -1608
805 -1608 -1332 687 1671 593 -1357 -995 730 1216 225 -1040 -480 996 1312 -468 -1688 -672 1380
$$ packed form
688B843j83l284k184K466K886J67l837j980K912K487j061m015k10M241K068l160
704A56l640J050L976N22k785k055K021K729j079k741l27K384J323j002k114pJ655
721F6R51r91p24k47O56Q04p14j343M42J884M19j580j762L53K727L76k391j235
739b309J650K122j139l029Q13L055J279l063k440J665L213J83l066j008K587J754
755B267j540k531P38K523N40j805j816Q80J897K10j218j337Q68J147M73j389j035
772a128N33J514L75j967j335J001K177O30k642r75J230K172q81k824L43K633J392
789B248k559k352R69L649L26k728k021J614K195m86j892n76K474J263j780j952
805a608K76K019R84j078j950L62J725M86r91j265N60J476L16j780j220J016K052
$$ plain form
822 1380 1379 -239 -1642 -356 1196 1169 -1058 -1021 970 1873 240 -1638 -1188 1489 2119 269 -1714 -1094
840 -1094 939 1562 -392 -1191 145 1810 834 -893 -1807 144 1840 865 -908 -1158 333 1190 609
857 609 -924 -364 752 1281 127 -1218 -788 1133 1416 0 -832 -306 795 800 -301 -660 254 1099
875 1099 107 -1147 -498 977 1207 -93 -1039 -622 1337 1035 -394 -1356 260 1338 799 -1320 -1338 334
893 334 1620 423 -1524 -1273 732 1557 165 -1717 -1536 867 1256 0 -1885 -824 1377 1649 -439
910 -439 -1587 -510 1331 994 -335 -1602 -149 1185 890 -608 -1276 304 1408 568 -1009 -1058 233
927 233 1206 -25 -1220 -774 592 745 -418 -1108 242 966 183 -1044 -1026 291 1080 74 -1256 -730
945 -730 600 494 -353 -1274 -512 982 518 -749 -1527 -251 1070 460 -659 -1300 -328 900 231 -1094
$$ packed form
822A380jj618j403J286J552k7k227L7J991R03j633j878M50K677O30j850j983O20
840a094K033O23j954p99J336J665r76j727r14J951J696r75j773k50J491Q57n81
857F09j533N60J116N29j154j345M30J921K83j416q32N26J101Nj101l59R14Q45
875A099r92j254O49J475K30j300r46M17J959l02j429r62J616J078n39k119j8J672
893C34J286j197j947K51K005Q25j392j882J81K403L89j256j885J061K201K72k088
910d39j148J077J841l37j329j267J453J334k95j498o68J580J104q40j577m9J291
927B33R73j231j195M46J366J53j163o90J350P24p83j227J8J317P89j006j330N26
945g30J330j06q47r21P62J494m64j267p78J276J321o10j119o41R72J228o69j325
$$ plain form
963 -1094 -1043 246 1291 190 -1086 -1136 854 1066 -31 -1463 -667 868 985 -508 -1285 195 1263
980 1263 870 -869 -1463 -275 928 605 -1037 -946 466 1048 230 -1159 -500 350 1038 -178 -1213 -633
998 -633 906 720 -208 -986 -118 904 685 -431 -717 195 1190 531 -613 -613 184 901 -80 -808 -308 635
1018 635 987 -246 -1062 -210 1049 739 -271 -873 -75 1223 453 -875 -783 325 990 252 -574 -536 544
1037 544 947 83 -941 -155 1029 884 43 -707 52 983 771 -256 -841 132 1037 744 -287 -684 781
1056 781 1196 304 -665 -196 1080 1351 -40 -912 108 722 869 -369 -635 178 1081 772 -613 -677 297
1075 297 1257 328 -388 -141 732 944 197 -564 -505 1025 815 -185 -673 -218 857 697 63 -433 366
1094 366 1005 753 -468 -404 536 1164 437 -383 -288 680 1220 295 -409 246 1218 1255 81 -556 270 1053
$$ packed form
963a094N1J289J045j101j276n0J990K12j097j432P96J535J17j493p77J480J068
980A263l93j739n94J188J203l23j642R1J412N82q18j389O59Q50O88j216j035N80
998f33J539j86r28p78Q68J022k19j116k86R12R95o59j144%P97P17r81p28N00R43
1018F35L52j233q16Q52J259l10j010o02P98J298p70j328R2J108O65p38q26L8J080
1037E44M03q64j024P86J184j45q41p50P59R31k12j027n85R73R05k93j031l97J465
1056G81M15q92r69M69J276K71j391q72J020O14J47j238k66Q13R03l09j385o4R74
1075B97R60r29p16K47Q73K12p47p61N9J530k10j000m88M55J075j60o34m96P99
1094C66O39k52j221O4R40O28p27q20R5R68N40r25p04O55R72L7j174o37Q26P83
$$ plain form
1114 1053 618 -130 -402 352 985 389 -136 -232 456 912 249 -429 -217 520 691 -265 -875 -62 854 753
1134 753 269 -597 83 926 623 -159 -752 176 763 610 -498 -473 395 1046 540 -840 -413 511 941 -197
1154 -197 -519 -243 844 752 -95 -543 50 1033 373 -164 -367 543 998 444 -262 -321 507 646 -190 -483
1174 -483 147 373 801 -21 -512 -256 441 814 -254 -393 138 915 492 -601 -615 484 795 215 -826
1193 -826 -157 752 879 -331 -717 44 584 702 -293 -949 64 659 802 -624 -609 128 446 -21 -623
1212 -623 -252 58 654 154 -1027 -570 277 500 -26 -626 -261 69 355 -301 -945 -69 594 280 -424 -596
1232 -596 -82 456 463 -460 -620 168 551 -44 -438 -561 444 449 -312 -883 -396 548 62 -583 -696 -6 411
1253 411 -107 -719 -761 119 -2 -35 -699 -353 218 251 -349 -536 -403 40 358 -391 -508 -105 294 301 -487 -661
$$ packed form
1114A053m35p48k72P54O33n96n25r6O88M56o63o78K12P37J71r56o10Q13R16j01
1134G53m84q66O80Q43l03p82n93R28N87j53j108K5Q68O51n06j380M27R24M30j138
1154a97l22K76J087r2q47m48N93R83o60n37k03R10M55n54p06n9Q28J39q36k93
1174d83O30K26M28q22m91K56O97L73j068j39N31P77m23j093j4J099L11n80j041
1193h26O69R09J27j210l86P61N40J18r95o56J013N95J43j426J5P37L18m67o02
1212f23L71L10N96n00j181M57Q47K23n26o00L65L30K86o56o44Q76O63l14p04j72
1232e96N14N38Pr23j60P88L83n95l94j23J005Np61n71M87R44m86o45j13O90M17
1253D11n18o12m2Q80j21l3o64L46N71L3o00j87J33M43L18p49j17M03L99Pp88j74
$$ plain form
1275 -661 -1 213 159 -593 -511 206 536 22 -448 -397 -2 85 -260 -610 -507 549 152 -347 -630 -223 281
1296 281 -132 -544 -850 38 474 -46 -647 -385 136 50 -102 -711 -367 310 365 -507 -604 -207 255 201 -504
1317 -504 -584 -293 541 210 -506 -557 129 394 -79 -474 -274 270 214 -377 -862 -467 176 32 -356 -490 -146
1338 -146 91 -56 -295 -615 45 64 243 -539 -509 148 626 211 -520 -269 -74 166 -214 -451 -528 175 374
1359 374 -21 -562 -13 286 270 54 -219 -49 480 36 -325 -358 473 339 -229 -586 76 555 326 -53 -529
1380 -529 -100 504 282 252 158 64 122 52 -452 -300 326 241 49 -301 -81 252 416 -157 -353 -169 719 646
1402 646 -340 -566 38 560 560 -119 -626 77 610 197 -331 -297 292 358 39 -372 -372 653 320 -39 -317 -90
1424 -90 384 399 -163 -126 -65 227 274 -68 -523 -72 270 160 -146 -101 271 505 247 -291 49 300 102 -52
$$ packed form
1275f61O60K14n4p52Q2P17L30n14m70N1L95Q7l45l50J03J056l97m99k83M07N04
1296B81m13m12l06Q88M36n20o01K62N21q6j52o09L44O77N5q72r7L97M62n4p05
1317e04q0K91Q34l31p16n1O86K65m73l95K00N44n6n91m85L95O43j44l88j34L44
1338a46K37j47k39l20O60J9J79p82L0O57M78m15p31K51J95K40l80k37p7P03J99
1359C74l95n41N49K99j6k16k73J70N29m44l61l3Q31j34n68l57O62M79k29l79m76
1380e29M29O04k22l0r4r4N8p0n04J52O26q5j92l50K20L33J64n73j96J84Q88p3
1402F46r86k26O04N22%o79n07P03N33m13n28L4N89O6l19m11%J025l33l59k78K27
1424i0M74J5n62L7O1K92M7l42m55M51L42j10l06M5L72K34k58n38L40K51j98j54
$$ plain form
1446 -52 -443 -161 602 553 -66 -446 -49 224 443 -235 -263 349 551 -137 -187 -168 225 438 -12 31 104 284
1468 284 259 -184 -224 -236 43 130 -173 -228 -71 419 -50 -230 -284 16 241 86 -371 49 104 363 -195 -344
1490 -344 -268 99 -104 -451 -373 -41 351 -69 -372 -390 156 111 -223 -376 -393 250 298 -69 -319 -336 146 415
1512 415 136 -216 282 328 104 43 -223 -44 263 159 -226 -311 285 224 -133 -43 -61 75 178 -91 -257 4
1534 4 361 440 -295 -391 -389 245 52 -238 -507 -8 274 -129 -243 -382 395 320 -64 -323 -190 182 266 -407 -390
1557 -390 -14 -149 -104 -150 -281 177 262 251 -114 -556 97 96 239 -246 23 234 292 184 -380 -71 129 56 172
1580 172 -691 -253 90 92 -75 -346 151 326 552 -232 -291 316 309 192 -264 129 89 410 27 -162 147 81
1602 81 159 -115 183 35 437 138 -467 -380 -29 295 43 -306 -400 171 115 -87 -511 -393 129 22 -249 -376
$$ packed form
1446e2l91K82P63m9o19l80L97K73K19o78k8O12K02o88n0J9L93K13m50M3P3J80
1468B84k5m43m0j2K79Q7l03n5J57M90m69j80n4L00K25j55m57M20N5K59n58j49
1490c44P6L67k03l47P8L32L92m20l03j8N46m5l34j53j7O43M8l67k50j7M82K69
1512D15k79l52M98M6k24o1k66J79L07j04l85q5N96o1l57R0j8J36J03k69j66K61
1534DL57P9p35r6KO34j93k90k69M99K82m03j14j39P77p5l84k59J33L72Q4o73J7
1557c90L76j35M5m6j31M58Q5j1l65m42O53jJ43m85K69K11N8j08n64L09K00p3J16
1580A72q63M38L43Kj67k71M97J75K26p84n9O07pj17m56L93m0L21l83j89L09o6
1602H1P8k74K98j48M02k99o05Q7L51L24k52l49r4N71n6k02m24J18N22j07k71j27
$$ plain form
1624 -376 -39 -64 -132 -211 57 264 200 -30 -147 -453 -214 184 231 -128 2 447 167 12 -21 222 412 249
1646 249 140 -55 47 235 507 -36 -168 166 330 162 32 -144 336 67 180 -368 -362 267 98 -137 -156
1667 -156 -214 -142 114 -534 -95 -78 175 -100 -18 -390 281 95 85 -48 -98 -12 293 -61 -54 -378 237 281 -215
1690 -215 -178 -181 192 149 134 -472 -39 257 153 -234 -249 -6 -87 -313 -519 227 449 272 80 92 -154 179 420
1713 420 -150 -256 -7 167 226 -178 -171 -171 241 -101 -90 -51 7 212 -30 -92 228 160 611 -252 -486 -198 -64
1736 -64 280 40 -523 -66 242 -70 -330 -125 169 -260 -70 -199 -206 143 -54 6 -107 -335 170 -5 -123
1757 -123 -189 -31 -101 3 -226 -348 -216 147 -38 -62 -209 153 265 -79 65 -324 68 0 -103 -118 -82 318
1779 318 -97 -112 -38 -141 232 94 94 -217 201 -2 -286 -48 -406 174 11 134 -379 -39 -32 292 -294 -44
$$ packed form
1624c76L37k5o8p9K68K07o4k30j17l06K39L98M7l59J30M45k80j55l3K43J90j63
1646B49j09j95J02J88K72n43j32L34J64j68j30j76M80k69J13n48OO29j69k35j9
1667a56n8P2K56o48M39J7K53k75Q2l72O71j86j0j33n0Q6L05l54Pl24O15M4m96
1690b15L7lL73m3j5o06M33K96j04l87j5K43q1k26k06P46K22j77j92J2k46L33K41
1713D20n70j06K49J74N9m04P%M12l42J1L9N8K05k42o2L20o8M51q63k34K88J34
1736f4L44k40n63M57L08l12k60K05K94m29J90j29pL49j97O0j13k28N05j75j18
1757a23o6J58p0J04k29j22J32L63j85k4j47L62J12l44J44l89L92o8j03j5L6M00
1779C18m15j5P4j03L73j38%l11M18k03k84K38l58N80j63J23n13L40PL24n86K50
$$ plain form
1801 -44 111 94 83 99 -86 104 199 -18 -15 -95 61 12 291 144 250 -116 299 47 -164 1 79 427 -220
1824 -220 -372 132 85 -37 -208 -387 -38 298 -60 125 -21 4 117 40 -112 37 56 204 -32 -16 65 141
1846 141 153 -25 -125 -123 143 177 46 -173 -43 200 -178 -57 -120 48 272 -168 -306 -180 116 379 -276 -13
1868 -13 -100 199 338 10 -86 292 113 122 -149 -189 443 186 -70 -91 -273 40 552 -23 -453 -221 81 199
1890 199 -132 130 -172 217 214 106 -46 95 308 -48 72 48 -2 -219 -178 -3 174 -176 47 47 185 82
1912 82 -55 3 -175 -114 -224 165 20 -89 -9 -88 61 166 -90 -7 239 121 -83 10 -203 58 -242 254
1934 254 -454 -115 6 242 105 -4 111 167 -147 -150 19 317 159 -93 -108 132 -130 104 -239 -36 78
1955 78 -23 214 -120 34 307 200 20 18 -334 74 -45 -95 30 -153 -91 59 -91 -188 50 232 -101 113
$$ packed form
1801d4J55j7j1J6j85J90R5k17Lq0J56m9K79j47J06l66M15k52k11J65P8L48o47
1824b20j52N04m7j22j71j79L49L36l58J85j46K5J13p7j52J49J9J48k36J6Q1P6
1846A41J2j78j00KK66L4j31k19J30K43l78J21o3J68K24m40j38J26K96K63o55K63
1868a3q7K99J39l28r6L78j79Rk71m0O32k57k56k1j82L13N12n75m30K32L02J18
1890A99l31K62l02L89lj08j52J41K13l56J20k4n0k17M1J75J77l50K23%J38j03
1912H2j37N8j78O1j10L89j45j09Q0p9J49J05k56Q3K46j18k04R3k13K61l00M96
1934B54p08L39J21K36j37j09J15N6l14lJ69K98j58k52j5K40k62K34l43K03J14
1955G8j01K37l34J54K73j07j80kl52M08j19n0J25j83O2J50j50r7K38J82l33K14
$$ plain form
1977 113 -30 121 -53 93 -117 67 -202 127 226 -31 -132 240 61 22 -178 -21 163 44 331 -24 37
1998 37 256 -137 -208 70 214 392 -14 -62 -43 141 148 -15 13 170 295 171 268 -140 72 131 13 -70 -278
2021 -278 153 91 -55 -255 86 -153 124 135 -10 21 -22 135 -154 -150 -326 -54 21 1 -394 43 45 225 55
2044 55 -40 93 55 -138 -155 -164 -45 -25 69 -46 -62 -285 133 53 31 -8 343 86 -124 70 -160 236 150 -177
2068 -177 -313 167 74 339 -140 -234 -3 69 89 279 -138 160 -107 -161 -108 -160 -273 6 133 -28 313 -63
2090 -63 245 -18 110 49 194 66 -10 60 173 89 -208 10 141 -47 28 -5 -9 -17 292 -58 -161 -89 -287 172
2114 172 192 -286 -348 306 114 155 -31 -129 183 358 270 -269 -71 13 7 -23 -355 -118 280 185 275 -8 -386 204
2138 204 -238 238 150 236 -18 -139 -65 208 81 198 250 98 -67 -45 -121 47 168 -214 -9 138 -35 -134
$$ packed form
1977A13j43J51j74J46k10J84k69L29R9k57j01L72j79l9k00J57J84j19K87l55O1
1998C7K19l93p1K78J44J78m06m8J9J84Pj63K8J57J25j24R7m08K12N9j18q3k08
2021b78M31o2j46k00L41k39K77J1j45L1m3J57k89Mj76K72P5k0l95M37KJ80j70
2044E5r5J33l8j93j7rJ19K0R4j15j6k23M18q0k2l9L51k57k10J94k30L96q6l27
2068a77j36M80r3K65m79r4K31P2K0J90m17K98k67n4N3n2j13K79J27j61L41l76
2090f3L08k63J28o1J45j28p6P0J13q4k97K18J31j88P5l3mqL09l50j03P2j98M59
2114A72K0m78o2O54j92M1j86r8L12J75q8n39J98Q4ol0l32K37L98r5R0k83l78N90
2138B04m42M76q8Q6k54j21P4K73j27J17N2j52j65K2p6J68J21l82K05J47j73r9
$$ plain form
2160 -134 267 150 166 -256 125 250 61 -145 68 76 -198 259 -195 0 -110 12 120 144 -194 -167 -111 74
2182 74 -267 25 -37 208 -381 -123 -95 -8 -36 38 -186 -219 79 -207 -71 -342 50 460 99 -146 -17 299
2204 299 -39 32 -20 -167 151 201 16 92 -30 400 91 357 -176 157 217 73 113 87 198 -11 154 -206
2226 -206 -244 -95 172 5 249 117 159 -185 192 -14 -139 169 23 -210 -65 -155 -3 347 119 -79 166
2247 166 64 25 -139 92 6 322 138 -56 -152 -23 80 -109 -253 167 201 -94 99 -119 -134 120 141 223
2269 223 -141 -81 324 28 16 -153 30 248 -101 -53 -231 30 158 -271 -192 87 -45 -35 0 -139 186 -20
2291 -20 184 -218 -299 38 -269 -167 -408 -186 -72 -49 -155 -41 -246 -54 56 -86 28 19 36 53 165 -101
2313 -101 -87 -191 106 -113 -227 28 73 243 102 -24 -217 -151 -208 162 58 47 -228 -50 -6 258 72 -45
$$ packed form
2160a34M01j17J6m22L81J25j89k06K13Qk74M57m54J95j10J22J08K4l38K7N6J85
2182G4l41K92o2K45n89K58K8Q7k8P4k24l3K98k86J36k71L92M10l61k45J29L16
2204B99l38P1n2j47L18N0j85P6j22M30l09K66n33L33O0j44M0k6J11k09J65l60
2226b06l8J49K67j67K44j32M2l44L77k06j25L08j46k33J45r0J52L50k28j98K45
2247A66j02l9j64K31q6L16j84j94r6J29J03j89j44M20L4k95J93k18j5K54K1Q2
2269B23l64O0M05k96j2j69J83K18l49M8j78K61J28m29P9K79j32J0L5j39L25k06
2291b0K04m02q1L37l07J02k41K22J14K3j06J14k05J92J10j42J14rJ7J7J12k66
2313a01J4j04K97k19j14K55M5J70j41j26j93O6n7L70j04j1k75J78M4K64j86j17
$$ plain form
2335 -45 -38 148 -70 56 -82 -329 168 -247 198 -12 148 61 287 -221 -146 -30 142 -186 -199 -288 96 -70
2357 -70 -14 146 -20 -301 302 -92 -94 17 131 239 -77 -76 -292 120 -42 25 101 205 -2 -56 224 0 95
2380 95 345 8 -220 144 389 -129 -91 -12 81 117 15 360 -85 -234 3 107 303 -97 1 374 2 128
2402 128 179 26 106 -394 208 118 87 -97 366 79 -102 112 -89 -285 -100 -281 -172 308 -309 -155 -24
2423 -24 -97 -270 260 -135 -42 111 -73 298 -242 124 173 -158 7 -67 -181 -71 -36 -20 107 225 192 -381 21
2446 21 89 -21 -256 -77 45 -188 -102 -184 11 -123 100 76 55 -260 52 205 49 124 -324 105 -366 167
2468 167 123 -323 -29 -21 127 22 15 423 229 -18 171 -342 129 -33 116 -29 -46 -109 220 -43 -450 233
2490 233 -37 224 159 35 -89 43 -58 -266 -22 -226 -2 -152 244 -133 58 -55 -58 154 -59 -122 -39 72
$$ packed form
2335d5PJ86k18J26j38k47M97m15M45k10J60q7K26n08P5J16J72l28j3q9L84j66
2357g0N6J60j66k81O03l94kJ11J14J08l16Jk16M12j62O7P6J04k07n4K80k24R5
2380I5K50l37k28L64K45n18L8P9R3L6j02L45m45j49K37J04J96m00R8L73l72J26
2402A28N1j53Q0n00O02r0l1j84M63k87j81K14k01j96J85j81J09M80o17J54J31
2423b4p3j73N30l95R3J53j84L71n40L66M9l31J65p4j14J10L5J6J27J18l3n73M02
2446B1O8j10k35J79J22k33Q6q2J95j34K23k4k1l15L12J53j56P5m48M29m71N33
2468A67m4m46K94QJ48j05pM08j94k47J89n13M71j62J49j45j7o3L29k63m07O83
2490B33k70K61o5j24j24J32j01k08K44k04K24j50L96l77J91j13lK12k13o3Q3J11
$$ plain form
2512 72 -55 160 -105 64 129 134 228 266 -54 -125 -36 -26 -175 89 101 247 147 -99 -81 -272 130 -193 213 129
2536 129 -190 175 -121 163 -383 -27 108 -56 88 -45 -141 124 168 -6 -278 -162 -137 103 187 -9 -319
2557 -319 -117 123 -102 -31 141 170 -53 41 -263 -58 122 -60 -95 -75 97 13 -108 -34 183 256 27 169 -245
2580 -245 -260 -504 356 -153 90 -73 44 255 -138 -146 -87 134 201 -200 134 -77 -207 -2 115 -177 -254 165
2602 165 -157 5 79 92 -46 69 68 65 35 2 108 127 -96 124 -11 252 -170 -184 205 -20 126 228 -171
2625 -171 262 8 171 -213 65 -27 38 11 -89 -3 102 148 -7 -124 -199 74 107 -91 40 114 85 -314 -39
2648 -39 13 -145 212 22 139 25 142 -92 -88 -246 132 -65 -127 -5 50 -1 122 176 -2 -122 -17 21 -155
2671 -155 -159 21 207 -284 -172 -21 34 9 -20 47 -57 -74 34 -15 88 -206 -63 80 264 -250 214 356 -126
$$ packed form
2512G2j27K15k65J69O5NR4L8l20p1Q9J0j49K64J2J46j00k46J8j91M02l23M06q4
2536A29l19L65k96K84n46L56J35j64J44j33r6K65M4j74k72J16K5K40Q4j96l10
2557c19K02K40k25P1J72K9k23R4l04K05J80j82l5K0J72q4j21P4K17P3k29J42m14
2580b45j5k44Q60n09K43j63J17K11l93qN9K21O7m01L34k11j30K05J17k92p7M19
2602A65l22J62P4J3j38J15jll0l3J06J9k23K20j35K63m22j4L89k25J46J02l99
2625a71M33k54J63l84K78r2O5k7j00Q6J05M6j55j17p5K73L3j98J31P4k9l99K75
2648c9N2j58L57j90J17j14J17k34Mj58L78j97o2J22N5n1J23N4j78j20J05L8j76
2671a55mJ80J86m91J12J51N5k5k9O7j04j7J08m9J03k94J43J43J84n14M64J42m82
$$ plain form
2694 -126 -53 -71 161 135 25 -41 -97 -47 75 30 -40 -70 -113 -75 25 250 -174 -155 -6 -103 -16 -135 -30 -87 -177
2719 -177 -139 26 190 -83 -223 -92 134 234 168 48 223 -75 52 -165 -219 125 23 -132 75 -108 51
2740 51 -170 166 -25 -77 128 -308 -29 -25 145 207 -129 106 -227 182 -45 23 238 -169 -280 -38 134 -91
2762 -91 140 -5 -143 100 -37 -42 161 -54 -145 -185 28 -265 314 35 -74 196 -46 225 -167 -419 103 -81
2784 -81 7 53 -103 -87 107 59 -158 -16 182 298 -212 -19 -9 277 22 2 46 205 -16 136 -51 143 151
2807 151 -176 -170 86 -165 -244 228 111 -287 96 -50 -108 31 6 -152 115 59 100 176 209 -239 -52 102 -76
2830 -76 151 59 172 6 -142 156 145 -54 -131 98 143 42 97 92 -83 148 -88 99 -412 -61 20 -94 8
2853 8 -74 106 -224 54 -84 -151 31 126 -171 -69 -16 257 63 -244 95 70 25 -15 -187 -112 193 -9 230
$$ packed form
2694a26P3j8K32k6j10o6n6N0J22m5p0l0m3L8J00K25m24J9J49r7Q7j19J05n7r0
2719a77L8J65J64k73j40J31K26J00o6j20J75k98J27k17n4L44j02j55K07j83J59
2740E1k21L36j91n2K05m36K79MJ70O2l36K35l33M09k27O8K15m07j11K42J72k25
2762i1K31j45j38K43j37nK03k15r1m0K13k93N79k79j09K70k42K71l92k52N22j84
2784h1Q8M6j56J6J94m8k17J42J98J16n10J93J0K86k55k0M4J59k21J52j87J94Q
2807A51l27OK56k51p9M72j17l98L83j46n8J39k5j58K67n6M1P6L3m48J87J54j78
2830g6K27r2J13j66j48K98j1j99p7K29M5j01N5nj75K31k36J87n11L51Q1j14J02
2853Hq2J80l30K78j38o7J82R5k97J02N3K73j94l07L39k5m5m0j72P5L05k02K39
$$ plain form
2876 230 88 67 -66 -190 43 -188 152 45 -193 93 -150 74 -114 -43 -174 -260 144 -70 139 -71 35
2897 35 -162 9 45 38 71 45 -179 -62 -19 -228 -114 112 -125 247 268 272 28 -89 -52 -183 248 69 -38 -131
2921 -131 70 107 30 64 154 127 -59 -80 28 -31 -108 255 71 2 97 129 -105 85 237 -117 64 -80 154 -177
2945 -177 73 135 -196 31 109 148 218 -91 -145 136 102 263 -181 232 -166 -74 152 -75 64 124 -309 73 196
2968 196 -116 130 149 17 -241 169 -287 -8 -46 17 48 -96 -245 -49 15 317 -101 14 159 -44 -22 46
2990 46 -255 -54 63 137 -35 -304 -107 -74 105 86 -157 -144 -178 5 -138 -136 -183 153 72 338 -118 12 144
3013 144 275 297 175 -40 -411 128 -87 -43 -86 -229 -326 -97 -397 -36 115 -98 -182 -105 150 -165 100 -94
3035 -94 -134 135 -98 -54 -115 101 -166 9 143 39 -41 -124 125 -261 65 -189 -270 33 156 51 -87 164
$$ packed form
2876B30j42k1j33j24K33k31L40j07k38K86k43K24j88P1j31q6M04k14K09k10J06
2897C5j97J71L6pL3k6k24J17M3k09J14K26k37L72K1Mk44j17L7j31M31j79j07r3
2921a31K01L7p7L4R0k7j86k1J08n9p7L63j84o9R5L2k34J90J52l54J81j44K34l31
2945a77K50O2l31K27P8L9P0l09n4K81l4J61m44M13l98R2K26k27J39O0m33L82J23
2968A96l12K46J9j32k58M10m56K79l8O3L1j44j49J96O4L02m18J15J45k03K2O8
2990D6l01K01J17P4j72k69J97L3J79j9k43J3l4J83j43Km7L36q1K66m56J30J32
3013A44J31K2j22k15l71N39k15M4m3j43r7K29l00L61J51k13q4P7K55l15K65j94
3035i4m0K69k33M4o1K16k67J75J34j04q0q3K49l86L26k54q1L03J23j05j38K51
$$ plain form
3057 164 -172 211 191 202 -74 -392 118 -28 115 -73 -58 -406 -150 160 -172 -40 -51 267 -36 -21 105 18
3079 18 60 -122 -75 -46 -141 61 -151 -56 -70 98 -90 -273 -69 11 107 -301 -214 -48 -296 -7 29 -317 -79 -102
3103 -102 -125 -105 38 -148 -106 272 -23 -82 -8 -2 6 -31 124 -338 -116 12 50 413 49 204 47 -182 -111 -152
3127 -152 -45 -129 -76 -196 -121 -36 103 164 -70 36 -185 1 -35 20 -66 274 48 -181 -268 218 -224 -166 114
3150 114 -16 -41 -64 91 -93 -69 173 120 -114 -15 -58 19 -200 -116 -24 -32 35 -203 46 106 -117 59 274 -165
3174 -165 120 -171 81 74 10 190 -82 188 254 158 -10 -196 18 -97 -122 -18 188 -45 218 384 175 31
3196 31 55 74 166 82 255 -127 -54 310 103 141 -213 -40 -152 -192 -105 -18 -336 32 341 59 -44 -66 109 483
3220 483 120 65 -225 270 201 115 104 76 -158 -212 226 33 -270 47 -56 124 -81 -58 -238 236 -249 -131
$$ packed form
3057A64l36L83k0J1k76l18N10j46J43j88J5l48K56L10l32J32j1L18l03J5J26q7
3079A8M2j82M7K9r5K02k12R5j4J68j88j83K04Q0R6m08Q7J66k48K89L6l46K38k3
3103a02k3K0J43j86M2L78k95n9P4OQl7J55m62K22J28L8L63l64J55j57k29P1m1
3127a52J07q4N3j20P5Q5J39O1k34J06k21J86l6N5q6L40k26k29q7M86m42N8K80
3150A14j30k5k3J55j84K4K42n3k34R9m3P7k19Q4R2qO7k38K49O0k23J76K15m39
3174a65K85k91K52po4J80k72K70O6r6j68j86K14j15k5J04K06k33K63J66k09j44
3196C1K4J9R2q4J73l82P3L64k07L8l54J73j12m0Q7Q7l18L68L09k82j03k2J75L74
3220D83l63n5k90M95o9q6j1k8k34n4M38j93l03L17j03J80k05K3j80M74m85J18
$$ plain form
3242 -131 -2 66 230 -92 -106 119 139 168 66 16 26 -92 -43 47 -248 95 -158 -34 -88 -98 -76 23 -138 -172
3266 -172 -47 -99 214 2 127 163 -148 -60 81 166 29 40 -116 -458 71 -11 331 169 -112 -12 -45 -145
3288 -145 186 -54 -101 213 -129 53 60 168 -22 -353 -179 132 69 197 100 13 2 -94 70 165 193 -2 11 223
3312 223 -127 -29 141 -120 -157 43 191 -247 129 -85 -168 96 172 -315 -99 271 -27 -62 64 -56 95 -279
3334 -279 -14 -10 291 -19 299 205 -149 -236 -134 64 13 -363 23 151 -8 241 -88 276 14 289 210 60
3356 60 -221 48 25 193 127 31 18 -132 156 8 -275 -109 93 -351 -214 118 -18 7 58 -22 16 -88 172
3379 172 113 40 145 -230 -161 -119 50 213 4 -132 16 74 -87 -24 35 242 114 -210 194 32 7 133 183
3402 183 146 118 77 9 159 -115 -15 -208 -50 132 24 -264 69 182 -105 -168 -97 -149 -161 279 157 101 1
$$ packed form
3242a31J29O8J64l22j4K25K0K9j02n0J0j18M9R0k95L43k53J24n4j0K2R9j61l4
3266a72J25n2L13k12J25L6l11Q8J41Q5j37J1j56l42N29q2L42j62k81J00l3j00
3288a45L31k40m7L14l42J82PJ08j90l31J74L11o3J28r7q7j1r6J64R5K8j95J3K12
3312B23l50R8J70k61l7K00J48m38L76k14q3K64P6m87K16L70k98l5J26j20J51l74
3334b79K65ML01l10L18r4l54q7J02J98n1l76L86J28j59K49l29L64k62K75p9j50
3356F0k81K69k3J68o6r6j3j50K88j48k83J66K02m44J37L32j36K5N1q0L8j04K60
3379A72n9p3J05l75O9M2J69J63k09j36J48N8j61O3N9K07j28l24M04j62k5J26N0
3402A83l7k8m1o8J50k74J00j93J58J82j08k88L33J13k87o3P1n2j2M40j22n6j00
$$ plain form
3425 1 112 208 -126 -87 91 316 -478 -213 -96 222 18 151 9 198 348 -80 63 24 -63 89 -272 -151
3447 -151 60 89 93 -34 315 -46 -37 -60 45 -150 155 -394 149 82 94 -215 -63 -107 54 137 57 -28 -115 -358
3471 -358 299 34 -144 -42 -106 -34 80 255 -19 261 114 -260 118 -66 -246 -53 -152 110 -26 19 95 121
3493 121 -18 -73 15 114 -114 -187 -15 109 -187 259 128 103 62 13 123 98 -377 -74 -8 -102 79 265 3
3516 3 -82 140 180 -193 -54 -68 -118 65 32 56 112 45 52 113 -94 -19 -241 396 120 -11 -61 -230 83 -133 -157
3541 -157 -12 143 -1 -54 75 59 0 6 2 287 -339 -253 -53 -253 -11 -109 -38 327 -27 130 -63 -142 -118 75
3565 75 66 -80 19 5 -137 -170 89 -149 100 216 -111 -87 -235 183 -153 172 -116 159 -185 -122 -105 -123 211
3588 211 -8 174 73 -202 -199 -26 76 91 15 17 217 24 204 32 42 -278 -63 -160 -99 -127 90 -48 -43 16
$$ packed form
3425AJ11R6l34L9J78K25p94K65J17L18k04J33j42J89J50m28J43l9q7J52l61J21
3447a51K11K9Mj27L49l61Rk3J05j95L05n49N43o7J2l09J52m4J61Q3q0q5q7k43
3471c58O57k65j78J02o4P2J14J75k74K80j47l74L78j84j80J93r9K62j36M5P6K6
3493A21j39n5Q8R9k28p3J72J24k96M46j31k5m1m9J10k5m75L03O6r4J81J86k62
3516Cq5K22M0l73J39j4n0J83l3K4N6o7PO1k07P5k22O37k76j31n0j69L13k16k4
3541a57J45J55j44n3J29j6n9OmK85o26Q6K00k00K42r8P1L65l54J57j93p9K4J93
3565G5rj46R9j4j42l3K59k38K49J16l27K4j48M18l36L25k88K75l44O3J7j8L34
3588B11k19J82j01k75LJ73J02J5p6KK00j93J80j72J0l20K15r7O1k8K17j38NN9
$$ plain form
3612 16 254 56 -32 14 -260 -56 -126 175 64 25 -220 132 -139 301 -39 29 -94 177 6 13 -63 161 60
3635 60 -41 124 -15 83 72 -269 236 -318 -287 183 58 -2 -133 14 -251 -76 70 -284 13 -259 -232 -11
3657 -11 181 -94 -80 -302 155 -50 9 45 -180 -50 112 180 253 -320 -62 -19 -126 99 365 -31 14 121 107
3680 107 -19 101 27 232 97 34 -105 -66 0 233 32 4 61 269 95 -28 226 145 -76 59 71 -144 -106
3703 -106 79 -251 107 -204 250 260 -23 30 41 -12 -24 -151 -298 -144 -149 -97 -129 -234 56 189 -110 91 -49
3726 -49 -135 -17 5 332 35 -39 -310 38 110 -107 18 -49 15 -33 21 79 -5 -418 408 -219 351 0 124 191
3750 191 -118 -46 -6 -129 386 127 -201 88 -3 -108 -208 93 -31 -32 151 -86 -113 26 -304 -70 128 81
3772 81 -142 -280 80 -219 25 51 -56 61 -62 -311 117 -21 -151 -285 20 13 -30 -50 12 160 -35 -116 171
$$ packed form
3612A6K38j98q8M6k74K04p0L01j11l9k45L52k71M40l40O8j23K71j71Pp6K24j01
3635F0j01J65j39R8j1l41N05n54L1M70j25o0j31J47k65J75J46l54K97k72K7K21
3657a1J92k75J4k22M57k05N9L6k25J30J62O8P3n73K58M3j07K25K66l96M5J07j4
3680A07j26J20p4K05j35o3j39L9O6K33k01k8N7K08j74j23K54q1k21J35J2k15L8
3703a06J85l30L58l11M54J0k83N3J1n3j2j27j47J54nN2l2j05K90J33k99K01j40
3726d9q6J18K2L27k97p4k71L48P2k17J25o7O4m8N4N8q4m13Q26o27N70l51J24O7
3750A91l09P2M0j23N15k59l28K89r1j05j00L01j24jJ83k37k7J39l30K34J98m7
3772H1k23j38L60k99K44K6j07J17j23k49M28j38j30j34L05pm3k0O2J48j95q1K87
$$ plain form
3795 171 66 87 53 91 -352 -157 249 39 100 0 -102 -67 298 -73 110 179 -94 -41 15 -218 -52 140 77
3818 77 312 -124 -192 203 -421 296 177 230 1 -77 117 -46 149 54 -156 212 -40 -59 -393 -69 9 -169
3840 -169 57 -187 11 -179 -19 -19 110 -166 -46 -333 -219 -246 36 87 -247 41 -180 141 -92 70 -58
3861 -58 -234 91 41 250 16 173 248 3 103 38 -44 -44 -54 75 -34 -102 297 136 -20 -104 7 -89 -298 -13
3885 -13 -343 55 217 -67 36 36 68 -124 312 -185 -101 -180 99 -69 155 -244 -48 121 278 122 -184 38
3907 38 43 -88 136 -180 -82 102 67 139 -167 -182 136 158 -133 280 -26 158 -422 76 -3 -99 -134 -53 -115 -86 152
3932 152 156 174 -38 117 175 -122 145 34 -102 171 -77 -198 -184 -120 -98 103 -118 49 -61 76 -196 146
3954 146 -88 -13 131 123 -49 62 -205 -32 216 -130 50 -201 138 35 161 -79 -152 -120 207 52 -27 27
$$ packed form
3795A71j05K1l4L8m43J95M06k10O1j00j02L5L65l71J83O9k73N3N6k33J66J92o3
3818G7K35m36o8L95o24P17j19N3k29p8J94j63J95r5k10L68k52j9l34L24P8j78
3840a69K26k44J98j90J60%J29k76J20k87J14k7K82N1l34K88k21L21k33J62j28
3861e8j76L25n0K09k34J57P5k45J00o5q2%j0J29j09o8L99j61j56q4J11r6k09K85
3885a3l30L98J62k84J03%L2j92M36m97Q4p9K79j68K24l99J96J69J57j56l06K22
3907C8Nj31K24l16R8J84l5P2l06j5L18K2k91M13l06J84n80M98p9r6l5Q1o2K9K38
3932A52MJ8k12J55N8k97K67j11j36K73k48j21J4O4K2K01k21J67j10J37k72L42
3954A46k34P5J44qj72J11k67J73K48l46J80k51L39j03J26k40p3L2L27j55p9N4
$$ plain form
3976 27 119 182 -44 191 164 -15 -141 296 31 -373 58 21 38 -46 -61 -46 11 163 -167 -2 110 42 -15 205
4000 205 -191 37 75 156 -139 -111 259 110 -6 88 -219 -142 -21 7 83 -254 111 114 49 309 94 270 -115
4023 -115 185 -99 -145 251 0 48 82 0 9 -359 -105 -83 -141 -243 -205 -31 59 -27 52 58 -209 64 -283 -83 -50
4048 -50 -10 -51 17 70 33 9 225 114 21 112 -187 -149 6 32 61 -179 -140 -12 -25 187 -98 -206 13 -36 -41 -145
4074 -145 -247 -27 29 -192 12 48 -275 111 -111 240 306 33 17 144 44 11 199 38 -99 -56 -79 -230
4096 -230 84 -1 210 169 -37 35 -262 -296 188 248 45 48 35 47 -107 -94 -20 -260 -52 -23 -123 341 4 -263
4120 -263 167 188 133 118 -12 -1 200 59 -61 160 146 -93 249 -86 133 120 225 56 -42 102 -71 -52 -39
4143 -39 208 -115 7 -93 -185 -231 -147 -47 35 308 -95 -1 320 8 12 404 79 -19 66 224 51 -15 -117 -84
$$ packed form
3976B7R2O3k26K35k7j79j26M37k65m04M31l7J7q4j5J5N7J52l30J65J12o8n7K20
4000B05l96K28L8Q1k95K8L70j49j16R4l07P7J21K8P6l37L65Lo5K60k15J76l85
4023a15L00k84m6L96k51M8L4q2Rl68K54K2n8j02L8J74R0q6P9Ok67K73l47K00L3
4048e0M0m1O8N3l7k4K16j11r3R1k99L8J55K6K9k40L9J28j3K12k85j08K19m9nj04
4074a45j02K20N6k21K04L6l23L86k22L51O6k73j6J27j00l3J88j61j37M3k3j51
4096b30L14q5K11m1k06P2k97l4M84O0k03Lj3J2j54J3P4k40K08K9j00M64l37k67
4120b63M30K1n5j5j30J1K01j41j20K21j4k39L42l35K19j3J05j69r8J44j73J9J3
4143c9K47l23J22j00r2m6Q4J00Q2K73m03R4L21l12ML92l25r8Q5J58j73o6j02L3
$$ plain form
4167 -84 27 260 -67 70 213 -10 -22 122 73 -88 146 -60 190 -10 -241 -109 -15 112 204 1 47 -205
4189 -205 -261 416 20 55 -60 122 268 32 12 -46 25 72 -105 11 -177 -31 -64 -235 -285 -217 73 -182 -189 -58
4213 -58 59 -153 -201 166 483 -87 -224 -61 -126 187 184 72 -155 -147 -12 36 -230 -102 243 -85 30 -25 -37
4236 -37 26 -108 23 48 222 -186 -117 26 -234 -51 -140 215 33 -179 -85 182 -112 254 -218 -245 140 255
4258 255 -177 -372 274 43 384 -165 17 -60 -53 125 82 376 21 6 -108 -145 225 -39 37 -168 114 -14
4280 -14 182 -34 80 35 6 -46 106 -154 -9 148 156 -53 -195 -79 -151 -189 -92 42 -177 19 105 -24 -31 -9
4304 -9 53 -223 -6 81 45 145 -47 -223 -159 -320 256 14 181 -188 -65 209 -13 224 81 -48 163 49
4326 49 7 -5 -139 51 22 -20 138 104 -252 -222 213 -133 -49 98 118 31 61 -228 -1 -177 89 -260 -61 -150
$$ packed form
4167h4J11K33l27J37J43k23j2J44m9j61K34k06K50k00k31J32R4J27R2k03M6k52
4189b05n6O77l96L5j15J82J46k36k0n8P1M7j77J16j88J46l3j71n0O8K90k55pJ31
4213e8J17k12m8L67L17n70j37J63o5L13lj12k27QJ35M8k66J28L45l28J15n5j2
4236c7O3j34J31K5J74m08O9J43k60J83q9L55j82k12R4K67k94L66m72k7L85J15
4258B55m32j95O46k31L41n49J82p7PJ78m3K94l55j5j14l7L70k64P6k05K82j28
4280a4J96k16J14m5k9n2J52k60J45J57Qk09j42J16p2l8R7J34k19J96Q6j29pK2
4304iO2k76K17Q7l6J00j92j76O4j61N76k42J67l69J23K74k22K37j43j29K11j14
4326D9m2j2j34J90k9m2J58l4l56L0M35l46Q4J47K0q7L0k89K27j76K66l49J99q9
$$ plain form
4350 -150 -131 -46 202 -53 -78 89 -199 -22 -54 13 272 -34 118 -2 -138 3 117 375 -177 211 -337 12
4372 12 -267 -19 -191 17 345 171 -57 21 23 -209 236 -74 51 286 56 -5 162 159 43 -266 35 -89
4394 -89 -112 149 -28 225 -128 31 115 -3 151 287 -6 104 48 -11 133 135 89 190 -83 -114 20 -213 -57
4417 -57 160 -172 -213 133 -130 10 138 -190 -149 -75 151 -4 191 -28 -10 -73 -77 -152 185 170 -122 -244 8
4440 8 46 266 -510 110 192 -295 85 -96 -100 53 -191 37 215 -99 -107 130 108 -142 132 -62 24 -237 33
4463 33 -442 -194 -107 -156 -236 3 83 197 14 57 -144 -288 43 -2 133 168 -146 284 -31 -124 243 53 179
4486 179 -54 -46 -413 -131 -16 -3 211 19 -102 370 -167 34 -182 -6 193 168 93 -195 303 -56 317 105
4508 105 86 -176 50 -2 -161 413 50 13 -83 111 -55 -41 96 -59 -64 8 -8 176 294 -112 -403 -156 140
$$ packed form
4350a50J9Q5K48k55k5J67k88J77l2O7K59l06J52j20j36J41J14K58n52L88n48L49
4372A2k79K48j72K08L28j74k28P8Kk32M45l10J25K35k30o1J67lj16l09L01j24
4394h9k3K61j77K53l53J59Q4j18J54J36k93J10n6n9J44Km6J01k73l1J34k33J56
4417e7K17l32m1L46k63J40J28l28M1P4K26j55J95k19J8o3mp5L37j5k92j22K52
4440HL8K20p76O20Q2m87L80j81mJ53k44K28J78l14qK37k2k50K74j94Q6k61K70
4463C3m75K48Q7m9q0K39Q0J14j83M3k01j44L31m5J35L5l14M30l15r3L67j90J26
4486A79k33Ql67K82J15J3K14j92j21M72n37K01k16J76J99k5p5k88M98l59L73k12
4508A05j9k62K26n2j59N74l63l7r6J94j66J4J37j55nP2j6J84J18m06k91K47K96
$$ plain form
4531 140 84 111 61 11 -95 21 -217 -116 -334 87 -85 -392 -187 266 -165 -65 -38 57 -49 -13 106 54 -196
4554 -196 -144 162 -42 -15 -21 194 73 -1 -110 -269 46 -74 22 -32 -3 -11 160 -81 7 -170 174 -2 8 5 -112
4579 -112 -97 85 298 94 -133 -17 129 -67 -124 98 104 -331 -42 135 31 -182 -2 54 201 -59 -47 180
4601 180 135 -21 39 -64 65 -64 6 -111 32 -298 -16 136 -110 -112 -247 406 43 58 -67 -88 123 19
4623 19 -5 -33 131 -220 -49 66 -159 147 190 -204 -15 226 -144 130 -191 208 -443 367 -54 59 -175
4644 -175 -103 -7 47 -69 -197 -218 86 -32 -235 -5 26 145 -271 160 157 -282 186 143 -257 229 247 -9 196
4667 196 113 185 75 -124 91 -359 322 314 -123 66 225 369 -278 -121 59 114 -117 267 -278 -154 72 49
4689 49 308 -262 -81 201 -159 -18 -77 -169 -112 -105 -221 -73 12 92 260 146 -110 -131 223 157 106 -105 160 103
$$ packed form
4531A40n6K7n0n0j06J16k38J01k18M21j72l07K05M53m31J00K7R5j06L6J19n2k50
4554a96N2L06k04K7oK15j21p4j09j59L15j20R6n4K9qJ71k41Q8j77L44j76J0lj17
4579a12J5J82K13k04k27J16J46j96n7K22Om35K89J77j04k13J80N6J47k60J2K27
4601A80m5j56O0j03J29j29P0j17J43l30K82J52k46kj35O53l63J5j25k1K11j04
4623A9k4k8J64l51J71J15k25L06M3l94J89K41l70K74l21L99o51Q10m21J13k34
4644a75P2R6N4j16j28k1L04j18k03K30L1J19m16M31lm39M68m3m00M86J8k56K05
4667A96q3P2j10j99K15m50O81qm37J89J59J44o47J57J80N5k31L84n45J24K26k3
4689D9K59n70J81K82l60J41n9r2N7Pj16J48Q5Q0J68j14k56k1L54o6n1k11K65n7
$$ plain form
4713 103 -84 -16 -38 65 50 -37 -104 -14 140 40 -45 143 23 311 209 -175 -32 264 -124 -200 -307 -209 -169
4736 -169 59 46 -152 -90 -38 24 -108 15 -268 137 42 321 -170 103 42 -184 -94 86 20 -65 191 -42 -72
4759 -72 -32 37 -174 477 -121 -76 -228 -488 99 -8 -4 -142 -170 -341 76 200 -109 -74 -2 129 -141 -41 31
4782 31 -261 102 -266 101 16 -75 -35 103 -55 113 -156 -35 -352 132 167 -19 171 -170 73 102 363 -85
4804 -85 -1 -35 -13 -217 108 -43 -121 94 206 -88 -80 -226 176 223 -38 -26 135 -56 -308 79 40 107 26 8
4828 8 -169 -274 170 82 155 347 194 25 135 69 226 -292 6 113 38 -175 114 -77 201 62 -55 325
4850 325 73 37 -49 -194 -309 129 11 177 73 219 42 -246 -214 24 92 -110 -71 -13 -144 -79 -160 100 4
4873 4 114 -257 288 97 163 -25 162 57 54 51 325 -64 -216 -208 39 -35 -8 -194 -33 5 -23 0 129 84 83 17
$$ packed form
4713A03j87O8k2J03j5q7o7R0J54j00q5J88j20K88j02l84J43K96l88p6j07R8M0
4736a69K28j3j98O2N2O2j32J23k83M05r5K79m91K73o1k26R0J80o6q5K56k33l0
4759g2M0O9k11O51n98M5j52k60N87j07Mj38k8j71M17J24l09L5P2J31k70J00P2
4782C1k92L63l68L67q5r1M0J38j58J68k69J21l17M84L5j86J90l41K43K9K61m48
4804h5Q4l4K2k04L25j51p8K15J12k94Qj46M02M7k61J2J61j91k52L87l9O7q1j8
4828Hj77j05M44q8P3J92j53j69J10o6J57n18K98J07p5k13K89j91K78j39j17L80
4850C25k52l6q6j45j15M38j18J66j04J46j77k88L2K38O8k02L9N8j31O5q1K60r6
4873DJ10l71N45j91O6j88J87j05llK74l89j52QK47p4K7j86J61L8k8K3J29m5jo6
$$ plain form
4899 17 85 114 41 283 314 140 243 110 -37 -156 -61 -31 63 -366 -31 -295 -15 -66 -40 153 -50 75 -161
4922 -161 -46 -11 -68 -67 -99 -242 -54 -218 -184 -40 148 183 262 -150 -202 -5 279 -334 -10 -316 -181 -4 -54
4945 -54 -21 -180 153 12 170 -94 -215 31 -243 96 -74 -173 167 139 -96 -18 -243 -201 68 83 13 15 -122
4968 -122 -236 178 94 167 -287 -178 149 118 67 -39 125 156 168 70 -98 17 -6 -179 -12 121 60 -34 -65 -169
4992 -169 59 -167 172 -17 20 -120 150 -104 58 -131 179 16 -162 206 -34 -61 -134 169 -119 287 -100
5013 -100 -148 1 111 -67 -69 155 264 -95 189 77 198 5 103 50 6 87 -161 -232 263 -211 1 309 371
5036 371 215 -47 36 76 -43 -40 109 -18 -27 -62 213 16 -205 -90 35 -250 -18 73 100 -100 -22 212 95
5059 95 50 97 74 25 209 2 22 77 178 16 175 35 -53 -98 -302 84 -33 -24 23 -2 -168 167 -146 37
$$ packed form
4899A7O8K9p3K42L1j74J03j33j47j19R5L0R4m29L35k64K80n1K6J93k03J25k36
4922a61J15L5n7Jl2j43J88j64L4J44J88L5P9m12n2J97K84o13L24l06J35J77n0
4945e4L3j59L33j41J58k64j21K46k74L39j70r9L40k8k35P8k25M2K69J5p0Kj37
4968a22j14M14q4P3m54J09L27l1n1j06J64L1J2r8j68J15k3j73J67J33o1r4l1j04
4992a69K28k26L39j89L7j40K70k54J62j89L10j63j78L68k40k7p3L03k88M06l87
5013a00m8J49J10j78kK24J09l59K84j12J21j93R8n3m4Q1k48p1M95m74K12L08O2
5036C71j56k62Q3M0j19LJ49j27rl5K75j97k21J15J25k85K32R1K7k00P8K34j17
5059I5m5M7k3m9J84k07K0N5J01j62J59j40q8m5k04L86j17RM7k5j66L35l13J83
$$ plain form
5083 37 107 125 337 -11 357 -111 284 -23 179 265 74 56 129 52 137 64 -131 69 -104 -10 -76 22 84 -134
5107 -134 -162 257 -24 29 9 22 -60 51 80 23 136 98 128 -33 -29 -164 190 217 -358 38 317 230 -392 -9
5131 -9 30 -260 71 77 33 -209 -144 -150 -73 106 281 160 136 218 -301 -181 316 -32 80 -71 142 169 -245 83
5155 83 15 -63 -59 -239 -278 -196 -48 -150 103 -139 -156 61 -125 113 218 -142 143 -131 150 -125 -120 166 -48
5178 -48 -38 -91 73 -46 120 -288 40 24 22 -31 -55 -206 -126 98 64 -8 -57 159 78 -181 69 401 178 101 -105
5203 -105 -330 207 60 -72 120 278 -10 -145 -503 45 114 -36 299 133 -256 -119 -42 -303 37 74 19
5224 19 -115 -101 -101 78 128 31 151 -128 -230 -67 62 10 153 -134 -233 -77 334 -620 -212 -206 185 -93 17
5247 17 -60 110 284 -120 -208 -80 -82 -67 -82 -76 -98 39 104 -2 -64 41 -137 296 29 136 323 -52 -98 -179 111
$$ packed form
5083C7P0J8K12l48L68m68L95l07K02Q6j91j8P3p7Q5p3j95K00j73R4o6R8O2k18
5107a34k8M19k81N3k0J3q2J11K9n7J13l8L0j61Mj35L54K7n75L96K79q7o22L83
5131iL9k90L31Om4k42O5oP7J79J75j21k4Q2n19J20M97l48J12j51K13K7m14L28
5155H3o8p8Mj80l9Q2J48j02K53k42j7K17j86K38J05l60K85k74K81k75NK86k14
5178d8J0n3J64j19J66m08L28j6kn3k4j51Q0K24l4p2m9K16q1k59K50L32k23p7k06
5203a05k25N37j47j32J92J58k88j35l58N48O9j50L35j66l89J37P7k61L40L7n5
5224A9j34J4%J79N0r7J20k79j02J63J29n2J43k87r9J56M11r54M08OL91k78J10
5247A7p7J70J74m04q8J28kJ5j5Ok2J37O5j06o2J05j78M33k67J07J87l75m6q1K90
$$ plain form
5272 111 92 -68 -2 211 -52 -322 128 -110 17 -6 218 -50 43 -99 -64 -16 218 166 -45 142 63 58 -145
5295 -145 17 190 -172 36 -32 53 47 -129 -51 144 -52 -65 -319 -260 81 -22 187 -143 56 -8 9 80 -212
5318 -212 111 45 68 -164 94 158 -21 -35 156 295 126 15 -3 -190 126 145 -84 -127 -298 -360 58 69 -11
5341 -11 43 80 -54 -34 206 53 -114 -114 -136 25 90 -202 -41 -24 318 -176 -93 442 135 -164 43 1 166 -46
5365 -46 -266 -85 78 20 159 137 -5 27 39 138 102 192 91 191 -161 117 47 27 278 32 -190 308 13
5388 13 -101 -113 -141 -95 114 33 30 41 -360 77 -81 114 -59 -76 -172 -274 31 -296 99 126 -102 4 -1 -55 -75
5413 -75 -22 170 188 -101 -178 -114 410 -166 -184 38 -171 58 88 166 85 -425 -4 -34 -15 14 225 -233 -188 140
5437 140 -24 348 324 42 118 -52 17 -48 61 313 -417 98 -19 271 111 -99 -44 166 -29 -141 55 -169
$$ packed form
5272A11j9j60O6K13k63k70M50k38J27k3K24k68R3j42L5M8K34n2k11J87p9nk03
5295a45J62J73l62K08o8Q5oj76P8J95j96j3k54N9L41j03K09l30J99o4J7P1k92
5318b12L23o6K3k32K58O4j79j4J91J39j69j11j8j87L16J9k29m3j71o2M18J1q0
5341a1N4L7j34K0K40j53j67%k2J61O5k92J61J7L42m94Q3N35l07k99K07m2J65k12
5365d6k20J81J63n8J39k2j42L2J2R9l6R0j01J00l52K78p0k0K51k46k22M98k95
5388A3j14j2k8M6K09q1lJ1m01M37j58J95j73j7r6j02L05l27L95K7k28J06nn4k0
5413g5N3J92J8k89p7O4N24n76j8K22k09K29L0P8q1n10M21l0J9K9K11m58M5L28
5437A40j64L72k4k82P6j70O9o5J09K52p30N15j17K90j60k10N5K10j95j12J96k24
$$ plain form
5459 -169 100 136 259 -83 -58 -192 -196 -186 -325 198 81 -267 -139 52 97 78 49 468 -91 -17 128 -21 178
5482 178 99 -18 30 -321 287 -207 85 93 48 91 -27 156 -36 -183 -66 -378 -192 46 -47 -261 -17 -20 208
5505 208 0 -101 -274 217 319 220 -319 -62 222 -63 -111 109 225 -273 -24 -80 69 -122 -54 247 218 171
5527 171 238 -138 111 168 -22 185 -94 -148 -112 -202 95 101 70 -193 -72 57 193 -15 -213 -64 -85 159 327
5550 327 -56 111 86 -55 104 130 -285 -119 288 28 80 -72 -100 -313 -391 321 -225 -20 79 110 70 457 59
5573 59 41 -151 154 86 -14 152 -135 -18 25 -267 300 51 -65 -232 -23 28 54 -242 94 -30 51 -384
5595 -384 -305 -39 -152 63 -215 -12 -70 149 15 -16 -158 210 -164 -201 -22 -116 198 -3 122 108 -39 210
5617 210 126 116 -143 -104 -56 -24 -2 -75 -60 30 -351 62 -71 125 123 112 96 310 75 -26 -70 2 305 122 -154
$$ packed form
5459a69K69L6J23l42K5j34mJ0j39N23j17l48J28J91M5j9k9M19n59P4J45j49J99
5482A78p9j17M8l51O08m94K92Qm5M3j18J83j92j47J17l12J86K38r3k14K44lK28
5505B08k08j01j73M91J02r9n39K57K84k85m8K20J16m98K49n6J49j91O8L01k9m7
5527A71O7l76K49N7j90K07k79n4L6r0K97Ol1k63J21J29J36k08j98J49k1K44J68
5550C27l83J67k5j41J59K6m15J66M07k60N2j52k8k13p8P12n46K05R9L1m0L87l98
5573E9j8j92L05o8j00J66k87J17M3k92N67k49j16j67K09N1K6k96L36j24Q1m35
5595c84P9K66j13K15k78K03n8K19j34l1j42L68l74l7J79r4L14k01J25j4j47K49
5617B10q4j0k59L9M8L2K2p3J5R0l81M13j33J96kj1j6K14k35j01m4P2L03j83k76
$$ plain form
5642 -154 62 288 0 -54 4 9 -40 22 -127 43 -76 76 -137 -47 58 140 -59 31 165 251 -45 65 18 -211
5666 -211 152 -248 -123 223 50 -167 -30 143 -5 27 -133 86 -87 -140 -19 223 48 -75 484 -258 -210
5687 -210 -125 -97 132 -325 413 92 42 153 126 -23 132 -56 6 138 189 140 -85 -177 -363 -94 -327 -37 26
5710 26 -29 -63 -260 -13 102 43 195 115 135 -67 -229 -175 22 -13 17 -100 7 93 116 226 -12 -212 -65 -72
5734 -72 162 80 -88 114 -278 -180 -58 -206 168 144 -26 -179 -20 -249 -160 -191 6 151 -133 -268 34 -106
5756 -106 -150 49 132 176 -33 -235 -51 -45 -99 249 338 -26 116 235 -341 135 40 99 140 -234 45 -29 350 -91
5780 -91 117 -242 -78 -231 -105 -36 172 127 106 -278 122 -72 -42 -97 -224 -246 -79 -198 28 23 109 245 -94
5803 -94 37 141 -207 -46 -138 -122 81 41 56 232 123 117 88 -74 -325 -132 57 98 217 -101 50 -56 44
$$ packed form
5642a54K16K26k88n4N8Nm9O2j49J70j19J52k13R0J05Q2j99R0J34Q6k96J10m7k29
5666b11L63m00J25L46j73k17J37J73j48L2j60K19j73n3J21K42j75j23N59p42M8
5687b10Q5K8K29m57P38l21n0J11k7j49J55j88O2J32N1m9k25r2j86K69k33K90O3
5710B6n5l4j97K47J15n9J52q0K0k02j62N4J97l5L0j17J07Q6K3J10k38k00J47p
5734g2K34q2j68K02l92R8J22j48L74k4j70j53J59k29Q9l1J97J45k84j35L02j40
5756a06m4J99Q3M4k09k02J84On4L48Q9l64J42J19n76M76r5N9M1l74K79p4L79m41
5780i1K08l59J64j53J26O9K08m5k1l84M00j94L0n5j27k2J67j19K26nQ6J36l39
5803i4J31J04l48J61r2J6K03m0J5J76j09ok9j62k51J93J89M1J19l18J51j06J00
$$ plain form
5826 44 -97 -234 -33 12 63 -90 91 186 -32 24 -157 154 193 169 -132 -185 -145 -424 224 63 -84 -18 94
5849 94 -12 12 52 -169 -255 -116 -136 144 -180 -177 -8 -232 -4 -171 -80 206 140 78 -216 -74 180 -16 -37 -182
5873 -182 -101 3 10 -148 82 -59 105 -44 64 106 151 219 128 -51 38 -140 -197 -13 178 -150 263 22 -156
5896 -156 -162 10 -236 81 -82 -246 99 26 51 14 -3 -197 276 -13 -286 -137 375 313 82 209 50 -56
5918 -56 -130 -183 54 -16 290 97 -74 66 -67 -123 -25 174 -61 307 -105 -133 4 279 149 188 396 -79 87
5941 87 14 164 -89 81 -31 -71 -103 225 -88 -79 354 106 132 -135 73 48 -138 -137 -260 22 38 -128 -78 -217
5965 -217 -32 68 -134 29 67 -59 -166 -296 -99 9 -243 -224 -253 105 -10 97 -142 35 118 -85 -57 54
5987 54 126 -269 -53 -132 201 -123 -12 -141 344 116 -54 -59 108 -76 117 -14 -233 69 -180 -153 217 136
$$ packed form
5826D4j41j37K01M5N1j53J81R5k18N6j81L11L9k4l01n3M0k79O48j61j47O6J12
5849I4j06K4M0k21q6J39k0K80l24LJ69k24K28j67R1K86o6o2k94J42K54j96k1j45
5873a82Q1J04Pj58K30j41J64j49J08M2M5O8r1j79Q9j78n7J84J91l28M13k41j78
5896a56oJ72k46L17j63j64L45p3K5l7j7j94M73k89k73J49N12o2k31J27j59j06
5918e6p4n3K37p0L06j93j71J40j33n6R8J99k35L68m12k8J37K75j30L9K08m75J66
5941H7p3J50k53J70j12m0l2L28l13RM33k48K6k67K08k5j86Jj23K82J6j66N0j39
5965b17J85J00k02J63L8j26j07j30J97J08k52J9k9L58j15J07k39J77Q3k03K8J11
5987E4P2l95K16p9L33l24J11j29M85k28j70nJ67j84J93j31k19L02k49K7L70q1
$$ [...]
8191b09
##END NTUPLES=NMR FID
##END=
