##TITLE=1H_CA-8667-4
 CDCl3, 8 sc, 
 21.11.2019
##JCAMPDX= 6.0         $$ Bruker NMR JCAMP-DX V2.0
##DATA TYPE= NMR FID
##DATA CLASS= NTUPLES
##ORIGIN= UXNMR, Bruker Analytische Messtechnik GmbH
##OWNER= root
$$ XWIN-NMR		Version 3.5
$$ Thu Nov 21 13:48:40 2019 Russian Standard Time (UT+4h)  she@DPX200
##.OBSERVE FREQUENCY= 200.1315
##.OBSERVE NUCLEUS= ^1H
##.DELAY= (6, 6)
##.ACQUISITION MODE= SIMULTANEOUS
##.ACQUISITION SCHEME= undefined
##.AVERAGES= 8
##.DIGITISER RES= 18
##SPECTROMETER/DATA SYSTEM= spect
##.PULSE SEQUENCE= zg30
##.SOLVENT NAME= CDCl3
##.SHIFT REFERENCE= (INTERNAL, CDCl3, 0, 15.7039)
##AUDIT TRAIL= $$ (NUMBER, WHEN, WHO, WHERE, WHAT)
$$ ##TITLE= Audit trail, XWIN-NMR		Version 3.5
$$ ##JCAMPDX= 5.01
$$ ##ORIGIN= Bruker BioSpin GmbH
$$ ##OWNER= she
$$ F:/spectra/data/she/nmr/H-F/1/audita.txt
$$ ##AUDIT TRAIL=  $$ (NUMBER, WHEN, WHO, WHERE, WHAT)
(   1,<2019-11-21 13:47:19.39 +0400>,<she>,<DPX200>,
      <created by zg, POWCHK disabled, PULCHK disabled
       configuration hash MD5:
       00 E9 B6 7A A2 85 ED C7 34 08 36 98 17 FE 4E 26
       data hash MD5: 16K
       7C ED 65 48 EB 1D 06 4D 35 FF DC 61 2E 71 12 0E>)
$$ ##END=
$$ 
$$ hash MD5
$$ 3B 60 21 10 C6 D1 C2 F2 47 BC 62 9B CC F8 6A 23
##$RELAX= 
##$RELAX= 
##$RELAX= 
##$RELAX= 
##$RELAX= 
##$RELAX= 
$$ Bruker specific parameters
$$ --------------------------
##$DU= <F:/spectra>
##$EXPNO= 1
##$NAME= <H-F>
##$PROCNO= 1
##$TYPE= <nmr>
##$USER= <she>
##$AMP= (0..31)
100 100 100 100 100 100 100 100 100 100 100 100 100 100 100 100 100 100 
100 100 100 100 100 100 100 100 100 100 100 100 100 100 
##$AQSEQ= 0
##$AQ_mod= 1
##$AUNM= <au_zg>
##$AUTOPOS= <>
##$BF1= 200.13
##$BF2= 200.13
##$BF3= 200.13
##$BF4= 200.13
##$BF5= 200.13
##$BF6= 200.13
##$BF7= 200.13
##$BF8= 200.13
##$BYTORDA= 1
##$CFDGTYP= 0
##$CFRGTYP= 5
##$CHEMSTR= <none>
##$CNST= (0..31)
1 1 145 1 1 1 1 1 1 1 1 1 1 1 1 1 1 1 1 1 1 1 1 1 1 1 1 1 1 1 1 1 
##$CPDPRG= <>
##$CPDPRG1= <>
##$CPDPRG2= <>
##$CPDPRG3= <>
##$CPDPRG4= <mlev>
##$CPDPRG5= <mlev>
##$CPDPRG6= <mlev>
##$CPDPRG7= <mlev>
##$CPDPRG8= <mlev>
##$CPDPRGB= <>
##$CPDPRGT= <>
##$D= (0..31)
0 1.2 0 0 0 0 0 0 0 0.06 0 0.03 0 0 0 0 0.0002 0 0 0 0 0 0 0 0 0 0 0 0 
0 0 0 
##$DATE= 1574329638
##$DBL= (0..7)
120 120 120 120 120 120 120 120 
##$DBP= (0..7)
150 150 150 150 150 150 150 150 
##$DBP07= 0
##$DBPNAM0= <>
##$DBPNAM1= <>
##$DBPNAM2= <>
##$DBPNAM3= <>
##$DBPNAM4= <>
##$DBPNAM5= <>
##$DBPNAM6= <>
##$DBPNAM7= <>
##$DBPOAL= (0..7)
0.5 0.5 0.5 0.5 0.5 0.5 0.5 0.5 
##$DBPOFFS= (0..7)
0 0 0 0 0 0 0 0 
##$DE= 6
##$DECBNUC= <off>
##$DECIM= 24
##$DECNUC= <off>
##$DECSTAT= 4
##$DIGMOD= 1
##$DIGTYP= 9
##$DL= (0..7)
0 120 120 120 120 120 120 120 
##$DP= (0..7)
150 150 150 150 150 150 150 150 
##$DP07= 0
##$DPNAME0= <>
##$DPNAME1= <>
##$DPNAME2= <>
##$DPNAME3= <>
##$DPNAME4= <>
##$DPNAME5= <>
##$DPNAME6= <>
##$DPNAME7= <>
##$DPOAL= (0..7)
0.5 0.5 0.5 0.5 0.5 0.5 0.5 0.5 
##$DPOFFS= (0..7)
0 0 0 0 0 0 0 0 
##$DQDMODE= 0
##$DR= 18
##$DS= 0
##$DSLIST= <SSSSSSSSSSSSSSS>
$$ [...]
##$SUBNAM2= <"">
##$SUBNAM3= <"">
##$SUBNAM4= <"">
##$SUBNAM5= <"">
##$SUBNAM6= <"">
##$SUBNAM7= <"">
##$SUBNAM8= <"">
##$SUBNAM9= <"">
##$SW= 24.9337058887773
##$SWIBOX= (0..15)
0 0 2 0 0 0 0 0 0 0 0 0 0 0 0 0 
##$SW_h= 4990.01996007984
##$TD= 16384
##$TD0= 1
##$TE= 0
##$TE2= 300
##$TE3= 300
##$TEG= 300
##$TL= (0..7)
0 120 120 120 120 120 120 120 
##$TP= (0..7)
150 150 150 150 150 150 150 150 
##$TP07= 0
##$TPNAME0= <>
##$TPNAME1= <>
##$TPNAME2= <>
##$TPNAME3= <>
##$TPNAME4= <>
##$TPNAME5= <>
##$TPNAME6= <>
##$TPNAME7= <>
##$TPOAL= (0..7)
0.5 0.5 0.5 0.5 0.5 0.5 0.5 0.5 
##$TPOFFS= (0..7)
0 0 0 0 0 0 0 0 
##$TUNHIN= 0
##$TUNHOUT= 0
##$TUNXOUT= 0
##$USERA1= <user>
##$USERA2= <user>
##$USERA3= <user>
##$USERA4= <user>
##$USERA5= <user>
##$V9= 5
##$VALIST= <valist>
##$VCLIST= <CCCCCCCCCCCCCCC>
##$VD= 0
##$VDLIST= <DDDDDDDDDDDDDDD>
##$VPLIST= <PPPPPPPPPPPPPPP>
##$VTLIST= <TTTTTTTTTTTTTTT>
##$WBST= 1024
##$WBSW= 4
##$XGAIN= (0..3)
0 0 0 0 
##$XL= 0
##$YL= 0
##$YMAX_a= 340752
##$YMIN_a= -159275
##$ZGOPTNS= <>
##$ZL1= 120
##$ZL2= 120
##$ZL3= 120
##$ZL4= 120
##$ABSF1= 10
##$ABSF2= 0
##$ABSG= 5
##$ABSL= 3
##$ALPHA= 0
##$AQORDER= 0
##$ASSFAC= 0
##$ASSFACI= 0
##$ASSFACX= 0
##$ASSWID= 0
##$AUNMP= <proc_1d>
##$AZFE= 0.1
##$AZFW= 0.1
##$BCFW= 1
##$BC_mod= 2
##$BYTORDP= 1
##$COROFFS= 0
##$CY= 11.3945322036743
##$DATMOD= 1
##$DC= 2
##$DFILT= <>
##$DTYPP= 0
##$F1P= 16.9975609425685
##$F2P= -3.02152046262296
##$FCOR= 0.5
##$FTSIZE= 0
##$FT_mod= 4
##$GAMMA= 1
##$GB= 0.15
##$INTBC= 1
##$INTSCL= 1
##$ISEN= 128
##$LB= 0.24
##$LEV0= 0
##$LPBIN= 0
##$MAXI= 10000
##$MC2= 0
##$MEAN= 0
##$ME_mod= 0
##$MI= 1.114404
##$NCOEF= 0
##$NC_proc= 0
##$NLEV= 6
##$NOISF1= 3.799351
##$NOISF2= 2.8
##$NSP= 1
##$NTH_PI= 0
##$NZP= 0
##$OFFSET= 15.70392
##$PC= 1
##$PHC0= -9787.445
##$PHC1= 18.00086
##$PH_mod= 1
##$PKNL= yes
##$PPARMOD= 0
##$PSCAL= 0
##$PSIGN= 0
##$REVERSE= no
##$SF= 200.130013532006
##$SI= 16384
##$SIGF1= 3
##$SIGF2= 2
##$SINO= 400
##$SIOLD= 16384
##$SREGLST= <1H.CDCl3>
##$SSB= 0
##$STSI= 0
##$STSR= 0
##$SW_p= 3612.71676300578
##$SYMM= 0
##$S_DEV= 0
##$TDeff= 0
##$TDoff= 0
##$TI= <>
##$TILT= no
##$TM1= 0
##$TM2= 0
##$TOPLEV= 0
##$USERP1= <user>
##$USERP2= <user>
##$USERP3= <user>
##$USERP4= <user>
##$USERP5= <user>
##$WDW= 1
##$XDIM= 8192
##$YMAX_p= 0
##$YMIN_p= 0
$$ End of Bruker specific parameters
$$ ---------------------------------
##NTUPLES= NMR FID
##VAR_NAME=  TIME,          FID/REAL,        FID/IMAG
##SYMBOL=    X,             R,               I
##VAR_TYPE=  INDEPENDENT,   DEPENDENT,       DEPENDENT
##VAR_FORM=  AFFN,          ASDF,            ASDF
##VAR_DIM=   8192,          8192,            8192
##UNITS=     SECONDS,       ARBITRARY UNITS, ARBITRARY UNITS
##FACTOR=    0.0002004,     1,               1
##FIRST=     0,             0,               0
##LAST=      1.6414764,     0,               0
##MIN=       0,             -159275,         0
##MAX=       1.6414764,     340752,          0
$$ Real data points
##PAGE= N=1
##DATA TABLE= (X++(R..R)), XYDATA
$$ [...]
2539a153K91K730k399j88K902j998k699L858P18l540P06K542j921l10K546j784
2555C01k367L515J075l531Q09J925k518N42K865k635k255L709L49l382J199J773
2571A374k527O22K845k579k056L888R1k969J089J542k721J083K770k835j521L367
2587A463J11k899J590J133k609P61K904l050j365L504k09l144J604R20k717J381
2603f22K501l066j424L767o20k660K157O54k906J991K414l131r14L224m86k576
2619a697K325K75k527J722K239m023k93L469r13k412K203qk489J818K488l845
2635a668p62L854j550j601K317j17k479K533J707l361o20L316o68j843K240o69
2651F29k655K532J777l968M10K786j316j390K294p21k621L157J406l390o5L081
$$ plain form
2539 -1153 -862 1868 -531 -719 2183 185 -2514 1344 2062 -1478 -772 1770 -151 -461 2085 301
2555 301 -2066 1449 2524 -1007 -198 1727 -791 -249 2616 -19 -2274 1435 1784 -1598 -399 1374
2571 1374 -1153 -531 2314 -265 -2321 1567 1658 -1311 -222 1320 -1401 -318 2452 -383 -1904 1463
2587 1463 1574 -1325 265 1398 -1211 -450 2454 -596 -1961 1543 1334 -1810 -206 714 -2003 -622
2603 -622 1879 -1187 -2611 1156 536 -2124 33 687 -2219 -228 2186 -945 -1859 1365 879 -1697
2619 -1697 628 903 -1624 98 2337 -1686 -1979 1490 577 -1835 368 360 -2129 -311 2177 -1668
2635 -1668 -2430 1424 -126 -1727 590 473 -2006 527 2234 -1127 -1747 1569 901 -942 1298 629
2651 629 -2026 506 2283 -1685 -1275 1511 195 -1195 1099 378 -2243 914 2320 -1070 -1135 1946
2667A946j993r67K804j400k426L277J141l351j32K704j721j009K766j525k623
2682b509L451Q25l327N47K423j728m43K656j479k264L356P32k967P51J963k025
2698c8m85K484j679k146L037Q88l395P58J601j770m52K501k199j738L378K28k931
2715a958J203J616j799L10K463k370j404L473K68l014J425J373k550O61K598k630
2731c35j310K947L7l180J736O29k104J022J786k352j308L334o11k250J633Q04
2747D78k124J376J697k716m58L141o93k260K089N80k539J855J377k767p39L191
2763A488p36k234J922J73k773K228J798l078q17L211o82k229K275j28k310J996
2779A04J831k940n20L115j169j557J902m5k446K099J560k963m21K892j223j227
$$ plain form
2667 1946 -47 -1014 1790 390 -2036 1241 2382 -969 -1101 1603 -118 -1127 1639 114 -2509
2682 -2509 942 1767 -1560 -1013 1410 -318 -761 1895 416 -1848 1508 2240 -727 24 1987 -38
2698 -38 -523 1961 282 -1864 1173 2061 -1334 -576 1025 -745 -1197 1304 -895 -2633 745 973 -1958
2715 -1958 -755 861 -938 -628 1835 -535 -1939 1534 1802 -1212 213 1586 -964 -303 2295 -335
2731 -335 -1645 1302 1339 -1841 -105 524 -1580 -558 1228 -1124 -2432 902 291 -1959 -326 478
2747 478 -1646 -270 1427 -1289 -1747 1394 701 -1559 530 1110 -1429 426 1803 -964 -1703 1488
2763 1488 752 -1482 440 613 -2160 68 1866 -1212 -2029 1182 500 -1729 546 418 -1892 104
2779 104 1935 -1005 -1525 1590 421 -1136 766 721 -1725 374 1934 -1029 -1450 1442 219 -1008
2795a008J945k78k320K568J354l219K61K730j542j493K449o77k205K175J351l456
2811a365M84K509j439r66J968q62k199K761R67l398M42K755j523j134K509j218
2827B91k074L177M82l335Q93K598j790o56K169j845j641L014J78k745R56J700
2843A372k065j60K459k212j551L120K57k921J291J552k355N01K153k162j314L190
2859A155O8k779J305J605k124L18K287k206j515L129j99k764J589J437k364K45
2875h13K156k044j244L305o69k566J596J144k151J045J662k429r37L079p09k086
2891a661J741Q86j851L21K043k364n64K897m07k860K129R09k527J517J612k828
2907a007k89K865o12k194K024J4k357J722J437k696l73K893r64j850J946K39k179
$$ plain form
2795 -1008 937 659 -1661 907 2261 -958 -697 2033 491 -1002 1447 770 -1435 740 2091 -1365
2811 -1365 -881 1628 189 -777 1191 329 -1870 891 1858 -1540 -1098 1657 134 -1000 1509 291
2827 291 -1783 1394 1876 -1459 -566 2032 242 -414 1755 -90 -1731 1283 1461 -1284 -328 1372
2843 1372 -693 -853 1606 -606 -2157 963 1220 -1701 -410 1142 -1213 -712 1441 -721 -2035 1155
2859 1155 1223 -1556 -251 1354 -770 -452 1835 -371 -1886 1243 1044 -1720 -131 1306 -1058 -813
2875 -813 1343 -701 -1945 1360 691 -1875 -279 865 -1286 -241 1421 -1008 -1945 1134 425 -1661
2891 -1661 80 966 -885 -564 1479 -885 -1449 1448 1041 -1819 310 1219 -1308 209 1821 -1007
2907 -1007 -1296 1569 957 -1237 787 801 -1556 166 1603 -1093 -1466 1427 463 -1387 559 798 -1381
2924a381J720J466k929k68K991j281j674K205m39j815J920J495k859j50K768j395
2940C74j095J938k79k444K170J211k969j23L222j639j718K247m82j971K414O76
2956A532l154N97K505j826m56J967q88j797K544M38k616M79K236j732q24K151
2972A156q64j652K079P79l063P38K241j941n21K442j408j634K360M45k831J165
2988e09J884k035l71K269j513j446K378K22k496J112J630k179L18J652j481j385
3004a950L235j47k567R88J354j888J80K117j777j005K492r7k626J570J186k253
3020a188N88J932k145j142L405m27k451J151J299k113O77J714k091q27K943n13
3036H12k366J875O33k100P62K065k537o08K983m43k922K217M61j397Q47J098k180
$$ plain form
2924 -1381 339 1805 -1124 -1392 1599 318 -1356 849 410 -1405 515 2010 -849 -999 1769 374
2940 374 -721 1217 938 -1506 664 1875 -1094 -1217 2005 366 -1352 895 413 -1558 856 1532
2956 1532 -1622 -1025 1480 -346 -802 1165 277 -1520 1024 1462 -1154 -675 1561 -171 -995 1156
2972 1156 292 -1360 719 1498 -1565 -827 1414 -527 -1048 1394 -14 -1648 712 1157 -1674 -509
2988 -509 1375 -660 -1031 1238 -275 -1721 657 879 -1617 -505 1125 -1054 -736 916 -565 -1950
3004 -1950 1285 1138 -1429 -441 913 -975 -795 1322 -455 -1460 1032 935 -1691 -121 1065 -1188
3020 -1188 -600 1332 -813 -1955 1450 1023 -1428 -277 1022 -1091 -414 1300 -791 -1618 1325 812
3036 812 -1554 321 954 -1146 -384 1681 -856 -1464 1519 1076 -1846 371 832 -565 282 1380 -800
3053h00l78K809j043j504J500O69k141J037J428k322m12K350l13k083J756l9j816
3070a302J820R15k386j35K710j373j180J911l10j914J715J124k663L85K043j098
3086B62j372K078k41k138J911Q50k289o4K407j420j151K158m52k134K436N54k653
3103a258M65K169j527o28J923q80j620K013N17k690O25K466j802q18K000q67j716
3120a628K467L47k532P42J571j631m57J852p97j420K237Q5k547J157J542j669
3136f81j43J858j344r98K262m1k291P06J534j566j32J884j838q40K383l5k465
3153a747J374J400j927J09J978j395j297K732p7k272J020J382k077N05J511j641
3169d22q20K562k50k464J432J092k203P93J921j929q77K396p30j894J584R17k095
$$ plain form
3053 -800 -1178 1631 588 -916 584 1253 -888 149 1577 -745 -1157 1193 880 -1203 553 514 -1302
3070 -1302 518 1433 -953 -1088 1622 249 -931 980 670 -1244 471 1595 -1068 -683 1360 262
3086 262 -1110 968 727 -1411 500 1350 -939 -1003 1404 -16 -1167 991 539 -1595 841 1395 -1258
3103 -1258 -793 1376 -151 -779 1144 264 -1356 657 1174 -1516 -891 1575 -227 -1045 955 88 -1628
3120 -1628 839 1186 -1346 -604 967 -664 -1121 731 -66 -1486 751 836 -1711 -554 988 -681
3136 -681 -824 1034 -310 -1308 954 913 -1378 -672 862 -704 -836 1048 -790 -1630 753 718 -1747
3153 -1747 -373 1027 -900 -791 1187 -208 -1505 1227 1150 -1122 -102 1280 -797 -292 1219 -422
3169 -422 -1242 1320 1070 -1394 38 1130 -1073 -280 1641 -288 -1165 1231 501 -1393 191 1108 -987
3186i87R26J639k223l80K418q79j553J369L52j375R10J196k058j86K369j084j273
3203h19J188M28j950J241J375k231r8K374r60j645J449L44j707J233R62j888q9
3220g93K302j017j408J348l62j277J458P19j917K1J986q50j251J536l4j609J380
3237B32R20k100P4K440j627j024J752m16j494J475P54k136N63J633j319r08J970
3254G89q04j410J587O94k283L37K027j427m33J763p34j432J788L99k151P52J580
3271A042j432j27J241o84j342K173m9j980R05J593j923j47J445r09j050K152K
3288I10k043M30J824j821OJ794j161r60K150m10j738J071J203k000N45J249j283
3305b34n96J888k82j893J160R84j575N58J018j409p22K209j69k041J585M28j633
$$ plain form
3186 -987 -61 1578 -645 -1025 1393 514 -1039 330 682 -693 217 1413 -645 -831 1538 454 -819
3203 -819 369 797 -1153 88 1463 -768 -866 1508 548 -1097 352 696 -1011 222 1184 -704 -793
3220 -793 1509 492 -916 432 70 -1207 251 970 -947 -926 1060 210 -1041 495 461 -1148 232
3237 232 1152 -948 -874 1566 -61 -1085 667 251 -1243 232 986 -1150 -587 1046 -273 -1181 789
3254 789 -15 -1425 162 856 -1427 -1090 937 -490 -923 840 106 -1326 462 861 -1290 -538 1042
3271 1042 -390 -517 724 40 -1302 871 822 -1158 -253 1340 -583 -730 715 -194 -1244 908 910
3288 910 -1133 -703 1121 -700 -694 1100 -61 -1021 1129 719 -1019 52 1255 -745 -200 1049 -234
3305 -234 -830 1058 776 -1117 43 1027 -548 10 1028 -381 -1103 1106 937 -1104 481 909 -724
3322g24N97J609k017l11K069m43j653J079M59j265N81J455j984n66K257m70j772
3339a099J478M25j380M45J253j721j01J949q93j402J476L11j513R38P63j516m26
3356a013K011q25j229J652o7j472Q61R12j697k33K280j039j028J336k01j359J324
3373B13R14k119J55J638o53j218J578j96j348J608L35j892M26J703j352p76J487
3390E03k78j477J357Q01k051P35J324j329n53J507o89j258J717O30k023M33J449
3407G98j020o58J734p25j300J826K82j854P70R96j429k01J858j177q80J797j6
3424H01j671O50Q25r99l28J745j273q38J725K47j519M67R92j064K18J078j217
3441a61o59J695k65j743J320P54j108l6J448j441o06J642k73j404J139O67j444
$$ plain form
3322 -724 -127 1482 -535 -846 1223 780 -873 206 665 -600 -19 1436 -548 -1114 1143 673 -1099
3339 -1099 379 804 -576 -131 1122 -599 -700 1249 356 -1046 430 741 -772 166 929 -587 -1013
3356 -1013 998 173 -1056 596 529 -943 -82 830 -867 -1100 1180 141 -887 449 248 -1111 213
3373 213 1127 -992 -837 801 148 -1070 508 312 -1036 572 907 -985 -559 1144 -208 -984 503
3390 503 225 -1252 105 906 -1145 -410 914 -415 -968 539 -150 -1408 309 939 -1084 -651 798
3407 798 -222 -880 854 129 -1171 655 937 -917 -147 849 -580 -781 1077 -100 -980 817 801
3424 801 -870 -220 605 -394 -722 1023 -250 -1088 637 884 -635 -168 824 -240 -22 1056 -161
3441 -161 -820 875 610 -1133 187 941 -167 -203 1245 -196 -802 840 567 -837 302 969 -475
3458d75M58R50j279l09J867p74j182P06R17j526Q05O04j084k77J574l33j265J013
3476C90M02j464N39J176j403k03J642m55j705J363O6j022O60O04j079l47J914
3493A078o93j469J388k1r28O99K75j322J06J909q81j068J205j7q97Q54N42j566
3511h06J1J526p25q99J314P0j293J067N34j331J43J494j069p41J091l08j144R30
3529a36Q17j757N26J367q08r25J532o43p86J137M29j571L60J085q71n30J308p47
3547b13o76J323K29j227Q2J365j132m69J354p62n55J165J53j525N79J364j155
3564a00o87J617o49r04J310L78j495J16J107r29r0J286q95q88J451j49j228Q86
3582A37R04j289nR49r20m83J276O0j532R52P01p41k90J110j002n40J215j82r23
$$ plain form
3458 -475 -17 933 -346 -655 1212 438 -744 -38 879 -647 158 762 -322 -599 975 642 -623 390
3476 390 792 -672 -133 1043 -360 -563 1079 624 -1081 282 348 -674 -14 590 -489 -836 1078
3493 1078 385 -1084 304 283 -645 54 329 -993 -887 1022 141 -927 278 261 -636 218 760 -806
3511 -806 -795 731 6 -893 421 491 -802 265 799 -532 -389 1105 36 -705 386 78 -1066 -136
3529 -136 681 -1076 -550 817 9 -916 616 -27 -813 324 753 -818 -458 627 -244 -774 534 -213
3547 -213 -889 434 663 -564 -482 883 -249 -718 636 -126 -681 484 637 -888 -309 1055 -100
3564 -100 -787 830 181 -723 587 965 -530 -414 693 -236 -326 960 65 -823 628 479 -749 137
3582 137 1041 -248 -253 696 -224 -707 569 629 -903 49 750 9 -281 829 -173 -713 502 320 -603
3601f03O75Q78j388K66J110j171m45J373n46q77M67J140j532O49R52r67p25J594
3619H50n77j001O76M35q59K95R33j071k87J211k59j232J080J0j001O72R16j232
3637d41k79J657p38j188R95L70j182N58P91j291p6J175o45o56J217j98n91L89
3655a33O05j033j02J236l57r69Q93J40j204J343L42j302K87J086o55q32J059K0
3673D24r66P31P17j671K70J061o03m38O84K58j360J268M37j641O64J121r79m21
3691d44R85o67k62O81L09j072N04Q76j060n3R36n51p76J278j09j270N28R06r30
3710a91l43J422r42n65J001K72j059N90N18j015j91J213m90n71Q31K11j192N52
3728E1N72j082j05J162n59p26J370l31j008O56P25r39j47Q97o17o68J354j46j324
$$ plain form
3601 -603 72 950 -438 -172 938 -233 -678 695 149 -728 -261 879 -653 -4 948 -19 -744 850
3619 850 273 -728 -52 383 -476 -181 752 -319 -606 605 346 -886 194 204 -797 -125 791 -441
3637 -441 -720 937 199 -989 6 376 -806 -248 543 -748 -824 351 -294 -950 267 69 -522 -133
3655 -133 472 -561 -663 573 216 -753 140 280 -924 419 761 -541 -254 832 177 -655 404 424
3673 424 -542 189 906 -765 -495 566 -37 -475 209 467 -893 375 812 -829 -165 956 -23 -444
3691 -444 541 -126 -388 293 602 -470 34 910 -150 -203 733 182 -594 684 575 -695 -167 739 -191
3710 -191 -534 888 -54 -619 382 654 -405 185 703 -312 -503 710 220 -351 480 691 -501 51
3728 51 623 -459 -564 598 39 -687 683 352 -656 0 725 -214 -361 536 -81 -749 605 459 -865
3747h65Q29M56q80j2J264j296j01J116j89j318R99J04n38P68J57j037l58J361
3765D60l54q95Q95J03p69O22M06q13M2J083q45p45R37J71q57N16M99q75l84J491
3785F88l97q06N69L73j192Q23L85q07P7R98o32j015P86M16p80Q29L46j544N47
3804c36J064p30n59J120l53q42R44L46r48j27P63j76p40R60m41n36P89M75j421
3823g48P53Q86q50m19R26o01o31Q58R3o68K94Q46q07N9M15j30o65Q86j26r01K38
3844b92R87q71k46P62l04o91J070j65n58L73M68p17l15Q16o21j6Q45q3j163N65
3864a56P93p33k32M56r2n13J099j37j185O83M93r73K39P24o10k76P85j61q87O17
3884f6P68r67k5O66m89l90P57j33q18R27M67j049J20Q73j381L24P16j37j162J012
$$ plain form
3747 -865 -36 420 -460 -472 792 -504 -605 511 322 -996 3 107 -431 337 494 -543 -901 460
3765 460 106 -789 106 209 -560 62 468 -345 -303 780 -65 -810 127 298 -559 -43 456 -419 -803 688
3785 688 291 -515 54 427 -765 58 443 -364 -287 711 79 -936 -150 266 -514 315 661 -883 -336
3804 -336 728 -2 -561 559 206 -636 308 654 -294 -421 342 166 -574 386 -55 -591 198 673 -748
3823 -748 5 891 41 -378 548 -53 -684 174 267 -401 -107 739 -68 -9 406 276 -389 497 371 -530 -292
3844 -292 695 -176 -422 340 36 -655 415 250 -308 65 533 -184 -499 317 -304 -320 525 442 -721 -156
3864 -156 637 -96 -328 128 36 -477 622 485 -700 -17 476 -497 -258 466 -144 -420 365 204 -683 -66
3884 -66 702 -265 -290 376 -113 -503 254 121 -697 230 697 -352 -232 641 -740 -416 300 163 -999 13
3904A3M60o34L6P81j189j7J023l03p25R18N4r16L11P39q77m8R94m86r20Q43L45
3925D02q16K8P79p97K25Q52o25o78Q29L7j007P91M51n36j76R93q99n93J247l82
3945A25l14K63M1n07J43R77m62n92P08J16p41L73N40j160K73Q03n60j32O26l30
3965A90p61R95o1q76L15Q86q92mO42k93k24K43L46j141P01M08m62l27O63k38m69
3986c59O83J57p77M00N52p56l6R21q93m32N05M24p61L57L51p94K98K75k55l30
4006d70J182n05o42K46O80j076L74P89p93n27J070J94j016M29O19o81l41Q53l66
4025A9l49L89J72p37K67N98r14Q9R37o91l55J085o47o89P27M57o88j21J073p82
4045a60j17J79M39r52R51N1j015O30M74k99n70P33k65p02R72k47o62K92M60m95
$$ plain form
3904 13 473 -161 -125 656 -533 -550 473 170 -555 363 417 -499 -188 551 -326 -374 620 134 -786 57 402
3925 402 -414 -386 393 -404 -179 673 48 -630 199 236 -771 20 471 -65 -241 752 -147 -740 507 125
3945 125 -189 74 115 -392 -249 728 266 -326 382 498 -243 130 670 -490 -217 586 26 -106 520 190
3965 190 -571 424 363 -513 -198 688 -204 -208 434 141 -83 160 506 -635 66 474 12 -315 348 110 -359
3986 -359 324 481 -296 104 656 -100 -136 785 -108 -540 -35 389 -372 -15 336 -458 -160 115 -140 -470
4006 -470 712 207 -435 -189 491 -585 -211 578 -215 -742 328 522 -494 -65 554 -127 -468 385 19
4025 19 -330 59 231 -506 -239 359 -555 -466 471 -220 -575 510 -137 -826 -99 358 -330 -451 622 -160
4045 -160 -277 -98 341 -611 340 391 -624 6 480 181 -389 344 79 -623 349 102 -560 -268 192 -303
4065c03k57J268m16o63N49J75o70M75J83n36l78R41l78p29J050j93m79N14N70
4084G23j199K47O21k77n56Q33J5p15M66L81o67Q9P84o22l52L75j69j45L44L24
4104E00j245M11J095m50p25Q81l60o16Q61j31p58M75P15o33m38N94l4p42Q08r2
4124A16o20N48M15o28m3N44j76l56O88Q0o25J03N13p50n7N81l1o31N46J22r78
4145f39L57P36n05l59J036n16o10O42mo04L45N14r45J60R92n72l08N79l49p66
4165h16O08N41m21m7M48j83l79O63k30p77O66%l48J56M64k66o27Q37l13q72J022
4186A26O14j060J41N93p28P2O92m82j73L24K83o95M5N39o50j78R55m6m35J52K61
4207C50n13J30M65p95L47K42O6n13M62J23q53O08M20m95l47O46j94n77M50J06
$$ plain form
4065 -303 -560 708 292 -371 178 353 -317 158 341 -195 -573 368 -10 -739 311 118 -361 153 723
4084 723 -476 -229 392 115 -441 392 407 -308 158 539 -128 -39 745 123 -229 146 -23 -168 176 500
4104 500 -745 -334 761 311 -414 467 107 -509 352 221 -537 -62 653 20 -418 176 142 -600 208 116
4124 116 -504 44 459 -169 -212 332 156 -200 488 568 -57 46 559 -191 -248 333 302 -329 217 339 -639
4145 -639 -282 454 -51 -410 626 110 -500 142 138 -466 -121 393 -552 -392 600 28 -280 299 -50 -816
4165 -816 -208 333 -88 -135 313 130 -249 414 184 -593 73 73 -275 -119 345 79 -548 289 -24 -896 126
4186 126 740 -320 -179 414 -314 -242 450 -32 -205 119 402 -293 -248 291 -359 -537 418 372 -63 89 350
4207 350 -163 -33 432 -363 -16 226 292 -221 241 364 -489 119 539 44 -303 343 149 -428 22 128
4227A28l40L37J78n69j86Q35m61m27P40l6m68L55K11m32J77J75l55p3O66j73m76
4248a94L48K07p20M11O39p26m35N79k0m07L71K13o47L16L29l39K23K52k13n54
4268c67K37L51p38L30L87j39l53L65K90q22O16J12m56J29K25n04k04Q36n06k4
4288b35K80n5m47M04M11m49j47P35n53k23N23j82o58O35K65q16M01L52l86r3N19
4309B81l72r0L73L76q80N6P42p47J94L63j78l01M56j52n41L22N02m12l26N92k30
4330B8k27K62J49l51J70K63o12K32M01k24n31P14l4n64L18L72m45j90P71n06l68
4351c72N82K24j081M89M45n16J58L16l37K76k41L50p58N11M39o45j01O17l25m77
4371d46Q32l80k72M4M87o15K53O50q15k19R10l11l31K80K81q80M06N22n83l02
$$ plain form
4227 128 -212 125 303 -266 -452 383 -78 -505 235 199 -269 86 297 -135 42 217 -138 -211 455 282 -194
4248 -194 154 361 -359 52 691 -35 -470 109 89 -318 53 266 -381 -65 264 -75 148 400 187 -367
4268 -367 -130 221 -517 -187 200 61 -292 73 363 -459 157 269 -187 -58 167 -337 -541 295 -211 -235
4288 -235 45 -10 -457 -53 358 -91 -238 497 -56 -279 244 62 -596 39 304 -512 -111 241 -145 -238 281
4309 281 -91 -181 192 568 -312 -256 486 -261 -67 296 118 -183 273 121 -420 -98 404 -8 -334 258 28
4330 28 -199 63 212 -139 31 294 -318 -86 315 91 -440 274 240 -324 -6 366 -79 -269 502 -4 -372
4351 -372 210 434 -647 -158 287 -229 -71 245 -92 184 -57 293 -465 46 485 -160 -261 356 31 -446
4371 -446 386 6 -266 -222 265 -350 -97 553 -262 -481 429 118 -213 67 348 -532 -126 396 -187 -489
4391d89O69K89n44q3J43n15M29L76n48m23P75l3n30O61q0l15J66r1K6l11L82L4
4413a2q0K63j16l45J6M52k22r4K17j07j47K98L14l65j01J95m28Q5N14m79kK92
4435A48J20m83R1J33j39j89Q24k26n11Q04n96l26N21J93n95J67L04j65k50L89
4455B14k09j45J70J85l51j72P18m35j80N94P6p56L76L29o18L20J03k76l10N70
4475B03k24k05M17J09p56L69L21k32L2P16q84l7L17K9m82M79M09o94J16R4P7k35
4497f1N46l55j82J62O4l59NK73M3l29J92j2n15L57O13m78q5L10j53m89M29O5j24
4520h3J82k20R9K41K74l85j55J66J15m18M81J44p08K77L54n21P4L21j15l97O79
4541D05p1o93O9N60l14j64L15m6l11L75J77o30L04K92m13j60K40j00j2J58j26
$$ plain form
4391 -489 180 469 -75 -158 -15 -530 -101 275 -273 -696 79 46 -484 177 97 -218 -52 -143 -117 -428 -46 -12
4413 -12 -92 171 55 -290 -274 178 -44 -138 79 -28 -175 123 437 72 -29 166 -262 -177 337 -142 -144 148
4435 148 268 -215 -124 9 -130 -319 505 279 -232 572 -24 -350 171 364 -231 -64 240 75 -175 214
4455 214 5 -140 30 215 -136 -308 410 -25 -205 389 465 -291 85 414 -204 116 219 -57 -367 203
4475 203 -21 -226 191 300 -456 -87 234 2 34 750 -134 -171 146 175 -307 172 581 -113 3 97 174 -61
4497 -61 485 130 -52 110 174 -185 -180 93 136 -193 -1 -13 -528 -171 442 -36 -121 189 36 -453 -24 41 -83
4520 -83 99 -121 -22 219 493 108 -47 119 234 -184 297 441 -267 10 364 -157 -83 238 123 -274 405
4541 405 334 -359 -290 270 -44 -208 107 61 -250 125 302 -328 -24 268 -145 -305 -65 -165 -177 -19 -145
4562a45p9J59J78j70J97l7Pl26K25r9m07M70M15n01J3K59ol28J80K36l79K49r
4585A02n52K68O00m51k59L65kl20K94j14Qj04M51l34j75O29l48l93L58L53m15
4606c9R5N11o91J85P7l51R7O0L16l00J71J25l66R8M67l77l07L80O8k89J8L33n16
4629b35J24L45m60j76M98j35j12k73M03J8k10O27m60N3P7L65p02M53m8m79J27
4650b00M76k66m33O76k59j60J97L65m75p2N07l96m70N96p0q5k27L96l04O5M09
4671B70j22k18R8K33m97M44j19l26L94P4o04p6P57m67j6L80k89j72J97K54m46
4692b51K44J42J13k67j19L46n67K62r0r9m9Q13m90k09N66n08J7R5M30n14K99J02
4714B66n13jM70kn24L26O3l49q9N48k60J05M17l63k22j9K80l34L96k62q0K27J9
$$ plain form
4562 -145 -224 -65 113 -57 140 103 110 -216 9 -90 -497 -27 388 -113 -100 159 153 -175 5 241 -138 111 102
4585 102 -450 -182 418 -33 -292 73 71 -249 45 -69 -61 -165 286 -48 -223 406 58 -335 23 376 -39
4606 -39 56 567 -124 61 138 -213 -116 -56 260 -40 131 256 -110 -12 455 78 -229 151 219 -70 -52 281 -235
4629 -235 -111 234 -226 -402 96 -39 -151 -424 -21 -3 -213 414 -46 7 84 449 -253 200 152 -327 -200
4650 -200 276 10 -423 253 -6 -166 31 396 -79 -151 356 -40 -510 86 16 -69 -296 100 -204 -139 270
4671 270 148 -70 28 261 -236 208 89 -237 157 231 -373 -449 308 -159 -175 205 -84 -256 -59 195 -251
4692 -251 -7 135 248 -19 -138 208 -359 -97 -187 -286 -335 478 -12 -221 345 -163 -146 -51 379 -135 164 266
4714 266 -247 -248 222 220 -304 22 85 -264 -353 195 -65 40 457 94 -128 -147 133 -201 195 -67 -147 80 99
4737I9j64k10O17l08k93L05J0k86P4J41L14p68Q47m08k3J82N1j20K2J9j60l2L83
4760B92l09o14O17K53k23k45L71O2n52L48O1k38L42k82k15L82Q5l97J88r9K68
4781I5k95J82K17l05L80R2o86K90Q9l6k21K24m5k25L35L9j45N5K1q7j66M60k20
4804D8j58Q1M22m73lL05j15j02K07m3n93M18J15j5k52L41j97j7L38L5m17p2L14
4827A67k49P1R7j57j61K28k1j07L00j33j66K04J10l18R2J25K4k74R9J12o2k57
4849b76L54j72j44M91k84m66L40N0J45k0l8m9M5R8k20Q2J96r3j50K83l76KJ00
4872a02K18j64O9k6J64n32N29J05m08j13K76j27J13k11l8P0L38Rl94J90K90L9
4894B95k5N3l90J74rl03R7K23K6k60J24J94j44o34P42l3l16K74k62J79k19M16
$$ plain form
4737 99 -65 -275 342 34 -259 46 56 -230 -156 -15 299 -469 378 -30 -53 129 180 60 82 101 -59 -91 292
4760 292 -17 -631 -14 239 16 -229 142 204 -348 0 61 -177 165 -117 -332 50 135 -262 -74 -173 95
4781 95 -200 -18 199 -106 274 366 -320 -30 59 23 -198 26 -19 -244 91 130 -15 40 61 -26 -192 268 48
4804 48 -110 -29 393 -80 -83 222 107 5 212 169 -424 -6 109 94 -158 183 -14 -31 307 342 -75 -147 167
4827 167 -82 -11 86 -71 -232 -4 -25 -132 168 35 -131 73 183 -135 -43 82 106 -168 -69 43 -19 -276
4849 -276 78 -94 -238 253 -31 -497 -157 -107 38 18 -20 -69 -24 74 -146 -64 132 39 -111 172 -204 -202 -102
4872 -102 116 -48 21 -5 159 -373 156 261 -147 -260 16 -111 2 -209 -247 -177 161 170 -224 -34 256 295
4894 295 270 323 -67 107 98 -205 -108 115 141 -119 5 199 55 -579 163 130 -186 88 -174 5 -214 202
4916B02l2k09mJ34k16Q2J36l0k63K35j06P8M1J24k99k10N70m30J51P5J07qK41
4939C69k67m58M26M2l03o4K07k61K92j9J38k59J84K26m62K08N5k02o8J99mn6K08
4962A31R0m79K36P3j47L77jp1k81j19L08qr0K26m60J23J73J4l35L64J6k02J2K63
4986B13k03N2L2j63j73L11J07l55J74N0l68M68L0j59j62O84k73n27J76J48M4j52
5008d6M45n38K47j06N9r1K09j60j60n2K83m5r0L81l42j86J59O1j67K70j4J1l57
5031b29L01m6k92M17m8l05K47l32N2J93N09o04k36N37ok35N7j76J49j8J21j05
5053d9k27M59r5j47j03N47n74J39p3n6O8J69j78q4K26p4O8k01L67j92J13k29K87
5076A61k3q2Q8l54K14l1K23j94J1j28J27J76l07J67j53R0k5M1J78m76L37n8q2
$$ plain form
4916 202 170 -39 -43 91 -125 -43 93 63 -200 35 -71 7 48 172 -127 -337 233 -197 -46 29 136 128 369
4939 369 102 -356 70 112 -191 -255 -48 -309 -17 -36 102 -157 27 253 -209 -1 54 -148 -216 -17 -21 -77 131
4962 131 221 -258 -22 51 -96 281 280 209 -72 -191 117 109 19 245 -215 -92 81 95 -240 124 140 -62 -50 213
4986 213 10 62 94 -69 -242 69 176 -179 -5 45 -323 145 175 16 -146 538 265 -262 -86 62 106 -46
5008 -46 399 -139 108 2 61 -30 179 19 -141 -193 90 45 -45 336 -6 -192 -33 28 -139 131 117 128 -229
5031 -229 72 26 -266 151 103 -202 45 -287 -235 -42 467 -137 -373 164 158 -77 -20 -196 -47 -65 56 -49
5053 -49 -276 183 88 -59 -162 385 -189 -50 -123 -179 -111 58 -120 -204 22 -52 16 -185 182 -10 103 -126 161
5076 161 138 56 144 -210 4 -27 196 2 13 -115 12 188 -119 48 -105 -15 -40 1 179 -297 40 -18 -100
5099a00J77r9m9o5L90P0k53m06L86k57K54l9m1K9p3J82k00j25K10k63L05m9o7
5122h3J92l99N34j94K22l16L2l33K73N3kj0j35j62J58Q2J74q0Q1k3mj4L7k70O2
5147a25q5O7P5q8K23r3O0k52K64P3j28j62Q0Q2r8j2L01l38J4Q1P8Nl86K18K27
5172H1l98L72j5j74K79k9r2L81k79j23Nk32J68k7J2L32l20j58L38n9J4r9K69l33
5196h7J5J48j69lj7J07m8L9k4J80k03K61k29k63R0O3J0J55J16k24K81j9r4j9K31
5221B97k90l19M88q3o0p2J9j43L31q1o2k58L10J70k82J55j0l58Q8J69J66k14j1
5244e0R8k87M18j57j83J71m0r0J51p3M0k84M49j75Q0o7Mk69L41J37l12j34M32
5267B00j08l17O42n15k12K26J98M7q9j03R0k99J70J7J5j3K29j69l8J35k71M0K30
$$ plain form
5099 -100 77 -22 -71 -136 254 324 71 -335 51 -206 48 9 -32 -3 -76 106 -94 -219 -9 -272 33 -16 -83
5122 -83 109 -290 244 50 272 -44 -12 -345 -72 -19 -21 -31 -166 -328 -170 -88 86 6 87 64 60 46 83 -187 -125
5147 -125 -210 -143 -68 -156 67 -26 34 -218 46 119 -9 -171 -91 -9 -107 -119 182 -156 -142 -61 17 22 -364 -146 81
5172 81 -317 55 40 -134 145 116 24 405 126 3 8 -224 -56 -83 -71 261 -59 -217 121 62 76 -23 246 -87
5196 -87 -72 76 -93 -96 -113 -6 -54 -15 -39 141 -62 199 -30 -293 -203 -140 -130 25 141 -83 198 179 85 66 297
5221 297 7 -312 176 93 33 -39 -20 -163 168 87 25 -233 77 247 -35 120 110 -248 -160 9 175 -39 -50
5244 -50 48 -239 179 22 -161 10 -30 -120 31 -42 -2 -286 163 -12 68 1 5 -264 77 214 -98 -232 200
5267 200 92 -225 417 -98 -310 -84 114 161 72 -31 59 -240 -70 -53 -38 -51 178 9 -29 106 -165 -125 105
5290A05j23Q5M1k37M03j65l43J56j57j58M52r0J61R1l60N3J77P1k14O6M1j56p5
5313a76J67o7j01Q8o3j3O1k27J39p0K76Jr3M13k29l35K90P6r4j2J99l50K13l1
5337F2j70J95K29j36k85j16J57pL43J77m52l34O34l80j5J84n0j50P7J33j94j29
5359b27L73j72j21K66r7k81K11J99k47J34J28j13j26K66j83o7n7J57M0k10J22
5380ej5R3j72L1k09K53q8J18r4l4L22l19K93l12N2J83J21k61o6O5oK19j44k27
5404b02k40M34J01k52K03J7j96K36j44J6K05j52j01mK7J03j68M8J60l81N2P5L12
5427A49k59K54k37O7j22K29o2k84K08L01J85r7o41J17J82K10j54k61N42k27R5
5448A95m9j83j04l9K79jR8l15K28j43L0J60L8P1j55j17l98N13M6l4j57kJ45m27
$$ plain form
5290 105 -18 67 108 -129 274 109 -234 -78 -235 -393 59 -31 130 221 -139 -86 91 162 -52 14 55 -101 -176
5313 -176 -9 -76 -177 -89 -152 -165 -104 -331 -192 -262 14 15 -78 335 106 -229 61 137 43 31 230 -120 93 62
5337 62 -108 87 316 180 -105 -221 -64 -71 272 449 -3 -337 297 -83 -98 86 36 -114 -37 96 -98 -227
5359 -227 146 -26 -147 119 22 -259 -48 151 -96 38 166 53 -73 193 10 -57 -114 43 83 -127 -5
5380 -5 -20 73 -99 -68 -277 -24 -112 6 -88 -122 200 -119 174 -138 -86 97 218 -43 -109 -44 -50 169 25 -202
5404 -202 -442 -8 93 -159 44 61 -135 101 -43 -27 178 26 -75 -79 -52 51 -117 -69 91 -290 -238 -163 149
5427 149 -110 144 -93 -26 -148 81 19 -265 -57 244 429 332 -309 -192 -10 200 46 -215 327 100 195
5448 195 146 -37 -141 -180 99 98 196 -119 109 -34 -4 156 194 265 110 -7 -405 108 154 120 -37 -39 106 -321
5472c21N47l15J11K32k89k38R8m1L21K2k9j71Q4l25M77j50j56K6p3K83j82o3L9
5495a13J29K2l79M26J39l99K69k08l6j14L52j63J67n1J97n87K83J31m27N59k46
5516d9K41k40k2L15m36rK60P3l08N48l94j04J83o5q3q0K7K22l18J33L21o23Q61
5539D53p37N3K39K49k89J5k45L42Mk4j10RJ30K54l40p8K90n14K49k4J6j06J82
5562A8j40J7L26j55k0l7L56k23r6q8J91m37L49j00k0P8p7J17k77M5K0J15M16j87
5586A91l95K69o0o7j37M36j96r0O7O1k29K19j46O3q8K12jj43K37m23p4K57J3J52
5610A28l71K89J98k44m5L59j95l13J67m69M95K97j53q3K92j5m38j68O18l98N9
5631A0J60j92m1J32r1J94j43n6j79K82O9l56J67p8K49l02K19Jj36J1J24j54q3
$$ plain form
5472 -321 226 -89 22 254 -35 -273 -175 -216 105 127 98 -73 11 -314 163 13 -143 -117 -190 93 -89 -152 -113
5495 -113 16 38 -341 85 224 -175 94 -114 -150 -264 88 -75 92 41 238 -349 -66 65 -362 197 -49
5516 -49 192 -48 -70 245 -191 -200 60 133 -175 373 -21 -125 58 -7 -90 -170 -143 79 -239 -106 215 -408 453
5539 453 -284 -231 8 257 -32 -17 -262 80 84 60 -50 -41 89 343 3 -75 215 -299 -50 -74 -58 -164 18
5562 18 -122 -105 221 66 46 9 365 142 46 -42 149 -288 61 -39 -59 19 -58 59 -218 -173 -153 -38 378 191
5586 191 -204 65 5 -62 -199 237 41 -49 18 79 -150 69 -77 -14 -102 110 109 -34 203 -220 -294 -37 -24 128
5610 128 -243 46 244 0 -45 314 119 -194 -27 -496 -1 296 143 60 352 337 -101 -269 349 -49 10
5631 10 170 -22 -63 69 -22 172 29 -27 -206 76 145 -211 -44 -122 127 -175 44 45 -91 -80 44 -110 -193
5654a93K36J32l28L85o76K70J75K57o60K65L23r7k82K70j60J80j16J84r1j93J97
5675G8p3O4r2M6j10l3J67k42K16L80o40j41K47J69O4mL27o73K0M75m65J28L61
5698B69l53L03l55M12j58n29O05m98L6N44l54Q9J09J32o8k91L44m09K08j00Q3
5719A9J60j44J02J2j23M74n88KJ08j02j50L34K4m45K06J12J05l70O15n57J1J58
5741c7L18k30r9m3P3j17L39M3j99J4P6j94K20L77o43j95M80l9k43J19K50m93M96
5764B73K2n63L83J12k42j20K30k05p7K09J75j09K8J48k51j32J30m4J10Q4j45J31
5786A47j73J5j31R1L04j34k13j22L46n57J16L34J07l09J31K39o16N34P3k63M7
5807c4J27j55j5K95m29j61K10K25k26L74K23n98J47j92J23p0J11J6QK56m40J72
$$ plain form
5654 -193 43 175 -153 232 -444 -174 1 258 -402 -137 186 89 -193 77 -83 97 -19 165 74 -119 78
5675 78 5 69 -23 23 -87 -120 47 -195 21 401 -239 -380 -133 36 100 96 423 -250 -230 245 -220 -92 269
5698 269 -84 219 -136 276 118 -411 194 -304 -268 276 -78 11 120 252 184 -107 237 -172 36 -64 19
5719 19 179 35 137 149 26 500 -88 -86 22 -80 -230 104 128 -317 -111 1 106 -264 351 -206 -195 -37
5741 -37 281 51 -48 -91 -18 -135 204 247 48 62 138 -56 164 541 -102 -297 183 144 -99 20 270 -223 273
5764 273 295 -268 115 227 -15 -135 95 -110 -187 22 197 88 116 264 13 -119 11 -33 77 161 16 147
5786 147 -26 -11 -142 -51 253 119 -94 -216 130 -427 -311 23 130 -179 -48 191 -425 109 182 -81 -34
5807 -34 93 -62 -77 218 -211 -372 -162 63 -163 211 434 -164 -17 -209 -86 -156 -45 -29 -21 235 -205 -33
5829c3j24J65P6k25j1L64l03N4L52n03J0j66K98p2L59o2k47P6K83m77O8J20k26
5852b24L53Q8l36K31j21M9n4pK11o3l74L57L34r12N62L21n71K56L1l86L7K06m2
5875e4k51L65p6J77o0M6l28J33k10J65l52P67j50l78K34r0K83k05J95k61n0Q5
5897a5L05m79K64R9k73j85L80k45j6J49j61J3P6M0K4l73O43k93J3K90l70J10J53
5920A49J13m53K22MN6J11nl02L5K49l52k40K63K48n0k26Q3k7j7j68M35j54L3M9
5944E6j04j4J92l38J84J67K27m24Q3K42m47K98N6n70K27J22p5j94L29J75l68K88
5966A12n2Q8r8L39k84k51K10J50l76K34N0n2P4N2Nj79k2J05p0j58N91m05m05N61
5990B19l88M1K38K91n58K17K87m48M3L72K7m03J18J99m29J61K85l52M3J60k17
$$ plain form
5829 -33 -157 8 84 -141 -152 212 -91 -37 315 -188 -178 -344 -46 -118 241 179 -68 8 291 -186 -118 2 -224
5852 -224 129 217 -119 112 -9 40 -14 -21 190 127 -247 110 444 -468 94 415 -156 100 131 -255 -218 -12 -54
5875 -54 -305 60 -16 161 101 147 -181 -48 -258 -93 -445 322 172 -206 28 -62 221 16 211 -50 -100 -15
5897 -15 290 -189 75 174 -99 -284 96 -149 -165 -16 -177 -164 -88 -48 -24 -397 246 -47 -34 256 -114 -4 149
5920 149 262 -191 31 35 91 202 197 -105 -70 179 -173 -413 -150 98 48 -178 -95 -122 -139 -307 128 -26 7 56
5944 56 -48 -62 130 -208 -24 143 370 -54 29 271 -176 122 178 -392 -165 -43 -118 -312 17 192 -176 112
5966 112 60 148 50 389 105 -146 64 214 -162 72 122 70 144 196 201 22 0 105 35 -123 468 63 -342 219
5990 219 -169 -128 110 401 -157 60 347 -101 -58 314 341 -62 56 255 -174 -13 272 -80 -37 123 -94
6011i4J38J42m68L1J14L21j64q1M59m38j26N02o2l03p4l7K01j24J23l72k0O40
6033C08l23L8RJ97n75L34J15k59K95p2J98l23j62K51j32j8M15l72k5K07K07j91
6055A22l5J3J36l10L71j98j84L23j98m4Q2K19m34J20J83j05j69K52j88M3q2N3
6077c0k1l5J16j66K5L54l6j84k20J41L15k38k21P0J09j84J05R8j1O9P9k28K29
6100A36k60K77l8l01L1O3K35l77N1M09k43N1Qk57j8P7L42m62K25K26l80K28L19
6123C42m61l65P96k94k80M12j12j95J2J84nj86L22j92l41N27k05Q1K7N7k16j23
6145b15J89j03r0J2K21J2q1J67L1l35N20j77o9O7l6m56M40M00o96R2O19o93j17
6168b98L82M2k85J28J96m53K67J02l1l19pL02k63K96L6k90L10K0m64L72q8L9k57
$$ plain form
6011 -94 44 186 -282 -251 -137 184 20 -61 398 -40 -166 336 274 -29 -103 -140 61 -63 60 -312 -332 308
6033 308 -15 23 32 229 -346 -12 103 -156 139 67 265 -58 -220 31 -101 -119 296 -76 -101 106 313 122
6055 122 87 100 236 -74 297 99 -85 238 40 -4 78 297 -137 -17 166 61 -108 144 -44 -1 -83 -30
6077 -30 -51 -86 30 -136 -111 243 207 23 -197 -56 259 21 -200 -130 -21 -205 -100 -2 -13 56 135 -93 136
6100 136 -124 153 115 -186 -155 -92 143 -234 -183 226 -17 34 42 -215 -233 -156 186 -276 -51 175 -205 23 342
6123 342 -119 -484 312 18 -262 150 38 -157 -145 39 34 -152 170 -22 -363 164 -41 40 67 124 -92 -215
6145 -215 -26 -129 -219 -207 14 26 -55 112 143 -192 328 151 82 149 113 -343 97 497 -199 -107 512 -181 -298
6168 -298 84 126 -159 -31 165 -288 -21 81 50 -269 -276 26 -237 59 95 -195 115 135 -329 43 -45 -6 -263
6191b63K33J73mk21J41j06k10L38j56k6n3J19J25o8k1k53K42k2k13J88K67p9k00
6214f9K61r9k41J9L2M9p1l7J07K54l37O08k08m80N84k06j91r3J33k57K23K41j65
6237E7m36M78J25l41J31L25n60l1O70m67J66L75o01l45O26L43n63J1N2J1K8J95
6259B49m62k3K92j69K46o9R9j96j67L27L7j35J92o7n73O95p1m44Q3J81j55j09
6281b39P45n15l53N41J91m94k8J91m0k43O04n9o0m61M63m30j64L96k43K43k22
6302a77K67m44L38Rj64K51j03j36QJ30j61l6NK99j87K34K5m4j79n1J20j50L54
6325B08k58j61M9M46j79k26L16j60j31J35J41k19O2J79m47r2N12l89J12nJ07k02
6347b02J93n0k12J98L96j67k68J26k37J69j09J19p9m4M90k51j68K28j47K3n9K86
$$ plain form
6191 -263 -30 143 139 -82 59 -47 -257 81 -75 -101 -154 -35 90 22 1 -252 -10 -32 -245 -57 210 131 -69
6214 -69 192 93 -148 -129 -97 -48 -119 -156 -49 205 -132 476 268 -212 372 166 -25 -118 15 -242 -19 222 57
6237 57 -379 99 224 -117 14 339 -221 -252 418 -49 117 492 -109 -454 172 515 -48 -37 15 26 54 249
6259 249 -213 -236 56 -113 133 64 163 -33 -200 127 164 29 221 154 -419 276 205 -239 -156 25 -130 -239
6281 -239 506 -9 -362 179 370 -124 -152 39 -1 -244 360 301 241 -220 243 -187 -351 45 -198 45 -177
6302 -177 90 -354 -16 -7 -171 80 -23 -159 -151 -21 -182 -218 -213 86 -101 133 158 114 -65 -116 4 -146 208
6325 208 -50 -211 -162 284 105 -121 195 35 -96 39 180 -39 23 202 -245 -337 175 -214 -102 -107 0 -202
6347 -202 -9 -59 -271 -73 323 156 -112 14 -223 -54 -163 -44 -123 -167 323 72 -96 132 -15 8 -51 235
6369B35m36J93J00J47l27J96J45o05O75k20m74M35q7Qj82L84Pm47J67j09J36j1
6391g0J80l71M65L8l63r2J17L52k91K2J33r7k33K24k10R0L46j19k92j68M81l59
6413b17J99jr6j84M35L15o24M77l18J48k43q7L34l27M05j72m60P56l5m66M50p4
6435B15m63J47K10Rk21QJ15j07K48J14k88R9M2k30RJ35K85k44k20K13k29j4K36
6458F9M2l60J68p0n6JN07m22k17O46j90r1L7q7n9L9M35m96J22Q3l11K07N8J66
6482B21l73J33j49J27j71M42l20K45Nj47k66J90M0k41J15J44J08k85N90l86RJ09
6504A40q8n99N75J85l60j15M56k3k76J82k10K06j59J4o1k80M86j1j9k8l3L8j40
6527a20L23k81k2K45M1n51K81K36m16L35p0p9K02ll52Q4J84p0k19K38m1Pj3K88
$$ plain form
6369 235 -201 -8 92 239 -88 108 253 -352 323 103 -371 64 -23 -15 -197 187 194 -253 -86 -195 -59 -70
6391 -70 110 -261 204 242 -121 -213 -96 256 -35 -13 120 23 -210 14 -196 -106 240 121 -171 -339 142 -217
6413 -217 -18 -19 -115 -299 136 451 -173 304 -14 134 -109 -196 138 -189 216 44 -416 340 305 -161 289 215
6435 215 -248 -101 109 118 -103 -95 20 -87 161 275 -13 86 128 -102 -93 42 327 83 -137 76 -153 -167 69
6458 69 111 -249 -81 -151 -207 -206 301 -121 -338 308 118 27 64 -23 -82 -43 392 -104 18 101 -210 -3 55 221
6482 221 -152 -19 -168 -41 -212 230 -90 155 160 13 -253 -63 -23 -264 -149 -5 103 -182 408 22 31 140
6504 140 52 -547 28 213 -147 -262 194 171 -105 77 -133 73 -86 -72 -133 -413 73 62 43 15 -18 20 -120
6527 -120 203 -78 -100 145 186 -365 -84 152 -264 71 1 -78 124 121 -231 -147 37 -33 -252 -14 -55 -48 -61 227
6551B27ll25J42j42M3J05J87j74n5j56l7n4M46k25l2M69m01j25K45J65n13J01
6573a12K42j83J37p4K46l96J02O3K8m17L36j11k36O46k87K63M7k87J16l04L61
6594A80l45j00M68J69o99K20J47l40K60J80K91o01R9J49Nj2k38K16j1j34q0M4
6616a32L10q3l25K68K71l44l9K77Ql88j0K16k62K54J52m07K35J73r0j52P0j27
6638a25rL44Q0l77l95Q40j96m42M93l07q7o9N21l92p0K95o21N41L29k12l09L18
6660A50m65K21J06j65L18j79j73J48M6m4J14k65j3J29p8k8L85r2k51J16K94j53
6682A21J23r4n5m11K03O9p2r8L07n44L69J71k36j91M91k06k2K50j64k53L83k48
6704a07m43K93M61n4r5M8L8m91M56J92n14K26k06K9j64O63m60M07l51J00j8o6
$$ plain form
6551 227 224 -101 41 -101 -58 47 234 60 5 -151 -188 -242 204 -21 -53 416 15 -110 135 300 -213 -112
6573 -112 130 -53 84 10 256 -140 -38 25 53 -364 -28 -139 -375 271 -16 247 294 7 123 -181 180
6594 180 -165 -265 203 372 -327 -107 40 -300 -40 140 431 -170 -71 78 83 71 -167 49 38 -96 -176 -132
6616 -132 178 95 -230 38 309 -35 -74 203 211 -177 -187 29 -233 21 173 -234 1 174 84 -68 2 -125
6638 -125 -134 210 290 -87 -482 358 162 -280 213 -94 -181 -250 271 -121 -191 104 -517 24 353 141 -168 150
6660 150 -315 -94 12 -153 165 -14 -187 -39 7 -37 77 -188 -201 -72 -150 -178 207 115 -136 -20 274 121
6682 121 244 150 95 -316 -113 -44 -116 -214 93 -451 -82 89 -147 -338 153 -53 -75 175 11 -242 141 -107
6704 -107 -550 -257 204 150 55 103 141 -350 106 298 -216 10 -196 -167 -331 332 -128 279 -72 28 10 -56
6726e6J3J11k91J56J43k84N03k19k82K45Om0j37j20K15j17J71J32l12J53J64q1
6748G3j40Q0J64m37M28j51j26J54O2k23r6L57k06J30k77L51r1J00J08m59J54K10
6770A65j53q4P7K38l26K53J84l55j74JK07n10P88Q2l74J83j59j04K15J7j71k08
6792b08M37j96k09K07j14l18M02P3J3j07J17k45j09O23n04K35o7k5j37R4K7l1
6814d2l47J71N21m24r4J72Qj94j3L07j76k3J83j73lk4K96Qj36J1j13L17j75k35
6838a78J82j8n7j34q5J41n2M09j17j58L5J94m82N7M25j03n06O78j75p0J9K11k65
6861d9J05j51j38J83J84n0l21K05K48k55nL32n39L82j2j82p2M0O6p0o6K53p5j43
6885a30L30Q0m48J59J52j4K7l61J72q7L00k24j16J82J53l72K14K2j13k9J47j12
$$ plain form
6726 -56 -43 68 -223 -67 76 -208 295 76 -206 39 45 5 -132 -252 -37 -154 17 149 -163 -10 154 73
6748 73 -67 13 177 -260 168 17 -109 45 107 -116 -212 145 -61 69 -208 143 52 152 260 -199 -45 165
6770 165 12 -72 5 243 -83 170 354 -1 -175 -174 33 -477 311 393 19 202 43 -61 154 171 0 -208
6792 -208 229 33 -176 31 -83 -401 1 74 87 -20 97 -148 -257 366 -138 97 30 5 -132 -38 -11 -42
6814 -42 -389 -218 303 -121 -215 -43 -35 -229 -242 65 -111 -134 49 -124 -127 -151 145 153 17 28 -85 232 57 -178
6838 -178 4 -14 -71 -205 -290 -149 -201 208 91 -67 -32 162 -320 -263 162 59 -447 231 56 -14 5 216 -49
6861 -49 56 -95 -233 -50 134 84 -237 -32 216 -39 -44 288 -251 131 119 -63 -135 -95 -29 -99 -165 88 13 -130
6885 -130 200 280 -168 -9 143 129 156 -205 -33 -120 180 -44 -160 22 175 -197 17 39 -74 -103 44 -68
6907f8j26N50l23k23j48K64r4q4K3N04m43j3K85k82K55j44qJ05j39M29n70R9L9
6930a12r3N4M73k23m75P06n51K82o4K6R0j29m0p7k3K58N6r7K36n93L89L2M5M3
6954B13k00K81k58k25M23k02r9K69j04mO5n65K42l9M14n5m03K94NK1j84J20k7
6977a8j55j2K32j04J87j65ML4Qj21K0J88n5k54J78L32l00M4K06m27L29J6qmj49
7002FJ36j86k4J55k96J09K45j13l22K54k87L21k62L99m90O92l97K53j75j69K70
7023A19k5k19K10k09M2N38m75r9K44j59j34r8QK65l29K96o1K29j70j5k55O43k24
7046A22j75K71l75J81K71r3k87k84N20j60k08K67J47j13m21O57l52J28j20J96
7066A72l92J16M1K46j53q3R7l30K92k5m9l4J54l46J74K99j09k3oK6J51m72K87
$$ plain form
6907 -68 -194 356 33 -190 -338 -74 -168 -252 -229 275 -168 -181 104 -178 77 -67 -75 30 -109 320 -250 -151 -112
6930 -112 -205 -151 322 99 -376 330 -221 61 -3 23 113 -16 -56 -133 -156 102 158 61 297 -296 93 125 170 213
6954 213 13 294 36 -189 234 32 -67 202 98 94 159 -406 -164 -203 211 156 -247 47 52 73 -111 9 -18
6977 -18 -173 -185 47 -57 130 -35 -31 3 11 -110 -90 98 43 -211 -33 299 -1 43 249 -178 151 167 159 155 6
7002 6 142 -44 -68 87 -209 -100 145 32 -290 -36 -323 -2 -264 135 -355 337 -60 193 18 -151 119
7023 119 94 -125 85 -124 -82 456 -19 -118 126 -33 -167 -265 -257 8 -321 -25 -86 143 -27 -42 -297 346 122
7046 122 -53 218 -157 24 295 202 -85 -369 151 -9 -217 50 197 84 -337 320 -32 96 -24 172
7066 172 -220 -104 -63 183 30 -53 44 -286 6 -19 -68 -102 52 -294 -120 179 70 47 41 67 218 -254 33
7089C3p7K39l0p6rj02J72k21j0Pr2K12j17N5o4P2J34l89M2K96m9l16M76k71P1
7114a4K20m90NK01J34KK5O0j64n0q0J61p2J29L47l54l14J48K08j75J90k00J92
7137A09j68p3L42k37K16Q3m52K25J87n58O14l66k06L27J10j97N1j38O8J58j81
7158h6J80j23J59L8k41K22n6J05o99N93j46j82K30K3l81J98J18J0o1K69J8j87
7180Ak14J67J48k91K71j77K48K86m33j96K52o8R1q2Q7k01k0j76K07qJ51k7p4J14
7204E6L5l04L1K62j71QK26o3k96K82LL22l38J0j82J40j20J3k8j73K17L40l39L19
7228B50l28m49N61K2k55J23L65l64J26p9r8j30J65r3J94m34P09l42k46N58j93
7249F2n06O05m0k13KL1j41K56O4k92J22Q6j36q2L13J7k43k45N27k32J62j53J79
$$ plain form
7089 33 -44 195 165 89 80 -22 150 -71 -81 -74 -166 46 -71 -16 -80 -8 126 -263 -221 75 26 -290 186 -85 -14
7114 -14 206 -284 -279 -78 56 58 83 143 -21 -71 -151 10 -62 67 414 60 -254 -106 102 -73 117 -83 109
7137 109 -59 -132 210 -27 189 272 -180 45 232 -326 288 -78 -284 43 153 -44 7 -131 -63 95 -86
7158 -86 94 -29 130 168 -73 149 93 198 -501 92 -54 -236 -6 17 -364 -166 -48 -38 -99 170 188 1
7180 1 -213 -46 102 -189 82 -95 153 439 6 -190 62 -6 85 3 90 -111 -131 -307 -100 -108 43 16 -58 56
7204 56 91 -213 -182 80 -91 -83 143 80 -216 66 69 391 53 63 -119 21 -99 -86 -114 -287 -70 270 -69 250
7228 250 -78 -527 34 56 -199 -76 289 -75 51 -28 -126 -256 -91 -184 10 -424 285 -57 -303 255 62
7249 62 -444 161 121 -92 -90 -59 -200 56 120 -172 -50 36 -100 -182 131 148 -95 -340 187 -45 117 -36 143
7272A43m08L11J80l46J23K65o93K28K22J25j53J70j54k97K87J01J07k49j77L05
7292I0j30J64j86j31L70r8k41K50k46K65k67O9L14l83K80m9l09J34O42m62j48
7313g2r7L27j14q8N6L4l70K60P3J30J18k37l9J2NK7j76L35l13j69j9L39j65L29
7337A86l48J60N4j44j3Nr8K45l22k6M16K0k92K10o4j80J47ljQ7l0k49O15p5nm59
7363a64K66L7k14L42j39l03J01M0l9R8J57l91K15J38j27k93K42K10k29j26L63
7384A84l76j61M66J64j69J25k21o1K37j56q1M3J83q5j05L5qq7j54J10J31l4L5
7407A5L5j79O1P4j78J54J30l26R5J68j96J06R4Jnj00K41k48j5M97n03J62p3m10
7431d00J59M46k8l65j9M11J61m8m19J70k76L11j11Q4j64K73M9j51J62K2l60m4
$$ plain form
7272 143 -265 46 226 -120 3 268 -425 -197 25 150 -3 167 13 -284 3 104 211 -38 -215 90
7292 90 -40 124 -62 -193 177 79 -162 88 -158 107 -160 -91 223 -160 120 71 -238 -104 538 76 -72
7313 -72 -169 158 44 -44 12 46 -324 -64 9 139 257 20 -19 -7 -2 25 -151 184 -129 -298 -317 22 -143 186
7337 186 -162 -2 52 -92 -105 -100 -198 47 -275 -301 115 135 -157 53 -11 -191 -44 -47 -48 39 9 -240 375 300 295 -164
7363 -164 102 139 -75 267 128 -175 -74 -34 -73 25 182 -209 6 144 17 -276 -34 176 -53 -179 184
7384 184 -192 -353 113 277 108 233 12 -49 188 32 -49 -6 177 92 -13 22 14 -73 -227 -117 14 -20 15
7407 15 50 -129 -68 6 -172 -18 112 -214 -119 49 -147 -41 53 54 49 -51 190 -58 -73 424 -79 83 10 -400
7431 -400 -241 205 177 -188 -207 204 365 317 -102 68 -208 103 -8 76 -88 185 234 83 245 267 -93 -137
7453a37K10j65R4r7J7M9K02k97M8J67J10n93L23J26J54p9Q9l80Q5R3J70l30N5
7476h6K13j21j44Q4K4j0l9K51l39M4K07l73J07O5K03j93j54J43L3K9o2K95qo5
7500A04q5o7J78q7j65k7J68n11N43J18k47j19K63m33O07k12J74n05N52r2j04l04
7522b51J93L36k99P7J36R7m33L59j72k13K32K1q9n4L2j00P5L3N3q6J13n6k22J89
7546b9K25j26J84j24l35L66j50J83n29M17m6q8o8N30j40m10L52k61K82k71J88
7567A50j52P2J13m92K29rK09l23M78n41J47Q5R4l12J94M82l45k73r5M04k88o3
7589b36J06N9j93L26M8k9J26j8j59j62j35N03l48J99k39q6M08p5j84lK19R8k25
7612@o1J69k50K2m2Q2K06J4k36J94j75l6J17R0N8j81j50M29l67O9L95l82j76K9
$$ plain form
7453 -137 73 -92 2 -95 -78 -29 173 -124 -76 91 201 -392 -69 57 211 132 221 -159 -74 19 189 -141 -86
7476 -86 127 6 -138 -54 -30 -40 -79 172 -167 -123 84 -289 -182 -117 86 -107 -261 -118 -85 -56 -118 177 169 104
7500 104 19 -48 130 43 -122 -149 19 -492 51 169 -78 -197 66 -367 240 28 202 -303 249 157 53 -251
7522 -251 -58 278 -21 56 192 289 -144 215 43 -170 62 83 -6 -60 -28 -128 -53 -20 33 -53 60 4 -218 -29
7546 -29 196 70 254 130 -205 161 11 194 -335 82 36 -52 -120 410 270 -140 212 -49 233 -38 150
7567 150 -2 70 183 -309 -80 -89 120 -203 275 -266 -119 -34 60 -252 -58 424 79 -194 -289 115 -173 -236
7589 -236 -130 -71 -264 62 110 81 207 189 30 -132 -267 236 -112 87 -152 -238 170 95 -89 -92 127 225 0
7612 0 -61 108 -142 -120 -162 -80 126 140 -96 98 -77 -113 4 94 152 -29 -179 250 -117 -48 347 -35 -211 -182
7636a82Q1m9K57k95J59J03J27j60j87K79J39q0j25J59n5j3l29K15pJ27j36J39
7658A67l48M65l02L3J78j08j59K47n7Mj36P7J1k88J96j66R3j11K64j74K18j09
7680el73Q36m89p7J79O0J09k58JM20n74L06L6n8m46L71k88N1L86q7k89K19K54
7703B84k67J9m1k37K84k59J54M5q5J31J88l87K91J19k68J59q1j32O8K52l76o3
7725b02K36j06r7Q4P3j15J6k0N0J44j42J97p0Q0l9j43J02n6qR2j66M2J87l60J30
7750i1n2r4M49j38N1j02l1k96N95j86j12K57l20J4J56m0K6K47k27k11J80L56m40
7773ir2K16j88K18l36K4L81l45M40r5j57J69O5j97l23L51r2j80L13j70L7L12k97
7796D5k2k69N84o43L15O1P4o0k11K62o9j54R7J24O8j39J65l35NK75m02j7QM22
$$ plain form
7636 -182 -101 -150 107 -188 -29 74 201 41 -146 133 272 192 67 226 171 158 -171 44 37 164 28 167
7658 167 -181 284 -18 15 193 85 -74 173 116 120 -16 61 72 -216 -20 -186 -93 -204 60 -114 104 -5
7680 -5 -378 458 -31 -108 71 131 240 -18 -17 403 -171 135 171 113 -333 38 -250 -199 187 100 -189 30 284
7703 284 17 36 -5 -242 42 -217 -63 -18 -103 28 216 -171 120 239 -29 130 49 -83 -15 237 -139 -202
7725 -202 34 -72 -169 -85 -12 -127 -111 -131 -81 63 -79 118 48 128 89 -54 48 -8 -16 76 -90 -48 139 -221 -91
7750 -91 -143 -237 212 74 125 23 -8 -304 291 105 -7 250 -70 -56 100 60 86 333 106 -105 75 431 -9
7773 -9 -101 115 -73 145 -191 -167 214 -131 309 214 57 226 291 94 -229 122 30 -150 163 -7 30 342 45
7796 45 23 -246 338 -305 10 71 145 85 -126 136 67 -87 10 134 202 63 228 -107 -102 173 -229 -246 -238 184
7820A84l25K74l47N26m29K49p7l10P1M82n6l73M24m96L60j88K93j28K8j38l31
7841c07K10Q3P6K10k13m2N5L9l16K48k2j90l7L01j69k38J83j63J56L9L04l02J68
7864G3k19K79n7O7qk33j23J99j88mr9M35m18M64Mk45o7Rj37N25k85nl5j55J38
7889h5PJ99L7m54L70n02j08M83j49j31K35K43j60K49l54O6K18l35L54j14j59J3
7911g7mp4k63N18l6j67L05l11Q0M9jk1k09K55r2j21L67l65J66O4J11j28m24M26
7935D8K24l40m1K58k96j10K91k54J40K49k42M7N4Pl58M41M1j41K20J1l32j35K64
7958D6K19n93L02M7j54J28K90m13R8k02N63l17l97L59J63l68J74J68j02J2l6j73
7980a86K37Kk92L60j70OK6l3J24k91L82O3l4k36K10k11q1K73m19K40J17k8j28
$$ plain form
7820 184 -141 133 -214 312 -117 132 55 -255 -184 298 242 -131 293 -203 157 -31 262 134 162 24 -307
7841 -307 -97 -14 62 272 59 17 72 111 -205 43 21 -169 -206 95 -74 -312 -129 -292 -136 -97 207 -95 73
7864 73 -146 133 76 143 135 -98 -221 -22 -210 -214 -313 122 -296 168 172 -73 -140 -131 -268 257 -28 -33 -68 -223 -85
7889 -85 -78 121 158 -296 74 -428 -536 -53 -202 -333 -98 145 -15 234 -120 -54 164 -171 183 69 -90 -77
7911 -77 -81 -155 -418 100 64 -103 202 -109 -29 20 19 -2 -211 44 -48 -169 198 -167 -1 63 174 46 -378 48
7935 48 272 -68 -109 149 -147 -257 34 -220 -80 169 -73 -26 28 35 -323 118 159 18 238 249 -83 -218 46
7958 46 265 -328 -26 21 -133 -5 285 -128 -30 -232 331 14 -383 -24 139 -229 -55 113 11 23 -13 -186
7980 -186 51 53 -239 121 -49 -43 -17 -50 74 -217 165 228 194 -42 168 -43 -124 149 -270 -30 87 59 -69
8003f9N4J14j57k6k5l8K41k89J93m3j13K53j94J67q4j07J13J56j41P1r5m3p0J07
8027b5J42k36n70J020k56q4M8k90K49j05L33j25k02J48R1l71L92m41J88k6J45
8048B5L19l72M79m82j11K63N2n12K39L03l95K07J25K0k14k03L20j34k30M08j24
8069a7mm0J42J9p8k22K79j41J16j94j70M72j95O2J83k06N5J61r2j67J03Jj33Q2
8093A6K06j99J44j88J70m95L90r1k24J56J58R3l64L14l13M22m20M19j00K4p7j78
8115a37n3L9M68o00j9L35J5l10L94q8j43K37J46k29j38Q4j35L99n53N70n09J87
8137d0J9m3o4KJ72k8q0J8J24k0K91m92j15L28j68j86M29q2j92j1K16j00R1q2j26
8162a39j08J75n0K75J12l31O5j04L9K47k23K40j82j65PJ82J14k47J10j13m7J16
$$ plain form
8003 -69 -15 99 -58 -84 -109 -147 94 -195 -2 -45 -158 95 -99 68 -16 -123 -10 146 5 76 -19 -62 -132 -25
8027 -25 117 -119 -689 331 75 -9 39 -251 -2 -107 226 101 -101 47 138 -233 159 -282 -94 -120 25
8048 25 344 -28 451 -31 -142 121 173 -339 -100 203 -192 15 140 160 -54 -257 63 -71 -301 107 -17
8069 -17 -21 -61 81 100 22 -200 79 -62 54 -140 -310 162 -33 29 212 6 61 222 130 -37 66 67 -66 16
8093 16 222 23 167 -21 149 -346 44 -47 -271 -115 43 136 -228 86 -227 195 -225 194 94 118 41 -137
8115 -137 -190 -151 317 -283 -302 33 48 -262 132 44 -99 138 284 55 -83 1 -134 265 -288 282 -227 -40
8137 -40 -21 -64 -128 -126 46 18 -62 -44 80 60 351 -141 -256 72 -96 -282 147 65 -127 -138 78 -22 69 -13 -139
8162 -139 -247 -72 -122 153 265 -66 -1 -105 -66 181 -42 198 16 -149 -142 40 154 -93 17 -96 -143 -27
8184b7K05m2n1j64K92l22K99
$$ plain form
8184 -27 178 136 85 -79 213 -109 190
8191A90
$$ Imaginary data points
##PAGE= N=2
##DATA TABLE= (X++(I..I)), XYDATA
0@%%%%%%Qj6J6k2L0l2M0n6O9p7R0j14J36j60J90k16K49k90L32l79M34m96N61o34
30c37P17q05R04j014J131j260J401j555J726j916K125k353K603k881L191l538
46a861L930m375M885n475O168o997Q008r274J0914j3132J6316k1310L0322n1648
60c3529J89423J84858l52646j47381O3923J84754J14783n0691k22189l0957J75285
71G5633O6178j34811q4584k573N6067Q2221l5903j72869O745K06964P3480j34131
83B417j16287l4169P3167J75174N1704j73769j02378J03837J00812J4039j7591
94G6956r1211p6511P9056Q8762m8932k7828M4799k4342m4849K8348o187m1313
106d3252M1568K9369o4705r405O1191o009j2780M5782k5643p8077J5161M0508
$$ plain form
0 0 0 0 0 0 0 0 8 -8 8 -14 16 -16 24 -32 37 -40 50 -64 72 -88 102 -114 135 -155 177 -202 232 -264 297 -337
30 -337 380 -425 479 -535 596 -664 737 -818 908 -1008 1117 -1236 1367 -1514 1677 -1861
46 -1861 2069 -2306 2579 -2896 3272 -3725 4283 -4991 5923 -7209 9107 -12203 18119 -33529
60 -33529 155894 340752 -11894 -159275 -95352 89402 204185 153494 -68695 -99652 75633
71 75633 141811 7000 -77584 -80157 -24090 58131 22228 -150641 -143896 63068 136548 2417
83 2417 -113870 -148039 -74872 100302 152006 -21763 -124141 -20304 80508 94547 76956
94 76956 -14255 -90766 -11710 77052 28120 292 45091 20749 -24100 4248 -1939 -43252
106 -43252 -1684 27685 -37020 -46425 14766 8757 -4023 41759 16116 -61961 -46800 -6292
118f292n582N1060M1664j02421q3325Q1569Q5148j0275l6563p7972o3078J02908
130b3159J43771m4493j21068j7314L3348M5037N2158n4248j03384N9934J27985
141I8567l5517j02833m280M3385N2505L3499j02542j41581P1671J86923J9072
152A18869j22441j00205k5729R8921J49080m1918j92055l2602J37023Q3362q936
163F3369n4970p9841K2603J27509M356j29680j9350J01463N2360j3748o0173r0112
175g6214K9008J52059J7205j53832p9274N3475P5855O6494j2968j33885o2486
186a24563J07071P3196m7367l7523p555p241N0523M4187n5866l0255O6971J1810
198D3388o1108j868K4760j147M0108K9448p1796m7825N6427K6993k3702J2251
$$ plain form
118 -6292 -11874 39186 80850 -21571 -104896 -23327 61821 51546 14983 -62989 -126067 -23159
130 -23159 120612 76119 -44949 -62263 -28915 16122 68280 14032 -89352 -29418 98567
141 98567 63050 -39783 -44063 -678 51827 85326 -17216 -158797 -87126 99797 118869
152 118869 -3572 -103777 -129506 -30585 118495 76577 -115478 -148080 -11057 72305 63369
163 63369 8399 -71442 -48839 78670 83026 -46654 -66004 35459 87819 74071 13898 -76214
175 -76214 -47206 104853 122058 -31774 -111048 -57573 18282 84776 71808 -62077 -124563
186 -124563 -17492 55704 8337 -29186 -36741 -43982 6541 50728 -5138 -35393 31578 43388
198 43388 -17720 -19588 5172 4025 44133 73581 1785 -46040 10387 37380 13678 25929
210B5929j3052o0096J4881O2334m046j0872J1899n5937n1058O7836O5349l4058
222A9109l2325j0540k3758M1934P5939l9861q5492K1906M8712p719M71k652l1085
235b5361L5229O2142n9131q7560M2365P8571O648k5890n7332n6674P3103J25942
247A12052l3542j30580l3658M9598O1493M9615m6917j12011J3249J15707J3343
258E8349p5422k7308R560K8132N1432k7112r5410J9838J16772J5168q2093n2022
270f0116m833N5559R6809j4990j32276l3361R7897N9108j4426l7914o4927j2050
282f5520R0184M0461p3525l2223M2683J1168p714K415l4476j1750O7100J6916
294D5719p5563k1786M9044K0664R955N837n9557m0706O3821M8676l2118j4119
$$ plain form
210 25929 12877 -47219 -32338 29996 25950 15078 26977 -28960 -80018 -12182 53167 19109
222 19109 -13216 -23756 -47514 -5580 70359 30498 -54994 -33088 15624 7905 8376 5724 -25361
235 -25361 9868 72010 12879 -74681 -32316 46255 52903 27013 -30319 -86993 -13890 112052
247 112052 78510 -52070 -85728 -36130 25363 74978 28061 -83950 -70701 45006 58349
258 58349 -17073 -44381 -34821 -6689 44743 17631 -77779 -57941 58831 73999 -8094 -60116
270 -60116 -64949 -9390 87419 72429 -59847 -93208 4689 63797 49371 11457 -53470 -65520
282 -65520 24664 65125 -8400 -40623 2060 13228 5514 7929 -26547 -38297 28803 45719
294 45719 -29844 -51630 -2586 18078 28033 33870 -25687 -66393 -2572 46104 13986 -133
306a33L568l0849R178N3772q340l5947J1224q091k9930L9209M5573l5921l0031
319a6718J7390r770l296L9869q183m8688K1767L7525l1468j8308K8830K805j083
332A0672J6303m1083m8592N8705P3563l0692n6815j8163n80M9040O6603m4752
344C4209j00269J0453P6281K0513j3372k8828m4436K1400P3603j7925p6939J0764
356c4546N8384R204j4531l1249m2119L9844R3260j9564j04531k2083N5475N0504
368C8048K8001l7117r2614k601R8588K9291n9031l2159j677J0415M5655R093o4998
381c1106j3882O4675R659m7669j0958Q719J3135M4681J709p5800k0318O7619L0615
394D1079k1442j4257l0595j9702N4152M2952m2489l1337J8093o973o424L3011
$$ plain form
306 -133 3435 -27414 -18236 35536 27196 -8751 2473 -5618 -35548 3661 49234 13313 -16718
319 -16718 672 -9098 -12394 27475 19292 -29396 -7629 29896 -1572 -19880 8950 11755 10672
332 10672 26975 -14108 -62700 -3995 69568 38876 -17939 -36102 -36682 12358 78961 34209
344 34209 -66060 -55607 20674 41187 27815 -1013 -45449 -24049 49554 31629 -45310 -34546
356 -34546 23838 33042 18511 -12738 -54857 -15013 78247 58683 -45848 -67931 -12456 38048
368 38048 66049 28932 -63682 -66283 32305 61596 2565 -29594 -31271 -20856 24799 33892 -31106
381 -31106 -44988 19687 29346 -18323 -29281 -20562 -7427 37254 38963 -36837 -57155 10464 41079
394 41079 19637 5380 -25215 -44917 9235 52187 9698 -21639 -3546 -10519 -16943 16068
406A6068p22l3554J0715J2630k7160R624L8478j8547k8097J8743p04j9066K5787
419D195J7386k9120K236K2276k9787j9025M2837J8321k5728r234j3904j7961M7181
432I673N1567m3909o1010J2353L0436K1124K2588l0393n9231K4773O5136j1308
444C1799m0773J89N967Q851K4637k5072n1672L1929O4050j9802n4868j4663P429
457c1999L7836N1347l3876q8294O337P8336K6346k1645k9483l6918J4977P2566
469D5530P163o3782j1041L9274Q347l972o468l2701M802N7003m462o8936j1554
482d0797M1089J8560N665j6318n7378r895O9260K7648m2296k1747J933q83L1487
495F328K7971l4848k5170L1422Q674k0974J4654J5451j9214L425J2442k6621q382
$$ plain form
406 16068 15346 -18208 -7493 5137 -22023 -12399 26079 7532 -20565 -1822 -2526 -21592 4195
419 4195 21581 -7539 -5303 16973 -12814 -31839 10998 29319 3591 -5643 -19547 -37508 9673
432 9673 61240 17331 -43679 -31326 -890 20234 42822 12429 -46802 -22029 43107 31799
444 31799 -8974 -8785 -2818 6033 30670 5598 -46074 -14145 49905 30103 -24765 -39428 -31999
457 -31999 5837 57184 23308 -64986 -58649 19687 46033 24388 -5095 -42013 -27036 45530
469 45530 52693 -11089 -22130 17144 25491 21519 15051 -17650 -12848 44155 39693 -29243 -40797
482 -40797 292 18852 24517 8199 -49179 -59074 10186 37834 -4462 -26209 -24276 -25159 6328
495 6328 34299 -549 -25719 5703 14377 -6597 8057 23508 4294 7719 20161 -6460 -14842
508a4842L6604Q3l0280M914L361k1446J3534K6868k0289j6177J3619j3913j4467
521c2431L8618K1910l3986j7858Q352n66K4082L1174l4090m6348K3913L6200m792
534A4178m140q539k7155J5735M0295k2499m0004K2072K8896r466r284j2990j9371
547c2272L3505N0312l1872o0705P568L8727K1920J1153l1695n6527J8392O9090
559C7596O35m7972j3816M757J2246L0241q037m9816O180N1004k975l5817m352
572b0126P146J6331L4956j3469o0331K055N9832J5795k3039j7838k2474L110N0421
585C2369J3668m9542j9564K3431L441j249R022j9460j6383K7825P277l2771J529
598b0407K8069n236q139Q195j5468q167L5218J3775k8566l985J3256r859N181
$$ plain form
508 -14842 21762 21845 -8435 -3521 -160 -21606 -8072 18796 -1493 -17670 -4051 -17964 -32431
521 -32431 6187 28097 -5889 -23747 -15395 -15961 8121 39295 5205 -41143 -17230 18970 14178
534 14178 10038 1499 -25656 -9921 30374 7875 -32129 -10057 18839 9373 89 -12901 -32272
547 -32272 1233 51545 19673 -41032 -33464 5263 27183 38336 6641 -49886 -31494 37596
559 37596 38231 -9741 -23557 -18800 -6554 23687 15650 -34166 -27986 23018 20043 -15774 -20126
572 -20126 -12980 3351 38307 24838 -35493 -33438 26394 42189 19150 1312 -21162 -18052 32369
585 32369 46037 -3505 -23069 362 3803 2554 11576 -7884 -24267 3558 10835 -21936 -20407
598 -20407 7662 2426 -5713 2482 -12986 -21153 14065 27840 -726 -4711 8545 -1314 3867
611C867K5717j1835k2916J0687P31j4486K1225J7944l2457k1464J7415M283R39
624c50J5707j7395l2809J9914L0261j6213j3750R996m765J699K0402j4913k6618
637b8834K8430L1932k3195k5023M147M286K1161K7008l1687m9789K0111M7086
649B5633J002j7679j8054k2466J9100M6721j2537m8265L857K9368J477l769p957
662c569k3056J3839M2306j4753m7407M775L1437J1071L509j8360l9439J1785N6161
675B8299L840m1543j1136Q713Q615K4519K885l8489p885L6013L945k1389K802
688h11L688n434J5498K212l2726m55L5394p3k3571o08k034n669K4085J1612l0687
703i579j0828K1405j341o045J7025l246k0456R679J0876j2929Q576J9425j9515
$$ plain form
611 3867 29584 17749 -5167 5520 6251 -8235 12990 30934 -1523 -22987 -5572 -1289 -350
624 -350 15357 -2038 -34847 -14933 15328 -885 -14635 -4639 -9404 -7705 12697 -2216 -28834
637 -28834 -404 31528 8333 -16690 -12543 -8257 12904 39912 8225 -41564 -21453 25633
649 25633 26635 8956 -9098 -31564 -12464 34257 21720 -26545 -22688 6680 8157 4388 -3569
662 -3569 -26625 -12786 29520 14767 -32640 -27865 3572 14643 18152 -208 -39647 -27862 28299
675 28299 32139 -9404 -20540 -11827 -3212 21307 24192 -14297 -22182 13831 17776 -3613 -811
688 -811 2877 -2557 12941 15153 -17573 -18028 17366 17293 -6278 -6886 -8920 -14589 9496 21108 -9579
703 -9579 -20407 998 -343 -6388 10637 7391 -13065 -3386 7490 -5439 3137 22562 3047
716C047j9468J9156J0012q920P888j709k2567Q921K4485j5532j6965J6789M287
729I424j2129M942l577j5432K0002K4046k7511k8394J7293J8168L779O026j9980
742c343l1003K2950M0804j1734k8621j3K898R413K1777j2454l3749J3331L3587
755B3843j1391k2114J870K207J0284K1355j8624m0445J3750M0415l17k0898j2276
768a2341j3280J3246L8682m795m3865l204K6486M688p92j140j9437o35L1112o41
782A4084l0545L291K1640j331k564j239k0336K825L4993O22l2349l573J3051m97
796a928R990P339k4690j1328K4279M604j5942P577O001j5290K452J1874j0571
809e633j289J9541q850k1062J3086J3172j0544K492P322j5828r41J9902o664j5787
$$ plain form
716 3047 -16421 2735 12747 3827 11715 10006 -12561 -3640 20845 5313 -11652 5137 9424
729 9424 -2705 2237 -1340 -16772 3230 27276 -235 -28629 -11336 6832 10611 16637 -3343
742 -3343 -34346 -11396 29408 17674 -10947 -10960 -8062 1351 23128 10674 -23075 -9744 23843
755 23843 12452 -9662 -7792 -5585 4699 26054 7430 -33015 -19265 21150 20833 -65 -12341
768 -12341 -25621 -12375 26307 21512 -22353 -25557 929 5617 4825 3685 -15752 -16387 14725 14084
782 14084 -16461 -13170 8470 7139 4575 3336 -17000 -14175 20818 21440 -10909 -14482 -1431 -1928
796 -1928 8062 15401 -9289 -20617 3662 8266 -7676 -99 5902 -9388 -6936 4938 -5633
809 -5633 -6922 12619 3769 -17293 -4207 8965 -1579 913 8235 -7593 -8534 11368 4704 -11083
823a1083J6177Q843j8528k107R316n724P741J5729k1020k4095K0915K1530q334
836I360o063o830j5000J4898K9128j4796k8470R902J5223l605K488l877j7358
849a5000J2635K6165j6732k7486J1710J8712J369K015j4329k4926J7024L7644
861B8801q553l1739k661Q292Q786J7502p695l3071M356L0907k637j8212J709K96
875c919J160J6578n141k8653O750L0719l771j8056k183l718M267K4651j129l2523
889a4968k919K3043J217m273M168j2698q769K0303N210j9891K901J4852r787o699
903h310J0591m829n096J6711r51k1531N564J6289q696k517J0038r322r013J5006
917C934J406j4188R940J0110j8185p050J5248J000k743Q482j1372j8336J7996
$$ plain form
823 -11083 5094 13937 -4591 -6698 2618 -3106 4635 20364 -656 -24751 -3836 17694 9360
836 9360 3297 -3533 -18533 -3635 25493 10697 -17773 -7871 7352 3747 6235 2358 -15000
849 -15000 -2365 23800 7068 -20418 -8708 10004 11373 13388 -941 -25867 -8843 28801
861 28801 20248 -11491 -14152 -5860 2926 20428 12733 -20338 -15982 14925 12288 -5924 -4215 -3919
875 -3919 -2759 13819 8678 -19975 -13225 17494 13723 -4333 -6516 -10234 -5967 18684 17555 -14968
889 -14968 -17887 5156 6373 2100 6268 -6430 -15199 5104 10314 -9577 -6676 8176 -1611 -8310
903 -8310 2281 -2548 -7644 9067 8116 -13415 -7851 8438 -258 -2775 7263 -2059 -11072 3934
917 3934 5340 -8848 1092 11202 -6983 -14033 1215 2215 -528 7954 -3418 -21754 -3758
930c758K0532j4120j1444M989l188M086J7167r402k1708J3400J8248j2740q379
943f317N981l007N639J4940j5845k4411J7720K3568q241j1802m641r181J2903
956b694K6935j2636l0888O291J9924J11l29l390j6467N867K5433p494k4524P672
970f189J4477l143J205l914j8175P778K8908o182k6674J234J0381K266J0493j492
984A0973k4537m37K5118N00j4584L641M40o506J1032M916j8160O16J9686o330
998F368j4727P467K865o156J0739K100j9471L79J7866m016q785Q915k715j0906
1012a0077J0163P562j2730L628J2068j3025r455J5523N131r210L315j770j3009
1025a1886J0011J7145j3460j3541J0596K511n857P795k167j4486R490J5503j4412
$$ plain form
930 -3758 16774 2654 -8790 -3801 -6989 -2903 14264 4862 -16846 -3446 14802 2062 -6317
943 -6317 -336 -3343 2296 17236 1391 -23020 -5300 18268 10027 -1775 -6416 -15597 -2694
956 -2694 24241 11605 -19283 -12992 6932 7043 6714 3324 -13143 -7276 18157 10663 -13861 -6189
970 -6189 8288 5145 6350 2436 -15739 -7961 20947 14765 -11909 -10675 -294 1972 12465 10973
984 10973 -13564 -14001 11117 11617 -2967 674 1114 -5392 5640 10556 -7604 -6988 12698 6368
998 6368 -8359 -892 1973 -4183 6556 8656 -10815 -10436 7430 3414 -5371 3544 829 -10077
1012 -10077 86 7648 -5082 -1454 10614 -2411 -11866 3657 8788 -422 2893 1123 -11886
1025 -11886 -1875 15270 1810 -11731 -1135 1376 -4481 3314 1147 -13339 -3849 11654 -2758
1038b758j2912J2932O016l077M948q375j5724J5626K2358j2919j7407N253L095
1051b944L966J4160r539k3124R970K1342p928j1348L889l050J576J4662p814k1603
1065a7785J0283K0816p646j0965J053m967N217K0352o923k5817N030J8792j915
1078E525k697P11j2460p13K1175r95j9552M679J0934o025r0M694j0868k46J8125
1093A2197l836j8738N666J0939n052K072M009j3845k378J7715p55j3472O496L878
1107D896r964L985Q902r003k428J2038o766j1999J2603Q037j1242l56N082q421
1121d636K216J4255q036j3676J1059O755j0428J640N253q134K550J2212j1751
1134g21j3156J4709J0256j0752k117o0q485R577J6370j2957j7894J0520R446l720
$$ plain form
1038 -2758 -15670 -2738 3278 201 5149 -3226 -18950 -3324 19034 6115 -11292 -6039 -2944
1051 -2944 1022 15182 5643 -17481 -7511 13831 5903 -5445 -1556 -4606 -3030 11632 3818 -17785
1065 -17785 -7502 13314 5668 -5297 -4244 -9211 -3994 16358 9435 -16382 -11352 7440 5525
1078 5525 2828 3539 -8921 -9634 11541 10546 -9006 -4327 6607 582 492 5186 -5682 -5928 12197
1093 12197 8361 -10377 -4711 6228 1176 3248 7257 -6588 -8966 8749 7994 -5478 1018 4896
1107 4896 -5068 -1083 7819 -1184 -3612 8426 1660 -10339 2264 10301 -941 -1297 3785 -4636
1121 -4636 -2420 11835 3799 -9877 1182 7937 -2491 -851 4402 -3732 -1182 11030 -721
1134 -721 -13877 832 11088 336 -1781 -1841 -10326 -749 15621 2664 -15230 -4710 4736 1016
1148A016L104k786j3985Q053J8274j0221j5326R266O839m154M309l450j4506R678
1162c889K0147j0970j6801N579N701O39R541n649k0021O001K1084n292j1839L524
1176b245j082k066J2462r85j7709M730J6104o911q660N401j506j377J2308k642
1190E822j8089M686J5953n009o283N279o144m004J3958J590j4817L149J0157q096
1204a848k928R642l919n745R907j686j2614Q316J1167j0667m776Q488l899l726
1218d288J1676k622j2882Q048R391j1509k352R807l966k827Q199n916j1643J3400
1232B516J0951j3073o882O678j894K414J0713r153j5212J0972J2626r168l844
1245b356M046n753K842J2416q927j4488J1838J1350r372m259K194n381N893J4359
$$ plain form
1148 1016 4120 1334 -12651 -4598 13676 3455 -11871 -2605 4234 80 4389 939 -13567 -3889
1162 -3889 16258 5288 -11513 -5934 -233 406 9947 4298 -15723 -9722 11362 6070 -5769 -2245
1176 -2245 -3327 -5393 7069 6084 -11625 -6895 9209 2298 -6362 -961 -2467 -3844 8464 5822
1190 5822 -12267 -7581 8372 3363 -2920 2359 -3785 -7789 6169 7759 -7058 -3909 6248 -1848
1204 -1848 -4776 4866 947 -4798 5109 3423 -9191 -875 10292 -375 -5151 3337 -562 -4288
1218 -4288 7388 4766 -8116 -68 9323 -2186 -4538 5269 1303 -1524 6675 759 -10884 2516
1232 2516 13467 394 -6488 190 -1704 710 11423 2270 -12942 -1970 10656 1488 -2356
1245 -2356 1690 -4063 -1221 11195 2268 -12220 -382 10968 1596 -2663 -469 -5850 43 14402
1259A4402j0604j7445R224J2248m501j005p74j1310M890J6896o540j5306O763
1272c062P309n429K816R58j1029L871J5186p241j3792P052O691l833M476m97j3840
1287a0364L604J6237m376j2006N585J820n307P848K871j2806J379J2399o581q199
1301g896Q950J749p097N172J941j1266M384J2721q005q858R176L49o188P081K037
1316D250j0610L739R976r249o174J1718P87p863M359r2q284Q030J0744j2165q805
1331i639J0306K548m119N896l334j1664Q835J1967j0801p640R207Q82l953O593
1345E084m245j0749J0275J2419j1980q861P845J223Q4P758o651j4336J0049J4266
1359A2181q725p158M435l126Q76J0469n023j4053Q518J1242q214m698M653l599
$$ plain form
1259 14402 3798 -13647 -4423 7825 3324 2319 1545 -9765 -4875 12021 5481 -9825 -3062
1272 -3062 4247 -1182 1634 2592 -8437 -4566 10620 3379 -10413 -3361 3330 -503 3973 3476 -10364
1287 -10364 -6760 9477 5101 -6905 -1320 500 -4807 3041 5912 -6894 -5515 6884 303 -7896
1301 -7896 1054 2803 -4294 878 2819 -8447 -4063 8658 653 -8205 971 1320 -4868 2213 4250
1316 4250 -6360 -2621 7355 -1894 -8068 3650 4437 -3426 933 841 -7443 587 11331 -834 -9639
1331 -9639 667 3215 -904 4992 1658 -10006 -1171 10796 -5 -7645 1562 2444 -1509 5084
1345 5084 839 -9910 365 12784 804 -8057 -212 1011 1095 8853 2202 -12134 -2085 12181
1359 12181 3456 -3702 733 -2393 -1517 8952 3929 -10124 -1606 9636 1422 -3276 1377 -2222
1373b222P86J0980o068j4402P652J1767o439l104L098p375J248J3806m145j4003
1387h421O216Q109o888M52M925p757o17J1482m340j1609Q212O767q362K76M358
1402B803p659O57J1705n272j0631P793M765q163K889N440q133j33J0046o284q135
1417h312J0128M713j0277J203M173n842K637R694q854r536J0589N157q114J589
1431a052K555p562L604R855q512q770J1117M397q402J640J621o600O344R943j0617
1446d39j0036J0424N286n253J901j329r274O587J2873r456r959P787L397m182
1460a673M451j530r620O748J1669r112r088P704L336l233N583l010j1451P270
1474a956J2959p884q290N793j33k248P954j705j2005M792J0887p289n228O565
$$ plain form
1373 -2222 -1436 9544 3476 -10926 -3274 8493 2054 -1050 2048 -5327 -4079 9727 5582 -8421
1387 -8421 -2205 5904 -984 -532 4393 -3364 -3981 7501 3161 -8448 -236 6531 -1831 -1555 2803
1402 2803 -4856 -4199 7506 2234 -8397 -604 4161 -4002 -1113 4327 -3806 -3939 6107 -177 -8312
1417 -8312 1816 6529 -3748 -2545 1628 -4214 -1577 8117 -737 -10273 316 5473 -2641 -1052
1431 -1052 1503 -6059 -2455 7400 -1112 -9882 1235 5632 -2770 -1130 491 -6109 235 10178 -439
1446 -439 -10475 -51 5235 -18 1883 554 -8720 -2133 10740 1284 -8675 -888 2509 -1673
1460 -1673 2778 1248 -8372 -1624 10045 933 -8155 -451 2885 -348 5235 2225 -9226 -1956
1474 -1956 11003 3119 -5171 622 489 -1759 6195 4490 -7515 -2723 8164 875 -4353 2212
1488B212j873l074Q039j813j1246O303R805p778m481O323k502k651R088k127j0768
1503f543N451Q129p756k154O965l916l566P825k000r149P554O837r713k728P546
1518B782k463k045P171l885r137Q143P086r138k110O568l932j519P642m936q418
1533h191Q898O433r916l042O593k665M78P402p083r377R672Q002q109j895L078
1548B78m114K724R340p106j0052Q826P013p590j327L531n298K601Q917p504j0402
1563a0163Q797O983o646p88J597p038L703J1791p276j0674P802M972m970K333
1577D23J662p970L106J0739o486q365P729L251n443L392J151q850L628J0537o707
1592A797p830O858J591m728M572J303r060K749R092o351n587P528K36n644M827
$$ plain form
1488 2212 339 -2735 5304 3491 -7755 -1452 8353 575 -3906 2417 -85 -2736 6352 4225 -6543
1503 -6543 -1092 7037 -719 -2873 4092 176 -3390 4435 2435 -6714 840 7677 -2036 -4764 2782
1518 2782 319 -1726 5445 1560 -7577 566 7652 -1486 -3596 2972 -960 -2479 5163 227 -8191
1533 -8191 707 7140 -2776 -5818 775 -1890 -1412 5990 -1093 -10470 -798 7204 -905 -2800 278
1548 278 -3836 -1112 8228 1122 -8930 -104 6909 -681 -2008 1523 -3775 -1174 7743 239 -10163
1563 -10163 -1366 5617 -1029 -1817 -220 -7258 -3555 8236 960 -9714 -1912 3060 -1910 423
1577 423 2085 -5885 -2779 7960 1474 -6891 838 4089 -1354 2038 3189 -5661 -2033 8504 1797
1592 1797 -6033 825 2416 -2312 2260 3563 -5497 -2748 6344 -7 -5594 1934 2170 -3474 1353
1607A353J394p386L808Q028p536n514Q353R28n335M666M85q347M958P935p568
1622B22m603P913n06m674M388k78p042N533P083r309m853Q263N48l985M223k571
1638C52p611P061Q362r285m611O695n54k078N770l062q127P447P884q870m169
1653d796O909r28j362O007m616r005Q001Q340q337m074M527k290r1P698m675r968
1669h660O907P100o644k574M631m012M9P848m140q575O726O480o709j389M045
1684A083m431J020Q413m436r000O378N907o090p9M008n542j16Q310m171o912O358
1700G00M061p271P74M259n347P28P499n409p202P395L420o429J225L505n785J167
1716b710P494n180n852P493K793o996K265L384n043K366O825o782o147R261L187
$$ plain form
1607 1353 2747 -4639 -831 7197 -339 -5853 2500 3428 -1907 2759 3244 -5103 -145 7790 222
1622 222 -4381 3532 3026 -1648 2740 2462 -4580 953 8036 -1273 -6126 2137 2685 -1300 2923 352
1638 352 -7259 -198 8164 -1121 -5732 963 409 -1669 4101 1039 -7088 359 8243 -627 -4796
1653 -4796 2113 1185 -177 5830 1214 -7791 210 8550 213 -3861 666 -1624 -1715 5983 1308 -8660
1669 -8660 -1753 5347 -1297 -3871 760 -3252 -3203 4645 505 -8070 -1344 5136 -1573 -2962 1083
1684 1083 -3348 -2328 6085 1649 -7351 -973 4934 -1156 -1235 2773 -2769 -2885 5425 1254 -5658 700
1700 700 4761 -2510 -1736 2523 -2824 -2096 5403 -6 -7208 187 3607 -2822 -1597 1908 -3877 -2710
1716 -2710 4784 -396 -6248 1245 4038 -2958 -693 2691 -2352 14 6839 57 -6090 3171 6358
1731F358p037J562J650n223K904P338p347o278P221K503o102K648R17o163L923
1746a126P167p523n856Q284K554n081K506M10o687N797P992p081o112O496J814
1761C554l167L904j175p858N257P439p289m719O076k4l688M373j294p865N430
1776a046P299p294m332N442n16j999N065j200p615M589P243o101k870N407k047
1791B5k708O218j367p520M974N952o475k486N600k110k475N667k205p091N273
1806g28N584o872j380N596l446j989N725j941o478N767M356p277j173N931k882
1821a207j260N339l320o200P047M536p082r60M815l233j74O307l879o443P056
1836A342M199p150m41M450l141J80N126m630o145P575L692o525q58L267l883J700
$$ plain form
1731 6358 -679 883 2533 -2690 214 7552 205 -6073 1148 3651 -2451 197 1114 -5049 -1126
1746 -1126 6041 -1482 -7338 946 3500 -1581 925 1335 -5352 445 8437 1356 -4756 1740 3554
1761 3554 387 4291 3116 -4742 515 7954 665 -4054 2022 1998 -1690 2683 1389 -6476 -1046
1776 -1046 6253 -1041 -5373 69 -447 -2446 2619 1419 -6196 -1607 5636 -465 -3335 2072 25
1791 25 -2683 3535 2168 -5352 -378 5574 -901 -3387 2213 103 -2372 3295 1090 -6001 -728
1806 -728 4856 -2016 -3396 2200 -1246 -3235 2490 549 -5929 -162 4194 -3083 -4256 1675 -1207
1821 -1207 -2467 2872 -448 -6648 399 4935 -2147 -3107 1708 -1525 -1699 4608 729 -5714 1342
1836 1342 5541 -1609 -2050 2400 -741 -561 4565 -65 -6210 1365 5057 -1468 -2326 941 -2942 -1242
1852a242O468n465o370O767M130n954O85K499m285J869O712n384n517O765L162
1867D840n970J430K162m859K077O977n559o299O352K729m360J287J588n755J983
1882a377O757m892n120N929J098m744L185J402n841K536O503n538m465O032R09
1897B374m014L033Q50n528K589N947n304l271N831n20m154L667R71n439K649N310
1913D991o450k858O587j55m684L571j48n518M106N151o589k355N748j002l120
1928b725L804n24n269M459M638o604k139O441o23l413L779j226n089N225M589
1943E323o783l107N895j332j665M093j946o311N104N113o282j637M531j788j186
1958a978M556k540n285N688M226n898j912M564j983m84M719l095o195N582M591
$$ plain form
1852 -1242 5226 -239 -6609 158 4288 -1666 -981 1518 -2767 -898 5814 430 -5087 1678 4840
1867 4840 -1130 300 2462 -2397 -320 6657 1098 -5201 1151 3880 -480 807 2395 -3360 -1377
1882 -1377 5380 488 -4632 1297 2395 -2349 836 2238 -3603 -1067 5436 -102 -4567 1465 2374
1897 2374 -1640 1393 2243 -3285 -696 5251 -53 -3324 2507 1987 -2167 1500 2471 -2968 -319 4991
1913 4991 -1459 -4317 2270 2115 -2569 1002 854 -4664 -558 4593 -1996 -4351 1397 395 -2725
1928 -2725 1079 555 -4714 -255 4383 -2221 -4360 2081 1458 -1955 1824 598 -4491 734 5323
1943 5323 -1460 -4567 1328 -4 -1669 2424 478 -5833 -729 4384 -1898 -3535 996 -792 -1978
1958 -1978 2578 38 -5247 441 4667 -1231 -3143 1421 -562 -1046 3673 578 -5617 -35 4556
1973D556n689p58L451k993o91N571k706n678N063L740n964N29L432l304J47N562
1989D268l668m996N426L411n351L57K990l520K02N022l422m553N233J986n288
2004a903J051L475m331O81M891m393l845O263J450n461J450K822l970J175M903
2019D258m064l628N377J357m928J669K246m099J598M469m784l575O192J190n324
2034b046J443J793l323J764M548n158l652N915R53m125K107O99m231K793M860
2049D340n605l055N921M68l902K130L82m055K971M951n694l346N649L91l001K872
2065A417l90n170L645M956n578k662N021n19k979L587m60n320L836M103n066k735
2081d314N141n72k502L853j527m788L885M323m722j714M697j900j651L872p30
$$ plain form
1973 4556 -1133 -1891 1560 -1433 -2124 3447 741 -4937 126 3866 -2098 -1569 1863 -1441 -1294 4268
1989 4268 600 -4396 1030 4441 -910 -553 2437 -1083 -881 4141 719 -3834 1399 3385 -1903
2004 -1903 -852 2623 -1708 -1027 3864 -529 -4374 1889 3339 -2122 -672 2150 -1820 -645 4258
2019 4258 194 -3434 1943 3300 -1628 41 2287 -1812 -214 4255 -529 -4104 2088 3278 -2046
2034 -2046 -603 1190 -2133 -369 4179 -979 -4631 1284 2237 -1888 219 918 -3313 -520 4340
2049 4340 -1265 -4320 1601 2069 -1833 297 679 -3376 -405 4546 -1148 -4494 1155 1546 -1455 1417
2065 1417 1027 -4143 -498 4458 -1120 -3782 1239 720 -2259 1328 868 -4452 -616 3487 -1579 -4314
2081 -4314 827 255 -2247 1606 79 -4709 -824 3499 -1223 -2937 1760 -140 -1791 2081 1351
2096A351m531L713L416m952q57M113j818j680L816j994m246M320L057n463o14
2111b369M271k268j302L852j822m087M133K485m923p7M157k216j045L480j993
2126B76m100N531K318n603k10M044k184l27L891k720m471N265K621n263J25L199
2142B392k441l2L642l104l989N137J876n424M86K424k440N52L744l949l687N444
2158F31J939m672Q36J959k741J639M453m122l246N170J557m252J425J923l362
2173h63J137L934m225k980M623P60l964J540P41m021J875L722l449l423M814K45
2189D66l551K676Q46l417K019L871l834k626N356K37l588K371O96l505K219L752
2205C988m458k428M817k57l423K698N5l918K120L422m708j438M730l23l528K860
$$ plain form
2096 1351 -3180 533 3949 -1003 -1860 2253 435 -1245 2571 577 -3669 651 3708 -1755 -2369
2111 -2369 1902 -366 -1668 2184 362 -3725 408 2893 -2030 -2107 2050 -166 -1211 2269 276
2126 276 -3824 1707 4025 -1578 -1788 2256 72 -255 3636 916 -3555 1710 4331 -932 -807 2392
2142 2392 -49 -81 3561 457 -3532 1605 3481 -1943 -1457 967 -1473 -921 2823 -1126 -4813 631
2158 631 2570 -2102 -1266 693 -2048 -409 4044 -78 -3324 1846 3403 -849 576 2499 -863
2173 -863 274 4208 -17 -2997 1626 2386 -1578 -38 703 -3318 -1443 2279 -1170 -4593 221 466
2189 466 -3085 -409 437 -2980 -961 2910 -924 -3550 1806 2043 -1545 826 1522 -1983 236 3988
2205 3988 -470 -2898 1919 1662 -1761 937 992 -2926 -806 2616 -2092 -3530 1200 877 -2651 209
2221B09j4l303L246K992m566j890N122p56k649K931n93l730L413L149m939r79
2237b357M374j276k113L016r12l612M181K535m826j144M012o84j439K547j452
2252H50l984M305K834n213j053L914j734j364L644k233l166L708K344m590p59
2267b497L913j658p71L431j756l875M754K425m506J09K772k107k23L763k525l578
2283b329L914J922m524J66K893l014l29L405k554l526M852J146m531N88K429k542
2299b034P05L438k662k504M238J446m141J298K383k803N17K964k949k614M550
2314A832P83m240J015J965k822P66L426l437l096M702O61m143J261J831k818J059
2330a255L423l364k459M831M68l881J877J228k729K146K472l969j951M723L29
$$ plain form
2221 209 195 -3108 138 3130 -1436 -3326 1796 1040 -1609 1322 729 -3001 412 3561 -1378 -2357
2237 -2357 2017 741 -1372 1644 732 -2880 1301 3836 -990 -2134 1878 1194 -245 2302 850
2252 850 -3134 1171 4005 -1208 -2261 1653 -81 -1445 2199 -34 -3200 508 2852 -1738 -2497
2267 -2497 1416 -242 -1013 2418 662 -3213 1541 3966 -540 -431 2341 234 11 3774 1249 -2329
2283 -2329 1585 3507 -1017 -851 2042 -972 -1301 2104 -450 -3976 876 2022 -2509 -1921 508 -2034
2299 -2034 -1329 2109 -553 -3057 1181 2627 -1514 -216 2167 -636 -119 2845 -104 -2718 1832
2314 1832 2615 -1625 -610 1355 -1467 -701 2725 -712 -3808 894 1555 -2588 -1327 504 -2314 -1255
2330 -1255 2168 -1196 -3655 1176 1644 -2237 -360 868 -1861 285 2757 -1212 -3163 1560 1889
2345A889l459J845J005l640K469L340m389j846M308p0l020J942L74k992J928L288
2361B972m531j072L893m1k996K436k51l362K760L030l889j301L712l48k063K509
2377A458m31l435L105K678m167m27L460j209j933K945r62l117L086K345m022j033
2393a659L274j174j480K828j270l142L294J906m000j56L155j431j293K701j024
2408E29l183L743J745l892m79L267j455j112K930j580l045L589J929m447K37K971
2424A747k208n06K979j921k848M021J241m329L62K719j870m69K725k490k385L735
2440E03J340l677K27K536j942J9L004k365k760M004J168l696P76K356k519M91
2456e35K958k962k233M037O43l535J030J624k657J041K871l325k058L870M25l229
$$ plain form
2345 1889 -1570 275 1280 -2360 109 3449 -940 -2786 1522 1452 -1568 374 748 -2244 -316 2972
2361 2972 -1559 -2631 1262 1221 -1775 661 410 -2952 -192 2838 -1051 -2352 1360 1012 -1051 1458
2377 1458 1027 -2408 697 3375 -792 -1219 2241 1032 -901 2044 1082 -2035 1051 3396 -626 -1659
2393 -1659 1615 441 -1039 1789 519 -2623 671 2577 -1423 -1579 1576 145 -1148 1553 529
2408 529 -2654 1089 2834 -1058 -1537 1730 275 -837 2093 513 -2532 1057 2986 -1461 -1224 1747
2424 1747 -461 -967 2012 91 -2757 1264 2505 -1824 -1462 1257 -613 -1082 1643 -847 -3232 503
2440 503 1843 -1834 -1607 929 -1013 -994 2010 -355 -3115 889 2057 -1639 -863 1493 -1026 -535
2456 -535 2423 -539 -2772 1265 1908 -1627 -597 1027 -1630 -589 2282 -1043 -3101 769 1194 -2035
2472b035J464J332k692J339K896l214j964M074N00l305J518J137k283J126K855
2487B748l342j973L981K27k926J703P10k660J388K766l281j354L614o84k640K232
2503E09O72k554J718K333l439j166L909r03k436J912O24l085K464J802k791j175
2519a606L772j368j984J999K31k970K665K009l941n78L588j120j797J973m0k625
2535a792K590J896m005l72L292j004j811K693j174k581K839J906l583n36L562
2550A920j548j342K346j107k320K775J766m011k14L032j520q00K759j529k913
2565b706L282J416l903P41K508j861m52K531j548k518L404R06l496N50K682k102
2581e66k04K798k079k376L323Q35l469Q62K376k689n8K849k358k033L517N62l590
$$ plain form
2472 -2035 -571 761 -1931 -592 2304 -910 -2874 1200 1700 -1605 -87 1050 -1233 -107 2748
2487 2748 -594 -2567 1414 1641 -1285 418 1128 -1532 -144 2622 -659 -2013 1601 917 -1723 509
2503 509 1181 -1373 345 2678 -761 -1927 1982 1079 -1357 555 1179 -1906 558 2360 -431 -1606
2519 -1606 2166 798 -1186 813 1044 -1926 739 2748 -1193 -1771 1817 697 -1100 873 833 -1792
2535 -1792 798 2694 -1311 -1683 1609 605 -1206 1487 313 -2268 571 2477 -1106 -1642 1920
2550 1920 372 -970 1376 269 -2051 724 2490 -1521 -1735 1297 -223 -1023 1736 207 -2706
2565 -2706 576 1992 -1911 -1170 1338 -523 -975 1556 8 -2510 894 1800 -1696 -1146 1536 -566
2581 -566 -770 2028 -51 -2427 896 1731 -1738 -876 1500 -1189 -1247 1602 -756 -2789 728 1290 -2300
2598b300J271J890k000L24K776k752j506L392P53l480J448J792k409M56K915k960
2614c90j547L502R1l320J483J370k240P00K383k932j577L369N51l061J264J364
2630A010k348J209K046k946j031L753R6l041J829Q93k463J270K403l381r28L513
2646A884m98k837J846N68k397J668K190l447n83L442n83k637K308J85k751J902
2662B60K142l383m28L348j129k093K155j59k524K215J855l465n91L337j380j613
2678a453K538p06k428K404J953l588j03L098j451j323K338n64k314K003J985l791
2694a402K16L132k192j281K715j122k645K706J262l367r2L104j683p42K253j384
2710e22k094L026J207l302O82K606j443q04K309j508k185L001J207l430K06K334
$$ plain form
2598 -2300 -1029 861 -1139 -815 1961 -791 -2297 1095 1848 -1632 -184 1608 -801 -345 2570 -390
2614 -390 -1937 1565 1656 -1664 -181 1189 -1051 -351 2032 -900 -2477 892 1443 -1618 -354 1010
2630 1010 -1338 -129 1917 -1029 -2060 1693 1789 -1252 577 1470 -993 277 2680 -701 -1629 1884
2646 1884 1386 -1451 395 963 -1434 234 2424 -1023 -1606 1836 1253 -1384 924 1109 -1642 260
2662 260 2402 -981 -1409 1939 810 -1283 872 713 -1811 404 2259 -1206 -1797 1540 160 -1453
2678 -1453 1085 379 -2049 355 2308 -1280 -1383 1715 264 -1059 1279 715 -1599 404 2389 -1402
2694 -1402 -1186 1946 -246 -1527 1188 66 -2579 127 1389 -1978 -2070 1034 -649 -1391 862 -522
2710 -522 -2616 410 1617 -1685 -1003 1603 160 -644 1665 157 -2028 973 2180 -1250 -1044 1290
2726A290j809o49K363j659k028L261M20l088Q44K074k395J77K274j701j727L542
2742A189L28l187J400J605j765N60J890k190j351K879J36k822J196J892k720Q15
2758a45K048k404j526L190J23k958J511J262k261O65K390k660j015L146r7k639
2774a370J548R92k116P66J981k623o02K970P7l379K204Q47k362J196K139k876
2790f08p77L380n93k386J591M05k164J666J770k890q11L183r87k515K063M39k441
2807a675J778J624l147m06L138r71j814J862L4k460K118K154l310n00L386j357
2823D54j823K167j90k241K140J099k927J27K918j575j562K196p33j568J808J161
2839A451l202J85K603j326j352K256n56k105K315J232l124L98K724j626o89K074
$$ plain form
2726 1290 -519 -1168 1195 -464 -2492 769 1189 -1899 -1055 1019 -1376 -1199 1075 -626 -2353 1189
2742 1189 1517 -1670 -270 1335 -430 130 2020 -170 -1521 1358 1494 -1328 -132 1760 -960 -145
2758 -145 1903 -501 -2027 1163 1286 -1672 -161 1101 -1160 -495 1895 -765 -1780 1366 1269 -1370
2774 -1370 178 1170 -946 -180 1801 -822 -1424 1546 1623 -1756 448 1295 -1067 129 2268 -608
2790 -608 -1385 1995 1402 -984 607 1012 -1152 514 2284 -606 -1417 1766 779 -1736 327 766 -1675
2807 -1675 103 1727 -1420 -1826 1312 341 -1473 389 423 -2037 81 2235 -1075 -1575 1811 454
2823 454 -1369 798 608 -1633 507 1606 -1321 -1194 1724 149 -1413 783 50 -1518 290 1451
2839 1451 -1751 -1566 1037 -289 -1641 615 59 -2046 269 1501 -1623 -1225 1499 -127 -816 1258
2855A258j114k026K825O41l025O96K412k025m07K194j151k318K970P65l178N87
2871h96K250j900l73K036j370j686K739L99k932J214K114j981k51K201j809j438
2887a683K969Mk565J087J734j977J29K137j928j618L247n08k350J556J547k440
2903f59N79J802k283q73K787l53k786J772R06j660L96K174k443r34L157m24k669
2920a511J973R52k148M68J979k553n86K910j84k539J703O13k384J394J978k937
2936h72m76K989j066k055J803Q42k565J330J378k541k22K622n15k394K112j6j680
2953a326J470J620k921m56L087j045j783J815J51j956J390J583k874j01K596j084
2969A66j879K477l92k227K375Q50l067M51K437j321p92J359l01j805J954J053
$$ plain form
2855 1258 144 -1882 943 1584 -1441 -745 1667 -358 -765 1429 278 -2040 930 1695 -1483 -896
2871 -896 1354 -546 -919 1117 -253 -1939 800 1199 -1733 -519 1595 -386 -637 1564 -245 -1683
2887 -1683 1286 1290 -1275 -188 1546 -431 -302 1835 -93 -1711 1536 1028 -1322 234 1781 -659
2903 -659 -80 1722 -561 -1434 1353 1000 -1786 -14 892 -768 -372 1802 -641 -1575 1582 1158 -1511
2920 -1511 462 1414 -734 -266 1713 -840 -1426 1484 1300 -1239 464 1077 -1307 87 2065 -872
2936 -872 -1348 1641 575 -1480 323 1165 -1400 -70 1308 -1233 -1455 1167 652 -1742 370 354 -1326
2953 -1326 144 1764 -1157 -1613 1474 429 -1354 461 612 -1344 46 1629 -1245 -1346 1250 166
2969 166 -1713 764 372 -1855 520 1370 -1697 -1246 1191 -130 -922 437 136 -1669 285 1338
2985A338k932N46K275j549r46J937o38j913K412Q24k833O63K195j447p80J869
3001A021r57j653K296J086l076P72J903j728p59K143r50j789K729L94k741R07
3017d02J699j508l68K000j232j367K299L50k499O42J997j770m30K108j630j115
3033a226K439k86k360J131J748j967j6J916j455j452K948k01k483R73J580j746
3049d57L58J656k127p42K668k58k388J238J019j850P45J598k002r03K825m90k044
3066a154J293Q77k201O51K019k318r12L125o25k215J825M64j942R33J749k322
3082g53l87K461j066j801J623N32j884P62J675k183j64K339j107j523J783L46
3098F53j979J248J633k610r5K446r72j870K129l8k122J843J127k524n6K373j190
$$ plain form
2985 1338 -1594 -1048 1227 -322 -1268 669 31 -1882 530 1354 -1479 -816 1379 -68 -848 1021
3001 1021 64 -1589 707 1793 -1283 -511 1392 -336 -1095 1048 98 -1691 1038 1432 -1309 -402
3017 -402 1297 -211 -579 1421 189 -1178 1121 1471 -1028 -386 1611 -159 -589 1519 -111 -1226
3033 -1226 1213 927 -1433 -302 1446 -521 -537 1379 -76 -1528 1420 1219 -1264 -291 1289 -457
3049 -457 -99 1557 -570 -1312 1356 1098 -1290 -52 967 -883 -138 1460 -542 -1445 1380 890 -1154
3066 -1154 139 1016 -1185 -534 1485 -833 -1745 1380 755 -1460 365 829 -1113 -180 1569 -753
3082 -753 -1140 1321 255 -1546 77 609 -1275 -513 1162 -1021 -1185 1154 47 -1476 307 653
3098 653 -1326 -78 1555 -1055 -1150 1296 324 -1546 583 545 -1577 266 1393 -1131 -1187 1186 -4
3115dj425J917j53j669J477J204k536K60J873o69j286J659n08j448K056P69k288
3132g71K3K027j125q82J325n00j270J772O06k426M06J896r44r52J725o75j559
3149a324J901R56k597P81J580j648k65J761p97j615K317L52k390O60J981j732
3165g9l46J507r83j294J971L32k485J317J266j685l10J844q14j398K083K28k145
3182i91J136J102j573l46J800j214j257K339j52k111J296J183j815K72J463j429
3198b97r29K167m4j916Q57P15j151M02J237j568p39K528p23j844J627O26j860
3215i12O06J431j770n86K170m39k192J684P63j707P70J147j759m33K335o38j992
3232a522J579N69j822R79J076j646k36K099n02j944J792k1j905J238J677k369
$$ plain form
3115 -4 -1429 488 335 -1334 143 1347 -1189 -929 944 275 -1011 648 140 -1308 748 1517 -771
3132 -771 -748 1279 154 -728 597 97 -1173 599 1205 -1221 -815 1081 137 -815 910 235 -1324
3149 -1324 577 1533 -1064 -283 1297 -351 -616 1145 348 -1267 1050 1402 -988 -328 1653 -79
3165 -79 -425 1082 99 -1195 776 1108 -1377 -60 1206 -479 -789 1055 241 -1157 926 1154 -991
3182 -991 145 1247 -326 -672 1128 -86 -1343 996 844 -1267 29 1212 -603 -331 1132 -297
3198 -297 -1226 941 897 -1019 -162 553 -598 -196 1041 -527 -1266 1262 539 -1305 322 948 -912
3215 -912 -306 1125 -645 -1231 939 500 -1692 -8 755 -952 -182 965 -794 -1227 1108 470 -1522
3232 -1522 57 626 -1196 -217 859 -787 -1023 1076 574 -1370 422 401 -1504 -266 1411 -958
3248i58j06K254q46j763J735k20j716J683J141k150J51K338j498j147J650O9j686
3265a069J427P65j952l9K366j186j393J682k56j623J880N05k190N67K236k005
3281b85k09J361o76j425J740P27k512P82J882j340p89J972o27j634J984K05k061
3298i05Q02J499j595k38J310o69r96J418M26k154P42J895j794k39J850j439j075
3315a162J662L02j576K27J713j352n87J965j081j232K101K1k167J179P92j003
3331a98m23J577j416o50K054l51k261J510J088j484K24J578j625j047K149k81
3347D44j724R65R49j317N62P79r64r19K117n60j176R83O39j533M56J001j121m80
3365h99J959q83j759J764M47j387M11J299j725l67K267n62j477J014O05j521P77
$$ plain form
3248 -958 -1064 1190 344 -1419 316 96 -1620 63 1204 -946 -795 1543 45 -1102 548 617 -1069
3265 -1069 358 1123 -829 -868 1498 312 -1081 601 345 -1278 602 1107 -1083 -516 1720 -285
3281 -285 -494 867 191 -1234 506 1233 -1279 -497 1385 45 -744 1228 601 -1033 951 1156 -905
3298 -905 -103 1396 -199 -437 873 204 -792 626 1052 -1102 -360 1535 -259 -498 1352 -87 -1162
3315 -1162 500 802 -774 -547 1166 -186 -773 1192 111 -1121 980 1001 -1166 13 805 -198
3331 -198 -621 956 -460 -1110 944 593 -1668 -158 930 -554 -330 1248 -377 -1424 725 444
3347 444 -1280 -315 634 -683 -121 658 -306 -1225 892 332 -844 139 778 -755 -299 702 -419 -899
3365 -899 1060 177 -1582 182 629 -758 -347 952 -773 -1140 1127 565 -912 102 707 -814 -37
3382c7P91j467j27K137j089j198J018O52j526Q80R80j532J02J551o73j216J294
3399E40j09j385J114R55j768R4J662o45j371J559j41j546J404N98j643K38J691
3416A247q16p34R94k28j438J612N16j835J89J528q28j073J352j01j368J682J84
3433H83j780M17J045o96n55J565p10j210J520O23k252P01J103o67p62J595p26
3450I4j022J721j4j830O77J438j353l37J466j041q31J499P0j556Q84J082j229
3467b82n75J450j098m78J996n01j588Q63J045j320jJ226j003q76J642j21j421
3484a042Q21J052j164l01J304p78j030K001l10j832R33R57j446M88P88q23k95
3501f77J477m61j001J075L26j445J65J503j228p43K141q78j540J433N18j343L86
$$ plain form
3382 -37 754 -713 -840 1297 208 -990 28 680 -846 34 1014 -518 -416 1135 462 -754 540
3399 540 431 -954 160 1115 -653 -559 1103 458 -913 646 505 -1041 363 961 -682 -444 1247
3416 1247 431 -303 691 463 -975 637 1153 -682 -493 1035 207 -866 486 385 -983 699 883
3433 883 -897 -480 565 -131 -686 879 169 -1041 479 1102 -1150 -449 654 -13 -775 820 94
3450 94 -928 793 779 -1051 -374 1064 -289 -626 840 -201 -1032 467 537 -1019 -135 947 -282
3467 -282 -857 593 -505 -983 1013 512 -1076 -213 832 -488 -489 737 -266 -1142 500 379 -1042
3484 -1042 -221 831 -333 -634 670 -108 -1138 863 553 -1279 -346 611 -835 -347 441 -382 -677
3501 -677 800 339 -662 413 739 -706 -541 962 -266 -1009 1132 254 -1286 147 665 -678 -292
3518b92J140j194n42J960p51j317J293L77j472Q47R94j467j43J474p19j282J402
3535C08J69r85Q52M73j297J20J537j304j263J909K4q15N34Q22j784J17J532q79
3553G0n28R39j96j167R12P12j422K02J550j038o67J028J37p87N10M28j335j13
3571g65K024j449m86J453l08j096Q86M11j384K11J161q52l93J220o33p35J016
3588B81N86j787M02J671j463m44J686q72j072J406K8j494Q11J145j085m77J247
3605E69o06o86J227P3j504P17J257j548K2J287j010l81R84j63j047O34P82j186
3623e79M76O96q69k71J214k87j540Q35J054j145m6J225j196l17J225n4j261O90
3641a50P16j048L89P79j091Q1R66n99m86O65J98q24L01P04o28m98J498m45j269
$$ plain form
3518 -292 848 -346 -888 1072 321 -996 297 674 -798 49 1043 -424 -567 907 188 -1094 308
3535 308 477 -508 344 817 -480 -360 1177 -127 -1390 519 543 -272 262 1084 -700 -583 949 70
3553 70 -458 481 285 -882 30 742 -680 -478 1072 34 -633 395 532 -255 255 683 -652 -765
3571 -765 1259 -190 -676 777 469 -627 259 670 -714 -503 658 -194 -587 633 0 -735 281
3588 281 867 -920 -518 1153 -310 -754 932 60 -1012 394 422 -1072 -261 884 -201 -678 569
3605 569 -37 -723 504 577 -927 -210 1047 -501 -479 808 -202 -583 401 238 -809 -175 607 -579
3623 -579 -103 593 -276 -547 667 380 -1160 -325 729 -416 -462 763 -433 -750 475 421 -840 -150
3641 -150 566 -482 -93 686 -405 -324 642 43 -443 222 420 -404 -103 601 -27 -525 973 528 -741
3660g41R98L50j265P55N26r97J97R00k22j267J190m7r43O18Q46j090m01J651q64
3679A94r79J032J06r82R07L35r08J5J069k34j365J179K23j018M19Q02j222L7J291
3698I01o63q26Q82Q5j168R49M84j279K55J092p21n45J060M8j079J104J88j581
3716h14N85Q82p49o55J184m89p00J258K12j236J94N71j67n27R83n67m27P64L80
3735F82j489L75R42o87k78P11k57n36Q92j37j260O45J096j147n0R29o92m08P08
3754C9N91j542N94R02j016RJ016n96p09R45L63j265O68Q03j100R4Q98j075k18
3773e99J199l25q53P81N04j076K52P67r63j68R78k99r13P15O82j117M35M18p11
3792b93m03J250k45j129J176M99j045R9O15p84p6R85l69n99M35O48j232K07P29
$$ plain form
3660 -741 257 607 -658 97 623 -374 -177 723 501 -766 424 377 -566 52 898 -192 -593 1058 194
3679 194 -785 247 353 -629 278 613 -295 -280 789 555 -810 369 592 -426 -7 795 -427 -390 901
3698 901 238 -588 294 379 -789 160 644 -635 -380 712 -9 -554 506 554 -525 579 767 -814
3716 -814 -229 653 -96 -751 433 -56 -756 502 714 -522 -328 243 76 -451 532 -35 -462 302 682
3735 682 -807 -432 510 -177 -455 256 -1 -537 355 218 -1042 -397 699 -448 -498 431 -261 -669 39
3754 39 630 -912 -318 584 -432 -423 593 -3 -712 233 596 -669 -1 802 -298 -204 694 -381 -599
3773 -599 600 275 -578 203 707 -369 -117 650 -313 -481 497 198 -715 0 682 -435 0 418 -293
3792 -293 -696 554 309 -820 356 855 -190 -91 524 -260 -336 649 280 -319 116 764 -468 -261 468
3811D68o15j85Q15k00q38J038n4j146N65R29j280K28J000n00n67O87Ro57M19K16
3831C32p87k7J241o23n12O69l3r14N63O40j043K3R12m82m12N33o9m72M19M56j141
3852g27L41P30n27m10P77K82r78Q58J57j121M39J020p97n54Q44l47p10J068k31
3871A14o55J62R76q14n17J094l82p79J044R3j240M42J211j108k3M78k6o99Q65
3890B36J80q86M27O14q04l88Q53l29j54R58k63j171O51O00q16J19M59k67m83J029
3910E65j70j246R60M80r24J77Q35r84Q3P93k37o97K42Q11q99J1J011j333J21J182
3930G81m34r70J034K42j064O17K31m91m29J090l63p68O03L29p26J05N65n35m51
3949f34J199n37m61M81K61q04Q70L23j036k63J004l63o56Q70K50r00M45N55r42
$$ plain form
3811 468 -147 -332 483 283 -555 483 429 -717 -152 777 -503 -275 725 225 -342 345 354 -303 116 332
3831 332 -455 -482 759 136 -376 293 260 -654 -91 549 -494 -471 441 -41 -453 80 11 -461 -42 414 -727
3852 -727 -386 344 -183 -593 184 466 -512 346 503 -618 -179 841 44 -510 334 -13 -723 345 114
3871 114 -541 -379 597 -217 -734 360 -22 -801 243 336 -904 -462 749 -359 -382 96 70 -629 236
3890 236 416 -470 -43 571 -233 -621 232 -97 -251 707 444 -727 -76 524 -292 -173 286 19 -464 565
3910 565 395 -851 109 589 -335 -158 677 -307 -224 569 332 -365 -123 688 -211 -200 811 -522 -401 781
3930 781 347 -623 411 653 -411 206 437 -54 -483 607 244 -524 79 408 -318 -213 352 -183 -634
3949 -634 565 28 -433 48 309 -495 375 698 -338 -601 403 40 -616 254 504 -396 49 604 -338
3968c38K5R01o96m54R04Q2r55J89Q94q80l2J034p41n68J117j75r76R75J62j128
3988f60L03J101j051j39O09K0n00M42M48j201K05J063p99k02M11j75j18J77N08
4007D42j135K68J050o24l61O78j10o59N87J32n79l1R97r09l0P00m08m33N06K75
4027C56o94L00N25o96j19Q85p08l17N32M61r30L09O04j051K88M24n0p62R97j2
4047C42o39O40J53o44J99N74p50k85P03J78r22L49N48p00r0O04l19l10Q43k27
4067B47k65K87K85p75JP25n99k63Q35q1q02M48N95j170O32K06m68j20P43m41o16
4088e96P00M63r58N63N1n20q3R23n05k77N29J4n80L73M82q21J55L67j49m44O10
4109B97j98n41L05M37n36p7Q57l62j101J229j21o58N01K03m52o3P27l57l54N49
$$ plain form
3968 -338 -313 588 -108 -562 342 424 -531 -342 552 -328 -360 674 -67 -635 482 307 -669 306 468 -660
3988 -660 -357 744 -307 -446 163 183 -317 125 573 -628 -423 640 -159 -361 50 -125 -243 -66 442
4007 442 -693 -425 625 1 -360 318 208 -451 136 268 -311 -342 655 -254 -284 416 8 -425 81 356
4027 356 -338 -38 487 -209 -328 557 -151 -468 64 525 -405 -96 508 -543 -255 169 119 -643 354 342
4047 342 -297 343 496 -148 51 625 -125 -410 293 471 -451 -102 446 -254 -344 260 -59 -369 474 247
4067 247 -18 269 554 -221 -220 505 -94 -357 478 397 -405 43 638 -532 100 306 -162 -282 461 20 -596
4088 -596 104 567 -391 172 223 -297 -380 543 38 -239 290 304 -276 97 579 -242 -87 280 131 -313 297
4109 297 99 -442 -137 300 -236 -313 544 182 -919 310 189 -469 32 235 -217 -280 447 90 -264 285
4129B85o8q97Q16M6o78L14Q15p55m65P16L29o76K33L36r77J71P59m65l31R91n43
4150d4l68N79J52p87J65O00o70j86O54k29l32N35J38n60J60N35l86n19Q44j04
4170A77o67J056n0j033O11K47o44L88J71j44n99P23j2n20L36M61o82Q2P16p83
4190a66j91N31k8m06N00L57r18O3Q07m62k82P52m06l76L04J21j66p9N96p89KP76
4212E40l15r04P50L9l96K89L15o14o2R49k97q10N92K56o20N8P83o74k77O44q4
4233A62l99J75P52j076N42R5l38R2K70j90o77Q51r0l76K50J34l14j74N47k32k66
4254b62K81J38n74M96P2k46j80M57k46l20R62m4r30L91J05p06J96R01o66j11K86
4275@J41p81P58M06q76K90P5j0l83M31Q5o12M36R8n0K31K95q68j0P11m92k86O39
$$ plain form
4129 285 217 -680 136 182 -496 -182 633 -122 -587 129 458 -218 15 351 -626 -455 304 -161 -492 499 -44
4150 -44 -412 167 319 -468 -303 297 -373 -559 95 -134 -466 69 207 -353 -193 342 -44 -563 281 177
4170 177 -490 566 516 -517 94 341 -303 85 256 112 -487 236 224 -296 40 501 -181 -99 617 -166
4190 -166 -357 174 146 -260 240 597 -321 -258 549 87 -195 557 151 -225 79 200 34 -45 551 -238 -236 540
4212 540 225 -679 71 110 -286 3 318 -296 -358 591 294 -516 76 332 -288 -230 553 -121 -398 246 162
4233 162 -237 -62 690 -386 156 251 -87 5 275 85 -592 259 169 -207 43 177 -137 -311 236 4 -262
4254 -262 19 157 -417 79 151 -95 -275 182 -64 -384 578 534 -396 -5 100 -606 -410 491 -175 -286 0
4275 0 141 -640 118 524 -352 -62 13 3 -380 51 136 -476 -40 58 8 239 534 -334 -344 367 -125 -411 228
4298B28J40q25N04L37l68k12L81J33p75P51k6o14M03M24o59j46P00j58m29P29
4318E18l06m21M7N20m80J21Q0j43k92L54P3n19L90O35p40o2M81n39M44J93J12
4339D66r84P08P5l54o2Q11q60j37O05j32m50L18M60q29L92K76l50j83M66k08m27
4360c99K23L87n46K52K22k08k4N78n16k41M21L24q36J0O10j82k2N9J43n60K14
4381i1j5j98J56L98l66k09M35J79o45L03J58m91K79M30n19J66N37l59l13L37K13
4402C85r31P46K3j44q1M52p32R8N34q6o56M69J23l13L08K86n51p14J073k63k60
4423b34K43M13p81K78N28n54k62O18j55l12L16K05l60J21L29n04o8K96r8j28L97
4444B88k63k08J78L30k01o67J099n46k18O59k48n56L44N02q80K17K54n2k22M65
$$ plain form
4298 228 368 -457 47 384 16 -196 185 318 -457 294 268 -346 57 481 -178 -324 376 218 -211 518
4318 518 212 -209 -162 358 -122 -1 79 -64 -356 -2 71 -448 -58 577 -163 -225 256 -283 161 354 466
4339 466 -518 190 265 -89 -151 660 -200 -337 268 136 -314 4 464 -365 27 303 -47 -230 236 28 -399
4360 -399 -176 211 -335 -83 139 -69 -93 485 -31 -272 149 473 -363 -353 257 75 53 112 255 -305 -91
4381 -91 -106 -304 -148 250 -116 -325 110 289 -356 -53 105 -386 -107 323 -196 -30 507 148 -165 172 385
4402 385 -546 200 223 79 -2 450 -282 -184 350 264 -392 77 200 -113 195 481 -70 -784 289 26 -234
4423 -234 9 422 -359 -81 447 -107 -369 249 94 -218 98 303 -57 64 393 -111 -179 117 19 -109 288
4444 288 25 -183 -5 325 124 -543 556 10 -208 451 203 -353 -9 493 -387 -170 84 32 -190 275
4464B75J38o79K55M47o20j6K87Ll08J77P5j76R6L69n25j41N42k15l23N61N8p87
4486e07L77K50k65R2P8j02J52l6k28l86O10J74o72L22M06j84o42O28K06q19M36
4507a10L45n96L27N04p67j26O40j26k21L13l0m01L49O2K06n34N13k40n21N22P7
4528A86o89O73J09n77M9J22J05O7J4K91p73M41K71n47J72M69r7m94N33l43l18
4549c36M41j82p3N0N31j71m79L17l2m0R6K62n81J34K50j83m33O18K6l40J41N08
4571E24o48jM19j93j23K73j43n95N62N9k75K66J90n88O0N63J38o50K83K08m68
4592a39L9O58o15j04M78l95m85P63n2k83j3M78o56K65R0l28k03P87j94j40J89
4613A40j01m0j44N45m11l37M24K01o33L68J95l90jK91l10J84J63k51k4J89K20
$$ plain form
4464 275 413 -266 -11 436 -184 -200 87 90 -218 -41 34 -142 -46 323 -202 -343 199 -16 -339 222 280 -507
4486 -507 -130 120 -145 -53 25 -77 75 39 -189 -575 35 209 -463 -141 265 81 -561 67 273 -546 -110
4507 -110 235 -361 -34 470 -297 -423 217 91 -130 183 153 -248 101 163 369 -165 348 108 -413 109 186
4528 186 -503 170 279 -298 -249 -127 -22 45 59 350 -423 18 289 -258 -86 383 286 -208 325 -18 -336
4549 -336 105 -77 -150 -100 431 260 -219 98 66 26 122 384 -197 -63 187 4 -429 189 215 -125 16 524
4571 524 -124 -125 294 101 -22 251 108 -487 75 134 -141 125 315 -273 -213 350 488 -162 121 329 -139
4592 -139 -100 558 -57 -161 317 -78 -563 200 148 -135 -148 330 -326 -61 29 -299 -502 285 91 -49 140
4613 140 39 -1 -145 400 -11 -348 76 277 -356 12 207 -183 -184 107 -203 -19 144 -107 -131 58 278
4634B78k69p0p3NL5K15j52j62N11j36k96p9M92p02M09M19l16n38N56o1r9J6O7
4657E0m34M03K08m2j53J77J40q51P10M5j55k01J86l94J2L63j70k4J55K10m87O19
4679C67k84j20j15O1jm2J96j25j41j63L98J26k70N00k82k30k4K07k22L39j83P6
4701F8l21N47j61j33K79k41j67J15J20l30L75j25O5k58K22R4m31L39M1n1j00J97
4723A44q8j87K30K49l69R5K42l71K91L10n66p1L49k79k80R6K61j78J39J71l11
4744a23M04j20j99M9n3J96j35j67O27m46k50L07Lk41M10k30l39K34J68p0o9j24
4766a68j00o6M98M5l87K16K39n21P6N12m41q3J93L47o39M5J64j56L99q0j22J32
4788A03J15j64l32L16K62k44l9k7L10m74M65q2l33j23K75k64ML67J65j85P0k87
$$ plain form
4634 278 9 -61 -134 -129 -94 121 -31 -193 318 182 -114 -193 299 -403 6 425 109 -429 127 66 -33 -17 50
4657 50 -384 19 227 185 32 209 349 -502 208 253 98 -103 83 -311 -299 64 -106 -130 25 235 -252 367
4679 367 83 -37 -152 -91 -92 -134 62 -63 -204 -367 31 157 -113 387 105 -125 -149 58 -164 175 -8 68
4701 68 -253 294 133 0 279 38 -129 -14 106 -224 151 26 91 -167 55 149 -282 57 98 47 -53 144
4723 144 56 -131 99 348 -21 74 316 -55 236 546 -20 -91 258 -21 -301 -205 56 -122 17 188 -123
4744 -123 281 161 -38 11 -42 154 19 -148 479 33 -217 90 93 -148 262 32 -307 -73 95 25 -44 -168
4766 -168 -268 -334 164 209 -178 38 277 -244 -168 344 -97 -180 13 360 -279 -234 -70 -226 173 93 -29 103
4788 103 218 54 -278 38 300 56 17 -10 300 -174 291 209 -124 -247 28 -236 -232 135 300 115 185 -102
4810a02l52N57j27j01k87M81O8k11K26j7j72J96k4j58J71q6lk42j47K89J27m3
4832D3J26n02M14K7Jj1n8K61p49M04J61K0j36J59j17j42K37L3p5L6R1n27Q9P86
4856E71n91j51J57J23l82Q6K96k2j02K11n16L55N8n4o9O7J0j7j43kj58N9N6J02
$$ plain form
4810 -102 -454 103 -24 -125 -412 69 137 -74 152 135 -37 159 135 -23 148 62 59 -183 -330 -41 86 43
4832 43 169 -333 81 108 109 98 40 301 -448 -44 117 137 1 160 43 -99 138 171 96 132 223 -304 -215 571
4856 571 -20 -171 -14 109 -273 -187 109 87 -15 196 -320 35 93 39 -30 37 47 30 -113 -115 -273 -214 -158 -56
$$ [...]
8191A08
##END NTUPLES=NMR FID
##END=
