##TITLE=1H_CA-8667-3
 CDCl3
 8 sc, 
 10.10.2024
##JCAMPDX= 6.0         $$ Bruker NMR JCAMP-DX V2.0
##DATA TYPE= NMR SPECTRUM
##DATA CLASS= NTUPLES
##ORIGIN= UXNMR, Bruker Analytische Messtechnik GmbH
##OWNER= root
$$ XWIN-NMR		Version 3.5
$$ Thu Oct 10 14:12:59 2024 Russian Standard Time (UT+4h)  she@DPX200
##.OBSERVE FREQUENCY= 200.1318
##.OBSERVE NUCLEUS= ^1H
##.ACQUISITION MODE= SIMULTANEOUS
##.ACQUISITION SCHEME= undefined
##.AVERAGES= 8
##.DIGITISER RES= 18
##SPECTROMETER/DATA SYSTEM= spect
##.PULSE SEQUENCE= zg30
##.SOLVENT NAME= D2O
##.SHIFT REFERENCE= (INTERNAL, D2O, 0, 20.9885)
##AUDIT TRAIL= $$ (NUMBER, WHEN, WHO, WHERE, WHAT)
$$ ##TITLE= Audit trail, XWIN-NMR		Version 3.5
$$ ##JCAMPDX= 5.01
$$ ##ORIGIN= Bruker BioSpin GmbH
$$ ##OWNER= she
$$ F:/spectra/data/she/nmr/H-F/1/pdata/1/auditp.txt
$$ ##AUDIT TRAIL=  $$ (NUMBER, WHEN, WHO, WHERE, WHAT)
(   1,<2024-10-10 14:11:09.29 +0400>,<she>,<DPX200>,
      <created by zg, POWCHK disabled, PULCHK disabled
       configuration hash MD5:
       00 E9 B6 7A A2 85 ED C7 34 08 36 98 17 FE 4E 26
       data hash MD5: 16K
       09 2B 36 AB 76 22 1F 98 84 02 86 23 B4 17 92 2D>)
(   2,<2024-10-10 14:11:32.67 +0400>,<she>,<DPX200>,
      <Start of raw data processing
       efp BC_mod = 2 LB = 0.24 FT_mod = 6 PKNL = 1 PHC0 = -26501.59 PHC1 = 13.98743 SI = 16K 
       data hash MD5: 16K
       58 60 15 B9 89 19 DA 02 47 6B F3 0D 8B 8A AC 7A>)
(   3,<2024-10-10 14:11:52.00 +0400>,<she>,<DPX200>,
      <pk PHC0 = 0.615774 PHC1 = -2.2 
       data hash MD5: 16K
       78 28 1A F7 B8 A1 69 23 CF C1 8F 48 4E 47 6D 84>)
(   4,<2024-10-10 14:11:55.62 +0400>,<she>,<DPX200>,
      <abs ABSG = 5 
       data hash MD5: 16K
       6C 63 16 66 FA F9 99 0C 54 EF 25 1B D1 F7 BA B9>)
(   5,<2024-10-10 14:12:27.50 +0400>,<she>,<DPX200>,
      <abs ABSG = 5 
       data hash MD5: 16K
       58 64 BC 01 3F 19 19 6C 60 D3 9A 40 E0 17 15 A1>)
$$ ##END=
$$ 
$$ hash MD5
$$ 77 6C A1 B2 F7 A1 24 C5 1D A3 29 3C 88 2F 8D 0B
##$RELAX= 
##$RELAX= 
##$RELAX= 
##$RELAX= 
##$RELAX= 
##$RELAX= 
$$ Bruker specific parameters
$$ --------------------------
##$DU= <F:/spectra>
##$EXPNO= 1
##$NAME= <H-F>
##$PROCNO= 1
##$TYPE= <nmr>
##$USER= <she>
##$AMP= (0..31)
100 100 100 100 100 100 100 100 100 100 100 100 100 100 100 100 100 100 
100 100 100 100 100 100 100 100 100 100 100 100 100 100 
##$AQSEQ= 0
##$AQ_mod= 1
##$AUNM= <au_zg>
##$AUTOPOS= <>
##$BF1= 200.13
##$BF2= 200.13
##$BF3= 200.13
##$BF4= 200.13
##$BF5= 200.13
##$BF6= 200.13
##$BF7= 200.13
##$BF8= 200.13
##$BYTORDA= 1
##$CFDGTYP= 0
##$CFRGTYP= 5
##$CHEMSTR= <none>
##$CNST= (0..31)
1 1 145 1 1 1 1 1 1 1 1 1 1 1 1 1 1 1 1 1 1 1 1 1 1 1 1 1 1 1 1 1 
##$CPDPRG= <>
##$CPDPRG1= <>
##$CPDPRG2= <>
##$CPDPRG3= <>
##$CPDPRG4= <mlev>
##$CPDPRG5= <mlev>
##$CPDPRG6= <mlev>
##$CPDPRG7= <mlev>
##$CPDPRG8= <mlev>
##$CPDPRGB= <>
##$CPDPRGT= <>
##$D= (0..31)
0 1.2 0 0 0 0 0 0 0 0.06 0 0.03 0 0 0 0 0.0002 0 0 0 0 0 0 0 0 0 0 0 0 
0 0 0 
##$DATE= 1728555068
##$DBL= (0..7)
$$ [...]
##$SUBNAM3= <"">
##$SUBNAM4= <"">
##$SUBNAM5= <"">
##$SUBNAM6= <"">
##$SUBNAM7= <"">
##$SUBNAM8= <"">
##$SUBNAM9= <"">
##$SW= 24.0689170037331
##$SWIBOX= (0..15)
0 0 2 0 0 0 0 0 0 0 0 0 0 0 0 0 
##$SW_h= 4816.95568400771
##$TD= 16384
##$TD0= 1
##$TE= 0
##$TE2= 300
##$TE3= 300
##$TEG= 300
##$TL= (0..7)
0 120 120 120 120 120 120 120 
##$TP= (0..7)
150 150 150 150 150 150 150 150 
##$TP07= 0
##$TPNAME0= <>
##$TPNAME1= <>
##$TPNAME2= <>
##$TPNAME3= <>
##$TPNAME4= <>
##$TPNAME5= <>
##$TPNAME6= <>
##$TPNAME7= <>
##$TPOAL= (0..7)
0.5 0.5 0.5 0.5 0.5 0.5 0.5 0.5 
##$TPOFFS= (0..7)
0 0 0 0 0 0 0 0 
##$TUNHIN= 0
##$TUNHOUT= 0
##$TUNXOUT= 0
##$USERA1= <user>
##$USERA2= <user>
##$USERA3= <user>
##$USERA4= <user>
##$USERA5= <user>
##$V9= 5
##$VALIST= <valist>
##$VCLIST= <CCCCCCCCCCCCCCC>
##$VD= 0
##$VDLIST= <DDDDDDDDDDDDDDD>
##$VPLIST= <PPPPPPPPPPPPPPP>
##$VTLIST= <TTTTTTTTTTTTTTT>
##$WBST= 1024
##$WBSW= 4
##$XGAIN= (0..3)
0 0 0 0 
##$XL= 0
##$YL= 0
##$YMAX_a= 25787
##$YMIN_a= -44898
##$ZGOPTNS= <>
##$ZL1= 120
##$ZL2= 120
##$ZL3= 120
##$ZL4= 120
##$ABSF1= 20.98851
##$ABSF2= -3.080622
##$ABSG= 5
##$ABSL= 3
##$ALPHA= 0
##$AQORDER= 0
##$ASSFAC= 0
##$ASSFACI= 0
##$ASSFACX= 0
##$ASSWID= 0
##$AUNMP= <proc_1d>
##$AZFE= 0.1
##$AZFW= 0.1
##$BCFW= 0
##$BC_mod= 2
##$BYTORDP= 0
##$COROFFS= 0
##$CY= -3
##$DATMOD= 1
##$DC= 0
##$DFILT= <>
##$DTYPP= 0
##$F1P= 0
##$F2P= 0
##$FCOR= 1
##$FTSIZE= 16384
##$FT_mod= 6
##$GAMMA= 0
##$GB= 0
##$INTBC= 1
##$INTSCL= 3.70164e-10
##$ISEN= 128
##$LB= 0.24
##$LEV0= 0
##$LPBIN= 0
##$MAXI= 10000
##$MC2= 0
##$MEAN= 0
##$ME_mod= 0
##$MI= 1.114404
##$NCOEF= 0
##$NC_proc= -9
##$NLEV= 6
##$NOISF1= 3.799351
##$NOISF2= 2.8
##$NSP= 0
##$NTH_PI= 0
##$NZP= 0
##$OFFSET= 20.98851
##$PC= 1
##$PHC0= -26500.97
##$PHC1= 11.78743
##$PH_mod= 1
##$PKNL= yes
##$PPARMOD= 0
##$PSCAL= 0
##$PSIGN= 0
##$REVERSE= no
##$SF= 200.130008046952
##$SI= 16384
##$SIGF1= 3
##$SIGF2= 2
##$SINO= 5.538805
##$SIOLD= 16384
##$SREGLST= <1H.CDCl3>
##$SSB= 0
##$STSI= 16384
##$STSR= 0
##$SW_p= 4816.95568400771
##$SYMM= 0
##$S_DEV= 0
##$TDeff= 16384
##$TDoff= 0
##$TI= <>
##$TILT= no
##$TM1= 0
##$TM2= 0
##$TOPLEV= 0
##$USERP1= <user>
##$USERP2= <user>
##$USERP3= <user>
##$USERP4= <user>
##$USERP5= <user>
##$WDW= 1
##$XDIM= 16384
##$YMAX_p= 309422407
##$YMIN_p= -2206599
$$ End of Bruker specific parameters
$$ ---------------------------------
##NTUPLES= NMR SPECTRUM
##VAR_NAME=  FREQUENCY,     SPECTRUM/REAL,   SPECTRUM/IMAG
##SYMBOL=    X,             R,               I
##VAR_TYPE=  INDEPENDENT,   DEPENDENT,       DEPENDENT
##VAR_FORM=  AFFN,          ASDF,            ASDF
##VAR_DIM=   16384,         16384,           16384
##UNITS=     HZ,            ARBITRARY UNITS, ARBITRARY UNITS
##FACTOR=    0.29402158847633, 1,            1
##FIRST=     4200.43070157786, 0,            0
##LAST=      -616.52498242985, 0,            0
##MIN=       -616.52498242985, -2206599,     0
##MAX=       4200.43070157786, 309422407,    0
$$ Real data points
##PAGE= N=1
##DATA TABLE= (X++(R..R)), XYDATA
$$ [...]
6759D6651254k70610K27788m3604R85510J036781k81009j055856k602564k865896
$$ 46651254 46380644 46608432 46564828 47550338 48587119 48306110 47250254 44647690 41781794
6750D1781794k963425k157468k220362j516074l58330p79803l78994l56593L72554
$$ 41781794 38818369 36660901 34440539 32924465 32566135 31786332 31407338 31050745 31423299
6741C1423299L03155J52465L73163J299817J770746J731925K179464J966381L006925
$$ 31423299 31726454 31878919 32252082 33551899 35322645 37054570 39234034 41200415 44207340
6732D4207340L025610K441237J013418k81922l40244o88658k14160J55973K53457
$$ 44207340 47232950 49674187 50687605 50405683 50065439 49376781 49162621 49318594 49572051
6723D9572051n64850k206379l257315l505134l968310l318516k454972k235099
$$ 49572051 49007201 46800822 43543507 40038373 36070063 32751547 30296575 28061476
6715B8061476j074779j783449r50939j043643j190437r20752r69392r47656p53799
$$ 28061476 26986697 25203248 24252309 23208666 22018229 21097477 20128085 19180429 18426630
6706A8426630n35121n17675l38845j41923n23103o69176j74116l55331k14550
$$ 18426630 17891509 17373834 17034989 16893066 16369963 15700787 15526671 15171340 14956790
6697A4956790Q4811p42964m21729j21509K06586J34926n77409o9665j65478M556
$$ 14956790 15041601 14298637 13876908 13755399 13961985 14096911 13519502 13449837 13284359 13288915
6687A3288915k33275m04057k55316m18123k14097k2316n1269k66321k4557m1670
$$ 13288915 13055640 12651583 12396267 11978144 11764047 11741731 11690462 11424141 11399584 11357914
6677A1357914l93751M41685j58o36824q978N7817q9851j21092k44729L11541L55880
$$ 11357914 10964163 11405848 11405690 10768866 10759888 10817705 10727854 10606762 10362033 10673574 11029454
6666A1029454n0101L12887k30319K80942k74908L54253L96812J53165L08190J52951
$$ 11029454 10979353 11292240 11061921 11342863 11067955 11422208 11819020 11972185 12280375 12433326
6656A2433326N52060K89175O09644J66480p1017O61526N34108M93153P67983R08737
$$ 12433326 12985386 13274561 13884205 14050685 13979668 14641194 15175302 15668455 16436438 17345175
6646A7345175R97442J465072J173140J609215J682287J627938N22717Q841n3564
$$ 17345175 18342617 19807689 20980829 22590044 24272331 25900269 26422986 26431827 26378263
6637B6378263l62933O75798p5072K57873k30675p18914p16639o75237j466338
$$ 26378263 26015330 26691128 26616056 26873929 26643254 25924340 25207701 24532464 23066126
6628B3066126j128000p36518l14781J98184O6566m4790R1930j55649N32578N21739
$$ 23066126 21938126 21201608 20886827 21085011 21151577 21106787 21198717 21043068 21575646 22097385
6618B2097385Q4670P08654J448041R26882Q77174J321936J334100J972125K294276
$$ 22097385 22182055 22890709 24338750 25265632 26142806 27464742 28798842 30770967 33065243
6609C3065243K845719J804703J650371J413213R18043R73509M01715O78958j56795
$$ 33065243 35910962 37715665 39366036 40779249 41697292 42670801 43072516 43751474 43594679
6600D3594679p93813j174581j645538j692006j325437j787290j851923j871421
$$ 43594679 42800866 41626285 39980747 38288741 36963304 35176014 33324091 31452670
6592C1452670k098594j866033j495135j168454j410295j184372k06000m76007
$$ 31452670 29354076 27488043 25992908 24824454 23414159 22229787 22023787 21547780
6584B1547780l54847n54805m4216n0091j82825j54349J73686P11300L41619O41068
$$ 21547780 21192933 20638128 20593912 20543821 20360996 20206647 20380333 21091633 21433252 22074320
6574B2074320J402079R68757J164941J035621J19669L15993o66295j108451m46221
$$ 22074320 23476399 24445156 25610097 26645718 26765387 27081380 26415085 25306634 24860413
6565B4860413l93461k84850m49279j029221j375535j821305j659813r77381j503609
$$ 24860413 24466952 24182102 23732823 22703602 21328067 19506762 17846949 16869568 15365959
6556A5365959j299133j099142n22869p53449n83154n95250l64865n62557n63900
$$ 15365959 14066826 12967684 12444815 11691366 11108212 10512962 10148097 9585540 9021640
6547I021640O6988k39335l70559o11838j31759m68107q8478o07503l86392m18586
$$ 9021640 9088628 8849293 8478734 7866896 7735137 7267030 7178552 6571049 6184657 5766071
6537E766071J85038m76582j26903R4419j10549k61139l29715J88674L5701k69026
$$ 5766071 5951109 5474527 5347624 5442043 5331494 5070355 4740640 4929314 4965015 4695989
6527D695989l19162r4107K908l43675R0425k55821j92008m1048p9443j73254L00731
$$ 4695989 4376827 4282720 4285628 3941953 4032378 3776557 3584549 3543501 3464058 3290804 3591535
6516C591535j48659r8338n37439m85087K30723K99990K8177l95276m7114J11847
$$ 3591535 3442876 3344538 2807099 2322012 2552735 2852725 2880902 2485626 2438512 2550359
6506B550359k13640L46602m4181l40017M9207j11096p3042o6338J1315k51282
$$ 2550359 2336719 2683321 2639140 2299123 2348330 2237234 2164192 2097854 2109169 1857887
6496A857887K30911M1334n6623J90882j62510j69900n301j25920J84521q4062
$$ 1857887 2088798 2130132 2073509 2264391 2101881 1931981 1926680 1800760 1985281 1901219
6486A901219M9083M8870j07677l93155L60297J37951m53672n2787J70232m98838
$$ 1901219 1950302 1999172 1891495 1498340 1858637 1996588 1542916 1490129 1660361 1161523
6476A161523Q7838K99365O9554j23360R7831J89322j23874M024M5530J22587j40786
$$ 1161523 1249361 1548726 1618280 1494920 1592751 1782073 1658199 1662223 1707753 1830340 1689554
6465A689554l77258L58761L19436l47663m06432J54071p3273j86398O2275N38127
$$ 1689554 1312296 1671057 1990493 1642830 1236398 1390469 1317196 1130798 1193073 1731200
6455A731200J24663l46690P4986m31523L820p6247R1578K37648k48870P0671O9946
$$ 1731200 1855863 1509173 1584159 1152636 1156456 1080209 1171787 1409435 1160565 1231236 1301182
6444A301182l28647J73334n24929J00215j04922j31274M71582L9456J13359k24977
$$ 1301182 972535 1145869 620940 721155 616233 484959 956541 995997 1109356 884379
6434H84379k656J2227q7170J04252n2220l25699K15183P6501r9463j06444N46591
$$ 884379 881723 893950 806780 911032 858812 533113 748296 824797 725334 618890 1165481
6423A165481l81538k19744k52067P3597J68313n9299k08718j86277L44726j79254
$$ 1165481 783943 564199 312132 385729 554042 494743 286025 99748 444474 265220
6413B65220j4378M30435k18168k77666M38529p1084k40632L38676Q2673n18589
$$ 265220 250842 681277 463109 185443 623972 552888 312256 650932 733605 215016
6403B15016k69829J53407M79437j20364r5659q7338k14292O3354J34128j42878
$$ 215016 -54813 98594 578031 457667 362008 274670 60378 123732 257860 114982
6393A14982q5990L20365l49043J3474M24603j3780p1299L45546p8729k91660J01126
$$ 114982 28992 349357 314 13788 438391 424611 353312 698858 620129 328469 429595
6382D29595k44736K0289r341q1440R5020J25739j55293K11616l94772N6679j49692
$$ 429595 184859 205148 195807 114367 209387 335126 179833 391449 -3323 53356 -96336
6371i6336M21240K39947j28120l98384Q6590K50679L68644k75108n89469K75912
$$ -96336 324904 564851 436731 38347 124937 375616 744260 469152 -120317 155595
6361A55595L13269j66695l564K4357j80916k295j02393r5009K42644l11473M10056
$$ 155595 468864 302169 298605 322962 142046 139751 37358 -57651 184993 -126480 283576
6350B83576R4374k11406J12541j4756M9929k71315M8606K11082j22539J92954
$$ 283576 377950 166544 279085 264329 314258 42943 91549 302631 180092 373046
6340C73046J58508j97399J20462j39680J33298J30309l03481j33388m6600k58222
$$ 373046 531554 334155 454617 314937 448235 578544 275063 141675 95075 -163147
6330a63147M67631k17382J06678j20419K14058j29887k19602j49867L59427J30386
$$ -163147 304484 87102 193780 73361 287419 157532 -62070 -211937 147490 277876
6320B77876J37099K14014l01133r4538j95473l5256l9135M1804m2532J32202j04027
$$ 277876 414975 628989 327856 233318 37845 2589 -36546 5258 -37274 94928 -9099
6309i099J1808J60176j66699K03843J9756k6844k28417L21945l65015K40548l26224
$$ -9099 2709 162885 -3814 200029 219785 192941 -35476 286469 -78546 162002 -164222
6298a64222j08350L21443k44832J9336J54768j21469Q9076L5646k32040L1660
$$ -164222 -272572 48871 -195961 -176625 -21857 -143326 -54250 -18604 -250644 -218984
6288b18984M56854o0109j00630J67709p8511j11697l27496L7195k3078M7852J82987
$$ -218984 237870 177761 77131 244840 166329 54632 -272864 -235669 -258747 -210895 -27908
6277b7908Q9832l17033J64097J8356k17216Q1265J95922N9084N0955N5781j75484
$$ -27908 61924 -255109 -91012 -72656 -289872 -208607 -12685 46399 97354 153135 -22349
6266b2349j84168K72379j21349N9428R9191q4573p3234K5170J97534q7022J3162
$$ -22349 -206517 65862 -55487 3941 103132 18559 -54675 -29505 168029 81007 94169
6255I4169j68024K18730j89549k3041M57319m03422j16427P1720l26577K9493
$$ 94169 -73855 144875 -44674 -67715 389604 -13818 -130245 -58525 -385102 -355609
6245c55609K51568j69241J05239J12448P2280l33219L494K76904N8512r9141J61245
$$ -355609 -104041 -273282 -168043 -55595 16685 -316534 -313040 -36136 22376 -76765 84480
6234H4480o5723k68714m02928J05602N27051J26374m75422N7860L43464l60866
$$ 84480 18757 -249957 -652885 -547283 -20232 106142 -369280 -311420 32044 -328822
6224c28822K83981l63823K1908L15884j52891l07369m14409O25035K32480K89284
$$ -328822 -44841 -408664 -386756 -70872 -223763 -531132 -945541 -320506 -88026 201258
6214B01258m62584J10720J07868n58129M14857K9365K45379J09031j72949J08074
$$ 201258 -261326 -150606 -42738 -600867 -186010 -156645 88734 197765 24816 132890
6204A32890j39615J36246k41847P0358j90588k21963K18040K21718j89153K84293
$$ 132890 -6725 129521 -112326 -41968 -232556 -454519 -236479 -14761 -203914 80379
6194H0379L0424k34856j65557Q5182k9872p8838K54499j60556n32214R1877O26820
$$ 80379 110803 -124053 -289610 -204428 -234300 -313138 -58639 -219195 -751409 -659532 -32712
6183c2712m18691r7457L95744k33049k66291K44173L10075k9532l63323N01191
$$ -32712 -451403 -548860 -153116 -386165 -652456 -408283 -98208 -127740 -491063 10128
6173A0128m56739j71740N91254J40923j76766j02407K8460P9608J38370q496j95219
$$ 10128 -446611 -618351 -27097 113826 -62940 -165347 -136887 -57279 81091 72595 -122624
6162a22624P9003k15827J84775Q3422k60629L32999j3582J26127j91841k22164
$$ -122624 -43621 -259448 -74673 8749 -251880 81119 67537 193664 1823 -220341
6152b20341j8769P502N13846j98195P3428k49405k41418J73488j24649k14435
$$ -220341 -239110 -231608 282238 84043 157471 -91934 -333352 -159864 -284513 -498948
6142d98948L88088M78722j76308m62715l64871J19724K76528J73234q8723J54843
$$ -498948 -110860 367862 191554 -271161 -636032 -516308 -239780 -66546 -155269 -426
6132d26Q1677j60250J85594k38855l68506J80049M42452O7334k99476j70154J66499
$$ -426 81251 -78999 106595 -132260 -500766 -320717 121735 189069 -110407 -280561 -114062
6121a14062J84328M8612o6472m36351L61943J10101k35151L253J10928k36459
$$ -114062 70266 118878 52406 -383945 -22002 88099 -147052 -143799 -32871 -269330
6111b69330J16882j25824M5735K54823n02383J20901J04941n19538J0082J86006
$$ -269330 -152448 -278272 -232537 22286 -480097 -359196 -254255 -773793 -763711 -577705
6101e77705K30497K12671K11269j76573m94006K65743K37176j72372K09381P3513
$$ -577705 -347208 -134537 76732 -99841 -593847 -328104 -90928 -263300 -53919 19594
6091A9594j36613J66728j04539n40376J49641j70961k67919K33861M74113J67614
$$ 19594 -117019 49709 -54830 -595206 -445565 -616526 -884445 -650584 -176471 -8857
6081h857L05834k52471O136k77036J9884L5968j23016K69350m90319K48061l531
$$ -8857 296977 44506 50642 -226394 -206510 -170542 -293558 -24208 -514527 -266466 -269997
6070b69997J25283k8380j95237J30789o132L3289R3906m12214J60671j18332K81493
$$ -269997 -144714 -173094 -368331 -237542 -243674 -210385 -116479 -528693 -368022 -486354 -204861
6059b04861J88668L7293k50623J0686j73094O3184K18922K39892n13595j08224
$$ -204861 -16193 21100 -229523 -218837 -391931 -328747 -109825 130067 -383528 -491752
6049d91752L57094n2127J93664k60118J62127O938R5883l17985Q0178R0430K75305
$$ -491752 -134658 -186785 6879 -253239 -91112 -84174 11709 -306276 -226098 -135668 139637
6038A39637j27798n63977L16972K578J79645N9073k49287j77309J06572Q8506
$$ 139637 11839 -552138 -235166 -232588 -52943 6130 -243157 -420466 -313894 -225388
6028b25388r461j38541l271K27760L13282r6278k32097J48232l35439K58674j78542
$$ -225388 -234849 -373390 -376661 -148901 164381 68103 -163994 -15762 -351201 -92527 -271069
6017b71069m11732M01525Q0791K31389J53767j70374l34384j79593L30222K28165
$$ -271069 -682801 -281276 -200485 30904 184671 14297 -320087 -499680 -169458 58707
6007E8707L25198o86277J74361J39035l24725L30735j395L0780l36843j56901
$$ 58707 383905 -302372 -128011 11024 -313701 17034 15639 46419 -290424 -447325
5997d47325n0445k4298L51476k99668K40952j33329P0809J75124j51534r9331
$$ -447325 -497770 -522068 -170592 -470260 -229308 -362637 -291828 -116704 -268238 -367569
5987c67569J33458n7596j69258L3760M01836j64110k74631N03675j81214p0955
$$ -367569 -234111 -291707 -460965 -427205 -25369 -189479 -464110 39565 -141649 -212604
5977b12604K94951J82470j09554j9531j69950k61618q9473K19126n8849P71854
$$ -212604 82347 264817 155263 135732 -34218 -295836 -385309 -166183 -225032 546822
5967E46822k66433l59228J33563q2132p41388n4696M37312k18180L59276L033
$$ 546822 280389 -78839 54724 -27408 -768796 -823492 -386180 -604360 -245084 -242051
5957b42051o3645J07993N506p3646j91924j45177J83938N70316r1036o4156p38119
$$ -242051 -305696 -197703 -192197 -265843 -457767 -602944 -419006 151310 60274 -3882 -742001
5946g42001M86009M06072l2929O9766k54675l8742k09133K91096n1662p6184L41538
$$ -742001 -255992 150080 117151 186917 -67758 -106500 -315633 -24537 -76199 -152383 189155
5935A89155j12035j30356K92419j32498l69722n1712M55361J12230k20388k15339
$$ 189155 77120 -53236 239183 106685 -263037 -314749 140612 252842 32454 -182885
5925a82885j17760N1871J12121l9498j07745J14726M56623j00957n49924K84912
$$ -182885 -300645 -248774 -136653 -176151 -283896 -169170 287453 186496 -363428 -78516
5915g8516k17276k78555j58570N23957L02563m07855K15407o1109l5240K5490
$$ -78516 -295792 -574347 -732917 -208960 93603 -314252 -98845 -159954 -195194 -169704
5905a69704l5849J27029K28969k7960K21458n28337l46953L86775R4984L7766
$$ -169704 -205553 -78524 150445 122485 343943 -184394 -531347 -144572 -49588 -11822
5895a1822k96675j47295M19546J727J42879j08984J56797J25877j95801J85092
$$ -11822 -308497 -455792 -36246 -34519 108360 -624 156173 282050 86249 271341
5885B71341m77097j25837L65921j56823j86861J54831J55934j28565k21329j55182
$$ 271341 -205756 -331593 34328 -122495 -309356 -154525 1409 -127156 -348485 -503667
5875e03667M0794N5496K42226j97051N14665l89432J23584K44895j88819j83751
$$ -503667 -462873 -407377 -165151 -362202 152463 -236969 -113385 131510 -57309 -241060
5865b41060K27653j6185K98276k65560j91608L38966l34477K07402j22393k41733
$$ -241060 -13407 -29592 268684 3124 -188484 150482 -183995 23407 -98986 -340719
5855c40719J92347J80877q4018m2239J12212m3402L08392m89656O0879J66391
$$ -340719 -148372 32505 -51513 -93752 18460 -24942 283450 -206206 -145327 21064
5845B1064j00071o371K43205l99215o1346J43480J21927j7616N8544J95744r5819
$$ 21064 -79007 -85378 157827 -241388 -302734 -159254 -37327 -54943 3601 199345 103526
5834A03526j21141n7800j76970p756J05407K88717R2482k14672L32580k80757
$$ 103526 -17615 -75415 -252385 -260141 -154734 133983 226465 11793 344373 63616
5824F3616K44595P2542J24496k63812k00680L42285J89950l02867K93377N1798
$$ 63616 308211 380753 505249 241437 40757 383042 572992 270125 563502 615300
5814F15300p3374J76279l19085k21765j02422O1389L66534j91373Q0828m31523
$$ 615300 541926 718205 399120 177355 74933 136322 502856 311483 392311 -39212
5804c9212m6029j47044J78488Q3602k49747L74733r8244K30875J70590r9912k9331
$$ -39212 -85241 -232285 -53797 29805 -219942 154791 56547 287422 458012 358100 328769
5793C28769j56197n9680L65186M1811k98528M2119l78291j2471j78187J32846
$$ 328769 172572 112892 478078 519889 221361 263480 -114811 -127282 -305469 -172623
5783a72623K41598M6739J8930J31431j11796N3095l73156J04944j7169L67377
$$ -172623 68975 115714 134644 266075 154279 207374 -165782 -60838 -78007 289370
5773B89370j1147M1362n86399L83761L86489j45776m85491m24723J55443L84153
$$ 289370 278223 319585 -266814 116947 503436 357660 -127831 -552554 -397111 -12958
5763a2958P1747L21897k81843n7528M0476J1494l6989j50969M28809J55516K7792
$$ -12958 58789 380686 98843 41315 81791 93285 56296 -94673 334136 489652 517444
5752E17444k07201m44732n2220K08387L02390k30769l71604K60618k6797L0926
$$ 517444 310243 -134489 -186709 21678 324068 93299 -278305 -17687 -44484 -13558
5742a3558N16874m58008j54797K89079j61549J41191m05072L988P6843J89876
$$ -13558 503316 45308 -109489 179590 18041 159232 -245840 -241852 -165009 24867
5732B4867r5060K06826n1369K64382j59353l97533Q1832J67607j58234K77808
$$ 24867 -70193 136633 85264 349646 190293 -207240 -125408 42199 -116035 161773
5722A61773o02929K15985o1040J10968K78592k97293k61411L81365j06196K34144
$$ 161773 -441156 -225171 -286211 -175243 103349 -193944 -455355 -73990 -180186 53958
5712E3958L06712j09745j9572k74293K87358k04607L3835n1875N7612L4348k95431
$$ 53958 360670 250925 231353 -42940 244418 39811 73646 21771 79383 113731 -181700
5701a81700j56225N1659J05205l07676Q27789J05671n03584o7326j61852M4566
$$ -181700 -337925 -286266 -181061 -488737 339052 444723 -58861 -126187 -288039 -243473
5691b43473k93241K56668N20018O5764Q6806p5671q1735l49644q4044K02232m50993
$$ -243473 -536714 -280046 239972 305736 392542 316871 235136 -114508 -198552 3680 -447313
5680d47313J13894O07099n30043N7229K38787l06423K29717M63672n13642p2178
$$ -447313 -333419 273680 -256363 -199134 39653 -266770 -37053 426619 -87023 -159201
5670a59201L25239l83986J65741L02613k66331l4907o8694l0188k54964m8179
$$ -159201 166038 -217948 -52207 250406 -15925 -50832 -119526 -149714 -404678 -452857
5660d52857j20974M90149k68970J05717L37363k05765j34015M6350J1514J15439
$$ -452857 -573831 -83682 -352652 -246935 90428 -115337 -249352 -203002 -191488 -76049
5650g6049M0076j13907L73107l5722p2489l8515n65764K60965O6147p5052l7j77273
$$ -76049 -35973 -149880 223227 187505 115016 76501 -489263 -228298 -162151 -237203 -237240 -414513
5638d14513K18173M5113K14472K18736j70023R3778j00857l65877J72755Q2067
$$ -414513 -196340 -151227 63245 281981 111958 205736 104879 -260998 -88243 -6176
5628f176j9451j26155L48572j28439m5718j74091m8334n6343J43187j07984Q6611
$$ -6176 -25627 -151782 196790 68351 22633 -151458 -199792 -256135 -112948 -220932 -134321
5617a34321K08589J12057l12689J7853k5517J56776r9873Q4495j60117K7112l33579
$$ -134321 74268 186325 -126364 -108511 -134028 22748 -77125 7370 -152747 -125635 -459214
5606d59214J86591L81592n55372K95163j42110j47221J57811M42104n1216k45621
$$ -459214 -272623 108969 -446403 -151240 -293350 -440571 -282760 159344 108128 -137493
5596a37493k12470P4456m01742N0617L50249R6420k13223j18648J58542r6466
$$ -137493 -349963 -275507 -677249 -626632 -276383 -179963 -393186 -511834 -353292 -449758
5586d49758J26320L89843N8950l85201j30306P7209J26252K3883J30771l53325
$$ -449758 -323438 66405 125355 -259846 -390152 -312943 -186691 -162808 -32037 -385362
5576c85362K98305r3620k24847M32053l26993R2437M82421J06314j14007o34618
$$ -385362 -87057 -180677 -405524 26529 -300464 -208027 274394 380708 266701 -367917
5566c67917n10065N06062L60083k54601N6871P6803l51715k62457N68256J47341
$$ -367917 -877982 -371920 -11837 -266438 -209567 -132764 -484479 -746936 -178680 -31339
5556c1339L1112L7575J1884j06751J56457j18581r7176k30307K9468j8164R7781
$$ -31339 -227 37348 49232 -57519 98938 -19643 -116819 -347126 -317658 -335822 -238041
5545b38041R1905j47266J43313J00056M3783M66557j33631j72912J66389k03354
$$ -238041 -146136 -293402 -150089 -50033 -6250 460307 326676 153764 320153 116799
5535A16799k13460p9591L24217j3285o5881p6174k37796P0080M01842J85707k30603
$$ 116799 -96661 -176252 147965 134680 68799 -7375 -245171 -175091 226751 412458 181855
5524A81855N1673k56968L3331O7208k44719q1831L08359R8392L40373l61608l31522
$$ 181855 233528 -23440 9891 77099 -167620 -249451 58908 157300 497673 136065 -195457
5513a95457p6442k44113L15320L32488L10922k22441k49091l10409L23393J16274
$$ -195457 -271899 -516012 -200692 131796 442718 220277 -28814 -339223 -15830 100444
5503A00444k90686O7612j42461K27444j68732J74506K35477n40498K04555m7270
$$ 100444 -190242 -122630 -265091 -37647 -206379 -31873 203604 -336894 -132339 -179609
5493a79609j79794J57595j95553K84843K02749j14564j22079L8439J05332N6132
$$ -179609 -359403 -201808 -397361 -112518 90231 -24333 -146412 -107973 -2641 53491
5483E3491k47101J16234R8801L9299m2620M12182J53951l75741j716r1719l6526
$$ 53491 -193610 -77376 21425 60724 18104 430286 584237 208496 206780 115061 78535
5472G8535k05067N5929k03489L56055j50707o2526R0812N04986l24483K71735
$$ 78535 -126532 -70603 -274092 81963 -68744 -131270 -40458 464528 140045 411780
5462D11780M1760R5150J11631k22808Q8044J22m59179j04034L61687m10646J48996
$$ 411780 453540 548690 660321 437513 525557 525679 66500 -37534 324153 -86493 62503
5451F2503M93722k36160N5543J19455J14419k41554J64592N1523l10385M12717
$$ 62503 556225 320065 375608 495063 609482 367928 532520 584043 273658 686375
5441F86375J62860o40569k15966N8772J66498l06722j751J27881j09804K29101
$$ 686375 849235 208666 -7300 51472 217970 -88752 -90503 37378 -72426 156675
5431A56675L8905l98823K21325J55132o4397P151q2733K3135o1413j47915o4867
$$ 156675 195580 -203243 18082 173214 108817 115968 33235 56370 -5043 -152958 -217825
5420b17825K85490K48608k52889J485N7098k63017L52162n4133P9209k17574R8338
$$ -217825 67665 316273 63384 64869 121967 -141050 211112 156979 236188 18614 116952
5409A16952l4496J5730m76528L34345M75040j68644K55964k29763K52711j63315
$$ 116952 82456 98186 -378342 -43997 431043 262399 518363 288600 541311 377996
5399C77996j28651K26780k17842j86084m9508k26403L24023k07816l7139k31066
$$ 377996 249345 476125 258283 72199 22691 -203712 120311 -87505 -124644 -355710
5389c55710K94480J59982j91568j57345j10050M02275j05824k881K62556r350
$$ -355710 -61230 98752 -92816 -250161 -360211 42064 -63760 -66641 195915 186565
5379A86565m89323M27969k35047J38173k76259R2366K18591K65519j16588J3697
$$ 186565 -302758 125211 -109836 28337 -247922 -155556 63035 328554 211966 225663
5369B25663j6794l9030j50187J66214K35092k82817m3552l52221K33958O13399
$$ 225663 208869 169839 19652 185866 420958 138141 94589 -257632 -23674 589725
5359E89725J84943l50686N2904q4827o1095R9475J49204j68698k04457q9447J93974
$$ 589725 774668 423982 476886 392059 330964 430439 579643 410945 206488 117041 311015
5348C11015j16107K95592J08590k27321J7097p7691n33668L3878J3507k19162
$$ 311015 194908 490500 599090 371769 388866 311175 -222493 -188615 -175108 -394270
5338c94270Q12993O3029l61170k29313j29394n1256p3583L75681M33877l8938
$$ -394270 418723 481752 120582 -108731 -238125 -289381 -362964 12717 446594 407656
5328D07656K66132k91262m33518j38697j31502L76672J27659j64454k65690K98329
$$ 407656 673788 382526 -50992 -189689 -321191 55481 183140 18686 -247004 51325
5318E1325L77616k53835o4662q5372k27308N10904L7078M2501K00770N4512r5329
$$ 51325 428941 175106 110444 25072 -202236 308668 345746 388247 589017 643529 548200
5307E48200J8904m3260m12626M2495K65736J99273j54632k15757m7792M36196
$$ 548200 567104 523844 111218 153713 419449 618722 464090 248333 200541 636737
5297F36737j3319j28501N2578M4336o8064j71788K96305j68022l54143K58250
$$ 636737 623418 494917 547495 591831 523767 351979 648284 480262 126119 384369
5287C84369o05014L23609J47439M69145r3087k22818k30905m8184M93276r9376
$$ 384369 -220645 102964 250403 719548 626461 403643 172738 124554 617830 518454
5277E18454m06093k34961K65981J72471p5467j55749L61122j43055J04602L43707
$$ 518454 112361 -122600 143381 315852 240385 84636 445758 302703 407305 751012
5267G51012n29169k0242j91150r2656L30947K92995L3835p5268K09305J04466
$$ 751012 221843 201601 10451 -82205 248742 541737 575572 500304 709609 814075
5257H14075l31197k14278J35450K23379k62011l92276K84678J01311L9409r562
$$ 814075 482878 268600 404050 627429 365418 -26858 257820 359131 398540 388978
5247C88978J33236L87380j38242p7121p846q5788J02512k08655j13379j38574
$$ 388978 522214 909594 771352 694231 686385 600597 703109 494454 381075 242501
5237B42501N01034k47223k8030K75833j67297l09287N32083j07028K85466n8241
$$ 242501 743535 496312 468282 744115 576818 267531 799614 692586 978052 919811
5227I19811J2987O7387n17553K87569K27377l9003k78555l52628N5168O35418
$$ 919811 932798 1000185 482632 770201 997578 958575 680020 327392 382560 1017978
5217A017978J2982K8270l12577O4275K04704J76747l25231k72803K24858K41294
$$ 1017978 1030960 1059230 746653 810928 1015632 1192379 867148 594345 819203 1060497
5207A060497j31149R2033N968L83788l36468Q7436J58353J1094L02181K73264
$$ 1060497 929348 1021381 1027349 1411137 1074669 1162105 1320458 1331552 1633733 1906997
5197A906997k24478l82134L92777j45353k0845m53289K53341J8940L47602n05365
$$ 1906997 1682519 1300385 1693162 1547809 1526964 1073675 1327016 1345956 1693558 1188193
5187A188193P4960k61515N7605k62120L3400K99096j21951M09512j37392L85392
$$ 1188193 1263153 1001638 1059243 797123 830523 1129619 1007668 1417180 1279788 1665180
5177A665180m14800k59027k16549k69384M7703K69845m571m69576K06568L08755
$$ 1665180 1250380 991353 774804 505420 553123 822968 818397 348821 555389 864144
5167H64144j74824k45397O34965j51532K65613J17152j43144k35388K018L41394
$$ 864144 689320 443923 1078888 927356 1192969 1310121 1166977 931589 933607 1275001
5157A275001l63749j53747l92120J27023J98459k46238N88950K95497j62671m6830
$$ 1275001 911252 757505 365385 492408 690867 444629 1033579 1329076 1166405 1119575
5147A119575n65989J85281J80350O7855j18081o7050K09441j70747j41147O7360
$$ 1119575 553586 738867 919217 987072 868991 801941 1011382 840635 699488 766848
5137G66848K70527J00731j74169k25718k56113L42370k32784J92294N0997m46647
$$ 766848 1037375 1138106 963937 738219 482106 824476 591692 783986 834983 388336
5127C88336K63305q5072l0858j47975J68889M77591j5947l98191L8578O3605K05642
$$ 388336 651641 566569 535711 387736 556625 1034216 1018269 620078 658656 722261 927903
5116I27903k7428J04742N626k28994k22007q6544J56552M2317J5908j16948K59541
$$ 927903 900475 1005217 1010843 781849 559842 473298 629850 672167 688075 571127 830668
5105H30668p0035Q6939m2130k34410k7649J59882N6362K21250J9139o08691M62910
$$ 830668 760633 847572 805442 571032 543383 703265 759627 980877 1000016 391325 854235
5094H54235o1855m05207M72755O575k14788k93233l2377J38771L85929m03085
$$ 854235 792380 387173 859928 866503 651715 358482 326105 464876 850805 447720
5084D47720L50760n4273k18252K133K21684J96407n73601J71511J33337m0055
$$ 447720 798480 744207 525955 528088 749772 946179 372578 544089 677426 637371
5074F37371P5333J9174K56441k20287j08159K84891l53988m8837j05797J55436
$$ 637371 712704 731878 988319 768032 659873 944764 590776 541939 436142 591578
5064E91578K01982O3490l56558r7749R3544J50875j65090J54472n0003K27742
$$ 591578 793560 857050 500492 402743 496287 647162 482072 636544 586541 814283
5054H14283L64095l36584l54371M92298P581m09264M3201j59651N15766Q4863
$$ 814283 1178378 841794 487423 979721 987302 578038 621239 461588 977354 1062217
5044A062217m32111O2938N7001j27839J87893j50394J00018q7400l38159p9921
$$ 1062217 630106 693044 750045 622206 810099 659705 759723 672323 334164 254243
5034B54243L55314j220J71276J20569k80330J17199K11993J49726j77721q8174
$$ 254243 609557 608337 779613 900182 619852 737051 949044 1098770 921049 832875
5024H32875L84312O1413j75551m22281J38515K06001j55683k36264O49368j9643
$$ 832875 1217187 1278600 1103049 680768 819283 1025284 869601 633337 1282705 1263062
5014A263062l35251l31596N04531K37805n43628p963O53516l33696M00009j31852
$$ 1263062 927811 596215 1100746 1338551 794923 786960 1440476 1106780 1506789 1374937
5004A374937l96062l3309N3326J57336k30006K26887k64830M51936k28658k75938
$$ 1374937 978875 945566 998892 1156228 926222 1153109 888279 1340215 1111557 835619
4994H35619J25005l86183J67380J96054L70128L52269o81901j27147j36562l75999
$$ 835619 960624 574441 741821 937875 1308003 1660272 978371 851224 714662 338663
4984C38663L02468K60935R4239N2346N4636m60619r6826M00793J77782o3342q9896
$$ 338663 641131 902066 996305 1048651 1103287 642668 545842 946635 1124417 1061075 971179
4973I71179L1526m2351p6359L1065M32404p3844k27530J14989J07082k91610J0517
$$ 971179 1002705 960354 883995 915060 1347464 1273620 1046090 1161079 1268161 976551 987068
4962I87068K05368j84923j74547J37938k8079J68035j85989M7725J22225k33325
$$ 987068 1192436 1007513 832966 970904 942825 1110860 924871 972596 1094821 861496
4952H61496J9838M47432n08811r2808L42731K1690J19807j29528L31971n9643
$$ 861496 881334 1328766 819955 727147 1069878 1091568 1211375 1081847 1413818 1354175
4942A354175l4294p4529k06952J07909J14137N0400r9330J8774r5175L68258k67611
$$ 1354175 1319881 1245352 1038400 1146309 1260446 1310846 1211516 1230290 1135115 1503373 1235762
4931A235762k32042q9989l2978q9478L56019L187K3023m16956M51662L52483l44083
$$ 1235762 1003720 913731 880753 791275 1147294 1150481 1173504 756548 1208210 1560693 1216610
4920A216610P972j57145L15361K45072j21051K86563m14636k13523J77234L55589
$$ 1216610 1224582 1067437 1382798 1627870 1506819 1793382 1378746 1165223 1342457 1698046
4910A698046k24087p7264l14552M7799K17729k00497M06829J00551k23383J44662
$$ 1698046 1473959 1396695 1082143 1129942 1347671 1147174 1554003 1654554 1431171 1575833
4900A575833j2703r1902o8540l05947N4903M00210J10831l27262J42195j18707
$$ 1575833 1563130 1471228 1402688 1096741 1151644 1551854 1662685 1335423 1477618 1358911
4890A358911P6878J62273j96946j1900P5758j83544K30758j56838j85744k73515
$$ 1358911 1435789 1598062 1401116 1389216 1464974 1281430 1512188 1355350 1169606 896091
4880H96091R9232K42008k78930J37120J04737k80173J61636O3270R1910r6529
$$ 896091 995323 1237331 958401 1095521 1200258 920085 1081721 1144991 1236901 1140372
4870A140372k6831K9696j55751L38445k2570k1274r1903k171J78914l32249L0192
$$ 1140372 1113541 1143237 987486 1325931 1303361 1282087 1190184 1188013 1366927 1034678 1064870
4859A064870J10647J83964k35675r7267L9938m2144L12799J59490K2685k96717
$$ 1064870 1175517 1359481 1123806 1026539 1066477 1024333 1337132 1496622 1519307 1222590
4849A222590l30342J64335K78918J33953Q3890J47497m80545J23674K5939O0469
$$ 1222590 892248 1056583 1335501 1469454 1553344 1700841 1220296 1343970 1369909 1430378
4839A430378L43842l22278j18855N06841k11326j21013J53953J49861R3986k71415
$$ 1430378 1774220 1451942 1333087 1839928 1628602 1507589 1661542 1811403 1905389 1633974
4829A633974k40678L27821K65006j14030J7540J59272J71322j57623O7136J49689
$$ 1633974 1393296 1721117 1986123 1872093 1889633 2048905 2220227 2062604 2129740 2279429
4819B279429j65468p5150M27302m40089l06107J60860o4340K43604o9303O073
$$ 2279429 2113961 2038811 2466113 2026024 1719917 1880777 1816437 2060041 1990738 1996811
4809A996811j13221K78733j55843j09153R0317J05494k22048P4272l3829p0834
$$ 1996811 1883590 2162323 2006480 1897327 1987644 2093138 1871090 1945362 1911533 1840699
4799A840699k90968N22665k06023k90001M58250K3846k04936K13865j10849j66818
$$ 1840699 1549731 2072396 1866373 1576372 2034622 2058468 1853532 2067397 1956548 1789730
4789A789730M5990J05658R8935k61686o2217Q2224J88221K54836M6882j55168
$$ 1789730 1835720 1941378 2040313 1778627 1716410 1798634 1986855 2241691 2288573 2133405
4779B133405R5931M9547r648m8222K21048o0323R3376k92602j15141j29607m42474
$$ 2133405 2229336 2278883 2269235 2221013 2442061 2381738 2475114 2182512 2067371 1937764 1495290
4768A495290K64166Q29620n22089J5660K11376j69049j90040R56K04932N3288
$$ 1495290 1759456 2589076 2066987 2082647 2294023 2124974 1934934 1935890 2140822 2194110
4758B194110J07212j72164n4618P9651j32676j36309p1361J29805P6413l54253
$$ 2194110 2301322 2129158 2074540 2154191 2021515 1885206 1813845 1943650 2020063 1665810
4748A665810k45236O50379k8193j10821j19819J46191K74506j69581N49963j83955
$$ 1665810 1420574 2070953 2042760 1931939 1812120 1958311 2232817 2063236 2613199 2429244
4738B429244m24669J00374k46164j34958K44954k03689P6141n4512L69088J51888
$$ 2429244 2004575 2104949 1858785 1723827 1968781 1765092 1841233 1786721 2155809 2307697
4728B307697k08107J30757j79931j03621k0786N5284j2895L4195J0119l8552J44746
$$ 2307697 2099590 2230347 2050416 1946795 1926009 1981293 1968398 2002593 2012712 1974160 2118906
4717B118906K70369N1976j23533k35612J28738j44948L31147m14244Q3355M66458
$$ 2118906 2389275 2441251 2317718 2082106 2210844 2065896 2397043 1982799 2066154 2532612
4707B532612p7336k56161Q9131P6177J45844K54559m16135k7396J84015l80456
$$ 2532612 2455276 2199115 2288246 2364423 2510267 2764826 2348691 2321295 2505310 2124854
4697B124854J88681O3669J76775M79846j97616L60203j6139k22823k579m30204
$$ 2124854 2313535 2377204 2553979 3033825 2836209 3196412 3180273 2957450 2954871 2524667
4687B524667N28313K23904l33789L25845j39369j11130K74800N6476P303j45961
$$ 2524667 3052980 3276884 2943095 3268940 3129571 3018441 3293241 3349717 3357020 3211059
4677C211059L05760J86570j30459J85466M015K19327J21643r4793J6881j85496
$$ 3211059 3516819 3703389 3572930 3758396 3762411 3981738 4103381 4008588 4025469 3839973
4667C839973K82776O3719L68k86830j79626N96098q1896K96753L42102m1891m0849
$$ 3839973 4122749 4186468 4186836 3900006 3720380 4316478 4234582 4531335 4873437 4831546 4790697
4656D790697k15555P3941Q4131K75495j06638j40192M04381m14954K07543K63798
$$ 4790697 4575142 4649083 4733214 5008709 4902071 4761879 5166260 4751306 4958849 5222647
4646E222647M44154j07181J64205J3311m52986p7178O07395j58817K38347M61102
$$ 5222647 5666801 5559620 5723825 5737136 5284150 5206972 5814367 5655550 5893897 6354999
4636F354999j81713K1470J29079K24069J27559M57671O3100R5964K34369q5564
$$ 6354999 6173286 6194756 6323835 6547904 6675463 7133134 7196234 7292198 7526567 7441003
4626G441003J72434K52085J90302Q4583J99941J27132K01965J34163j12745j2353
$$ 7441003 7613437 7865522 8055824 8140407 8340348 8467480 8669445 8803608 8690863 8678510
4616H678510O26859O41226J38364O54329j90786K78015K84811N37730N35079j40387
$$ 8678510 9305369 9946595 10084959 10739288 10548502 10826517 11111328 11649058 12184137 12043750
4606A2043750N07250O57808M62634N74230O77601L00210O40021O79320J23269
$$ 12043750 12551000 13208808 13671442 14245672 14923273 15223483 15863504 16542824 16666093
4597A6666093P76827R79881Q92999M18469P71769Q67915J258270J078921J534158
$$ 16666093 17442920 18422801 19315800 19734269 20506038 21373953 22632223 23711144 25245302
4588B5245302J237555J298637J314008J501556J967179J415240J225198J460254
$$ 25245302 26482857 27781494 29095502 30597058 32564237 33979477 35204675 36664929
4580C6664929J451951J629980J091180R55820J232906J113597K033495J975617
$$ 36664929 38116880 39746860 40838040 41793860 43026766 44140363 46173858 48149475
4572D8149475K303379K590505L091688K242069L199138L651518M242692M884638
$$ 48149475 50452854 53043359 56135047 58377116 61576254 65227772 69470464 74355102
4564G4355102M938321N979252O296785P401745Q233083Q456343R363390R845825
$$ 74355102 79293423 85272675 91569460 98971205 107204288 115660631 125024021 134869846
4556A34869846R516249Q963634Q058759O049390M403332J677699k321900m979541
$$ 134869846 144386095 153349729 161408488 167457878 171861210 173538909 171217009 166237468
4548A66237468p412472r199367j0135481j0797526j0005399r440474q401992q231868
$$ 166237468 158824996 149625629 139490148 128692622 118687223 109246749 100844757 92612889
4540I2612889o930246n996295n268465m832274m736744l655398l338431l336342
$$ 92612889 85682643 79686348 74417883 69585609 64848865 61193467 57855036 54518694
4532E4518694k714686k362790k306921k138792k245430j793543j842712j754641
$$ 54518694 51804008 49441218 47134297 44995505 42750075 40956532 39113820 37359179
4524C7359179j338940j921220j328997j020678j253211q47689j552968j369362
$$ 37359179 36020239 34099019 32770022 31749344 30496133 29648444 28095476 26726114
4516B6726114r88570j298599o47300q65372r11430r55476r94077l24321n54122
$$ 26726114 25737544 24438945 23791645 22926273 22014843 21059367 20065290 19740969 19186847
4507A9186847l81599n50263o10030o44648l72296p25654j09587m11270n58543
$$ 19186847 18805248 18254985 17644955 17000307 16628011 15902357 15792770 15381500 14822957
4498A4822957l55562m8947q86216k58076j25490j58954l14541n81175j73861k19282
$$ 14822957 14467395 14418448 13532232 13274156 13148666 12989712 12675171 12093996 11920135 11700853
4488A1700853J86639k29640n16436j46804n69707k78244M66168l91360k15654
$$ 11700853 11887492 11657852 11141416 10994612 10424905 10146661 10612829 10221469 10005815
4479A0005815l36383J28363K53889k45543m38771k63269K2495l2997k81798k17269
$$ 10005815 9669432 9797795 10051684 9806141 9367370 9104101 9126596 9093599 8811801 8594532
4469H594532k5052Q3874r2106l05845J81320l90968m12283L31315l44163q5868
$$ 8594532 8569480 8653354 8561248 8255403 8436723 8045755 7633472 7964787 7620624 7534756
4459G534756n60574J18446j47488M5569K56253J05207p7785J00757j24705k70770
$$ 7534756 6974182 7092628 6945140 6990709 7246962 7352169 7274384 7375141 7250436 6979666
4449F979666p9837k15329L14748l10613L829j04709l34401J71817N16918J3455
$$ 6979666 6899829 6684500 6999248 6688635 6692464 6587755 6253354 6425171 6942089 6955544
4439F955544j56250K37287k93901p6964n9726k29748J28963j48519K90047J22229
$$ 6955544 6799294 7036581 6742680 6665716 6605990 6376242 6505205 6356686 6646733 6768962
4429F768962k54751k48441J27119j12518j84462K29764j7630k49982J99307J05125
$$ 6768962 6514211 6265770 6392889 6280371 6095909 6325673 6308043 6058061 6257368 6362493
4419F362493j941K38561J57847j22226j80118q3029K19933j93793J09717M3204
$$ 6362493 6360552 6599113 6756960 6634734 6454616 6371587 6591520 6397727 6507444 6550648
4409F550648J29843m5483Q2911k83261j17465K91685K5358l12627K8046K13845
$$ 6550648 6680491 6635008 6717919 6434658 6317193 6608878 6634236 6321609 6349655 6563500
4399F563500k42612M1570P681l7810j89583K4086J74336P8676J22815j8041j26148
$$ 6563500 6320888 6362458 6370139 6332329 6142746 6166832 6341168 6419844 6542659 6524618 6398470
4388F398470l77415L41871k02578L5387J55785k66574k7610L1437R4463L5965
$$ 6398470 6021055 6362926 6160348 6195735 6351520 6084946 6057336 6088773 6183236 6219201
4378F219201N9584j11043M52528L67135p2669k86722p1021l83720j53820L33101
$$ 6219201 6278785 6167742 6620270 6987405 6914736 6628014 6556993 6173273 6019453 6352554
4368F352554R9395J2889j15540j93205P30015j42433l87935p3031J86858J17982
$$ 6352554 6451949 6464838 6349298 6156093 6886108 6743675 6355740 6282709 6469567 6587549
4358F587549j80078k76069K62507M6062O500m91633q1034j21563J55546J39952
$$ 6587549 6407471 6131402 6393909 6439971 6446471 5954838 5873804 5752241 5907787 6047739
4348F047739k01031P0041J8447K11486j78177l81547L58227n29295J79418L60302
$$ 6047739 5846708 5916749 5935196 6146682 5968505 5586958 5945185 5415890 5595308 5955610
4338E955610j07781r2622j54739M24368k7016n4781p0931L12606J33797k95292
$$ 5955610 5847829 5755207 5600468 6024836 5997820 5943039 5872108 6184714 6318511 6023219
4328F023219q6529K70026k49515k3565J27932O3401j38574K54635j03190p7988
$$ 6023219 5936690 6206716 5957201 5933636 6061568 6124969 5986395 6241030 6137840 6059852
4318F059852J60436L5028K46834K56117l85792P244k16046m2129R957L32362R4085
$$ 6059852 6220288 6255316 6502150 6758267 6372475 6379719 6163673 6121544 6131501 6463863 6557948
4307F557948j79636o21475j41749M38386o7287k10450J30698K66349p1998k82718
$$ 6557948 6378312 5756837 5615088 6053474 5986187 5775737 5906435 6172784 6100786 5818068
4297E818068n310J04142R8608N0870j67143k65758J42737J11263n9321J79679
$$ 5818068 5812758 5916900 6015508 6066378 5899235 5633477 5776214 5887477 5828156 6007835
4287F007835l24311L6793L66963k99960M17737j73935J42939K08215j01154j20733
$$ 6007835 5683524 5720317 6087280 5787320 6205057 6031122 6174061 6382276 6281122 6160389
4277F160389j4200L97128n96246j47916o1480J21129M47176j31006o7055N88612
$$ 6160389 6146189 6543317 5947071 5799155 5737675 5858804 6305980 6174974 6107919 6696531
4267F696531j19149j69496K75936k2320k88183L70168K17299j16217j50522J3055
$$ 6696531 6577382 6407886 6683822 6661502 6373319 6743487 6960786 6844569 6694047 6707102
4257F707102j42008j42039J33740L53340L30718j27951P9954J76168o0302l17809
$$ 6707102 6565094 6423055 6556795 6910135 7240853 7112902 7192856 7369024 7308722 6990913
4247F990913j05492K91656p8250K42442k01670J24006Q097P2478k72255j28900
$$ 6990913 6885421 7177077 7098827 7341269 7139599 7263605 7271702 7344180 7071925 6943025
4237F943025K76783P7199k26545K53083K96961J98823j89562n07633L56718K88607
$$ 6943025 7219808 7297007 7070462 7323545 7620506 7819329 7629767 7122134 7478852 7767459
4227G767459j54j97087q1406J09080P6444J11170N7195j75520J02461M8190q8362
$$ 7767459 7767305 7570218 7488812 7597892 7674336 7785506 7842701 7667181 7769642 7817832 7729470
4216G729470j40429k52247L35203r166j32832J29357K62945l75155l2339L40153
$$ 7729470 7589041 7336794 7671997 7662831 7529999 7659356 7922301 7547146 7514807 7854960
4206G854960O4825j42556q8654J55639K14844q7537m20808J8856L01957K93317
$$ 7854960 7919785 7777229 7688575 7844214 8059058 7971521 7550713 7569569 7871526 8164843
4196H164843j08905n03201M28007J26167j33628j93261J63602O6242q9633k84729
$$ 8164843 8055938 7552737 7980744 8106911 7973283 7780022 7943624 8009866 7920233 7635504
4186G635504N4289J36987j93239J23153L7591N21435Q6659m62027J63506M32755
$$ 7635504 7689793 7826780 7633541 7756694 7794285 8315720 8402379 7940352 8103858 8536613
4176H536613l82405K98508m1798p1592l1897J45954l4862L260m22497O5842o1066
$$ 8536613 8154208 8452716 8410918 8339326 8307429 8453383 8418521 8421781 7999284 8065126 8004060
4165H004060l8973L70480K61732L16186m60850j65781J68545k03236J42502J38963
$$ 8004060 7965087 8335567 8597299 8913485 8452635 8286854 8455399 8252163 8394665 8533628
4155H533628r4877J96530j49802n4300m5360p0898L16522k98846l78609P2822
$$ 8533628 8438751 8635281 8485479 8431179 8385819 8314921 8631443 8332597 7953988 8026810
4145H026810M06494j85950L17853O212K5873J88155J11050q9169l5117K48018
$$ 8026810 8433304 8247354 8565207 8571419 8597292 8785447 8896497 8807328 8772211 9020229
4135I020229q1526M7819K65381l34182r6769J63868j91913L57680k20952Q5685
$$ 9020229 8938703 8986522 9251903 8917721 8820952 8984820 8792907 9150587 8929635 9015320
4125I015320j7388l21140L42622J14192L1141o4033J90027J88335n7041R2346
$$ 9015320 8997932 8676792 9019414 9133606 9164747 9100714 9290741 9479076 9422035 9514381
4115I514381P0664n23078K09427N35174l43474j06766J014298j76889K08788N50589
$$ 9514381 9585045 9061967 9271394 9806568 9463094 9356328 10370626 10193737 10402525 10953114
4105A0953114l97808K70369j20400k26565L0231J29278K46481l6590K5733J06667
$$ 10953114 10555306 10825675 10705275 10478710 10508941 10638219 10884700 10848110 10873843 10980510
4095A0980510K89331R6677K4669K18702K87642K8976L33421n2119K59362M31114
$$ 10980510 11269841 11366518 11391187 11609889 11897531 11926507 12259928 12207809 12467171 12898285
4085A2898285K47042l17804M32904R00751J79102J41271l25021L90447L15871
$$ 12898285 13145327 12827523 13260427 14161178 14340280 14481551 14156530 14546977 14862848
4076A4862848J73963N33617M36917Q6395O44934O60610K78044M88897Q99688N09617
$$ 14862848 15036811 15570428 16007345 16093740 16738674 17399284 17677328 18166225 19065913 19575530
4066A9575530Q18678L18282Q38652P25360K97872L39431M33012P29963K99041
$$ 19575530 20394208 20712490 21551142 22276502 22574374 22913805 23346817 24076780 24375821
4057B4375821R68026R43495Q30349Q70399O38305P73973J294383J104728J137541
$$ 24375821 25343847 26287342 27117691 27988090 28626395 29400368 30694751 31799479 32937020
4048C2937020J207159J365079N92756J599049J521054J050287K035311J497472
$$ 32937020 34144179 35509258 36102014 37701063 39222117 40272404 42307715 43805187
4040D3805187J407338J393085J586907J155656J190587O29101Q83314K20032N62519
$$ 43805187 45212525 46605610 48192517 49348173 50538760 51167861 52051175 52271207 52833726
4031E2833726J08751Q53172R42835Q38331J165713O33650O66467J136669J295500
$$ 52833726 52942477 53795649 54738484 55576815 56742528 57376178 58042645 59179314 60474814
4022F0474814J747422J242720J806156J381574R38732J454360J787118J543342
$$ 60474814 62222236 63464956 65271112 66652686 67591418 69045778 70832896 72376238
4014G2376238J444749J435172J647153J432509J659907J237683J753291K041114
$$ 72376238 73820987 75256159 76903312 78335821 79995728 81233411 82986702 85027816
4006H5027816K130039K058528K478156K835142K981963L050243L269841L565940
$$ 85027816 87157855 89216383 91694539 94529681 97511644 100561887 103831728 107397668
3998A07397668L286104K852054K231490J531992k93289o82842j674348j515082
$$ 107397668 110683772 113535826 115767316 117299308 117006019 116323177 114648829 113133747
3990A13133747j359538r26033q03217K65149P10299J041687P38521J357770J566601
$$ 113133747 111774209 110848176 110044959 110310108 111020407 112062094 112800615 114158385 115724986
3981A15724986K03573k99707q87433j349190k157331l028385k616457l164394
$$ 115724986 115928559 115628852 114741419 113392229 111234898 108206513 105590056 102425662
3973A02425662k676029k773925j748886j853281j994245p16373o14729o71901
$$ 102425662 99749633 96975708 95226822 93373541 91379296 90662923 90048194 89376293
3965H9376293r1745j50512M09687Q33320R53439Q39290J545496J978431J391571
$$ 89376293 89284548 89134036 89543723 90377043 91330482 92169772 93715268 95693699 97085270
3956I7085270J869262J904233J578778J311162J555484Q43724P07997J52136L57727
$$ 97085270 98954532 100858765 102437543 103748705 105304189 106147913 106855910 107008046 107365773
3947A07365773l31522o90444n38316m13749k20649l88087o40811o42396m21777
$$ 107365773 107034251 106343807 105805491 105391742 105171093 104783006 104142195 103499799 103078022
3938A03078022J05290l46755l32709p15745q36120j175786j077300j562655k090919
$$ 103078022 103183312 102836557 102503848 101788103 100951983 99776197 98698897 97136242 95045323
3929I5045323j861154k069101j972605k582485k232003k224672k368526j902768
$$ 95045323 93184169 91115068 89142463 86559978 84327975 82103303 79734777 77832009
3921G7832009j885244k314542j672106j834442j637860j417344j658083j662273
$$ 77832009 75946765 73632223 71960117 70125675 68487815 67070471 65412388 63750115
3913F3750115j315962j840859j826507j371918j101433j500283j074615j853732
$$ 63750115 62434153 60593294 58766787 57394869 56293436 54793153 53718538 51864806
3905E1864806j393129j218756j088096j471020r46323j297854p64698r01372p86277
$$ 51864806 50471677 49252921 48164825 46693805 45747482 44449628 43684930 42783558 41997281
3896D1997281n64017r72193k20570q48039q33049Q4008K17962k92243O0553K67640
$$ 41997281 41433264 40461071 40240501 39392462 38559413 38643421 38861383 38569140 38629693 38897333
3886C8897333K22025m5948L7794M60990L82483K87758L81220P96585Q13354Q24451
$$ 38897333 39119358 39073410 39111204 39572194 39954677 40242435 40623655 41420240 42233594 43058045
3876D3058045P99778R64546J264698J831008J418808J588640J856065K369672
$$ 43058045 43857823 44822369 46087067 47918075 49336883 50925523 52781588 55151260
3868E5151260K040351J564312K391641K892224L383824K828777L223662M111097
$$ 55151260 57191611 58755923 61147564 64039788 67423612 70252389 73476051 77587148
3860G7587148M448362M555892M751433M686808N395294N080389M920069M683455
$$ 77587148 82035510 86591402 91342835 96029643 101424937 106505326 111425395 116108850
3852A16108850M417938N025355O249912O577770P792663R238860J0770380J3325946
$$ 116108850 120526788 125552143 131802055 138379825 146172488 155411348 166181728 179507674
3844A79507674J5177786J7340680J9053944K0761629K2002412K0190207J3904303
$$ 179507674 194685460 212026140 231080084 251841713 273844125 294034332 307938635
3837C07938635J483772j2239752k3090971k7325646k6904955k2213293j9139484
$$ 307938635 309422407 297182655 274091684 246766038 219861083 197647790 178508306
3830A78508306j5565399j3100481j0938940r120204q504601p939275p071662o220597
$$ 178508306 162942907 149842426 138903486 129783282 121278681 113339406 106267744 100047147
3822A00047147n521759n266868m645319m165344l765836l341698l338955l155287
$$ 100047147 94525388 89258520 84613201 80447857 76682021 73340323 70001368 66846081
3814F6846081k740885k527848k549009k659426j538947k284207k278323j940625
$$ 66846081 64105196 61577348 59028339 56368913 54829966 52545759 50267436 48326811
3806D8326811k295446j811042j903816j774085j322698j398383j375152j250143
$$ 48326811 46031365 44220323 42316507 40542422 39219724 37821341 36446189 35196046
3798C5196046j632254q33446q69395j300549r05278p11057q98253p91275p32560
$$ 35196046 33563792 32730346 31860951 30560402 29655124 28944067 28045814 27254539 26521979
3789B6521979p31748n74086m22163j156780k47938o94817o60999j098913j01525
$$ 26521979 25790231 25216145 24793982 23637202 23389264 22694447 22033448 20934535 20833010
3780B0833010l38676q45134j23372n24754n05658n96402k71122n99001l23823
$$ 20833010 20494334 19649200 19525828 19001074 18495416 17899014 17627892 17028891 16705068
3771A6705068J33873p38750k66578k99511n3509m2561m07357k59113j11328m21840
$$ 16705068 16838941 16100191 15833613 15534102 15480593 15438032 15030675 14771562 14660234 14238394
3761A4238394m0152j311m82354p47906L7746j15105l01806n53045J28293j67188
$$ 14238394 14198242 14196931 13714577 12966671 13004417 12889312 12587506 12034461 12162754 11995566
3751A1995566l07658l31224j94048J10903j27841l26240k20111J46373n7231m26214
$$ 11995566 11687908 11356684 11162636 11273539 11145698 10819458 10599347 10745720 10688489 10262275
3741A0262275L9270k54609q562r3356j62466L43923k97992k22520j68587j95562
$$ 10262275 10301545 10046936 10038374 9945018 9782552 10126475 9828483 9605963 9437376 9241814
3731I241814k25219M25894M9113k87151K4531r0695k78582K92134j13150m63030
$$ 9241814 9016595 9442489 9491602 9204451 9228982 9138287 8859705 9151839 9038689 8575659
3721H575659l86893j41269k34405R4904M5879J27777l71804N0936k51273M00278
$$ 8575659 8188766 8047497 7813092 7907996 7953875 8081652 7709848 7760784 7509511 7909789
3711G909789o07069j21325j7075l25693J54800k25456q5093J52782l31024j47848
$$ 7909789 7302720 7181395 7164320 6838627 6993427 6767971 6682878 6835660 6504636 6356788
3701F356788K55053l39524m20346l62844O43885Q9450l39452J3439J71976m05070
$$ 6356788 6611841 6272317 5851971 5489127 6133012 6222462 5883010 5896449 6068425 5663355
3691E663355M16520r4702n20509q3252J36756J06979k01462k8792j92000k6520
$$ 5663355 6079875 5985173 5464664 5381412 5518168 5625147 5423685 5394893 5202893 5176373
3681E176373j97081p7500N5859j43852J86652J76326m28630j33035K81603q1966
$$ 5176373 4979292 4901792 4957651 4813799 5000451 5176777 4748147 4615112 4896715 4814749
3671D814749l82487j80724K70841O5917j54755O931m0124j08111k21447l21088
$$ 4814749 4432262 4251538 4522379 4588296 4433541 4440472 4400348 4292237 4070790 3749702
3661C749702J84196M7547p8029L33719Q5971o5188n5794k52881l2517j51698j38943
$$ 3749702 3933898 3981445 3903416 4237135 4323106 4257918 4202124 3949243 3916726 3765028 3626085
3650C626085N9139j66335J03438r4997j0789o1442K00674K49401J9964k98916
$$ 3626085 3685224 3518889 3622327 3527330 3516541 3455099 3655773 3905174 3925138 3626222
3640C626222m06833j73023J20183j56265k66618L54285o2176K91651P7336J52706
$$ 3626222 3219389 3046366 3166549 3010284 2743666 3097951 3035775 3327426 3404762 3557468
3630C557468o7994k30662j14307K00923K11512L15229j75097J43505K34518j19648
$$ 3557468 3489474 3258812 3144505 3345428 3556940 3872169 3697072 3840577 4075095 3955447
3620C955447n9989K46939L74796k19516J76478K8659M44569N83239j80123o6208
$$ 3955447 3895458 4142397 4517193 4297677 4474155 4502814 4947383 5530622 5350499 5284291
3610E284291J03560K13567k35605k72322k61064k91504n59262r0847K3743k44676
$$ 5284291 5387851 5601418 5365813 5093491 4832427 4540923 3981661 3890814 3914557 3669881
3600C669881J28962k36141j48055p0666m03640K59160j22098p7520O9399j9611
$$ 3669881 3798843 3562702 3414647 3343981 2940341 3199501 3077403 2999883 3069282 3049671
3590C049671l04862m0784k9654j46201L64497j34390M27206j85294R329J56588
$$ 3049671 2744809 2704025 2674371 2528170 2892667 2758277 3185483 3000189 3009518 3166106
3580C166106l04966k54136J37013j60181n56489K99603J88900J75805k00647o27693
$$ 3166106 2861140 2607004 2744017 2583836 2027347 2326950 2515850 2691655 2491008 1863315
3570A863315J02299J13035K74894l95652j04206K9059j66766N00092j77166j67593
$$ 1863315 1965614 2078649 2353543 1957891 1853685 1882744 1715978 2216070 2038904 1871311
3560A871311J32966n1958J35097L33312l332m74638l64759k469R0235N9739O53326
$$ 1871311 2004277 1952319 2087416 2420728 2417396 1942758 1577999 1575530 1665765 1725504 2378830
3549B378830l74749j88417J88795j79209K58100j80392p7542J33661k4978j57117
$$ 2378830 2004081 1815664 2004459 1825250 2083350 1902958 1825416 1959077 1934099 1776982
3539A776982k46205J66162k7068Q5831l0971j66087M9196L52909l48374O6355
$$ 1776982 1530777 1696939 1669871 1755702 1724731 1558644 1607840 1960749 1612375 1678730
3529A678730J25825J69592J71688k97288K10350o7569l08408K83445n08103J61217
$$ 1678730 1804555 1974147 2145835 1848547 2058897 1991328 1682920 1966365 1458262 1619479
3519A619479M9392k05922J71378L4381L7069n6499J41475k64223J83585J14657
$$ 1619479 1668871 1462949 1634327 1668708 1705777 1649278 1790753 1526530 1710115 1824772
3509A824772j12457L51689j7577j19240m52813J23331M50557k12558j5329q4610
$$ 1824772 1712315 2064004 2046427 1927187 1474374 1597705 2048262 1835704 1820375 1735765
3499A735765L35939j32588j9964q8161j42776J75816J01734j3119J8723p9834
$$ 1735765 2071704 1939116 1919152 1830991 1688215 1864031 1965765 1952646 1971369 1891535
3489A891535j71843Q9184K18713k2307K4444k58143M90952m48525n13429N1505
$$ 1891535 1719692 1808876 2027589 2005282 2029726 1771583 2262535 1814010 1300581 1352086
3479A352086q5526J21744k5814l30660o672K49225q6081N5759j9707P1435o2886
$$ 1352086 1266560 1388304 1362490 1031830 1025158 1274383 1188302 1244061 1224354 1295789 1232903
3468A232903K29832k83113m51209N65193P3255O5862j29173N5613Q257J8058l44539
$$ 1232903 1462735 1179622 728413 1293606 1366861 1432723 1303550 1359163 1367420 1385478 1040939
3457A040939R9361l34894j401K61423L50365q6688j91465J72021m81724P9650
$$ 1040939 1140300 805406 804005 1065428 1415793 1329105 1137640 1309661 827937 907587
3447I07587L51470m23187n8345J90114r757J35397J40661j78881Q9036M3803l34947
$$ 907587 1259057 835870 777525 967639 957882 1093279 1233940 1055059 1144095 1187898 852951
3436H52951J62102m2406K30238l62551J89696r3307q8865J10345o8379l20813
$$ 852951 1015053 972647 1202885 840334 1030030 936723 847858 958203 889824 569011
3426E69011K98033j52698J55516R154N12309k18341m07409J62688k40132J05812
$$ 569011 867044 714346 869862 879016 1391325 1172984 765575 928263 688131 793943
3416G93943j78307J83540L72531k70938r7669r5474j567N38003R323o5752q6592
$$ 793943 615636 799176 1171707 900769 803100 707626 706059 1244062 1253385 1187633 1101041
3405A101041M0343K83541l26625Q9526n9210k37671J87793l6773R9696j26979
$$ 1101041 1141384 1424925 1098300 1187826 1128616 890945 1078738 1041965 1141661 1014682
3395A014682k11774P9933J02831k85026L23707j3533j51794o6355N19521l27763
$$ 1014682 802908 882841 985672 700646 1024353 1010820 859026 792671 1312192 984429
3385I84429J48664M12768K4442q5678J78128J50392m98206p2237k98248K92552
$$ 984429 1133093 1545861 1570303 1484625 1662753 1813145 1314939 1242702 944454 1237006
3375A237006k08700j36878r7111L48992J25606Q6166l9787m55927J99224J06624
$$ 1237006 1028306 891428 794317 1143309 1268915 1355081 1315294 859367 1058591 1165215
3365A165215k74058j27884K52924m0009L32030m85626j85975J01967k14026J05664
$$ 1165215 891157 763273 1016197 976188 1308218 822592 636617 738584 524558 630222
3355F30222L17927J24642k80900J06951O1166J03630J01366n5673k89743n4689
$$ 630222 948149 1072791 791891 898842 960008 1063638 1165004 1109331 819588 764899
3345G64899r0550j44194O42133J88717P9249p6774m51826K32884k9014k09516
$$ 764899 674349 530155 1172288 1361005 1440254 1363480 911654 1144538 1115524 906008
3335I06008R2157j45492Q9842Q5189K78771o93213L39651L31510o51021L37543
$$ 906008 998165 852673 942515 1027704 1306475 613262 952913 1284423 633402 970945
3325I70945N4169J31764q0710k21005l85283k54510O77011j48589k70783J12173
$$ 970945 1025114 1156878 1076168 855163 469880 215370 892381 743792 473009 585182
3315E85182r9820K57212j89299L06691L3863j39594l4200j1206l88286j32978
$$ 585182 485362 742574 553275 859966 893829 754235 720035 708829 320543 187565
3305A87565J884N44178L7313J50553M7640k17130J99558l25438N31722l50409
$$ 187565 189449 733627 770940 921493 969133 752003 951561 626123 1157845 807436
3295H07436O0466J15242j50776L6043J4762j78106J15331L87574j73893k91397
$$ 807436 867902 983144 832368 868411 883173 705067 820398 1207972 1034079 742682
3285G42682n0706L24924J169k52209J88479k03296K7944J55930j35951J71260
$$ 742682 691976 1016900 1018069 765860 954339 751043 778987 934917 798966 970226
3275I70226j5710l27180l3787O53685l44329K26903L3198n52082K61755M40171
$$ 970226 954516 627336 593549 1247234 902905 1129808 1163006 610924 872679 1312850
3265A312850j37232R2890q5013l054n9821L28349l5392p6497K3154J31501K09955
$$ 1312850 1175618 1268508 1183495 1180441 1120620 1448969 1413577 1337080 1360234 1491735 1701690
3254A701690k36621j06623r619j31974J12711M5695J66585K8589j97074K24432
$$ 1701690 1465069 1358446 1348827 1216853 1329564 1375259 1541844 1570433 1373359 1597791
3244A597791l16501R0434M7413l40108k84599L55892K1303J57864K85411k54599
$$ 1597791 1281290 1371724 1419137 1079029 794430 1150322 1171625 1329489 1614900 1360301
3234A360301K93977R3709k79619k10668m3154M159j01744q6049K92580j65032
$$ 1360301 1654278 1747987 1468368 1257700 1214546 1218705 1116961 1030912 1323492 1158460
3224A158460p9843j11317M50858K19541m52490J59277j22411L03787j00750J34539
$$ 1158460 1078617 967300 1418158 1637699 1185209 1344486 1222075 1525862 1425112 1559651
3214A559651N069J73823K28977j13402j15337j32363M05448J39468k28504j10400
$$ 1559651 1564720 1738543 1967520 1854118 1738781 1606418 2011866 2151334 1922830 1812430
3204A812430j48075L06959k08825k74461P08839L9128n28021L72216o53687N11742
$$ 1812430 1664355 1971314 1762489 1488028 2196867 2235995 1707974 2080190 1426503 1938245
3194A938245j56544k0705k0210j83908K35653M9158k67692l11250L89024M01836
$$ 1938245 1781701 1760996 1740786 1556878 1792531 1841689 1573997 1262747 1651771 2053607
3184B053607K29351o31672M1164L93365L0859J38867j8963k75241m23945P5551
$$ 2053607 2282958 1651286 1692450 2085815 2116674 2255541 2236578 1961337 1537392 1612943
3174A612943K86554O2982k71442j72884j23838K31600M96450m75581l78560K36008
$$ 1612943 1899497 1962479 1691037 1518153 1394315 1625915 2122365 1646784 1268224 1504232
3164A504232K8762l27052K19261j3990J27066L30406o8057k16673m6170n28955
$$ 1504232 1532994 1205942 1425203 1411213 1538279 1868685 1800628 1583955 1537785 1008830
3154A008830K0959L37225r5714j24778K2732J57618k36198K63787J84129l29074
$$ 1008830 1029789 1367014 1271300 1146522 1169254 1326872 1090674 1354461 1538590 1209516
3144A209516k64279J71381N18731k98746l56502j46133M75323m50126l11709M490
$$ 1209516 945237 1116618 1635349 1336603 980101 833968 1309291 859165 547456 551946
3134E51946p1622J23799J69515k62887P2637K5312J13423P3605O2899k98111m1747
$$ 551946 480324 604123 773638 510751 583388 608700 722123 795728 858627 560516 518769
3123E18769J86945j80523o6343k25903k05851N74305p3794j98220K72987K65311
$$ 518769 705714 525191 458848 232945 27094 601399 527605 329385 602372 867683
3113H67683k53499l2436J61820O8663k83833L47286N8931K44573l6688j04415
$$ 867683 614184 581748 743568 812231 528398 875684 934615 1179188 1142500 1038085
3103A038085p6411M21177j28367n16212L63875j71723J40146k95167Q3977L09312
$$ 1038085 961674 1382851 1254484 738272 1102147 930424 1070570 775403 859380 1168692
3093A168692o761k33278J13318j89631j43836J15781K99176l17098K28529m7884
$$ 1168692 1161931 928653 1041971 852340 708504 824285 1123461 806363 1034892 987008
3083I87008k56585j83719L40162P8557m3669j23535k5849J61486M3245K85435
$$ 987008 730423 546704 886866 965423 921754 798219 772370 933856 977101 1262536
3073A262536n70786N8489P0511P6803q6649O8372M03824j1601l17162k41703J73261
$$ 1262536 691750 750239 820750 897553 810904 879276 1283100 1271499 954337 712634 885895
3062H85895J96016P2689j06358j7782O3863K04773p5253L34530l58797J60092
$$ 885895 1081911 1154600 1048242 1030460 1094323 1299096 1223843 1558373 1199576 1359668
3052A359668K08057j8382m40791K75529j71966J76016j96797M10328L19724o9306
$$ 1359668 1567725 1549343 1108552 1384081 1212115 1388131 1191334 1601662 1921386 1852080
3042A852080J96206o4504l56101J27044K86235N4371k14687P5720J92816j37351
$$ 1852080 2048286 1983782 1627681 1754725 2040960 2095331 1880644 1956364 2149180 2011829
3032B011829J5299L7176L2271J22794j60295L40960J06496j52878o0451k70552
$$ 2011829 2027128 2064304 2096575 2219369 2059074 2400034 2506530 2353652 2293201 2022649
3022B022649P20870N033j87969J50882j82482m0399J53368P9891J4231M87928
$$ 2022649 2743519 2748552 2560583 2711465 2528983 2488584 2641952 2721843 2736074 3224002
3012C224002M54628K28577M19780l7481l93042k70897J62607M80528j31558l72953
$$ 3224002 3678630 3907207 4326987 4289506 3896464 3625567 3788174 4268702 4137144 3764191
3002C764191k0260l95576N65590P9767n2887j19497M89325P8683L0562j86333
$$ 3764191 3743931 3348355 3913945 3993712 3940825 3821328 4310653 4389336 4419898 4233565
2992D233565M82891K69077J95557j6583J23534q4152k71280P3356k22072j50777
$$ 4233565 4716456 4985533 5181090 5164507 5288041 5203889 4932609 5005965 4783893 4633116
2982D633116k10980J98543L37082J42548J25912J78431m07224N7265K49270m8957
$$ 4633116 4422136 4620679 4957761 5100309 5226221 5404652 4997428 5054693 5303963 5255006
2972E255006R8168K50072j12861p0661J91043M08808l4000J35346K30116J22453
$$ 5255006 5353174 5603246 5490385 5419724 5610767 6019575 5985575 6120921 6351037 6473490
2962F473490L47705L97259K07316K81285M39457K22017K60818O01347N79286M15560
$$ 6473490 6821195 7218454 7425770 7707055 8146512 8368529 8629347 9230694 9809980 10225540
2952A0225540K71089j95386J31689J99673L1338n44776r05741n95570k13078p31902
$$ 10225540 10496629 10301243 10432932 10632605 10663943 10119167 9213426 8617856 8404778 7672876
2942G672876m87333k33388m9097l33812k75354p0152j09364o37312L89916R0930
$$ 7672876 7185543 6952155 6903058 6569246 6293892 6223740 6114376 5477064 5866980 5957910
2932E957910J23369k47070k25313k92196j07259o3470p70158K04177J29148q9937
$$ 5957910 6081279 5834209 5608896 5316700 5209441 5145971 4375813 4579990 4709138 4619201
2922D619201l32306m3137k64099l49328l68240L37506o5097j63862j3980m49202
$$ 4619201 4286895 4243758 3979659 3630331 3262091 3599597 3534500 3370638 3356658 2907456
2912B907456k65728j1791M0400k48481K13603k91240K58579K66688m97689N1452
$$ 2907456 2641728 2629937 2670337 2421856 2635459 2344219 2602798 2869486 2371797 2423249
2902B423249L19863k61587k26356M779q1679q9663j37555R4246l39582j28332
$$ 2423249 2743112 2481525 2255169 2259948 2178269 2088606 1951051 2045297 1705715 1577383
2892A577383J8509J83173j241k98139J52957J37605j23132L1745q2344K7265k77003
$$ 1577383 1595892 1779065 1777824 1479685 1632642 1770247 1647115 1678860 1596516 1623781 1346778
2881A346778m21462K16518K9735k63251L01756j83552L8048L4412r208j11658
$$ 1346778 925316 1141834 1171569 908318 1210074 1026522 1064570 1098982 1089774 978116
2871I78116j88459L6960J30509O5970k57450k32287J1307K73656K08845l33682
$$ 978116 789657 826617 957126 1023096 765646 533359 544666 818322 1027167 693485
2861F93485j93528J04554P7192j53042O85457j82916l42574J2341j39959O0467
$$ 693485 499957 604511 681703 528661 1214118 1031202 688628 700969 561010 621477
2851F21477K80874J35853k66247o5871M97218K07885n23926k23292Q150p0150
$$ 621477 902351 1038204 771957 706086 1203304 1411189 887263 663971 672121 601971
2841F01971l9049J23416j57140K20461Q120q2240K95970Q0414k02751K88633m36048
$$ 601971 562922 686338 529198 749659 757779 675539 971509 1051923 849172 1137805 701757
2830G01757k68912L05605K18156l74048l53604J07839P1400M2064J52348Q0822
$$ 701757 432845 738450 956606 582558 228954 336793 408193 450257 602605 683427
2820F83427j88836K32141m567K096l91700K9064J82962m43j30191L16508l10812
$$ 683427 494591 726732 722165 724261 332561 361625 544587 544144 413953 730461 419649
2809D19649r6690M9856J24704M6728m57891L42858l21580K48465L10297l23314
$$ 419649 322959 372815 497519 544247 86356 429214 107634 356099 666396 343082
2799C43082j10916k90987K97931j97224Q2558J91885K33079n7883m8776J08517
$$ 343082 232166 -58821 239110 41886 124444 316329 549408 491525 442749 551266
2789E51266k07870o6509p274j92070j0921J80800k69117j87313K69559M19457
$$ 551266 343396 276887 269613 77543 66622 247422 -21695 -209008 60551 480008
2779D80008K23717j12232k65594K6598K9869J44128J92876j37051J13817J30217
$$ 480008 703725 591493 325899 352497 382366 526494 719370 582319 696136 826353
2769H26353l80447L26715j82139n53067j02299M22505L16044l41481K4300J41386
$$ 826353 445906 772621 590482 37415 -64884 357621 673665 332184 356484 497870
2759D97870p915L7779l98207j9762l1653L26767O96871N3801o30827J34714L58972
$$ 497870 489955 527734 129527 109765 78112 404879 1101750 1155551 524724 659438 1018410
2748A018410J2823j93859l48785l54408J87554k03532J74225M23555k91003L28579
$$ 1018410 1031233 837374 488589 134181 321735 118203 292428 715983 424980 753559
2738G53559K7895l46101l1151K54311j01304r7905L47700J01596m8744L9204m67387
$$ 753559 781454 435353 404202 658513 557209 459304 807004 908600 859856 899060 431673
2727D31673L56554J89567J08483J37702J41603Q6555m59900l70611K32212L5755
$$ 431673 788227 977794 1086277 1223979 1365582 1452137 992237 621626 853838 889593
2717H89593L4234k57766o3458K55237N9243m5576m2068N21204n25881J48442k7751
$$ 889593 923827 666061 602603 857840 917083 871507 829439 1350643 824762 973204 945453
2706I45453L06118K48805p3571j18458M2888K74211o4304m52461J66036J56652
$$ 945453 1251571 1500376 1426805 1308347 1351235 1625446 1561142 1108681 1274717 1431369
2696A431369R9386k23906L14108k36123l6134k46292k6995J13910K13268j58481
$$ 1431369 1530755 1306849 1620957 1384834 1348700 1102408 1075413 1189323 1402591 1244110
2686A244110K06594l3922l55420L14409j32083k4969j44114J58765j71197N9531
$$ 1244110 1450704 1416782 1061362 1375771 1243688 1218719 1074605 1233370 1062173 1121704
2676A121704j13321L25726K1064p3025j23065J05198Q5746k27913j11720j12059
$$ 1121704 1008383 1334109 1355173 1282148 1159083 1264281 1350027 1122114 1010394 898335
2666H98335k64662O65145L7847m11100m78597L42614K54764p655k57092j0884
$$ 898335 633673 1298818 1336665 925565 446968 789582 1044346 1036691 779599 768715
2656G68715J63319q4478j53367j52825k33207K60382M87358P73m33436O6536j91018
$$ 768715 932034 847556 694189 541364 308157 568539 1055897 1056670 623234 689770 498752
2645D98752M3320J10538r0898J76098J80774P0188m30034J1217k23829J88811
$$ 498752 542072 652610 561712 737810 918584 988772 558738 569955 346126 534937
2635E34937m52704K86945j00533l9567j56198J59303K69751l19781j73875J01870
$$ 534937 82233 369178 268645 229078 72880 232183 501934 182153 8278 110148
2625A10148N4062m8840M1476R806o8010J4377j44088J27943j736J14814J50876
$$ 110148 164210 115370 156846 166652 98642 113019 -31069 96874 95138 209952 360828
2614C60828J08242j22303K46831m281m44990q0874j52521N07165K01211k93483
$$ 360828 469070 346767 593598 589317 144327 63453 -89068 418097 619308 325825
2604C25825k14943J42226l43869J97999J01664n82711K88708k27803O2484O27320
$$ 325825 110882 253108 -90761 107238 208902 -373809 -85101 -312904 -250420 376900
2594C76900m91359J94454K7565P9535p1303l61363K3552P6092J06587j71908l6296
$$ 376900 -114459 79995 107560 187095 115792 -245571 -222019 -145927 -39340 -211248 -247544
2583b47544L6784j83881L85831K26028l98047m4425K87039j13166J38824j2520
$$ -247544 -210760 -394641 -8810 217218 -180829 -225254 61785 -51381 87443 74923
2573G4923l24652l0419O11665m70436P1156K13133m05377l3497M39557k18707
$$ 74923 -249729 -280148 331517 -138919 -67763 145370 -260007 -293504 146053 -72654
2563g2654l73388p0656O1430j1338M43661j51408o3245j19775J97306q464j65557
$$ -72654 -446042 -516698 -455268 -466606 -22945 -174353 -237598 -357373 -160067 -168531 -334088
2552c34088k81937M0388L15218J79809N7254n7961j32743J70018J3205j6435k50912
$$ -334088 -616025 -575637 -260419 -80610 -23356 -81317 -214060 -44042 -30837 -47272 -298184
2541b98184k527K05687L3697k14857J9540n5302K6294M73269n16943j3465j39934
$$ -298184 -300711 -95024 -61327 -276184 -256644 -311946 -285652 187617 -329326 -342791 -482725
2530d82725p5299L4295L99917j89246K11976k37978j08367L29299j3594j84916
$$ -482725 -558024 -523729 -123812 -313058 -101082 -339060 -447427 -118128 -131722 -316638
2520c16638K41940K02179K50716j18171l60440l37841J24238k38491o9558N72190
$$ -316638 -74698 127481 378197 260026 -100414 -438255 -314017 -552508 -622066 -49876
2510d9876J3954O071r1999l95325M32934p3183J6069M9147L13887l17463k63367
$$ -49876 -35922 -29851 -121850 -517175 -84241 -157424 -141355 -92208 221679 -95784 -359151
2499c59151K29735j32661L90102k80527L24139N1290m4357j03638k63182j06393
$$ -359151 -129416 -262077 128025 -152502 171637 222927 178570 74932 -188250 -294643
2489b94643r5859P6334n1031K44382j72482j69956J05889K5515j913K18283p5101
$$ -294643 -390502 -314168 -365199 -120817 -293299 -463255 -357366 -331851 -333764 -115481 -190582
2478a90582l1616r7916k66025O8473N0996k0337Q0724j94497p4621M42477l56378
$$ -190582 -222198 -320114 -586139 -517666 -466670 -487007 -406283 -600780 -675401 -232924 -589302
2467e89302K25277J39919O2421K04470j13074K9271m74915J26333o5930J16512
$$ -589302 -364025 -224106 -161685 42785 -70289 -41018 -515933 -389600 -455530 -339018
2457c39018q4801j1237l2169K35729J03795J3454l43938M3282J95718J48527k19907
$$ -339018 -423819 -435056 -467225 -231496 -127701 -114247 -458185 -414903 -219185 -70658 -290565
2446b90565O3980Q2084L37164k51526j11904j07323Q9664Q388k92255K83991k83853
$$ -290565 -226585 -144501 192663 -58863 -170767 -278090 -188426 -180038 -472293 -188302 -472155
2435d72155k2607l0093K11585L10394O5744n8759p36865N34389J83840k60830
$$ -472155 -494762 -524855 -313270 -2876 62868 4109 -732756 -198367 -14527 -275357
2425b75357J22125p5591L1034o3188J09913N0201J88310j88896J4255J22734J62223
$$ -275357 -153232 -228823 -197789 -260977 -151064 -100863 87447 -101449 -87194 35540 197763
2414A97763k3386j39418k28790K31223J1163L4243l70431J69087M31940j65365
$$ 197763 174377 34959 -193831 37392 48555 82798 -287633 -118546 313394 148029
2404A48029q6831J9395J10421j67489o9906j57025k91513L00925j51116O24966
$$ 148029 61198 80593 191014 23525 -46381 -203406 -494919 -193994 -345110 279856
2394B79856J41900m55401k29606L51665J39035M0827n06090j29623K06212J0122
$$ 279856 421756 -33645 -263251 88414 227449 268276 -237814 -367437 -161225 -151103
2384a51103J29560o58801N4428o3953R141J83135m9172K084K35697J76473K551
$$ -151103 -21543 -680344 -625916 -689869 -680728 -497593 -546765 -544681 -308984 -132511 -129960
2373a29960N4734j38598j03457K35311J43875k1290j66781q7111J76266r0549
$$ -129960 -75226 -213824 -317281 -81970 61905 40615 -126166 -213277 -37011 -127560
2363a27560J03826N8563N0395j9786J77843l19027J52025l00121R0227O2519K36119
$$ -127560 -23734 34829 85224 65438 243281 -75746 76279 -223842 -133615 -71096 165023
2352A65023k66922q0110Q0608j62898k54261J38978K26777K47992j62474o0707
$$ 165023 -101899 -182009 -101401 -264299 -518560 -379582 -152805 95187 -67287 -127994
2342a27994J97291j9380Q8208l15493j05188j4263k40914K96911M31434K2136
$$ -127994 69297 49917 138125 -177368 -282556 -296819 -537733 -240822 190612 212748
2332B12748m54558l40697L04270k3765K06760J08412Q9084K48779m02k72297Q372
$$ 212748 -241810 -582507 -278237 -302002 -95242 13170 102254 351033 350631 78334 86706
2321H6706K48908n4574l36636j52019M06737J17371l89033J03188L07235k53223
$$ 86706 335614 281040 -55596 -207615 199122 316493 -72540 30648 337883 84660
2311H4660k44314M45049l21761l5010r532j72046J2494N6061o3379N35387j43540
$$ 84660 -159654 285395 -36366 -71376 -80908 -252954 -240460 -184399 -247778 287609 144069
2300A44069L12444k16072k56927M96678k65452M1511l50189J4899K17398K39593
$$ 144069 456513 240441 -16486 480192 214740 256251 -93938 -79039 138359 377952
2290C77952N3761M1735m87415k77516K68983J23095k56272j49428L23160m7211
$$ 377952 431713 473448 -13967 -291483 -22500 100595 -155677 -305105 18055 -29156
2280b9156j93590K88876R1653k34539N6354j85054K15210n4513J60104l2299Q6155
$$ -29156 -222746 66130 157783 -76756 -20402 -205456 9754 -44759 115345 83046 169201
2269A69201l79362P4544L7762k43968J67550M86297r065j06210j62567K14911
$$ 169201 -210161 -135617 -97855 -341823 -174273 312024 302959 196749 34182 249093
2259B49093j45196o2407R047J46173n9866j68210j68579Q6498J08178o9907p7166
$$ 249093 103897 41490 50537 196710 136844 -31366 -199945 -113447 -5269 -75176 -152342
2248a52342n3692J55435P4499K74401J47242p3744l01924l50614k71251P52019
$$ -152342 -206034 -50599 23900 298301 445543 371799 69875 -280739 -551990 200029
2238B00029m33641K15836L60556l47594O6536j5036O3095L40393Q482l42945M7676
$$ 200029 -233612 -17776 342780 -4814 61722 46686 109781 450174 458656 115711 163387
2227A63387N1948K49556O5656k55356N570l74458n26648O43830K59710j96313
$$ 163387 215335 464891 530547 275191 280761 -93697 -620345 23485 283195 86882
2217H6882P1002K6934j88449K55828K29836j51375j74088q0374J50915q9222P0632
$$ 86882 157884 184818 -3631 252197 482033 330658 156570 76196 227111 137889 208521
2206B08521N40688n7850O5628j32604j45321j95466j84198J29675K14946j094
$$ 208521 749209 691359 756987 624383 479062 283596 99398 229073 444019 442925
2196D42925K18664K24605k06463Q3834k83305M36150K1290R238k42651J60102
$$ 442925 661589 886194 679731 763565 480260 916410 937700 946938 704287 864389
2186H64389j90184j25103K93926L4522k50058j79489O9536J05366l25613J19197
$$ 864389 674205 549102 843028 877550 627492 448003 517539 622905 297292 416489
2176D16489K77247K11377L10297m55769M0438j97301l6714M10120O1326j47958
$$ 416489 693736 905113 1215410 759641 800079 602778 566064 976184 1037510 889552
2166H89552k43755Q9648J61103M707j04984K50344j82994j6371J87051K42143
$$ 889552 645797 735445 896548 901255 796271 1046615 863621 847250 1034301 1276444
2156A276444K86013o6060p8724J46007Q959K28701j8019J38840L88124M05647
$$ 1276444 1562457 1496397 1417673 1563680 1572639 1801340 1783321 1922161 2310285 2715932
2146B715932p11492k53725J95679L44717K76378J45288K926k28145K31692J01150
$$ 2715932 2004440 1750715 1946394 2291111 2567489 2712777 2715703 2487558 2719250 2820400
2136B820400L63164K71889J70259j68021j03889M84503O91272K89866k16911j05596
$$ 2820400 3183564 3455453 3625712 3457691 3353802 3838305 4529577 4819443 4602532 4496936
2126D496936R16197M19351O11938k2715N85130J13997P29838P47965P91126O35198
$$ 4496936 5413133 5832484 6444422 6421707 7006837 7120834 7850672 8598637 9389763 10024961
2116A0024961L28678O53769Q91903J112767R15996J321697J001668J102779J648677
$$ 10024961 10353639 11007408 11899311 13012078 13928074 15249771 16251439 17354218 19002895
2107A9002895J494141J779278K395397K333449L577761M389400M845907O562682
$$ 19002895 20497036 22276314 24671711 27005160 30582921 34972321 39818228 46380910
2099D6380910P589041Q583823K617714m881466p751844r588366o547063n024674
$$ 46380910 53969951 62553774 65171488 60290022 52538178 42949812 36402749 31378075
2091C1378075m273872k868228j522833j291574j255783r53215j278078j500959
$$ 31378075 27104203 24235975 22713142 21421568 20165785 19212570 17934492 16433533
2083A6433533j166985j251237q55239p02768r65946m17929l16122n54454r21639
$$ 16433533 15266548 14015311 13160072 12457304 11491358 11073429 10757307 10202853 9281214
2074I281214n96113l25367l48719m86771q5055m08324l29196l44406n9283l69379
$$ 9281214 8685101 8359734 8011015 7524244 7439189 7030865 6701669 6357263 6297980 5928601
2064E928601q67277K05943j73227k86605m95742j95443l51295M65319q8891m7317
$$ 5928601 5061324 5267267 5094040 4807435 4311693 4116250 3764955 4230274 4141383 4094066
2054D094066k37483n29840k92888j53458P48687n51711k07789r2538k18795n1855
$$ 4094066 3856583 3326743 3033855 2880397 3629084 3077373 2869584 2777046 2558251 2506396
2044B506396r1673j87659N6537r7245l34692K67170l5352j39980j96221q7283
$$ 2506396 2414723 2227064 2283601 2186356 1851664 2118834 2083482 1943502 1747281 1659998
2034A659998r7881M880l43978n9439R3393L21665j95922K7318J19486l39151k212
$$ 1659998 1562117 1566997 1223019 1163580 1256973 1578638 1382716 1410034 1529520 1190369 1188157
2023A188157o977r9163j49239K8048j64782N3435N2469k91166K46291j24155J08657
$$ 1188157 1181180 1082017 932778 960826 796044 849479 901948 610782 857073 732918 841575
2012H41575O2546P33R0250n44730K60333P8107K95658k93675L5664k77375k31059
$$ 841575 904121 904854 995104 450374 710707 788814 1084472 790797 826461 549086 318027
2001C18027k3245K52754j08948j9852R839J66737k09608j31769j468j94577P8600
$$ 318027 294782 547536 438588 418736 428575 595312 385704 253935 252467 57890 136490
1990A36490j97417M52505J70560k25744j27881m1650K12464J79874R9529o19145
$$ 136490 -60927 391578 562138 336394 208513 166863 379327 559201 658730 39585
1980C9585J71525J59611P752K64944m33412k21530k8574K46047L8244L02870K38391
$$ 39585 211110 370721 378473 643417 210005 -11525 -40099 205948 244192 547062 785453
1969G85453k14063k89205j40854m3536k64349k12185P88669k62286j30179J16907
$$ 785453 571390 282185 141331 97795 -166554 -378739 409930 147644 17465 134372
1959A34372Q0408L9346j00309P4610r630k08249o8694L07392K43189r1280k25409
$$ 134372 214780 254126 153817 228427 218797 10548 -58146 249246 492435 401155 175746
1948A75746K52203j53011O6927j93139m59342J91248K55622q7172J10766j75459
$$ 175746 427949 274938 341865 148726 -310616 -119368 136254 49082 159848 -15611
1938a5611l59235P18942k23230m36500L95359m20883r503J16178J29108J24981
$$ -15611 -374846 344096 120866 -315634 79725 -341158 -350661 -234483 -105375 19606
1928A9606J13433j0117q005k30862p8449J92797j7017P6540n1025K8205j46854
$$ 19606 133039 122922 114917 -115945 -194394 -1597 -18614 57926 6901 35106 -111748
1917a11748K08036L00017r4663k13311j08499j63155L89889l18193J09566L17283
$$ -111748 96288 396305 301642 88331 -20168 -183323 206566 -111627 -2061 315222
1907C15222k47306J630R1556J28122k1208J03396Q438L983K3570j5398p3852P1471
$$ 315222 67916 69546 161102 289224 268016 371412 379850 383833 407403 392005 318153 389624
1895C89624k19259P160q1275J40674j5138j97640L46684j14322l76362L00810
$$ 389624 170365 177525 96250 236924 221786 24146 370830 256508 -119854 180956
1885A80956j58915k21394l12288N02003N4592J86937n2317j97766j44015m8884
$$ 180956 22041 -199353 -511641 -9638 44954 231891 179574 -18192 -162207 -211091
1875b11091J39393O5750j57673L40605q6766k15313K84605m34482M50886l30046
$$ -211091 -71698 -5948 -163621 176984 90218 -125095 159510 -274972 175914 -154132
1865a54132J62122n1069p9057K28049k2861l02853j70867M82239l21189p8812
$$ -154132 7990 -43079 -122136 105913 83052 -219801 -390668 91571 -229618 -308430
1855c08430M52144l84936K38620l20264R4160L08596j18966N2791l8268J61414
$$ -308430 143714 -241222 -2602 -322866 -228706 79890 -39076 13715 -24553 136861
1845A36861J85767j08332n73241J73011J61070M34692p7904j49109K73003k07310
$$ 136861 322628 214296 -358945 -185934 -24864 409828 331924 182815 455818 248508
1835B48508l78457M3433j49469P5280J19544l5400N10062j66542j32879o9810
$$ 248508 -129949 -86516 -235985 -160705 -41161 -76561 433501 266959 134080 64270
1825F4270L3823k63738N3699M4962o7132L47699j18474l50523o8963L38985j25377
$$ 64270 98093 -165645 -111946 -66984 -134116 213583 95109 -255414 -324377 14608 -110769
1814a10769M6516M23864l60635j79826O1536J31189j2828J79777n79856L18939
$$ -110769 -64253 359611 -1024 -180850 -119314 11875 -953 178824 -401032 -82093
1804h2093K1221n687N1360j23893K29156J69210k30622n26177O28966L5452m74190
$$ -82093 -60872 -66559 -15199 -139092 90064 259274 28652 -497525 131441 166893 -307297
1793c07297K80255k65166P7904Q3P1229J76979l46873m6235P2193J70218R9538
$$ -307297 -27042 -292208 -214304 -214221 -142992 33987 -312886 -359121 -286928 -116710 -17172
1782a7172J05132K91327o44752j07261L29868p4998m3916P3613L16825n58411
$$ -17172 87960 379287 -265465 -372726 -42858 -117856 -161772 -88159 228666 -329745
1772c29745r0358O1129K03349K34085j07074l96253j078L52704L12838j17587
$$ -329745 -420103 -358974 -155625 78460 -28614 -424867 -425945 -73241 239597 122010
1762A22010m46384j6016L26349J63334q8755j66549p523N7441M20379j13378k64891
$$ 122010 -324374 -340390 -14041 149293 60538 -106011 -113534 -56093 364286 250908 -13983
1751a3983J97199k78216m02429m0920K77499M50373m9680m05802k65602M29871
$$ -13983 183216 -95000 -497429 -538349 -260850 189523 139843 -265959 -531561 -101690
1741a01690J1777J05503k18742o8954J94343J45488j74417J29179l3597n7957
$$ -101690 -89913 15590 -203152 -272106 -77763 67725 -106692 22487 -11110 -69067
1731f9067j11420J55271j33292j38900K15706j79243K18106L14561n11479L57656
$$ -69067 -180487 -25216 -158508 -297408 -81702 -260945 -42839 271722 -239757 117899
1721A17899k64062m39907L77061J1571k28181J05145P0696k05592J16606L13414
$$ 117899 -146163 -586070 -209009 -197438 -425619 -320474 -249778 -455370 -338764 -25350
1711b5350R4975m23788p6606M23195R2907l53590J29459o3893R1608J17690j12986
$$ -25350 69625 -354163 -430769 -7574 85333 -268257 -138798 -202691 -111083 6607 -106379
1700a06379j46488L26253j49264M1991o0010j40382O5807l29605K88807M3062
$$ -106379 -252867 73386 -75878 -33887 -93897 -234279 -168472 -498077 -209270 -166208
1690a66208o2091j84665L38497k21778J01032n699P3170k64831p7342N47424n36038
$$ -166208 -228299 -412964 -74467 -296245 -195213 -200912 -127742 -392573 -469915 77509 -458529
1679d58529O23934j64656j69116J29246P1902k15656J96067j41752L40598r2679
$$ -458529 165405 749 -168367 -39121 32781 -182875 13192 -128560 212038 119359
1669A19359m10801L0107P0112P5951m8433Q7420k51579k516J38875m79374K49960
$$ 119359 -291442 -261335 -191223 -115272 -163705 -76285 -327864 -330380 -191505 -670879 -420919
1658d20919K02907K01067k3630j01895L31178j56298j97537j33908J62321J8945
$$ -420919 -218012 -16945 -40575 -142470 188708 32410 -165127 -299035 -136714 -117769
1648a17769K60166j66921n25107J48809N74845k3960l58476J59039P3887J32490
$$ -117769 142397 -24524 -549631 -400822 174023 150063 -208413 -49374 24513 157003
1638A57003J4260j35781j21683L3347k5324j58552n628l229n69033J09481K31696
$$ 157003 171263 35482 -86201 -52854 -78178 -236730 -242358 -245587 -814620 -705139 -473443
1627d73443N26426k7827j61409k4881Q2855K05976l98922N0523j04430J21754
$$ -473443 52983 25156 -136253 -161134 -78279 127697 -271225 -220702 -325132 -203378
1617b03378k12534J61973J41377l3201k86716J26091K09887j00999J84640k18687
$$ -203378 -415912 -253939 -112562 -145763 -432479 -306388 -96501 -197500 -12860 -231547
1607b31547L01904K63272k9339r3182L9192j58687J72998K16174o41767j53129
$$ -231547 70357 333629 304290 211108 250300 91613 264611 480785 -160982 -314111
1597c14111M261N97373O5052J18348k38217q1777j46571k87212L06679J67645
$$ -314111 -309850 287523 352575 470923 232706 150929 4358 -282854 23825 191470
1587A91470m02862J96275n9322k84807K27671L34554k67290l15504J6148n1245
$$ 191470 -211392 -15117 -74439 -359246 -131575 202979 -64311 -379815 -363667 -414912
1577d14912K29575N8460l79635n0266J13556P1180J88863K6511J0053k34849J81309
$$ -414912 -185337 -126877 -506512 -556778 -443222 -372042 -183179 -156668 -146615 -381464 -200155
1566b00155j01114l5032L02318p2327q1539R837l21447M83788J46743k50209j96473
$$ -200155 -301269 -336301 -33983 -106310 -187849 -178012 -499459 -15671 131072 -119137 -315610
1555c15610j19257Q1027l5780K05820m05340K07728K45738j46979K8041J72157
$$ -315610 -434867 -353840 -389620 -183800 -589140 -381412 -135674 -282653 -254612 -82455
1545h2455n01088J81635K54439j86644L52487J84730r9216p9099q8798J0221k00929
$$ -82455 -583543 -401908 -147469 -334113 18374 203104 103888 24789 -64009 -53788 -254717
1534b54717M10265J5884j51919j19372l22891J96945m3755R7290m6640k6577j62557
$$ -254717 155548 171432 19513 -99859 -422750 -225805 -269560 -172270 -218910 -245487 -408044
1523d08044L43759R3538J42402j19733k33169J5957J5653k3876N7682K35736k56088
$$ -408044 -64285 29253 171655 51922 -181247 -165290 -149637 -173513 -115831 119905 -136183
1512a36183k20808K69783l6989K03273l1368m6505j50433l36782J31305K77511
$$ -136183 -356991 -87208 -124197 79076 47708 1203 -149230 -486012 -354707 -77196
1502g7196O434n8703n1873j10928J12540K55254j67509M15431j33235k08116Q2242
$$ -77196 -70762 -129465 -181338 -292266 -179726 75528 -91981 323450 190215 -17901 64341
1491F4341n38060K47749J46523j88095M09175J14244k08220l51854j41165J61440
$$ 64341 -473719 -225970 -79447 -267542 141633 255877 47657 -304197 -445362 -283922
1481b83922N3567j1154L22944k49339L7319m18137q0930L86949K8215k30980L85158
$$ -283922 -230355 -241509 81435 -167904 -130585 -548722 -629652 -242703 -214488 -445468 -60310
1470f0310O9161r0016M7654r160j26904k06669j03N19458Q5702k88480p9294L4917
$$ -60310 8851 -81165 -33511 -42671 -169575 -376244 -376347 143111 228813 -59667 -138961 -104044
1458a04044j43672K0034k05114M47294l72921l55873J79810J45880J71326j79882
$$ -104044 -247716 -227682 -432796 14498 -358423 -714296 -534486 -388606 -217280 -397162
1448c97162k2122q9307P1930m5862R5867P2851K85220r6187J49880P4694p9191
$$ -397162 -419284 -508591 -436661 -482523 -386656 -313805 -28585 -124772 25108 99802 20611
1437B0611k07344N96014k64617o49737N13043K3190l28941L76682p5584j15510
$$ 20611 -186733 409281 144664 -505073 7970 31160 -297781 78901 3317 -112193
1427a12193j52666o508J49883O3085j61915K37699m12132K66415m5974L03893
$$ -112193 -264859 -271367 -121484 -58399 -220314 17385 -394747 -128332 -174306 129587
1417A29587j1306L646L3415k66545J89360j6520l02807L84272n93781L09252j89059
$$ 129587 118281 121927 155342 -111203 78157 61637 -241170 143102 -450679 -141427 -330486
1406c30486J92886J29571J7716k78419L52102l13049l4750M12277k71991L4404
$$ -330486 -137600 -8029 9687 -268732 83370 -229679 -264429 147848 -124143 -89739
1396h9739M149p3964q9833Q9098l83522L17940J06155K7507r4812J96264r6084
$$ -89739 -85590 -159554 -249387 -160289 -543811 -225871 -119716 -92209 -187021 9243 -86841
1385h6841K3063k79668J64701K30704j35241o9047q3142n8780K5023J73173j09551
$$ -86841 -63778 -343446 -178745 51959 -83282 -152329 -235471 -294251 -269228 -96055 -205606
1374b05606K07795R4017p6546J90266l22657J09697j34638L46534L9368m98537
$$ -205606 2189 96206 19660 209926 -112731 -3034 -137672 208862 248230 -250307
1364b50307J25987k43k95776L50929o3297r9338J15530J35493N1301J7019K05524
$$ -250307 -124320 -124563 -420339 -69410 -132707 -232045 -116515 18978 70279 87298 292822
1353B92822J41649j84128m5982p3968m10814j57878k635J57117K31072r2474N4004
$$ 292822 434471 250343 204361 130393 -280421 -438299 -440934 -283817 -52745 -145219 -91215
1342i1215q0023K49935j47575N8077p9242j75861L9288L19737p4451m16735R8932
$$ -91215 -171238 78697 -68878 -10801 -90043 -265904 -226616 93121 18670 -398065 -299133
1331b99133K02542q3501L2468L8856j02123K49391P3800k79875j09241m07674
$$ -299133 -96591 -180092 -147624 -108768 -210891 38500 112300 -167575 -276816 -684490
1321f84490K57080j64564J38842L22682O0084M06387N8584j1341j43580m39802
$$ -684490 -427410 -591974 -453132 -130450 -70366 336021 394605 383264 239684 -200118
1311b00118k22281o5954J60810O30932j98466o6849L8916l93775k87868N51431
$$ -200118 -422399 -488353 -327543 303389 104923 38074 76990 -316785 -604653 -53222
1301e3222L8657j29100K1558N757l2246L5115q3245J50327o9321K53533J87629
$$ -53222 -14565 -143665 -122107 -116350 -148596 -113481 -196726 -46399 -115720 137813 325442
1290C25442n57577J54407j67079n3012L66226n7382j35034M28247j15462k73088
$$ 325442 -232135 -77728 -244807 -297819 68407 11025 -124009 304238 188776 -84312
1280h4312K6905q5563J53800j05721p6901k15585P2920L85881j3805N48407m07861
$$ -84312 -57407 -142970 10830 -94891 -171792 -387377 -314457 71424 57619 606026 198165
1269A98165p2779K48475p9990k26284q101J27628M9376j01861j02628m9402K14563
$$ 198165 125386 373861 293871 67587 59486 187114 236490 134629 32001 -17401 197162
1258A97162n1881j02948o9411P7236p657J26916o7714k85110M98983l7896k04775
$$ 197162 145281 42333 -27078 50158 42501 169417 101703 -183407 315576 277680 72905
1247G2905l12451k13622L6095L69293L30085k31932o3569l7385L29270j28459
$$ 72905 -239546 -453168 -417073 -47780 282305 50373 -13196 -50581 278689 150230
1237A50230j38499J01309J3797k27215n8325k62987K01038J07653K96697m11281
$$ 150230 11731 113040 126837 -100378 -158703 -421690 -220652 -112999 183698 -227583
1227b27583l37422P53510J00762l69712n20374N80131j97684N66692m48492J88718
$$ -227583 -565005 188505 289267 -80445 -600819 -20688 -218372 348320 -100172 88546
1217H8546k8036M7702k3986M5606P792j28312O8177o2521O5986J16573k67998
$$ 88546 60510 108212 84226 129832 137624 9312 77489 14968 80954 197527 -70471
1206g0471M6192K78865l92979Q7152j03863J01991Q0026L65211m4837j34397j68666
$$ -70471 -24279 254586 -138393 -51241 -155104 -53113 26913 392124 347287 212890 44224
1195D4224l16162L78104k19312j54100J69854K25140m34878p2374N16269k61210
$$ 44224 -271938 106166 -113146 -267246 -97392 127748 -307130 -379504 136765 -124445
1185a24445R0499j24677n2590K94970M67801m41360l41705L4480K61256K03994
$$ -124445 -33946 -158623 -211213 83757 551558 110198 -231507 -197027 64229 268223
1175B68223j04172j88938j00313M12083Q7488k13128p6184j69897j88169L03117
$$ 268223 164051 -24887 -125200 286883 374371 161243 85059 -84838 -273007 30110
1165C0110r8527k4409K65349o5985L6675j03475l48613K80158j93915O0204J2895
$$ 30110 -68417 -92826 172523 106538 143213 39738 -308875 -28717 -222632 -162428 -149533
1154a49533j47573N7933k25603j58001J31148M32548K74314l21162J36878N18421
$$ -149533 -297106 -239173 -464776 -622777 -491629 -59081 215233 -105929 30949 549370
1144E49370l80663j16800M17403l05249J5488q7281K19266J0571m42821j61709
$$ 549370 168707 51907 469310 164061 179549 92268 311534 322105 -120716 -282425
1134b82425N39259j68682j07315q7213k37216K36196J68879M036p5133j1823o621
$$ -282425 256834 88152 -19163 -106376 -343592 -107396 61483 65519 -9614 -21437 -28058
1123b8058k49302O9725M04287L24084k24820l84504q9908L7004L85571N6809r7207
$$ -28058 -277360 -207635 196652 520736 295916 -88588 -178496 -141492 244079 300888 203681
1112B03681l6532j45380P0480j27822j26266j14593K49237q254o1057J91050l05937
$$ 203681 167149 21769 92249 -35573 -161839 -276432 -27195 -35449 -96506 94544 -211393
1101b11393J44001P8010j72413K02269m0844j69129J16630j4563k3298k0375K80715
$$ -211393 -67392 10618 -161795 40474 -370 -169499 -52869 -67432 -90730 -111105 169610
1090A69610k32647L04889j21299J78441l06599k12670l6495L78851j65171K25798
$$ 169610 -63037 241852 120553 298994 -7605 -220275 -256770 122081 -43090 182708
1080A82708R3038j6148k62468J52987N4442j1841j05248k62290J9616M61576l40160
$$ 182708 275746 259598 -2870 150117 204559 192718 87470 -174820 -155204 306372 -33788
1069c3788k15732K17752l01699R7280J34453j04829K78994l81674m19574M12457
$$ -33788 -249520 -31768 -333467 -236187 -101734 -206563 72431 -309243 -728817 -316360
1059c16360J67876K00773m00945J63096n1548K98766J06541j23599j63053l26980
$$ -316360 -148484 52289 -348656 -185560 -237108 61658 168199 44600 -118453 -445433
1049d45433Q0582J66902K22953M0384k8769J31587J98806q4743J07959k59005
$$ -445433 -364851 -197949 25004 65388 36619 168206 367012 282269 390228 131223
1039A31223j80542K48768j12940J80775J68604q2934P8080J02420k15570j73661
$$ 131223 -49319 199449 86509 267284 435888 352954 431034 533454 317884 144223
1029A44223K30398m30477J41411K8909k41115J85835m2116L94641k67430P3210
$$ 144223 374621 -55856 85555 114464 -126651 59184 17068 411709 144279 217489
1019B17489k08537m4740k36106N5607j39502k66087O92710O5726N3698l89727
$$ 217489 8952 -35788 -271894 -216287 -355789 -621876 70834 136560 190258 -199469
1009a99469M37116j90422m9387L9883n1252M12518j23218k17265k8072J05344
$$ -199469 237647 47225 -2162 37721 -13531 398987 275769 58504 30432 135776
999A35776o3008l05328J8192j16397O7451K19592k03202K31994J86551N6833j36938
$$ 135776 72768 -232560 -214368 -330765 -263314 -43722 -246924 -14930 171621 228454 91516
988I1516L4363j47004j3191P0957K70672l90773j45276L31767o6153J25659q074
$$ 91516 125879 -21125 -34316 36641 307313 -83460 -228736 103031 36878 162537 154463
977A54463j88397J68876k00511L27137j17721J43980k83879j09433P3358K23288
$$ 154463 -33934 134942 -65569 261568 143847 287827 3948 -105485 -32127 191161
967A91161N9052l39923P3894j70043J39417k31439j63821M77131L25960l26788
$$ 191161 250213 -89710 -15816 -185859 -46442 -277881 -441702 35429 361389 34601
957C4601r0410k92899j11413M68821J07600K6110j1106k8891M46027j21058n60549
$$ 34601 -55809 -348708 -460121 8700 116300 142410 131304 102413 548440 427382 -133167
946a33167O55073j51865j82976n2957j07509p2274l09341K82596O25932k82277
$$ -133167 521906 370041 187065 134108 26599 -45675 -355016 -72420 553512 271235
936B71235j59644L95797m36562l07944K77567K8536m1644j39041l38384K86372
$$ 271235 111591 507388 70826 -237118 40449 68985 27341 -111700 -450084 -163712
926a63712J44132K49408q4084j88389J20829J92182q4383j87529k04336M67829
$$ -163712 -19580 229828 145744 -42645 78184 270366 185983 -1546 -205882 261947
916B61947K1356k79890m67030J97669M66696l89080M39155j34088k51536p2515
$$ 261947 283303 3413 -463617 -265948 200748 -188332 250823 116735 -134801 -207316
906b07316L98138j09485k83688O13142J80734o42870j14573J88247K76606N8876
$$ -207316 190822 81337 -202351 410791 591525 -51345 -165918 22329 298935 357811
896C57811j16521R2504m31964L16271K06697j65196J06632n5465K23307j89868
$$ 357811 241290 333794 -98170 218101 424798 259602 366234 310769 534076 344208
886C44208k36676k0693k68527L97504J41862q7781K9320k35525n24936M54490
$$ 344208 107532 86839 -181688 215816 357678 269897 299217 63692 -461244 -6754
876f754K42182k43898N0233k92800R7908K73658o0609o5408L27681l49873j8778
$$ -6754 235428 -8470 41763 -251037 -153129 120529 59920 -5488 322193 -27680 -46458
865d6458j16500K45453J70614q9526j9660l93392K22781j23387k58724K91108
$$ -46458 -162958 82495 253109 163583 143923 -249469 -26688 -150075 -408799 -117691
855a17691k34559J04067K04202l54281j61040K75287M18356j97013R1704j85936
$$ -117691 -352250 -248183 -43981 -398262 -559302 -284015 134341 -62672 29032 -156904
845a56904O59J68340K3773M07001m72251K78436L46670o98821j43821k31289K30464
$$ -156904 -156245 12095 35868 442869 -29382 249054 595724 -103097 -246918 -478207 -247743
834b47743m8130K57108j18042J42321N11550l23116m6816O4094n4952m2988M583
$$ -247743 -295873 -38765 -156807 -14486 497064 173948 127132 191226 136274 93286 97869
823I7869k66923k89563K91239P8772Q2489k41799P2018M23964J34k08722j50371
$$ 97869 -169054 -458617 -167378 -88606 -6117 -247916 -175898 248066 248200 39478 -110893
$$ [...]
##END NTUPLES=NMR SPECTRUM
##END=
