##TITLE=1H_CA-8667-2
 DMSO, 8 sc, 
 18.11.2019
##JCAMPDX= 6.0         $$ Bruker NMR JCAMP-DX V2.0
##DATA TYPE= NMR FID
##DATA CLASS= NTUPLES
##ORIGIN= UXNMR, Bruker Analytische Messtechnik GmbH
##OWNER= root
$$ XWIN-NMR		Version 3.5
$$ Mon Nov 18 14:10:04 2019 Russian Standard Time (UT+4h)  she@DPX200
##.OBSERVE FREQUENCY= 200.1315
##.OBSERVE NUCLEUS= ^1H
##.DELAY= (6, 6)
##.ACQUISITION MODE= SIMULTANEOUS
##.ACQUISITION SCHEME= undefined
##.AVERAGES= 8
##.DIGITISER RES= 18
##SPECTROMETER/DATA SYSTEM= spect
##.PULSE SEQUENCE= zg30
##.SOLVENT NAME= DMSO
##.SHIFT REFERENCE= (INTERNAL, DMSO, 0, 15.7039)
##AUDIT TRAIL= $$ (NUMBER, WHEN, WHO, WHERE, WHAT)
$$ ##TITLE= Audit trail, XWIN-NMR		Version 3.5
$$ ##JCAMPDX= 5.01
$$ ##ORIGIN= Bruker BioSpin GmbH
$$ ##OWNER= she
$$ F:/spectra/data/she/nmr/H-F/1/audita.txt
$$ ##AUDIT TRAIL=  $$ (NUMBER, WHEN, WHO, WHERE, WHAT)
(   1,<2019-11-18 14:09:06.54 +0400>,<she>,<DPX200>,
      <created by zg, POWCHK disabled, PULCHK disabled
       configuration hash MD5:
       00 E9 B6 7A A2 85 ED C7 34 08 36 98 17 FE 4E 26
       data hash MD5: 16K
       3F 94 75 78 6C 31 2B A3 EC D2 07 20 E9 22 BB 18>)
$$ ##END=
$$ 
$$ hash MD5
$$ B1 AB DA 8A 5C 56 B5 B9 02 59 39 2A CC E7 EF C3
##$RELAX= 
##$RELAX= 
##$RELAX= 
##$RELAX= 
##$RELAX= 
##$RELAX= 
$$ Bruker specific parameters
$$ --------------------------
##$DU= <F:/spectra>
##$EXPNO= 1
##$NAME= <H-F>
##$PROCNO= 1
##$TYPE= <nmr>
##$USER= <she>
##$AMP= (0..31)
100 100 100 100 100 100 100 100 100 100 100 100 100 100 100 100 100 100 
100 100 100 100 100 100 100 100 100 100 100 100 100 100 
##$AQSEQ= 0
##$AQ_mod= 1
##$AUNM= <au_zg>
##$AUTOPOS= <>
##$BF1= 200.13
##$BF2= 200.13
##$BF3= 200.13
##$BF4= 200.13
##$BF5= 200.13
##$BF6= 200.13
##$BF7= 200.13
##$BF8= 200.13
##$BYTORDA= 1
##$CFDGTYP= 0
##$CFRGTYP= 5
##$CHEMSTR= <none>
##$CNST= (0..31)
1 1 145 1 1 1 1 1 1 1 1 1 1 1 1 1 1 1 1 1 1 1 1 1 1 1 1 1 1 1 1 1 
##$CPDPRG= <>
##$CPDPRG1= <>
##$CPDPRG2= <>
##$CPDPRG3= <>
##$CPDPRG4= <mlev>
##$CPDPRG5= <mlev>
##$CPDPRG6= <mlev>
##$CPDPRG7= <mlev>
##$CPDPRG8= <mlev>
##$CPDPRGB= <>
##$CPDPRGT= <>
##$D= (0..31)
0 1.2 0 0 0 0 0 0 0 0.06 0 0.03 0 0 0 0 0.0002 0 0 0 0 0 0 0 0 0 0 0 0 
0 0 0 
##$DATE= 1574071746
##$DBL= (0..7)
120 120 120 120 120 120 120 120 
##$DBP= (0..7)
150 150 150 150 150 150 150 150 
##$DBP07= 0
##$DBPNAM0= <>
##$DBPNAM1= <>
##$DBPNAM2= <>
##$DBPNAM3= <>
##$DBPNAM4= <>
##$DBPNAM5= <>
##$DBPNAM6= <>
##$DBPNAM7= <>
##$DBPOAL= (0..7)
0.5 0.5 0.5 0.5 0.5 0.5 0.5 0.5 
##$DBPOFFS= (0..7)
0 0 0 0 0 0 0 0 
##$DE= 6
##$DECBNUC= <off>
##$DECIM= 24
##$DECNUC= <off>
##$DECSTAT= 4
##$DIGMOD= 1
##$DIGTYP= 9
##$DL= (0..7)
0 120 120 120 120 120 120 120 
##$DP= (0..7)
150 150 150 150 150 150 150 150 
##$DP07= 0
##$DPNAME0= <>
##$DPNAME1= <>
##$DPNAME2= <>
##$DPNAME3= <>
##$DPNAME4= <>
##$DPNAME5= <>
##$DPNAME6= <>
##$DPNAME7= <>
##$DPOAL= (0..7)
0.5 0.5 0.5 0.5 0.5 0.5 0.5 0.5 
##$DPOFFS= (0..7)
0 0 0 0 0 0 0 0 
##$DQDMODE= 0
##$DR= 18
##$DS= 0
##$DSLIST= <SSSSSSSSSSSSSSS>
$$ [...]
##$SUBNAM2= <"">
##$SUBNAM3= <"">
##$SUBNAM4= <"">
##$SUBNAM5= <"">
##$SUBNAM6= <"">
##$SUBNAM7= <"">
##$SUBNAM8= <"">
##$SUBNAM9= <"">
##$SW= 24.0689530833862
##$SWIBOX= (0..15)
0 0 2 0 0 0 0 0 0 0 0 0 0 0 0 0 
##$SW_h= 4816.95568400771
##$TD= 16384
##$TD0= 1
##$TE= 0
##$TE2= 300
##$TE3= 300
##$TEG= 300
##$TL= (0..7)
0 120 120 120 120 120 120 120 
##$TP= (0..7)
150 150 150 150 150 150 150 150 
##$TP07= 0
##$TPNAME0= <>
##$TPNAME1= <>
##$TPNAME2= <>
##$TPNAME3= <>
##$TPNAME4= <>
##$TPNAME5= <>
##$TPNAME6= <>
##$TPNAME7= <>
##$TPOAL= (0..7)
0.5 0.5 0.5 0.5 0.5 0.5 0.5 0.5 
##$TPOFFS= (0..7)
0 0 0 0 0 0 0 0 
##$TUNHIN= 0
##$TUNHOUT= 0
##$TUNXOUT= 0
##$USERA1= <user>
##$USERA2= <user>
##$USERA3= <user>
##$USERA4= <user>
##$USERA5= <user>
##$V9= 5
##$VALIST= <valist>
##$VCLIST= <CCCCCCCCCCCCCCC>
##$VD= 0
##$VDLIST= <DDDDDDDDDDDDDDD>
##$VPLIST= <PPPPPPPPPPPPPPP>
##$VTLIST= <TTTTTTTTTTTTTTT>
##$WBST= 1024
##$WBSW= 4
##$XGAIN= (0..3)
0 0 0 0 
##$XL= 0
##$YL= 0
##$YMAX_a= 725900
##$YMIN_a= -521995
##$ZGOPTNS= <>
##$ZL1= 120
##$ZL2= 120
##$ZL3= 120
##$ZL4= 120
##$ABSF1= 10
##$ABSF2= 0
##$ABSG= 5
##$ABSL= 3
##$ALPHA= 0
##$AQORDER= 0
##$ASSFAC= 0
##$ASSFACI= 0
##$ASSFACX= 0
##$ASSWID= 0
##$AUNMP= <proc_1d>
##$AZFE= 0.1
##$AZFW= 0.1
##$BCFW= 1
##$BC_mod= 2
##$BYTORDP= 1
##$COROFFS= 0
##$CY= 11.3945322036743
##$DATMOD= 1
##$DC= 2
##$DFILT= <>
##$DTYPP= 0
##$F1P= 16.9975609425685
##$F2P= -3.02152046262296
##$FCOR= 0.5
##$FTSIZE= 0
##$FT_mod= 4
##$GAMMA= 1
##$GB= 0.15
##$INTBC= 1
##$INTSCL= 1
##$ISEN= 128
##$LB= 0.24
##$LEV0= 0
##$LPBIN= 0
##$MAXI= 10000
##$MC2= 0
##$MEAN= 0
##$ME_mod= 0
##$MI= 1.114404
##$NCOEF= 0
##$NC_proc= 0
##$NLEV= 6
##$NOISF1= 3.799351
##$NOISF2= 2.8
##$NSP= 1
##$NTH_PI= 0
##$NZP= 0
##$OFFSET= 15.70392
##$PC= 1
##$PHC0= -9434.51
##$PHC1= 18.00087
##$PH_mod= 1
##$PKNL= yes
##$PPARMOD= 0
##$PSCAL= 0
##$PSIGN= 0
##$REVERSE= no
##$SF= 200.130013532006
##$SI= 16384
##$SIGF1= 3
##$SIGF2= 2
##$SINO= 400
##$SIOLD= 16384
##$SREGLST= <1H.CDCl3>
##$SSB= 0
##$STSI= 0
##$STSR= 0
##$SW_p= 3612.71676300578
##$SYMM= 0
##$S_DEV= 0
##$TDeff= 0
##$TDoff= 0
##$TI= <>
##$TILT= no
##$TM1= 0
##$TM2= 0
##$TOPLEV= 0
##$USERP1= <user>
##$USERP2= <user>
##$USERP3= <user>
##$USERP4= <user>
##$USERP5= <user>
##$WDW= 1
##$XDIM= 8192
##$YMAX_p= 0
##$YMIN_p= 0
$$ End of Bruker specific parameters
$$ ---------------------------------
##NTUPLES= NMR FID
##VAR_NAME=  TIME,          FID/REAL,        FID/IMAG
##SYMBOL=    X,             R,               I
##VAR_TYPE=  INDEPENDENT,   DEPENDENT,       DEPENDENT
##VAR_FORM=  AFFN,          ASDF,            ASDF
##VAR_DIM=   8192,          8192,            8192
##UNITS=     SECONDS,       ARBITRARY UNITS, ARBITRARY UNITS
##FACTOR=    0.0002076,     1,               1
##FIRST=     0,             0,               0
##LAST=      1.7004516,     0,               0
##MIN=       0,             -521995,         0
##MAX=       1.7004516,     725900,          0
$$ Real data points
##PAGE= N=1
##DATA TABLE= (X++(R..R)), XYDATA
$$ [...]
$$ plain form
1864 73 209 -241 379 307 -126 -54 -71 -27 51 -77 -350 -181 89 317 -130 -33 -102 -57 60 110 -349 209 -30
1887 -30 82 -91 53 -69 -106 -201 98 -57 50 -89 127 -189 -223 -173 -247 -40 -204 -53 160 6 118 -237
1909 -237 -170 -131 -109 -57 -139 325 68 25 -269 194 120 -26 -212 35 82 86 63 -203 -125 119 -37 -331 180 -229
1933 -229 -144 -182 70 160 148 -226 -16 9 63 161 -182 104 61 80 -125 -248 5 275 151 -165 39 -282 33
1956 33 41 -54 135 97 -142 -9 -64 -67 -25 -46 120 -180 69 271 65 -348 -201 -63 8 20 32 232 -207 227
1980 227 -156 -31 121 -84 -186 -86 51 211 -21 -135 -65 -208 366 -267 -129 12 101 -89 -13 88 -292
2001 -292 35 101 214 -62 478 152 -62 -114 -143 -78 -61 31 -119 227 -203 -18 247 19 7 -157 53 -10 -77
2024 -77 133 -87 -125 -123 -143 -58 -218 -2 162 -51 -102 -2 51 -12 71 -193 -58 485 -80 -165 161 150 -81 -185
$$ packed form
1864G3J36m50O20p2m33P2j7M4P8j28k73J69K70K28m47R7o9M5J17N0m59N58k39
1887c0J12j73J44j22l7r5K99j55J07j39K16l16l4N0p4K07j64J51K13j54J12l55
1909b37O7L9K2N2q2M64k57m3k94M63p4j46j86K47M7Mk3k66P8K44j56k94N11m09
1933b29Q5l8K52R0j2l74K10K5N4R8l43K86m3J9k05j23K53K70j24l16K04l21L15
1956C3Qr5J89l8k39J33n5lM2k1J66l00K49K02k06m13J47J38P1J2J2K00m39M34
1980B27l83J25J52k05j02J00J37J60k32j14P0j43N74o33J38J41Q9j90P6J01l80
2001b92L27O6J13k76N40l26k14n2k9O5J7R2j50L46m30J85K65k28j2j64K10o3o7
2024g7K10k20l8Kk0Q5j60K16J64k13n1J00N3o3Q3k64J35N43n65q5L26j1k31j04
$$ plain form
2048 -185 -19 -58 -155 -22 -140 149 192 -65 204 35 338 177 -109 -121 -43 -41 -24 244 -88 -302 171 -250 -200
2071 -200 -58 -115 4 47 49 -116 10 4 14 -97 120 61 -226 -2 -90 -45 -2 -62 -150 159 240 -45 17 85 2 -105
2097 -105 -23 -58 -181 -65 -129 -158 31 1 -263 155 117 -3 95 -14 36 10 -96 -64 12 274 -89 26 -175 143
2121 143 -77 93 -2 -107 342 129 -235 64 157 144 -58 -189 196 -58 218 82 -30 -45 49 121 -37 9
2143 9 -234 4 76 -83 -97 -7 -23 44 294 -76 150 216 144 -252 9 53 122 -232 81 -147 257 -243 -159 -338
2167 -338 141 107 106 130 282 -68 -35 65 167 6 -72 -212 -49 68 -109 -155 -200 9 399 141 28 -7 201
2190 201 114 -188 43 -33 111 -162 121 -165 49 -142 17 74 -87 66 0 -171 -348 -22 -127 -37 -34 55 254
2213 254 43 -212 -229 -253 27 -328 -222 32 -303 -63 -153 3 72 199 151 -246 76 -40 76 58 327 -211
$$ packed form
2048a85J66l9r7J33j18K89M3k57K69j69L03j61k86j2P8KJ7K68l32k14M73m21N0
2071b00J42n7J19M3Kj65J26oJ0j11K17n9k87K24q8M5M3o0q8L09Q1k85O2O8q3j07
2097a05Q2l5j23J16o4k9J89l0k64M18l8j20R8j09N0k6j06L2P6K62l63J15k01L18
2121A43k20J70r5j05M49k13l64K99R3j3k02j31L85k54K76j36j12j5R4P2j58M6
2143Ik43K38P2j59j4R0j6O7K50l70K26O6p2l96K61M4O9l54L13k28M04n00Q4j79
2167c38M79l4jK4J52l50L3J00J02j61p8j40J63J17j77m6m5K09L90k58j13l5K08
2190B01q7l02K31p6J44k73K83k86K14j91J59N7j61J53o6j71j77L26j05R0LQ9J99
2213B54k11k55j7k4K80l55J06K54l35K40r0J56O9J27m8l97L22j16J16j8K69n38
$$ plain form
2235 -211 4 11 101 -121 -248 10 51 -64 -12 72 -60 74 -296 52 -129 -112 -17 138 35 129 195 -143 211
2258 211 108 78 100 61 -295 -18 59 61 -5 67 13 -121 269 -51 30 68 180 -124 -89 171 84 77 -241 -205 518
2283 518 -70 133 -153 186 -33 -222 153 130 -58 -139 -223 149 13 10 162 127 298 -144 -175 3 87 160 -69
2306 -69 308 -118 -1 241 -40 -6 63 -41 218 76 394 -307 -185 -239 21 -130 40 -55 -173 -52 -153 66
2328 66 204 30 -224 324 -176 246 -211 188 -164 33 -211 -307 -139 320 -124 -60 -104 27 -120 -118 -114 -150 -52
2351 -52 172 66 -41 126 103 -38 -267 -229 77 93 -71 103 75 1 134 -100 -55 -9 -112 101 -189 30 157
2374 157 -8 50 88 222 -118 -24 125 -30 358 -43 66 -97 -40 144 -202 17 72 64 -85 43 10 228 -278
2397 -278 71 5 74 110 471 94 89 39 57 4 -81 176 -141 -49 -178 192 74 25 -157 -141 -125 -160 24 -105 156
$$ packed form
2235b11K15PR0k22j27K58M1j15N2Q4j32J34l70L48j81J7R5J55j03R4O6l38L54
2258B11j03l0K2l9l56K77P7Ko6P2n4j34L90l20Q1L8J12l04L5K60q7pl18L6P23
2283E18n88K03k86L39k19j89L75k3j88q1q4L72j36lJ52l5J71m42l1J78Q4P3k29
2306f9L77m26J17K42k81L4O9j04K59j42L18p01J22n4K60j51J70r5j18J21j01K19
2328F6J38j74k54N48n00M22m57L99l52J97k44r6J68M59m44O4m4J31j47KMl6R8
2351e2K24j06j07J67k3j41k29L8L06J6j64J74k8p4J33k34M5M6j03K13k90K19J27
2374A57j65N8L8J34l40R4J49j55L88m01J09j63N7J84l46K19N5qj49J28l3K18n06
2397b78L49o6O9L6L61l77nn0J8n3q5K57l17R2j29L70j18m9j82J6J6l5J84j29K61
$$ plain form
2422 156 -149 -25 -5 -34 -21 -127 3 -131 101 95 138 -49 -40 -49 246 80 -80 8 51 2 -154 -131 150 197 -117
2447 -117 -350 105 143 153 -155 -122 -52 91 -34 -84 193 64 100 -120 -249 170 110 16 55 -205 -43 -245 -307
2470 -307 -4 77 49 -258 128 -43 250 97 -45 -151 -164 -265 224 -287 202 -151 -14 -175 -160 133 4
2491 4 -30 104 79 283 41 -136 -153 -332 93 -139 120 38 -61 -85 68 -212 -21 151 160 -282 144 6 64 259
2515 259 -80 -43 70 -85 138 214 206 28 53 -263 152 124 59 95 57 -97 103 -252 -38 3 169 35 308
2538 308 -72 -27 -90 -34 26 30 143 -321 208 38 2 -216 191 275 -57 69 -108 -94 173 142 -171 328 84
2561 84 -24 -114 -241 -36 -188 -372 4 185 -52 -140 -82 113 141 -81 -62 124 338 239 357 59 -35 106 -144
2584 -144 -13 121 12 -34 -220 -13 73 107 -234 -23 511 -33 -510 -250 21 -128 13 -2 172 -43 87
$$ packed form
2422A56l05J24K0k9J3j06J30j34K32oM3j87RrK95j66j60Q8M3m9j56K3K81M7l14
2447a17k33M55L8J0l08L3P0J43j25n0K77j29L6k20j29M19o0r4L9k60J62k02o2
2470c07L03Q1k8l07L86j71K93j53j42j06j3j01M89n11M89l53J37j61J5K93j29
2491Dl4J34k5K04k42j77j7j79M25k32K59q2r9k4J53k80J91J72Rm42M26j38N8J95
2515B59l39L7J13j55K23P6qj78K5l16M15k8o5L6l8j54K00l55K14M1J66j34K73
2538C08l80M5o3N6O0MJ13m64N29j70l6k18M07Q4l32J26j77J4K67l1l13M99k44
2561H4j08r0j27K05j52j84L76J81k37q8N8J95K8k22J9J86K14r9J18k98r4J41k50
2584a44J31J34j09m6j86K07Q6L4l41K11N34n44m77K60K71j49J41j5J74k15J30
$$ plain form
2605 87 149 -137 -55 279 202 -41 -181 180 43 -33 -216 195 9 29 -94 166 -40 349 31 -171 -47 95
2627 95 -109 -6 -202 -41 178 -177 -161 93 69 -253 -168 315 80 -98 -7 19 17 31 -111 56 56 -43 -229 -62
2651 -62 11 135 118 158 351 -61 -148 220 288 -158 -220 -61 -169 -12 91 -162 -127 -326 86 42 78 -277 -74
2674 -74 69 198 -73 204 -18 -35 262 19 69 -75 151 159 50 140 218 28 162 -151 -33 216 2 -71 -22
2697 -22 -69 248 233 -160 -41 -284 -79 -115 -219 -111 72 118 -12 177 72 86 8 275 124 -89 12 180
2719 180 135 -191 264 -78 158 -312 -363 8 -16 -8 -427 -146 105 212 217 50 -168 54 6 24 -110 16 -16
2742 -16 385 -81 150 442 -4 -23 235 91 60 120 -213 84 -44 -265 45 9 135 175 87 102 -122 6 38
2765 38 115 40 -314 -263 -85 74 121 -46 -156 29 101 -94 -21 -87 -79 -121 -51 308 237 126 -39 -319 46 -178
$$ packed form
2605H7O2k86Q2L34p7k43j40L61j37p6j83M11j86K0j23K60k06L89l18k02J24J42
2627I5k04J03j96J61K19l55J6K54k4l22Q5M83k35j78R1K6kJ4j42J67%r9j86J67
2651f2P3J24j7M0J93m12q7L68O8m46o2J59j08J57J03k53L5j99M12m4L6l55K03
2674g4J43J29k71K77k22j7K97k43N0j44K26Qj09R0P8j90J34l13J18K49k14p3M9
2697b2m7L17j5l93J19k43K05l6j04J08J83M6j30J89j05J4p8K67j51k13J01J68
2719A80m5l26M55l42K36m70n1L71k4Qm19K81K51J07Nj67k18K22m8J8j34J26l2
2742a6M01m66K31K92m46j9K58j44l1O0l33K97j28k21L10l6J26M0q8J5k24J28L2
2765C8P7p5l54N1J78J59M7j67j10J85P2j95P3o6Qm2P0L59p1j11j65k80L65k24
$$ plain form
2789 -178 -16 -38 -216 -65 69 -205 155 -157 185 162 158 0 171 20 -60 -18 -46 60 -108 -22 16 175 -218
2812 -218 -44 -352 -96 199 81 129 -2 -38 11 -99 -128 56 9 12 -74 -92 -48 -28 224 269 29 44 -45 -195 345
2837 345 40 -6 5 -67 -125 -227 25 -260 -136 33 105 150 -160 -97 3 -85 141 -142 -238 221 -115 -165 -94 10
2861 10 -54 -139 154 -17 -108 296 -218 -41 89 38 -60 -117 -2 -133 1 -38 -180 -78 -241 -182 -44 205 -61
2884 -61 332 -94 48 37 -12 -320 -65 26 -172 114 -199 -129 -34 -194 58 -175 -84 -357 155 103 140 192 24
2907 24 -120 73 -103 245 263 228 328 -27 15 192 77 -210 -214 -111 110 -98 132 79 -45 -92 75 -22 -142
2930 -142 -264 123 -1 -177 113 167 78 86 102 140 71 81 165 9 -154 -40 278 171 117 -184 223 112 -89
2953 -89 -67 -24 101 -166 -62 -225 -41 16 -148 -65 91 -35 19 23 -13 17 -134 -86 71 -43 101 197 -54 21
$$ packed form
2789a78J62k2j78J51J34k74L60l12L42k3mj58J71j51q0M2k8J06j68Q6L8J59l93
2812b18J74l08K56K95j18M8j31l6M9j10k9J84m7Lq6j8M4K0K52M5k40J5q9j50N40
2837C45l05m6J1p2n8j02K52k85J24J69P2M5l10O3J00q8K26k83r6M59l36n0P1J04
2861A0o4q5K93j71r1M04n14J77J30n1r8n7J15j31J34l9j42J02j63N9J38K49k66
2884f1L93m26J42j1m9l08K55R1j98K86l13P0R5j60K52k33R1k73N12n2L7N2j68
2907B4j44J93j76L48J8l5J00l55M2J77j15k87mJ03K21k08K30n3j24m7J67r7j20
2930a42j22L87j24j76K90N4q9QJ6L8o9J0Q4j56j63J14L18j07n4l01M07j11k01
2953h9K2M3J25k67J04j63J84N7j64Q3J56j26N4Ml6L0j51M8J57j14J44R6k51P5
$$ plain form
2977 21 23 -16 -193 54 327 47 -75 12 -232 75 96 132 -9 -81 210 -401 134 -152 -172 -17 119 -387 144
3000 144 215 72 129 201 325 -46 77 98 41 100 -100 -145 -37 398 -44 -188 -1 19 277 -1 -1 152 -70
3023 -70 61 136 77 93 -173 7 63 -1 60 70 306 113 -254 141 52 -136 -103 86 322 31 51 -36 -81 -16 73
3048 73 52 -111 -186 5 217 -16 -175 252 -47 0 -149 197 34 -37 -151 105 240 -40 153 -133 -57 130
3070 130 44 221 167 -18 -107 21 -1 106 -171 -191 96 82 -211 165 63 -94 -60 -266 49 -102 -21 174 14
3093 14 26 320 146 63 126 -147 116 325 -124 -150 -331 -421 -340 -154 -25 -132 67 21 -108 48 80 54 122 -265
3117 -265 -35 61 92 2 -411 -347 -159 172 73 -2 29 -283 -17 21 -180 -111 11 121 -49 203 -37 -95 9
3140 9 120 -181 41 205 -131 -232 281 -1 4 -65 -26 121 358 21 35 202 -178 94 176 94 -69 -5 -117
$$ packed form
2977B1Kl9j77K47K73k80j22Q7k44L07K1L6j41p2K91o11N35k86k0J55J36n06N31
3000A44P1j43N7P2J24l71J23K1n7N9k00m5J08M35m42j44J87K0K58k78%J53k22
3023g0J31P5n9J6k66J80N6o4O1J0K36j93l67L95q9j88L3J89K36k91K0q7m5O5Q9
3048G3k1j63p5J91K12k33j59M27k99M7j49L46j63p1j14K56J35k80J93k86P6J87
3070A30q6J77n4j85q9J28k2J07k77k0K87j4k93L76j02j57L4k06L15j51Q1J95j60
3093A4J2K94j74q3O3k73K63K09m49k6j81r0Q1J86J29j07J99m6j29J56L2k6O8l87
3117b65K30R6L1r0m13O4J88L31r9p5L1l12K66L8k01O9J22J10j70K52k40n8J04
3140IJ11l01K22J64l36j01N13k82No9L9J47K37l37J4J67l80K72Q2q2j63O4j12
$$ plain form
3163 -117 336 -143 -52 276 -195 -190 90 -92 184 110 -19 -275 131 110 256 29 -129 13 70 156 -96 -197
3185 -197 123 112 279 -200 31 -2 -235 -120 100 -270 58 155 -117 -50 135 92 -216 138 -57 -115 -247 40
3207 40 -7 101 151 -34 177 -28 248 -50 -307 99 41 139 -156 -292 -23 -124 -229 20 70 126 222 103 -48
3230 -48 -152 -52 103 -192 -238 -102 -4 56 164 -121 71 195 55 -47 -255 -104 27 216 68 92 -116 171
3252 171 160 163 202 128 -61 59 74 216 -69 127 -112 80 193 -101 -150 114 -48 -11 -163 -304 134 -88 251
3275 251 -130 91 -127 104 -18 -154 248 -218 162 156 179 -198 73 136 149 -163 275 -103 -23 114 66 -84
3297 -84 -32 -192 44 63 -212 47 -272 -63 -256 -45 -101 161 -61 -5 -39 -75 -3 -191 51 237 32 -167 71
3320 71 70 -61 -43 -154 87 -17 249 -119 -164 -289 224 122 88 207 228 -12 -104 125 -121 87 232 134 -45
$$ packed form
3163a17M53m79R1L28m71NK80j82K76p4j29k56M06k1J46k27j58J42N7Q6k52j01
3185a97L20j1J67m79K31l3k33J15K20l70L28R7k72O7J85m3l08L54j95n8j32K87
3207D0m7J08N0j85K11k05K76k98k57M06n8R8k95j36K69j01j05K49N0N6R6j19j51
3230d8j04J00J55k95m6J36R8O0J08k85J92J24j40j02k08J51J31J89j48K4k08K87
3252A71j1LL9p4j89J20J5J42k85J96k39J92J13k94m9K64j62L7j52j41M38k22L39
3275B51l81K21k18K31j22j36M02m66L80oK3l77K71O3J3l12M38l78Q0J37m8j50
3297h4N2j60K36J9k75K59l19K09j93K11n6K62k22N6l4l6P2j88K42J86k05j99K38
3320G1jj31J8j11K41j04K66l68m5j25N13j02l4J19K1k40r2K29k46K08J45r8j79
$$ plain form
3343 -45 -59 160 6 -32 -257 35 -154 -102 94 103 53 -29 -92 126 -46 -146 -106 -167 141 -181 88 217 269 166
3367 166 239 219 130 -209 165 151 -104 229 -14 -266 83 252 -55 176 -73 83 -240 302 172 24 236
3388 236 -110 286 56 113 63 200 21 84 -61 218 -75 4 101 -175 13 -60 -200 64 -10 368 241 265 -100
3411 -100 -167 -143 -116 -24 -91 -63 -210 237 159 110 -131 -61 10 195 129 29 -130 -161 -214 173 274 217 149 292 204
3436 204 -129 116 -208 154 50 45 35 -192 -94 -19 -32 -180 8 118 100 64 -74 -183 -39 -20 -99 -129 -179 -327
3460 -327 57 -54 -8 -92 18 99 -35 21 -167 387 89 94 -11 134 -137 -156 36 -32 16 35 -59 -132 319 73
3484 73 4 -24 -121 12 237 134 -37 -50 12 57 -207 54 -165 -187 221 84 113 292 -68 36 -128 121 229
3507 229 -78 -66 -71 184 109 31 -431 0 -78 194 -19 -53 -53 215 -42 -56 -102 0 -28 108 37 132 71 -30 22
$$ packed form
3343d5j4K19j54l8k25K92j89N2J96Rn0q2o3K18j72j00M0o1L08l22K69J29N2j03
3367A66P3k0q9l39L74j4k55L33k43k52L49J69l07K31k49J56l23N42j30j48K12
3388B36l46L96k30N7n0J37j79O3j45K79k93P9R7k76J88p3j40K64p4L78j27K4l65
3411a00o7K4K7R2o7K8j47M47p8m9k41P0P1J85o6j00j59l1n3L87J01n7o8J43q8
3436B04l33K45l24L62j04nj0k27R8P5j3j48J88J10j8l6j38j09J44J9p9l0n0j48
3460c27L84j11M6q4J10Q1j34N6j88N54k98Nj05J45k71j9J92o8M8J9r4p3M51k46
3484G3o9k8r7J33K25j03j71j3O2M5k64K61k19k2M08j37K9J79l60J04j64K49J08
3507B29l07J2nK55p5p8m62M31p8K72k13l4%K68k57j4m6J02k8J36p1R5o1j01N2
$$ plain form
3532 22 -76 -8 -277 -44 2 -86 -153 285 -28 -124 259 97 71 -27 -14 -2 -223 93 -338 -24 -62 236 -169 -181
3556 -181 196 354 94 -124 -71 -72 -70 13 181 -10 -13 86 -81 132 153 14 63 -237 100 -21 -96 -58 167 -126
3580 -126 -93 110 -111 22 -19 92 -257 79 209 -181 -45 14 -79 -43 -210 -72 9 16 -80 42 174 -49 81
3603 81 38 -48 140 189 163 271 -205 -36 -64 -52 73 -50 -311 24 -35 -21 18 34 -16 86 -113 151 75 170 -233
3628 -233 -145 60 -59 -63 49 230 265 -103 -225 71 183 102 122 185 -151 218 235 -13 -143 -79 -184 21 -96
3651 -96 -200 -30 95 67 -157 53 120 3 111 -202 39 -150 53 -95 217 137 34 -117 3 -58 -134 40
3673 40 101 -91 -158 -36 -396 -201 410 -28 -49 -63 178 -79 145 -65 -152 79 187 81 -129 202 47 27
3695 27 -11 320 37 -35 139 327 -167 -148 6 178 -222 -282 55 125 21 -7 -91 -117 -189 -4 -151 141 90 -172
$$ packed form
3532B2r8O8k69K33M6q8o7M38l13r6L83j62k6r8J3J2k21L16m31L14l8K98m05j2
3556a81L77J58k60k18N3jKQ3J68j91lR9j67K13K1j39M9l00L37j21p5L8K25k93
3580a26L3K03k21J33m1J11l49L36J30l90J36N9r3L6j67J38Q1Pr6J22J32k23J30
3603H1m3q6J88M9k6J08m76J69k8J2J25j23k61L35n9J4L9J6n0J02j99K64p6R5m03
3628b33Q8K05j19mJ12J81L5l68j22K96J12q1K0O3l36L69J7k48j30O4j05K05j17
3651i6j04J70J25k8k24K10O7j17J08l13K41j89K03j48L12q0j03j51J20o1p6J74
3673D0O1j92o7J22l60J95O11m38k1j4K41k57K24k10q7K31J08j06k10L31j55k0
3695B7l8L31k83p2J74J88m94J9J54J72m00o0L37P0j04k8q4k6p2J85j47K92n1k62
$$ plain form
3719 -172 224 129 126 184 6 53 216 -39 29 -229 -70 75 35 -175 -88 148 -85 87 -115 -21 31 -191 -141 -169
3743 -169 138 146 156 -24 -198 355 47 -171 73 -155 194 -51 95 37 -131 -111 101 -275 -28 -97 -178 -212 51
3766 51 24 11 -116 -150 152 245 -158 146 71 12 -201 -155 383 89 84 -105 215 -4 -215 61 197 -183 -213 145
3790 145 138 18 -66 -155 -42 169 143 -58 -153 -99 43 -46 -32 -244 -181 133 82 20 205 69 -96 -285 -112 207
3814 207 179 8 50 39 48 10 3 54 14 -103 254 -114 145 15 -77 90 -18 167 34 333 -12 136 -232 -60
3838 -60 -10 80 -75 -21 -9 11 -16 41 78 -91 -224 -72 31 -124 -128 -14 19 57 -239 -37 -99 7 -393 -4 -11
3863 -11 22 56 130 -134 -367 -110 178 78 -123 59 11 38 -32 118 73 23 -194 -11 148 -137 57 -280 32
3886 32 -16 -101 -9 187 54 105 77 -21 -113 141 -102 72 -129 -121 -179 272 187 -113 90 51 247 115 22 171 -82
$$ packed form
3719a72L96r5lN8j78M7J63k55O8k58J59J45m0k10Q7K36k33J72k02R4N2k22N0k8
3743a69L07QJ0j80j74N53l08k18K44k28L49k45J46n8j68K0K12l76K47o9q1l4K63
3766E1k7j3j27l4L02R3m03L04p5n9k13M6N38k94nj89L20k19k11K76J36l80l0L58
3790A45pj20q4q9J13K11k6k01r5N4J42q9J4k12O3L14n1o2J85j36j65j89J73L19
3814B07k8j71M2j1Rl8pN1m0j17L57l68K59j30r2J67j08J85j33K99l45J48l68J72
3838f0N0R0j55N4J2K0k7N7L7j69j33J52J03j55mJ14L3L8k96K02o2J06m00L89p
3863a1L3L4P4k64k33K57K88j00k01J82m8K7p0J50m5n0k17J83J59k85J94l37L12
3886C2m8q5R2J96j33N1k8r8r2K54k43J74k01Qn8M51q5l00K03l9J96j32r3J49k53
$$ plain form
3911 -82 287 -236 267 -172 179 61 -254 -121 -11 -303 -220 -86 251 138 -205 -81 -65 73 27 116 41 71
3933 71 -328 -151 0 2 -109 -139 45 70 57 20 -94 -111 -131 -86 93 103 -147 -1 -266 12 101 100 -25 -107 294
3958 294 -180 47 -47 -101 -232 -59 -61 -75 331 20 59 102 -324 -4 -157 174 -165 -263 -20 -15 83 5 256 -13
3982 -13 -34 -156 -78 -227 24 62 -152 186 29 -69 -101 119 128 -15 -182 38 14 75 24 193 14 122 -14 -122
4006 -122 4 113 -148 39 215 -70 -103 216 -218 -57 -205 -36 -223 -18 131 -158 244 -192 103 -264
4026 -264 -92 -20 -18 255 111 109 32 172 74 54 -58 -40 150 -137 9 -88 11 98 -192 -111 -127 17 -90 -15 18
4051 18 144 -86 28 -36 104 -222 197 -79 -96 -92 -207 299 -102 -69 -16 -198 -50 -188 38 -3 -264 177 -123
4074 -123 126 -163 247 -159 -29 -50 195 30 -10 -3 -10 219 -212 138 2 261 -101 -56 206 -68 -37 165 76
$$ packed form
3911h2L69n23N03m39L51j18l15J33J10k92Q3J34L37j13l43J24J6J38m6Q9p5L0
3933G1l99J77J51Kj11l0J84K5j3l7j14j7k0M5J79J0k50J46k65K78Q9jj25q2M01
3958B94m74K27r4n4j31J73kj4M06l11L9M3m26L20j53L31l39r8K43NR8p8K51k69
3982a3k1j22P8j49K51L8k14L38j57r8l2K20Rj43j67K20k4O1n1J69j79J08j36j08
4006a22J26J09k61J87J76k85l3L19m34J61j48J69j87K05J49k89M02m36K95l67
4026b64J72P2KK73j44kp7J40r8k0j12J8J90k87J46r7R9Q7k90Q1j6J44j07P5L3
4051A8J26k30J14o4J40l26M19k76j7Mj15N06m01L3N3j82J48j38K26m1k61M41l00
4074a23K49k89M10m06J30k1K45j65m0PpK29m31L50j36K59l62M5K62k74L1K02q9
$$ plain form
4097 76 336 -146 24 78 89 180 -75 68 -18 91 -97 -148 -127 -75 139 123 142 -24 -80 -87 -190 120 90 287 408
4122 408 -285 250 189 -382 -175 -37 -138 -95 37 109 5 158 -34 -122 61 25 -126 38 47 88 -49 174 -8
4145 -8 261 -22 -132 217 77 8 -214 -148 32 -137 185 229 -293 -146 -2 36 -211 122 2 1 -107 62 -177
4168 -177 -125 21 309 240 -244 -1 -78 91 -124 221 -2 -286 35 338 -184 -188 -137 158 92 -151 -127 201 -29
4191 -29 -153 -186 288 -342 68 -247 417 -72 10 -85 -450 -21 164 -121 -162 93 179 177 -86 -60 135 -180 282
4214 282 -305 48 -138 268 156 95 -40 -47 246 -60 4 -123 42 -427 -34 48 257 84 -114 -281 280 -294
4236 -294 77 335 21 -75 -270 -225 77 -296 -28 72 -125 124 -28 -365 59 358 55 170 -94 83 105
4257 105 -69 -78 79 38 35 62 17 -135 25 105 9 -98 327 -266 -52 -78 65 123 -216 -94 -19 -193 -158 67
$$ packed form
4097G6K60m82J70N4J1R1k55J43q6J09j88n1K1N2K14j6J9j66n6pj03L10l0J97J21
4122D08o93N35o1n71K07J38j01M3J32P2j04J53j92q8J83l6j51J64RM1j37K23j82
4145hK69k83j10L49j40o9k22O6J80j69L22M4n22J47J44L8k47L33j20jj08J69k39
4168a77N2J46K88o9m84K43p7J69k15L45k23k84L21L03n22mN1K95o6k43K4L28k30
4191b9j24l3M74o30M10l15O64m89Q2r5l65M29J85k85m1K55Q6kk63K6J95l15M62
4214B82n87L53j86M06j12o1j35pK93l06O4j27J65m69L93Q2K09j73j98j67N61n74
4236b94L71K58l14r6j95M5L02l73K68J00j97K49j52l37M24K99l03J15k64J77K2
4257A05j74rJ57m1lK7m5j52J60Q0r6j07M25n93K14k6J43N8l39J22P5j74L5K25
$$ plain form
4281 67 -10 154 331 244 87 -93 55 337 86 -143 -4 -237 40 -19 -91 -63 200 -165 -144 352 -159 2
4303 2 17 217 166 129 246 -190 -260 40 24 98 250 149 181 29 39 -192 306 69 -79 86 -174 -127 12 -82
4327 -82 26 217 52 23 -153 89 -148 239 -46 -150 -83 212 113 -155 144 142 116 68 -19 11 -112 -95 35 -197
4351 -197 -79 201 -134 201 -170 -44 152 99 313 203 -184 -44 20 -43 -139 233 441 -275 -75 -37 156 65
4373 65 -118 -60 32 1 -168 364 -31 -25 52 195 211 -338 26 -39 33 43 -65 191 135 -32 29 -55 176 70 122
4398 122 187 75 88 36 15 -11 133 94 -251 -111 -72 208 -61 -220 -145 -89 -80 -154 -148 76 -95 12 -3 -8 28 51
4424 51 -178 -10 29 221 -119 -31 -79 160 -105 -53 -375 99 130 -271 -244 48 -117 -203 -34 86 30 -216 170
4447 170 -351 39 -160 59 106 99 120 17 -74 -126 -261 144 190 138 -97 -152 53 -142 80 47 -139 -101 267 -184
$$ packed form
4281F7p7J64J77q7j57j80J48K82k51k29J39k33K77n9p2K8K63l65K1M96n11J61
4303BJ5K00n1l7J17m36p0L00j6P4J52j01L2j52J0k31M98k37j48J65k60M7J39r4
4327h2J08J91j65k9j76K42k37L87k85j04O7K95r9k68K99kk6m8q7L0j23J7J30k32
4351a97J18K80l35L35l71J26J96n3K14j10l87J40O4o3r6L72K08p16K00L8J93r1
4373F5j83N8R2l1j69N32l95OP7J43J6n49L64o5P2J0j08K56n6j67O1q4K31j06N2
4398A22O5j12J3n2k1k6J44l9l45J40L9K80k69j59P5N6Rp4OK24j71J07j5nL6K3
4424E1k29J68L9J92l40Q8m8K39k65N2l22M74L1m01K7K92j65q6J69J20n6k46L86
4447A70n21L90j99K19M7pK1j03r1n2j35M05M6n2k35n5K05j95K22l3j86L8L68m51
$$ plain form
4471 -184 134 129 -54 -140 101 29 223 334 156 101 -144 -22 -260 -94 -139 114 12 28 -114 -2 200 0
4493 0 -88 -207 -227 -96 -158 -15 -200 -73 61 -15 109 -134 168 -238 -247 -122 126 53 -133 84 85 71 -206 -232
4517 -232 78 187 -18 75 436 145 78 36 -79 -251 -104 52 -97 -4 -30 -11 175 179 239 -30 -373 -244 -55
4540 -55 -255 -344 4 -340 -52 5 74 -135 -160 -67 -183 182 13 156 -27 -137 8 67 51 -116 152 -477 -107
4563 -107 2 14 -57 -94 -322 148 126 -341 -37 198 89 2 -123 226 -85 -294 217 -122 -147 263 -94 59
4585 59 154 -335 115 -107 176 -5 -4 -33 50 -188 -25 -211 -425 156 -219 200 11 17 308 -52 -72 -258 -235
4608 -235 -112 -87 -127 -232 35 -56 -95 117 37 14 -185 37 -111 84 -49 -92 205 74 -122 -73 -174 -238 -155
4631 -155 220 -66 186 -84 29 40 -160 78 30 5 -162 -157 70 -69 92 -149 -277 -35 21 204 -142 -123
$$ packed form
4471a84L18nj83q6K41p2J94J11j78n5k45J22k38J66m5K53j02J6j42J12K02k00
4493@q8j19k0J31o2J43j85J27J34p6J24k43L02m06rJ25K48p3j86K17Jj4k77k6
4517b32L10J09k05R3L61k91o7m2j15j72J47J56j49R3k6J9J86MO0k69l43J29J89
4540e5k00q9L48l44K88N7O9k09k5R3j16L65j69J43j83j10J45N9j6j67K68o29L70
4563a07J09J2p1l7k28M70k2m67L04K35j09q7j25L49l11k09N11l39k5M10l57J53
4585E9R5m89M50k22K83j81Jk9Q3k38J63j86k14N81l75M19j89OK91l60k0j86K3
4608b35J23K5m0j05K67r1l9K12q0k3j99K22j48J95j33m3K97j31j96M9j01o4Q3
4631a55L75k86K52k70J13J1k00K38m8k5j67NK27j39J61k41j28K42N6J83l46J9
$$ plain form
4653 -123 21 195 -3 -284 34 -24 -82 155 96 64 -74 -70 -106 -7 -112 16 269 -209 -11 -109 -153 78 -108
4676 -108 -55 43 289 -13 -192 -166 -86 -192 -33 188 -31 -166 -26 5 -128 291 -130 -6 -233 54 -41 -373
4698 -373 68 23 210 32 -108 160 -174 168 440 272 -143 -37 63 11 56 23 -44 211 182 27 -60 45
4720 45 22 44 -12 -59 146 -205 165 -52 -160 -42 -46 253 -119 72 82 137 -125 -76 -106 -109 -69 84 37 -11 2 35
4746 35 -85 -165 262 132 -95 -33 -50 -43 139 -88 -39 -119 16 88 -61 120 -158 104 170 112 -55 -200 23 -91
4770 -91 41 -57 197 108 -28 80 15 -183 11 304 -17 101 75 -77 162 28 17 158 -102 39 185 -144
4792 -144 -14 4 204 116 -237 143 52 191 125 -112 140 -110 344 15 23 -74 45 0 -211 -10 77 258 -143
4815 -143 339 -18 170 96 108 140 -111 293 -17 17 196 -81 -23 -136 141 206 -12 -221 99 177 173 217 -79
$$ packed form
4653a23J44J74j98k81L18n8n8K37n9l2j38Ml6R9j05J28K53m78J98r8m4K31j86
4676a08N3R8K46l02j79K6Q0j06J59K21k19j35J40L1j33M19m21J24k27K87r5l32
4698c73M41m5J87j78j40K68l34L42K72j68m15J06J00n2M5l3o7K55k9j55q7J05
4720D5k3K2n6m7K05l51L70k17j08J18mK99l72J91J0N5k62M9l0lM0J53m7m8J3L3
4746C5j20q0M27j30k27O2j7PJ82k27M9q0J35P2j49J81k78K62O6n8j67j45K23j14
4770i1J32r8K54q9j36J08o5j98J94K93l21J18k6j52K39j34j1J41k60J41J46l29
4792a44J30J8K00q8l53L80r1J39o6k37K52k50M54l29Qr7J19m5k11K01Q7J81m01
4815a43M82l57J88p4J2L2k51M04l10L4J79k77N8j13K77O5k18k09L20P8mM4k96
$$ plain form
4838 -79 -2 -249 117 99 -148 -33 109 -9 169 -38 35 -219 33 -121 -72 -214 68 -4 -66 -110 242 98 31
4861 31 157 72 95 272 -112 88 -289 -103 -99 -17 6 -195 -140 54 12 -150 -50 -242 121 -192 167 -243 -20
4884 -20 56 -18 25 -136 -228 -10 149 327 79 -12 -172 53 -110 -153 -35 -275 61 -243 -136 -153 -29 -5 -46
4907 -46 279 -253 -67 -105 -68 145 -11 -118 310 -6 -73 192 -162 100 -198 -103 -149 61 -68 5 154 -42
4929 -42 -32 99 348 -122 -160 -105 40 -129 153 -118 -82 -255 -188 -15 95 -77 39 -315 -45 154 -123 163
4951 163 -245 178 -65 163 7 328 -54 -152 35 -76 -272 -199 35 -243 88 -270 -23 -227 40 -220 -93
4972 -93 136 -31 -43 -13 -6 -281 -291 -51 -64 17 183 11 134 51 144 118 -519 -106 41 41 219 119 -219 -38
4996 -38 -140 -47 126 -116 -144 -30 249 -107 10 196 -83 -180 -152 -74 -111 -2 -150 -124 -88 154 331 -30 -209
$$ packed form
4838g9P7k47L66j8k47J15J42j18J78k07P3k54K52j54M9j42K82p2o2m4L52j44o7
4861C1J26q5K3J77l84K00l77J86MQ2K3k01N5J94m2j62J00j92L63l13L59m10K23
4884b0P6p4M3j61r2K18J59J78k48r1j60K25j63m3J18k40L36l04J07j7J24K4m1
4907d6L25n32J86l8L7K13j56j07M28l16o7K65l54K62k98R5m6K10j29P3J49j96
4929d2J0J31K49m70l8N5J45j69K82k71L6j73O7J73J10j72J16l54K70J99k77K86
4951A63m08M23k43K28j56L21l82r8J87j11j96P3K34k78L31l58K47k04K67k60J27
4972i3K29j67j2L0Pk75j0K40j3Q1J66j72J23q3R3k6o37M13J47%J78j00l38J81
4996c8j02R3J73k42k8J14K79l56J17J86k79r7K8P8l7J09j48K6L6K42J77l61j79
$$ plain form
5019 -209 -248 11 67 16 13 246 240 -12 18 81 -45 -132 -85 277 24 -55 -132 -132 75 -78 14 -196 -165 65 417 77
5045 77 240 -65 27 58 46 -38 264 -66 223 -267 211 58 197 -2 -169 56 56 -53 2 72 215 -50 -113
5068 -113 -55 95 -64 -265 125 53 66 10 67 15 33 -50 90 42 83 -182 -125 64 -124 13 26 182 -150 -39
5092 -39 -85 26 -242 -129 81 -100 265 -56 103 107 -93 -103 55 -166 201 -194 15 53 -54 -35 64 100 -78
5115 -78 -121 152 -151 -400 -288 -50 -181 -15 -88 -224 -220 51 76 293 -268 -182 107 -112 51 -105 33 75 205
5138 205 -225 153 -134 -113 -6 -151 66 64 -19 -150 -68 -153 -169 80 -69 81 -83 197 -78 114 -131 -114 -101
5161 -101 20 -58 123 -264 -155 177 18 197 -271 -246 -235 96 -389 -312 -130 -213 -115 -115 67 -175 -171 44 -243
5184 -243 -50 48 -42 237 253 -121 -168 74 -72 -44 194 97 74 10 290 -56 177 -1 241 -15 36 -23 106
$$ packed form
5019b09l9K59N6n1lK33ok52L0O3j26q7M7L62k53p9p7%K07j53R2k10L1K30L52l40
5045G7J63l05R2L1j2q4L02l30K89m90M78j53J39j99j67K25%j09N5P0J43k65o3
5068a13N8J50j59k01L90p2J3n6N7n2J8q3J40m8M1k65N7J89j88J37J3J56l32J11
5092c9m6J11k68J13K10j81L65l21J59Mk00j0J58k21L67l95K09L8j07J9R9L6j78
5115g8m3K73l03k49J12K38j31J66p3j36MK71K5K17n61Q6K89k19J63j56J38M2J30
5138B05m30L78k87K1J07j45K17kq3j31Q2q5j6K49j49J50j64K80k75J92k45J7J3
5161a01J21p8J81l87J09L32j59J79m68K5J1L31m85P7J82q3R8%J82k42MK15k87
5184b43J93R8r0K79J6l74m7K42j46K8K38r7k3o4K80l46K33j78K42k56N1n9J29
$$ plain form
5207 106 212 75 -120 -138 -82 -60 95 -28 251 25 345 142 -16 -81 -169 155 -43 -85 113 10 -142 7
5229 7 -176 94 -293 -89 -83 -66 116 37 -188 -167 78 219 -143 -9 -30 -170 -119 35 139 -27 -39 -63 -145 -284
5253 -284 102 50 -50 -45 -201 305 -15 130 271 174 -186 143 203 186 -15 133 136 -71 80 -40 232 -224 219
5276 219 294 269 -405 6 -236 74 64 49 -125 59 340 109 -61 -139 110 73 -148 123 -24 -24 -131 5 167
5299 167 -245 108 216 49 59 186 -29 364 171 39 -182 215 186 -47 41 7 42 -117 -26 -192 -195 114 23
5322 23 -31 227 62 375 19 264 278 214 131 -29 -107 -17 46 -186 96 289 260 122 49 -167 -89 -111 -90 -45 121
5347 121 42 34 -188 -137 -50 30 -321 -138 -14 -146 -70 -173 72 34 -245 48 -118 75 -73 -87 46 -3 -108
5370 -108 -9 -93 10 329 -64 -57 98 -48 182 -18 -281 167 32 227 -171 350 56 292 -137 39 212
$$ packed form
5207A06J06j37j95j8N6K2J55j23K79k26L20k03j58o5q8L24j98m2J98j03j52J49
5229Gj83K70l87K04OJ7J82p9k25K1K45J41l62J34k1j40N1J54J04j66j2k4q2j39
5253b84L86n2j00Nj56N06l20J45J41r7l60L29O0j7k01J48Lk07J51j20K72m56M43
5276B19P5k5o74M11k42L10j0j5j74J84K81k31j70p8K49l7k21K71j47%j07J36J62
5299A67m12L53J08j67J0J27k15L93j93j32k21L97k9k33Q8l4L5j59R1j66lL09r1
5322B3n4K58j65L13l56K45J4o4q3j60p8R0O3k32K82J93k9j38p3k16P8k2K1M5J66
5347A21p9qk22N1Q7Q0l51J83J24j32P6j03K45l8k79K93j66J93j48j4J33m9j05
5370a08R9q4J03L19l93PJ55j46K30k00k63M48j35J95l98N21k94K36m29J76J73
$$ plain form
5391 212 19 -81 -263 -76 -389 4 19 -35 156 123 21 -201 15 -337 -66 119 360 75 305 214 151 -106
5413 -106 -51 -227 249 35 162 69 148 -135 59 213 -159 66 -13 18 -16 363 217 90 -83 111 94 300
5435 300 428 -119 -76 48 295 -59 82 -148 206 47 -2 164 48 -86 -156 57 287 174 -255 58 -156
5456 -156 -256 -151 132 168 5 -1 -299 -20 -27 202 -92 -427 -98 30 222 -43 -189 -31 -44 -115 212 -106
5478 -106 10 185 -111 153 -101 -141 128 87 63 324 -35 -124 -73 31 70 243 222 -144 15 -170 -107 220 99
5501 99 -125 21 -132 -19 14 -98 -124 178 154 -208 -168 105 287 -71 108 -41 -125 -60 348 16 -124 56
5523 56 -87 -185 96 -105 87 151 172 140 14 205 42 -273 -145 54 233 124 -76 133 -187 181 -163 -53
5545 -53 -88 2 202 16 137 3 -167 133 -315 -9 -18 -114 161 -116 -101 -16 -245 -18 73 -248 172 -348 -223
$$ packed form
5391B12j93j00j82J87l13L93J5n4J91l3j02k22K16l52K71J85K41k85K30r1o3k57
5413a06N5j76M76k14J27r3P9k83J94J54l72K25p9L1l4L79j46j27j73J94j7K06
5435C00J28n47M3J24K47l54J41k30L54j59m9J66j16j34p0K13K30j13m29L13k14
5456a56j00J05K83L6j63ok98K79pK29k94l35L29J28J92k65j46J58j3p1L27l18
5478a06J16J75k96K64k54m0K69m1k4K61l59q9N1J04L9J73k1l66J59j85O3L27j21
5501I9k24J46j53J13L3j12k6L02k4l62M0K73J82l58J79j49q4O5M08l32j40J80
5523E6j43r8K81k01J92O4K1l2j26J91j63l15J28J99J79j09k00K09l20L68l44J10
5545e3l5R0K00j86J21j34j70L00m48L06rr6K75k77J5Q5k29K27R1l21M20n20J25
$$ plain form
5568 -223 -27 -39 246 -189 20 -15 -255 66 -57 152 -72 -64 40 93 -33 -70 -195 138 -230 -168 206 77
5590 77 -98 -48 -165 -59 -67 -45 27 -192 306 2 246 26 -64 -214 -260 -284 -164 102 88 193 -131 8 -20 208
5614 208 -131 62 16 166 40 -312 95 -36 108 177 200 82 198 -350 -79 42 -1 5 28 153 270 67
5636 67 33 -1 92 191 -53 19 40 143 -184 -148 33 178 -7 -113 -108 22 -228 279 153 71 147 125 -10 3 -84
5661 -84 269 -133 173 -72 7 566 -82 -51 152 -158 -39 52 -123 246 135 -282 -4 -40 209 -52 -214 -26
5683 -26 -35 27 38 73 70 -5 -59 345 211 77 -198 -167 -135 100 -24 -80 -117 95 106 37 265 -226 -8 -230 7
5708 7 397 329 -302 -16 64 74 -170 361 50 126 44 258 121 85 161 141 168 -327 94 82 188 -109 2 35
5732 35 -291 -49 78 114 394 -193 -170 -89 -46 -25 -89 132 -150 124 -1 -15 49 44 -284 67 136 5 38 177
$$ packed form
5568b23J96j2K85m35K09l5k40L21j23K09k24QJ04N3j26l7j25L33l68O2L74j29
5590G7j75N0j17J06qK2P2k19M98l04K44k20r0j50m6k4J20K66j4J05l24J39k8K28
5614B08l39J93m6J50j26l52M07j31J44O9K3j18J16n48K71J21m3OK3J25J17k03
5636F7l4l4R3R9k44P2K1J03l27L6J81J45j85j06NJ30k50N07j26q2P6k2j35J3q7
5661h4L53m02L06k45P9N59o48L1K03l10J19R1j75L69j11m17K78l6K49k61j62J88
5683b6rO2J1L5lp5n4M04j34j34k75L1L2K35j24n6l7K12J1o9K28m91K18k22K37
5708GL90o8o31K86Q0J0k44N31l11P6q2K14j37l6P6k0K7m95M21j2J06k97J11L3
5732C5l26K42J27L6K80n87K3Q1M3K1o4K21k82K74j25j4O4nl28L51O9j31L3J39
$$ plain form
5756 177 -95 24 122 104 -140 -281 155 -73 -82 158 68 -46 -56 -129 53 -59 148 -75 10 -94 15 86 -8
5779 -8 100 -4 -162 50 -13 -234 120 9 323 153 72 235 62 89 -25 -98 85 267 94 146 -68 43
5801 43 -36 -126 -213 85 -107 -167 110 -140 -80 104 160 -44 -83 29 -55 116 197 38 271 -195 55 153 -39 73
5825 73 52 -211 5 113 362 136 -143 48 80 -1 85 -212 -195 321 -96 -261 200 78 -150 -50 -164 -288
5847 -288 117 113 -159 -268 78 26 -60 -124 -63 116 -133 -42 139 -110 9 -79 -9 60 23 42 -119 -48 189 -76
5871 -76 53 117 -41 -79 -279 -11 -3 -274 -83 -246 172 103 -41 48 109 -58 -290 -19 -205 171 -99 29 66
5894 66 -51 65 273 -191 -99 70 -89 -25 199 -156 -67 74 108 -23 82 81 -261 424 -46 -192 258 277 149
5917 149 323 137 -37 21 148 -348 4 53 9 -232 -92 -104 -107 150 -127 -84 41 189 -67 214 -89 36
$$ packed form
5756A77k72J19R8j8k44j41M36k28rK40r0j14j0p3J82j12K07k23Q5j04J09P1r4
5779hJ08j04j58K12o3k21L54j11L14j70q1J63j73K7j14p3J83J82j73N2k14J11
5801D3p9r0q7K98j92o0K77k50O0J84N6k04l9J12q4J71Q1j59K33m66K50R8j92J12
5825G3k1k63K16J08K49k26k79J91L2q1Q6k97J7N16m17j65M61j22k28J00j14j24
5847b88M05mk72j09L46n2q6o4O1J79k49R1J81k49J19q8P0O9l7J9j61P1K37k65
5871g6J29O4j58l8k00K68Qk71J91j63M18o9j44Q9O1j67k32K71j86L76k70J28L7
5894F6j17J16K08m64R2J69j59O4K24l55Q9J41L4j31J05jl42O85m70j46M50J9j28
5917A49J74j86j74N8J27m96L52M9m4k41J40j2lK57k77M3J25J48k56K81l03J25
$$ plain form
5939 36 5 76 122 -20 117 -55 -62 -117 -92 13 196 80 -180 131 164 15 58 113 -166 -435 304 -182 -80 -27
5963 -27 -180 -11 28 -150 47 -23 -52 6 -179 185 243 39 -21 64 171 -162 -55 79 -131 -283 -16 32 4
5986 4 98 -3 -94 176 189 -132 -186 -188 -123 -4 -246 -108 -31 165 -212 -87 -48 -102 48 -81 110 -146 0 -30
6010 -30 -101 138 1 -84 134 244 71 18 193 186 -79 106 -1 -286 -174 -303 -74 92 -106 56 9 110
6032 110 225 248 -291 -142 -39 -52 19 -62 37 -280 -40 -19 -239 -113 166 45 83 231 102 106 -235 -36 270
6055 270 164 104 21 -30 18 80 -140 5 255 -31 13 -68 359 200 325 129 94 198 1 32 -96 126 -121
6078 -121 -105 36 -17 83 -7 -129 -103 16 -290 50 -62 -152 -202 118 364 -91 83 -278 -38 113 -147 -148 109
6101 109 -59 16 328 -51 -33 -118 113 -57 18 178 -89 -111 -34 -251 20 -7 0 63 -93 -20 417 -87 63 -9
$$ packed form
5939C6l1P1M6j42J37j72pn5K5J05J83j16k60L11L3j49M3N5k79k69P39m86J02N3
5963b7j53J69L9j78J97p0k9N8j85L64N8k04o0Q5J07l33J07J34k10j52K67M8k8
5986DR4j01r1K70J3l21n4kO5J19k42J38P7J96l77J25L9n4J50j29J91k56J46l0
6010c0p1K39j37q5K18J10j73n3J75pk65J85j07k85J12j29K29J66j98J62m7J01
6032A10J15K3n39J49J03j3P1q1R9l17K40K1k20J26K79j21L8J48j29Ml41J99L06
6055B70j06o0q3n1M8O2k20J45K50k86M4q1M27j59J25j96l5J04j97L1j28K22k47
6078a21J6J41n3J00r0j22K6J19l06L40j12r0n0L20K46m55J74l61K40J51k60jK57
6101A09j68P5L12l79J8q5K31j70P5J60k67k2P7k17K71k7PO3j56P3M37n04J50p2
$$ plain form
6125 -9 85 92 -248 17 -278 111 -61 30 -130 -6 116 105 -350 -105 -18 -206 42 19 -17 -271 -58 -69 -62 -45 -33
6150 -33 17 206 -203 -178 219 -225 192 -232 -31 -153 30 102 30 54 -134 54 15 295 115 -214 -86 -126 -96
6173 -96 43 -178 -106 -83 -143 14 113 180 -132 -236 -134 53 -115 48 138 201 83 24 -136 11 -15 -237 123
6196 123 -11 -141 -70 92 332 95 15 -33 36 67 -113 -64 66 33 -65 -128 206 -204 136 120 77 -42 -92 176
6220 176 154 -129 -67 13 -107 -247 85 330 280 50 409 427 59 117 77 22 -10 67 -362 -14 -82 -24 173 -65
6244 -65 160 169 110 -144 20 132 80 -135 37 -27 138 32 -186 21 418 -212 -102 100 -25 -74 190 -22
6266 -22 5 155 -79 -179 87 -67 36 -29 -84 54 -13 108 -40 17 314 45 178 -25 -132 21 -103 -195
6288 -195 235 -161 -110 -92 69 10 393 66 -247 -104 -61 66 238 -14 84 6 72 33 58 37 -235 102 127 40
$$ packed form
6125iR4Pl40K65k95L89j72R1j60J24J22j1m55K45Q7j88K48k3l6k54K13j1PJ7J2
6150c3N0J89m09K5L97m44M17m24K01j22J83P2p2K4j88J88l9K80j80l29J28m0L0
6173i6J39k21P2K3o0J57R9O7l12j04J02J87j68J63R0O3j18n9j60J47k6k22L60
6196A23j34j30P1J62K40k37q0m8O9L1j80M9J30l3r8o3L34m10L40j6m3j19n0K68
6220A76k2k83O2Q0j20j40L32K45n0k30L59J8l68N8m0n5l2P7m29L48o8N8J97k38
6244f5K25Rn9k54J64J12n2k15J72o4J65j06k18K07L97o30J10K02j25m9K64k12
6266b2K7J50k34j00K66j54J03o5n5J38o7J21j48N7K97k69J33k03j07J53j24r2
6288a95M30l96N1J8J61n9L83l27l13J43M3J27J72k52R8p8O6l9K5k1k72L37K5q7
$$ plain form
6312 40 194 -60 35 14 -140 -133 9 194 107 151 -170 169 -47 -177 -25 -102 162 -167 48 -369 -14 140 10
6335 10 -124 119 -19 181 187 -15 -235 -293 -234 -18 -149 -9 156 149 127 -230 -295 40 -269 -150 59 -110 -58
6358 -58 209 21 205 -33 56 253 -40 193 -255 7 113 -151 26 -74 27 -308 -305 -16 145 47 -47 -105
6380 -105 -6 -24 93 13 -45 44 62 -1 141 40 -177 -4 170 125 300 14 87 -128 -232 -121 -70 -84 -58 -196
6404 -196 165 -36 291 0 -135 -79 20 262 -99 114 206 -140 -3 43 -73 -191 274 233 102 -85 -248 59
6426 59 -7 -160 174 -38 75 183 225 79 -236 -89 -10 -47 229 -30 -286 -83 -197 66 324 167 -75 19
6448 19 -188 34 -2 163 184 -28 -306 86 -381 -241 83 57 -31 -76 130 -31 66 -269 -95 -206 190 -77
6470 -77 -45 156 -58 -38 134 -16 -28 -39 94 4 106 -1 -145 -138 167 -143 167 100 379 -180 243 -256 -69
$$ packed form
6312D0J54k54R5k1j54PJ42J85q7M4l21L39k16j30J52p7K64l29K15m17L55J54j30
6335A0j34K43j38K00Ok02k20n8N9K16j31J40J65pk2l57o5L35l09J19K09j69N2
6358e8K67j88J84k38Q9J97k93K33m48K62J06k64J77j00J01l35LK89J61r8r4n8
6380a05R9j8J17q0n8Q9J8o3J42j01k17J73J74m5J75k86P3k15j04J11N1j4K6j38
6404a96L61k01L27k91j35N6R9K42l61K13R2l46J37M6j16j18M65m1j31j87j63L07
6426E9o6j53L34k12J13J08M2j46l15J47P9l7K76k59k56K03j14K63K58j57k42R4
6448A9k07K22l6J65K1k12k78L92m67J40L24k6q8m5K06j61R7l35J74j11L96k67
6470g7L2K01k14K0J72j50j2j1J33r0J02j07j44PL05l10L10o7K79n59M23m99J87
$$ plain form
6493 -69 346 86 -56 -54 222 -4 133 -50 -113 -24 192 117 182 -209 -30 236 99 105 -123 184 -34 -245 -11
6516 -11 193 20 14 -68 33 84 -147 241 -221 -98 -87 66 -203 -106 25 120 -126 244 -80 -213 216 -23 -176
6539 -176 -86 -95 -26 47 94 -142 66 -97 41 -62 -305 440 -170 -13 206 74 -79 -140 182 -1 -228 -150 -154
6562 -154 -71 282 -23 -61 -25 -239 -201 -55 -43 245 29 -181 -117 134 6 -105 -118 -271 2 34 -79 -13 -182
6585 -182 267 -170 270 -130 -75 10 199 -316 172 226 39 288 8 72 -223 -66 208 194 95 87 -23 -189 -130
6608 -130 54 -76 -57 -137 245 -8 302 80 66 142 193 -13 -154 -79 131 89 -40 -195 -68 1 216 288 240
6631 240 -213 202 40 -50 -137 -190 12 -67 -109 121 38 -454 62 202 112 353 -37 -147 -12 93 -47 49 -65
6654 -65 -272 -67 170 -71 233 -87 -178 -195 -76 -77 20 -172 -230 -155 -153 -108 -33 26 -286 105 18 241 -25 -141 33
$$ packed form
6493f9M15k60j42KK76k26J37j83o3Q9K16p5O5l91J79K66j37Ok28L07k18k11K34
6516a1K04j73oq2J01N1k31L88m62J23J1J53k69R7J31R5k46L70l24j33M29k39j53
6539a76R0rO9P3M7k36K08j63J38j03k43P45o10J57K19j32j53o1L22j83k27P8m
6562a54Q3L53l05l8L6k14L8J46J2K88k16k10O4K51j28j11j3j53K73L2j13O6j69
6585a82M49m37M40m00N5Q5J89n15M88N4j87K49k80O4k95J57K74j4r9qj10j66N9
6608a30J84j30J9q0L82k53L10k22j4P6N1k06j41P5K10m2j29j55J27O9K15P2m8
6631B40m53M15j62r0q7n3K02p9m2K30q3m92N16J40r0K41l90j10J35J05j40R6j14
6654f5k07K05K37k41L04l20r1j7J19jR7j92n8P5KM5P5N9l12L91q7K23k66j16J74
$$ plain form
6679 33 92 -192 109 -106 264 34 210 -83 206 81 -17 -5 207 146 31 62 -190 279 -111 8 -158 -127
6701 -127 -139 -139 197 -98 -101 9 -123 1 -38 -97 126 -129 132 -318 -175 -154 -131 -81 -66 356 -201 133 36 170
6725 170 158 29 115 134 -213 -88 49 85 -265 -33 82 -57 96 -175 -99 -62 139 102 252 -87 82 203
6747 203 60 -282 -221 -187 2 -229 87 79 -116 99 27 -425 292 -123 -51 -73 -47 -183 149 -286 86 74 -82
6770 -82 78 86 108 -150 -34 -86 66 -13 -186 -192 -26 -233 71 10 -76 214 101 165 -99 105 128 -161 -123 56
6794 56 -113 -91 -145 -33 143 65 -151 76 -88 -228 -121 -241 -90 9 -15 2 -44 -186 -154 -239 -115 193 -167
6817 -167 -115 194 71 99 -8 147 62 -297 75 105 -75 -179 34 278 185 -296 -163 10 91 -3 -7 278 124
6840 124 152 -107 -50 -61 45 130 69 323 129 231 -124 54 294 -28 -29 -51 66 -262 196 -238 12 201 -184
$$ packed form
6679C3N9k84L01k15L70k30J76k93K89j25r8J2K12o1j15L1k52M69l90J19j66L1
6701a27j2%L36k95lJ10j32J24l9n9K23k55K61m50J43K1K3N0J5M22n57L34r7J34
6725A70j2j29Q6J9l47J25J37L6l50K32J15j39J53k71P6L7K01l7J50l39J69J21
6747B03j43l42O1L4J89k31L16qj95K15p2m52P17m15P2k2K6j36L32m35L72j2j56
6770h2J60QK2k58J16n2J52p9j73oJ66k07L04o1q6K90j13O4k64K04K3k89L8J79
6794E6j69K2n4J12J76p8k16K27j64j40J07j20J51R9k4J7m6j42L2q5J24L08l60
6817a67N2L09j23K8j07J55q5l59L72L0j80j04K13K44r3m81J33J73Q1r4mK85j54
6840A24K8k59N7j1J06Q5o1K54j94J02l55J78K40l22jk2J17l28M58m34K50J89l85
$$ plain form
6863 -184 -59 159 -27 -35 117 301 137 255 4 -166 119 -238 48 68 -282 41 -31 -230 327 264 -120 -27
6885 -27 -173 65 59 -22 -31 -27 73 -76 93 -16 -152 109 -158 -7 185 345 -5 92 -106 62 136 255 108
6908 108 161 104 -187 17 -225 249 23 -113 -77 -55 117 172 108 -183 68 -94 -29 -96 65 118 90 -86 117
6931 117 48 511 93 -59 -99 -89 25 260 -160 111 154 40 -233 205 -109 80 41 146 234 -314 163 3
6953 3 -124 83 -22 -2 -102 235 -207 -147 -55 -210 106 85 3 -185 -57 -83 -10 54 -63 -70 39 118 -62 -208
6977 -208 -233 -42 -199 -9 -30 -183 -177 104 45 -55 23 -187 -24 -211 -254 -104 99 81 65 -87 23 164 43
7000 43 77 90 -4 61 194 -64 46 -2 134 -111 -202 7 -95 79 13 21 -165 -132 275 85 191 -101 231 343
7024 343 27 214 194 -131 -134 -6 27 80 -16 -119 70 202 -64 61 144 -160 124 257 45 398 -178 181
$$ packed form
6863a84J25K18j86qJ52J84j64J18k51j70K85l57K86K0l50L23p2j99N57o3l84R3
6885b7j46K38oq1rMJ00j49J69j09j36K61k67J51J92J60l50R7j98J68P4J19j47
6908A08N3n7k91K04k42M74k26j36L6K2J72N5o4k91K51j62O5o7J61N3k8j76K03
6931A17o9M63m18j52m0J0J14K35m20K71M3j14k73M38l14J89l9J05Q8n48M77j60
6953Cj27K07j05K0j00L37m42O0R2j55L16k1q2j88J28k6P3O4j17pJ09P9j80j46
6977b08k5J91j57J90k1j53OK81n9j00P8k10J63j87m3J50K03j8j6j52J10J41j21
7000D3L4J3r4O5J33k58J10m8J36k45r1K09j02J74o6Qj86L3M07j90J06k92L32J12
7024C43l16J87k0l25lJ28L3N3r6j03J89J32k66J25Q3l04K84J33k12L53n76L59
$$ plain form
7046 181 -138 -265 217 -18 -93 -96 56 -71 -26 62 -112 -73 28 -48 -59 -162 -29 24 122 120 80 195 74 51 -152
7071 -152 -99 -36 -46 22 189 -56 95 130 -194 -3 -120 -329 31 74 75 219 -114 194 70 152 71 -65 -82 89
7095 89 143 266 -239 -129 171 -50 -165 225 61 -197 -142 84 13 36 121 71 24 -100 44 15 83 133 -189 -272
7119 -272 -11 0 19 -200 -62 -64 -128 138 69 -3 -150 193 -68 -121 143 -116 214 290 -237 -160 -258 -23 -85 28
7143 28 58 -53 -25 241 -334 -50 157 99 -168 -136 -78 -39 36 66 -39 58 48 202 22 -144 79 65 -124 -66
7167 -66 62 -223 -28 -106 267 98 -251 -71 -127 -99 111 -4 44 -122 253 -84 -54 -31 59 -97 44 -80 14
7190 14 97 -26 303 92 136 221 39 170 67 257 86 -30 506 -69 95 68 -67 251 63 -125 -12 -80
7212 -80 -27 -64 58 359 151 50 107 -217 -94 -111 -160 -157 -205 10 -322 -217 17 87 -234 234 -191 113 207 -45
$$ packed form
7046A81l19j27M82k35p5lJ52j27M5Q8j74L9J01p6j1j03J33N3R8km0J15j21k3k03
7071a52N3O3j0O8J67k45J51L5l24J91j17k09L60M3JJ44l33L08j24Q2q1j36j7J71
7095H9N4J23n05J10L00k21j15L90j64k58N5K26p1K3Q5n0m7j24J44k9O8N0l22q3
7119b72K61J1J9k19J38ko4K66o9p2j47L43k61n3K64k59L30P6n27P7r8K35o2J13
7143B8L0j11K8K66n75K84K07n8k67L2N8L9P5L0j05R7j0J54j80j66K23j4j89N8
7167f6J28k85J95p8L73j69l49J80n6K8K10j15M8j66L75l37L0K3R0j56J41j24R4
7190A4Q3j23L29k11M4Q5j82J31j03J90j71j16N36n75J64k7j35L18j88j88J13o8
7212h0N3l7J22L01k08j01N7l24J23j7m9Lm8K15l32J05K34P0l21M68m25L04R4k52
$$ plain form
7236 -45 -79 -30 155 72 138 -127 270 -174 -164 -22 -15 17 -27 249 -89 93 251 -11 15 87 -134 76 -30 70
7260 70 275 149 14 -190 170 -132 -20 114 -27 -67 -214 234 1 -190 -147 3 73 -97 -67 133 -247 34
7282 34 -66 -1 131 -147 -49 -137 -257 -154 -41 -19 -15 54 -18 -92 16 389 32 -180 40 -229 -19 46 93 -103
7306 -103 -13 -233 -111 -295 60 -31 52 120 -62 112 -163 19 73 85 111 155 -183 68 -125 -143 104 -188 104
7329 104 -253 -159 -136 -43 67 -160 80 -198 2 -107 247 -49 -220 -116 111 -25 130 -267 119 -35 24
7350 24 122 243 -197 -26 26 -325 83 -26 142 -298 -12 -148 -116 -221 -44 -157 133 105 -193 132 -306 -50
7372 -50 -9 94 -190 -152 68 88 97 -5 -233 26 143 -179 -16 156 40 15 74 55 137 120 -242 -11 -90 50
7396 50 98 74 -2 40 -21 -193 -97 204 -38 -9 -22 -10 -326 69 -97 70 -132 -128 -151 101 -55 -139 -301 156 16
$$ packed form
7236d5l4M9J85q3O6k65L97m44J0J42PL2m4K76l38J82J58k62K6P2k21K10j06J00
7260G0K05j26j35k04L60l02J12J34j41m0j47M48k33j91M3J50P0j70L0K00l80K81
7282C4j00O5J32k78R8q8j20J03J13K2MO9p2p4J08L73l57k12K20k69K10O5M7j96
7306a03R0k20J22j84L55r1Q3O8j82J74k75J82N4J2K6M4l38K51j93j8K47k92K92
7329A04l57R4K3R3J10k27K40k78K00j09L54k96j71J04K27j36J55l97L86j54N9
7350B4R8J21m40J71N2l51M08j09J68m40K86j36L2j05J77j13K90k8k98L25m38K56
7372e0M1J03k84L8K20K0Rj02k28K59J17l22J63J72j16k5N9j9Q2j7l62K31p9J40
7396E0M8k4p6M2o1j72R6L01k42K9j3J2l16L95j66J67k02Mk3K52j56q4j62M57j40
$$ plain form
7421 16 52 -107 -222 105 73 35 -131 334 -184 -164 -230 200 120 74 -341 -58 -20 99 -11 132 -15 -155 89
7444 89 -317 53 -110 -82 -108 19 69 13 -307 -118 207 161 142 99 -104 -77 -331 -102 83 61 19 -168 91 -111
7468 -111 -90 22 -133 -64 123 -148 -52 143 -66 -74 -169 88 -115 226 -274 -141 -64 -215 32 285 157 -135
7490 -135 46 -410 -292 228 -14 177 -216 -17 261 -60 50 -66 128 -26 107 316 82 70 -78 -77 34
7511 34 102 -169 92 -118 61 82 -56 -57 154 -111 124 80 -28 -61 235 12 -78 -56 -176 -335 -15 -66 -32 -35
7535 -35 158 5 -27 70 -150 -45 106 -101 -11 117 44 290 194 224 206 73 151 -88 -158 -61 107 258 -37 -72
7559 -72 125 -63 -287 -121 73 -18 47 -81 -70 63 2 -95 18 269 0 53 -187 196 -213 130 -87 -311
7581 -311 -30 -236 32 -170 -129 -37 -181 -36 109 -36 -149 -163 -13 -173 -21 183 -90 -8 82 22 -103 105
$$ packed form
7421A6L6j59j15L27l2l8j66M65n18K0o6M30q0m6m15K83L8J19j10J43j47j40K44
7444H9m06L70j63K8k6J27N0n6l20J89L25m6j9m3k03K7k54K29J85k2m2j87K59k02
7468a11K1J12j55O9J87k71R6J95k09qr5K57k03L41n00J33P7j51K47K53j28k92
7490a35J81m56J18N20k42J91l93J99K78l21J10j16J94j54J33K09k34j2j48JJ11
7511C4O8k71K61k10J79K1j38jK11k65K35m4j08l3K96k23r0K2j20j59L20n1L4l
7535c5J93j53l2R7k20J05J51k07R0J28p3K46r6L0j8j33P8k39p0R7J68J51k95l5
7559g2J97j88k24J66J94r1O5j28J1J33o1r7J13K51k69N3k40L83m09L43k17k24
7581c11K81k06K68k02M1R2j44J45J45j45j13j4J50j60J52K04k73Q2R0o0j25K08
$$ plain form
7603 105 45 -69 -22 117 202 39 14 3 -18 -56 -79 21 -35 150 -28 -98 165 89 142 -108 -19 11 53 27 -206
7628 -206 213 -13 98 132 -63 -477 -213 49 134 -187 -121 55 35 -41 -188 14 38 142 -167 13 -32 226
7650 226 59 241 -76 113 -8 -290 6 -45 165 182 -102 -75 -32 121 82 -231 163 -9 21 -191 12 47
7672 47 -100 85 -92 129 26 -57 337 -35 282 333 -21 -34 40 -141 122 103 112 113 -99 166 169 -158 -111 8
7696 8 132 -84 88 207 -150 225 -288 137 48 88 -182 64 63 172 35 21 464 127 59 -206 -23 116 154
7719 154 -27 37 -18 -17 103 -180 77 142 93 -90 -68 -40 -49 270 38 -106 17 137 -284 179 -222 2 184
7742 184 64 -177 74 -38 -282 -202 2 -73 -69 -50 140 332 -124 168 142 140 104 -181 167 -146 205 298 126
7765 126 53 -48 166 0 -164 -245 184 -49 -40 100 -99 236 54 189 -77 -106 75 -91 10 -332 -22 337
$$ packed form
7603A05o0j14M7J39Q5j63k5j1k1l8k3J00n6J85j78p0K63p6N3k50Q9L0M2k6k33
7628b06M19k26J11L4j95m14K64K62Q5l21O6J76k0p6j47K02K4J04l09J80m5K58
7650B26j67J82l17J89j21k82K96n1K10J7k84K7M3J53l9l13L94j72L0k12K03L5
7672D7j47J85j77K21j03q3L94l72L17N1l54j3P4j81K63j9RJk12K65Ll27M7J19
7696HJ24k16J72J19l57L75n13M25q9M0k70K46jJ09j37j4M43l37o8k65J83J39L8
7719A54j81O4n5JJ20k83K57O5m9j83K2K8rL19k32j44J23J20m21M63m01K24J82
7742A84j20k41K51j12k44Q0K04p5MJ9J90J92m56K92k6kl6k85L48l13L51R3j72
7765A26p3j01K14j66j64q1M29k33RJ40j99L35j82J35k66k9J81j66J01l42L10L59
$$ plain form
7787 337 39 8 222 -214 -318 72 -107 -169 -139 253 98 26 178 25 -82 189 -167 56 -117 -186 121 2
7809 2 3 -250 -79 -101 -35 51 -52 95 74 10 2 13 -246 -16 -74 -54 152 -286 -49 -170 -218 -66 -17 10 -82 170
7835 170 13 -1 -128 49 -96 2 112 130 -172 48 -35 3 149 -173 304 93 138 264 -2 -94 108 -63
7857 -63 119 -63 126 -13 105 -82 -258 -33 -77 -164 -130 -97 -86 -8 -10 119 15 -119 -35 -91 46 -77 -68 156
7881 156 -107 -272 31 199 -146 -215 87 87 -99 141 139 222 -108 -313 -208 -44 79 13 9 -145 106 8 83 -211
7905 -211 -114 86 101 168 -89 -288 55 -34 214 -176 52 -135 97 -132 -54 -118 50 116 101 24 19 42 -126 7
7929 7 -86 118 -243 -153 -121 -330 21 -145 -12 126 357 90 -147 -87 -147 -27 23 31 -193 -116 -114 12 116 82 -72
7954 -72 1 -75 -35 46 159 -244 -13 -195 -52 122 110 47 58 -130 160 -239 -136 -30 -110 -152 -234 42 -124 -60
$$ packed form
7787C37k98l1K14m36j04L90j79o2L0L92j55p2J52j53j07K71l56K23j73o9L07j19
7809BJk53J71k2O6Q6j03J47k1o4qJ1k59K30n8K0K06m38K37j21m8J52M9K7r2K52
7835A70j57j4j27J77j45R8J10J8l02K20q3L8J46l22M77k11M5J26k66r2K02j71
7857f3J82j82J89j39J18j87j76K25m4q7L4L3J1P8kJ29j04j34Q4n6J37j23RK24
7881A56k63j65L03J68l45o9L02%j86K40kQ3l30k05J05J64J23o6mj54K51r8P5k94
7905b11R7K00J5O7k57j99L43q9K48l90K28j87K32k29P8o4J68O6j5p7nK3j68J33
7929Gr3K04l61R0L2k09L51j66J33J38K31k67k37O0o0J20N0Qk24P7KJ26J04l4j54
7954g2P3p6M0Q1J13m03K31j82J43J74j2o3J1j88K90l99J03J06q0m2q2K76j66O4
$$ plain form
7978 -60 -85 -165 83 -113 -44 33 106 -31 2 -19 81 -8 17 -73 -51 -60 219 144 293 -7 -23 -125 -78 -182 -67 -73
8004 -73 14 42 -156 -185 53 71 123 -25 -106 82 98 220 -104 -111 -68 36 308 20 0 215 -88 32 -19 -98 9
8029 9 -208 -209 -31 -108 -7 5 238 -39 -180 -5 169 -69 -120 -51 -24 76 -131 -143 178 -25 -254 132 42 126
8053 126 125 59 -125 293 23 -2 -15 -153 231 -167 -114 -242 -12 -95 -3 -11 -18 268 141 50 -86 -72 -102 303 156
8078 156 -44 -108 -87 -365 -175 -107 1 -80 -27 59 59 160 -164 -65 189 -197 -45 38 55 57 44 -19 -139 -44 -79 42
8104 42 264 -11 -170 -132 -87 -72 165 70 -282 97 330 -332 11 -68 -9 23 155 18 280 165 25 97 -116
8127 -116 -59 9 -102 -162 -73 271 -88 -159 305 -44 39 80 -139 125 8 250 165 -40 26 43 149 -16 -40 78
8151 78 -122 111 31 121 42 -343 -87 75 -299 -34 -20 161 60 -65 308 8 -44 -191 -48 308 -57 -169
$$ packed form
7978f0k5q0K48j96O9P7P3j37L3k1J00q9K5r0K2rK79p5J49l00j6j02M7j04J15o
8004g3Q7K8j98k9K38J8N2j48q1J88J6J22l24pM3J04K72k88k0K15l03J20n1p9J07
8029Ik17jJ78p7J01J2K33k77j41J75J74k38n1O9K7J00k07j2L21k03k29L86r0Q4
8053A26jo6j84M18k70k5j3j38L84l98N3j28K30q3R2qpK86j27r1j36J4l0M05j47
8078A56k00o4K1k78J90O8J08q1N3Q6%J01l24R9K54l86J52Q3J7Kj3o3j20R5l5J21
8104D2K22k75j59L8M5J5K37r5l52L79K33o62L43p9N9L2J32j37K62j15j40P2k13
8127a16N7O8j11o0Q9L44l59p1M64l49Q3M1k19K64j17K42q5k05O6J7J06j65k4J18
8151G8k00K33q0R0p9l85K56J62l74K65J4J81j01j25L73l00n2j47J43L56l65j12
$$ plain form
8173 -169 269 -196 27 32 -99 124 69 -173 -43 -148 207 332 -319 149 108 181 92 -100
$$ packed form
8173a69M38m65K23Nj31K23n5k42J30j05L55J25o51M68m1P3q9j92
8191a00
$$ Imaginary data points
##PAGE= N=2
##DATA TABLE= (X++(I..I)), XYDATA
$$ plain form
0 0 0 0 0 -8 8 -8 13 -16 16 -24 32 -40 48 -64 72 -88 105 -128 152 -176 208 -242 280 -321 372 -423 482
27 482 -550 620 -701 792 -887 993 -1114 1240 -1383 1539 -1708 1894 -2101 2326 -2575 2852
43 2852 -3156 3496 -3882 4313 -4806 5377 -6034 6817 -7758 8917 -10385 12316 -14978
56 -14978 18908 -25305 37531 -69439 327101 725900 -16078 -512645 -451906 137155 498807
67 498807 403734 -13197 -262192 -242164 -23285 162749 259833 175093 -50112 -293925 -286074
78 -286074 6565 325471 293807 -72203 -398754 -328970 39655 322073 232878 -96316 -323815
89 -323815 -242141 23395 218822 189491 -3026 -188819 -209188 -45740 164227 224984 74556
100 74556 -138482 -194761 -44810 148174 195760 73262 -82617 -127971 -49253 63836 124536
$$ packed form
0@%%%qJ6j6K1k9L2m0N6p2Q8j12J36j60J93k33K80l28L84m50N22o01O93p95R05
27D82j032J170j321J493j679J880k107K354k623K922l247L602l995M427m901N427
43B852o008O652p378Q195r119J0183j1411J2851j4575J6675j9302K2701k7294
56a4978L3886m4213O2836j06970L96540L98799p41978m96567O0739N89061L61652
67D98807r5073m16931k48995K0028K18879J86034R7084q4740k25205k43813P851
78b86074K92639L18906l1664l66010l26551O9784L68625K82418q9195l29194k27499
89c23815Q1674K65536J95427k9331j92517j85793k0369J63448K09967O0757j50428
100G4556k13038n6279J49951J92984M7586j22498j55879m5354P8718J13089O0700
$$ plain form
111 124536 101971 8461 -100594 -129702 -26381 128220 167287 24410 -158732 -175880 -3205
122 -3205 163561 138097 -38554 -160725 -103376 42153 104938 43102 -38353 -53936 -27037
133 -27037 -11747 -2927 27300 55451 23517 -57264 -92762 -20591 87548 102267 -2300 -105149
145 -105149 -86974 27219 100456 56641 -37630 -74445 -31188 28221 44068 19640 -8775 -18945
157 -18945 -18832 -12055 7923 31642 30037 -3425 -35355 -28627 11724 41828 31137 -4411 -28312
170 -28312 -22502 4256 27883 29311 7003 -20192 -29476 -10415 21724 33545 9214 -27078 -34674
183 -34674 -6149 22199 19981 -5524 -21149 -13933 -1300 -51 -2550 2032 7911 -654 -18914
196 -18914 -21939 1782 28200 22089 -12783 -33494 -13344 22522 32371 7771 -18908 -17538 4251
$$ packed form
111A24536k2565r3510j09055k9108J03321J54601L9067j42877j83142j7148J72675
122c205J66766k5464j76651j22171N7349J45529O2785o1836q1455j5583K6899
133b7037J5290Q820L0227K8151l1934q0781l5498P2171J08139J4719j04567j02849
145a05149J8175J14193P3237m3815r4271l6815M3257N9409J5847k4428k8415j0170
157a8945J13O777J9978K3719j605l3462l1930O728M0351L0104j0691l5548k3901
170b8312N810K6758K3627J428k2308k7195r284J9061L2139J1821k4331l6292p596
183c4674K8525K8348k218k5505j5625P216J2633J249k499M582N879q565j8260
196a8914l025K3721K6418o111l4872k0711K0150L5866R849k4600k6679J370K1789
$$ plain form
209 4251 17833 12464 1377 -1771 316 -1262 -4227 2330 13607 12891 -4198 -18151 -11648 8223
223 8223 18894 7870 -12018 -18895 -8276 6791 12221 4607 -7373 -14042 -10555 47 10132
236 10132 10112 -2307 -15203 -13393 1371 12943 9761 -2779 -10798 -7303 1614 6987 6714 3302
250 3302 -1176 -6280 -7107 380 12069 13464 -406 -15090 -12402 6145 18872 10617 -8230 -16009
264 -16009 -5196 9735 11877 1616 -6471 -5891 -1802 88 1651 4583 4394 -2152 -9754 -7806 4457
279 4457 12654 5781 -8830 -14072 -3522 9776 10927 -187 -9252 -7300 1147 5017 3950 1322
293 1322 -1308 -3503 -4796 -877 5889 7875 511 -8436 -8296 1568 9704 6691 -3880 -8543 -3219
308 -3219 4639 5466 1137 -2028 -2154 -1396 -1588 169 3524 4408 -1002 -6916 -5168 3586 8583 3510
$$ packed form
209D251J3582n369j1087l148K087j578k965O557J1277p16j7089j3953O503J9871
223H223J0671j1024j9888o877J0619J5067N430p614j1980o669L487J0602J0085
236A0132k0j2419j2896J810J4764J1572l182j2540q019L495Q917N373k73l412
250C302m478n104q27P487J1689J395j3870j4684K688J8547J2727q255j8847p779
264a6009J0813J4931K142j0261q087N80M089J890J563K932j89o546p602J948J2263
279D457Q197o873j4611n242J0550J3298J151j1114r065J952Q447L870j067k628
293A322k630k195j293L919O766J986p364q947J40R864Q136l013j0571m663N324
308c219P858Q27m329l165j26P58j92J757L355Q84n410n914J748Q754M997n073
$$ plain form
324 3510 -6166 -7948 -129 7298 5133 -1919 -4654 -1509 2645 2002 -272 -162 1554 231 -3192 -2896
340 -2896 2075 5185 1790 -5195 -6303 184 5951 3698 -3555 -6014 -1513 3811 3066 -1252 -2970
355 -2970 -512 1093 -313 -1174 401 2276 1265 -2575 -3129 871 4417 2648 -2571 -4040 262 3935
371 3935 2979 -1345 -2587 -16 2593 1439 -1152 -740 854 942 -841 -1711 -80 2342 1075 -2184
387 -2184 -2735 432 2730 1610 -2033 -3042 -39 2214 927 -1500 -1901 303 1540 48 -1406 -560
403 -560 1348 935 -765 -1387 284 1767 1134 -1169 -1627 504 2376 955 -1712 -1586 319 1687 653
420 653 -1324 -1334 615 1467 2 -1195 -831 974 764 -512 -845 335 1233 691 -796 -1083 625 1637
438 1637 547 -1234 -1311 876 1438 5 -961 -834 307 831 -148 -981 -424 311 456 -718 -1102 -476
$$ packed form
324C510r676j782P819P427k165p052k735L145M154o43k274J10J716j323l423K96
340b896M971L110l395o985j108O487N767k253p253k459M501N324p45m318j718
355b970K458J605j406q61J575J875j011l840n54M000L546j769n219j469M302L673
371C935r56m324j242K571K609j154k591M12J594Q8j783q70J631K422j267l259
387b184n51L167K298j120l643j009L003K253j287k427m01K204J237j492j454Q46
403e60J908m13j700o22J671J483o33k303m58K131J872j421k667J26J905J368j034
420F53j977j0J949Q52j465j197L64J805k10j276l33J180Q98n42j487k87J708J012
438A637j090j781p7K187N62j433r66J27J141N24r79q33N57P35J45j174l84O26
$$ plain form
456 -476 695 -386 -1254 -1015 374 814 -53 -1106 -765 335 742 249 -523 -193 371 836 -89 -28 129
475 129 591 53 -46 -109 744 954 -179 -612 -303 618 619 -141 -750 -518 254 183 -179 -318 -429 -290 -588 -581
497 -581 -311 -177 83 -540 -930 -323 346 430 -244 -529 -90 287 732 24 -167 87 497 452 76 226 347
518 347 376 45 109 165 437 453 -180 -483 -304 487 558 -17 -514 -352 242 273 -122 -176 -227 -122 -34 -431 -243
541 -243 130 74 -317 -701 214 376 206 -236 -356 171 451 467 21 -187 67 282 157 365 140 177 -15
562 -15 -247 -76 281 287 127 -46 -543 -94 516 296 -190 -451 215 216 155 -118 -76 -16 194 -236 -291 119 21 -90
586 -90 -236 -195 -85 333 21 -389 -203 -227 294 67 -288 -386 133 87 -76 -233 -163 175 248 -154 -3 99 274
609 274 386 -306 -89 152 364 187 -34 -75 186 522 28 -214 -231 263 44 -225 -123 -309 -24 39 -85
$$ packed form
456d76J171j081q68K39J389M40q67j053L41J100M07m93p72L30N64M65r25O1J57
475A29M62n38r9o3Q53K10j133m33L09R21Jp60o09K32P72p1l62j39j11J39k98P
497e81K70J34K60o23l90O07O69Q4o74k85M39L77M45p08j91K54M10m5l76J50J21
518C47K9l31O4N6K72J6o33l03J79P91P1n75m97J62N94L1l95n4n1J05Q8l97J88
541b43L73n6l91l84R15J62j70m42j20N27K80J6m46k08K54K15j25K08k25L7j92
562a5k32J71L57Oj60j73m97M49O10k20m86k61O66Jo1k73M2O0K10m30n5M10r8j11
586i0j46M1J10M18l12m10J86k4N21k27l55r8N19m6j63j57P0L38P3m02J51J02J75
609B74J12o92K17K41K12j77k21m1K61L36m94k42j7M94k19k69J02j86K85O3j24
$$ plain form
630 -85 -15 87 140 -223 -271 -157 265 366 -76 -405 30 257 19 -39 106 -30 102 -76 -292 22 212 203 -131
653 -131 -283 -65 -127 86 71 -291 252 45 -150 53 75 -98 115 209 139 -106 14 219 73 -79 -120 20
675 20 7 -39 -218 -242 215 123 59 190 165 196 -67 -236 141 -12 55 -316 -158 -92 242 -52 60 -81 187 -140
699 -140 -153 -40 -22 -374 27 106 -29 -69 -59 148 -6 -6 -98 106 519 70 -110 189 119 292 73 45 -282 164
723 164 185 33 -25 14 293 -46 264 -38 -299 -70 31 34 -124 -30 -133 52 28 158 -27 128 86 -265 165
746 165 -56 55 -22 255 -42 -27 455 9 -116 298 -8 -172 -17 129 89 -178 9 140 123 52 371 -85
768 -85 168 39 -45 91 116 78 58 -356 84 -77 27 -13 -44 59 -304 -34 -53 22 3 34 -358 7 -108 93
792 93 -16 207 154 145 366 67 26 248 102 12 -212 -174 -176 212 -176 -173 60 -94 100 306 -47 -112 84 44 -39
$$ packed form
630h5P0J02N3l63m8J14M22J01m42l29M35K27k38n8J45j36J32j78k16L14J90rl34
653a31j52K18o2K13j5l62N43k07j95K03K2j73K13R4p0k45J20K05j46j52m1J40
675B0j3m6j79k4M57r2o4J31k5L1k63j69L77j53O7l71J58O6L34k94J12j41K68l27
699a40j3J13J8l52M01P9j35m0J0K07j54%r2K04M13m49j80K99p0J73k19k8l27M46
723A64K1j52n8L9K79l39L10l02k61K29J01Lj58R4j03J85k4J30j85J55m2l51M30
746A65k21J11p7K77k97J5M82m46j25M14l06j64J55J46m0k67J87J31j7p1L19m56
768h5K53j29q4J36K5l8k0m14M40j61J04m0l1J03l63K70j9P5j9L1l92L65j15K01
792I3j09K23n3rK21k99m1K22j46r0k24L8kL88l88LK33j54J94K06l53o5J96m0q3
$$ plain form
817 -39 -301 136 17 -93 -28 126 -169 -19 4 239 38 4 -43 298 71 38 -286 -277 -184 -111 69 -192 -160 -213
841 -213 -79 2 -100 187 14 -62 17 -74 -143 38 -20 -186 281 114 -17 170 -53 -261 195 -211 -77 -39 44
864 44 35 74 -61 -167 -112 22 -203 -322 -138 23 -147 -158 -87 -133 -162 31 -8 -26 151 66 77 339 -235 -29 159
889 159 48 9 -229 -297 10 -92 -193 -278 -27 -26 110 -208 -188 -30 50 104 31 158 137 -7 80 -127 -9 27
913 27 145 4 -26 -101 -31 -51 -83 -146 -115 -134 -31 217 28 -132 113 207 41 70 10 105 -165 58 -420 -94 -54
938 -54 48 207 -83 7 -46 -121 4 -49 -45 168 -188 -17 173 196 184 -68 121 -74 -125 -3 41 -148 123 -273
962 -273 -360 256 -76 -72 -100 -50 -127 65 142 -173 -178 239 173 30 -14 64 -177 -83 -73 -173 -118 7 244 27 -176
987 -176 129 -132 79 -81 -23 -92 88 -2 126 -148 -29 38 -47 29 -244 -2 -113 -12 -125 28 204 213 37
$$ packed form
817c9k62M37j19j10O5J54k95J50K3K35k01l4m7L41k27l3l24RR3P3J80k61L2n3
841b13J34Q1j02K87j73p6P9r1o9J81n8j66M67j67j31J87k23k08M56m06J34L8Q3
864D4rL9j35j06N5J34k25j19J84J61j70j1P1m6k9J93l9j8J77q5J1K62n74K06J88
889A59j11l9k38o8L07j02j01q5K51JJ36l18K0J58Q0N4p3J27k1j44Q7k07J18L6
913B7J18j41l0p5P0k0l2o3L1j9J03K48j89j60K45R4j66K9o0R5k70K23m78L26M0
938e4J02J59k90R0n3p5J25n3MK13l56J71J90K3j2k52J89j95n1J22M4j89K71l96
962b73q7O16l32Mk8N0p7J92P7l15nM17o6j43m4P8k41R4J0j00N5J25K37k17k03
987a76L05k61K11j60N8o9J80r0J28k74J19O7q5P6k73K42j11J01j13J53J76Rj76
$$ plain form
1010 37 160 18 -98 -214 -148 68 -38 36 -129 237 60 -13 132 -60 103 -11 -244 74 -25 31 -144 151
1032 151 162 -123 -40 -56 88 109 -101 81 -116 207 -365 -108 -85 156 -10 -27 -214 143 187 66 48 22 -50
1055 -50 -107 7 150 -267 -187 195 164 176 -327 -124 162 -10 -77 -84 98 423 25 18 -192 267 -220 -166 -123 211
1079 211 76 112 -138 38 -12 -41 175 14 248 33 32 -322 -32 194 187 91 -48 45 -158 19 -299 -243 74
1102 74 98 -195 -14 -147 62 -6 133 218 48 97 78 254 73 166 155 -25 75 165 116 -29 3 -221 -191 168
1126 168 -159 -92 21 -144 -134 -223 188 85 -361 -189 -262 -330 -14 -389 145 152 255 -111 -109 -257 -32 71 -50
1149 -50 -192 -52 120 -122 116 -135 303 128 -46 34 -71 -70 25 162 -76 -259 109 -228 76 101 -23 -122
1171 -122 -137 159 -47 118 9 -259 -44 31 135 -41 -183 -174 -41 -351 -9 228 -194 45 71 33 -297 65
$$ packed form
1010C7J23j42j16j16O6K16j06P4j65L66j77p3J45j92J63j14k33L18r9N6j75K95
1032A51J1k85Q3j6J44K1k10J82j97L23n72K57K3K41j66j7j87L57M4j21j8k6p2
1055e0n7J14J43m17Q0L82l1J2n03K03K86j72o7pJ82L25l98pk10M59m87N4M3L34
1079B11j35L6k50J76n0k9K16j61K34k15jl54K90K26pr6j39R3k03J77l18N6L17
1102G4K4k93J81j33K09o8J39Q5j70M9j9J76j81R3j1j80J00R0m9j45L2k24L0L59
1126A68l27O7J13j65J0q9M11j03m46J72p3o8L16l75N34PJ03l66Kj48K25J03j21
1149e0j42J40J72k42K38k51M38j75j74Q0j05JR5J37k38j83L68l37L04K5j24r9
1171a22j5K96k06J65j09k68K15P5J04j76j42RJ33l10L42K37m22K39K6l8l30L62
$$ plain form
1193 65 -153 -28 190 20 -23 -504 16 -126 111 291 47 -151 -248 -151 -30 -28 7 140 301 27 -122 -166 210
1216 210 220 -108 109 -3 -216 -47 -336 119 -95 -99 -127 -107 -86 -202 79 91 -100 -127 -113 99 -71 -15 12 100
1240 100 50 -177 -29 155 -57 -33 301 -54 203 -146 -222 -123 90 -2 -196 148 111 84 138 89 77 198 -50
1263 -50 47 -140 -44 -23 92 -173 -67 -64 -60 338 109 32 64 -153 47 133 168 0 -52 60 259 -32 20 216 93
1288 93 -15 -179 82 -404 -237 23 -125 12 -156 -17 -107 -329 -243 42 63 338 -28 166 -46 -96 -5 -38
1310 -38 -54 222 -154 203 -208 243 71 158 110 -196 -161 -11 66 -177 243 160 65 -22 95 171 -204 87 -188
1333 -188 14 144 -17 -134 -5 -243 -39 -65 459 71 -438 -80 102 12 -149 -60 -18 -141 312 -122 14
1354 14 126 179 73 192 -142 218 -196 44 232 46 39 -18 198 -322 301 -135 142 184 105 -85 16 93 -295
$$ packed form
1193F5k18J25K18j70m3m81N20j42K37J80k44j98r7R7J21KL5J33J61k74j49m4L76
1216B10J0l28K17j12k13J69k89M55k14mk8K0K1j16K81J2j91k7J4K12j70N6K7Q8
1240A00n0k27J48J84k12K4L34l55K57l49p6R9K13r2j94L44l7k7N4m9j2J21k48
1263e0R7j87R6K1J15k65J06LML98k29p7L2k17K00Q6L5j68n2J12J99k91N2J96j23
1288I3j08j64K61m86J67K60j48J37j68J39r0k22Q6K85K1K75l66J94k12n0R1l3
1310c8j6K76l76L57m11M51j72Q7m8l06L5J50P7k43M20q3r5q7J17P6l75K91k75
1333a88K02J30j61j17J29k38K04k6N24l88n09L58J82r0j61Q9M2j23M53m34J36
1354A4J12N3j06J19l34L60m14K40J88j86pn7K16n20O23m36K77M2p9j90J01P7l88
$$ plain form
1377 -295 -51 159 -20 84 -103 -65 41 -81 -157 -251 -240 -59 -19 248 -93 -137 14 37 90 51 83 170 -63 -200
1401 -200 -162 192 -123 -65 298 119 -132 -121 -117 -227 -34 160 195 65 -98 -161 173 34 -94 147 126 -4 -7
1424 -7 -213 133 36 -54 151 191 37 -52 -67 -43 -71 -103 -306 -127 76 398 13 -76 -41 -46 -94 52 121 -98 -159 331
1450 331 156 -271 220 188 56 -243 -69 42 46 -81 -177 140 -204 -82 -148 108 -113 -258 45 165 107 198
1472 198 63 -140 55 154 -155 -127 7 -75 468 146 -103 24 31 102 -183 184 -67 315 33 130 -69 83
1494 83 203 -56 -199 17 -264 -247 27 -98 -11 -67 63 77 32 -6 -41 92 305 105 25 118 87 -448 112 105
1518 105 89 -137 -113 206 -48 -98 245 -87 241 329 -49 -27 -56 94 -15 -116 158 150 -132 64 -70 202 -68
1541 -68 188 -200 -150 215 -215 94 124 187 126 281 69 -116 -273 -9 -47 131 124 212 97 254 154 167 -31
$$ packed form
1377b95K44K10j79J04j87L8J06j22p6r4J1J81M0K67l41m4J51K3N3l9L2Q7k33j37
1401b00L8L54l15N8L63j79k51J1Mj10J93J94L5j30j63o3L34j39j28K41k1j30l
1424gk06L46r7r0K05M0j54q9j5K4k8l2k03J79K03L22l85q9L5nm8J46O9k19o1M90
1450C31j75m27M91l2j32k99J74J11Mj27r6L17l44J22o6K56k21j45L03J20n8R1
1472A98j35k03J95R9l09K8J34q2N43l22k49J27PP1k85L67k51L82k82R7j99J52
1494H3J20k59j43K16k81J7K74j25Q7n6J30J4m5l8l5J33K13k00q0R3l1n35N60p
1518A05j6k26K4L19k54n0L43l32L28Q8l78K2k9J50j09j01K74qk82J96j34K72k70
1541f8K56l88N0L65m30L09L0O3o1J55k12j85j57K64l8J78pQ8j15J57j00J3j98
$$ plain form
1564 -31 -37 15 101 -38 132 191 -181 -50 -200 -29 62 98 53 -150 -193 -106 -178 182 -371 -198 -110 -66 99 49 0
1589 0 57 -118 -172 29 135 478 50 -401 -7 99 -263 142 -42 -26 103 183 27 -51 35 150 47 -154 360
1612 360 48 -38 -102 27 219 292 -55 97 63 -337 11 46 -246 28 243 2 -100 41 195 -31 -48 173
1634 173 316 338 433 -197 24 -39 -201 65 -79 17 157 -81 61 -115 60 99 -153 -49 -96 -31 31 96 -208
1657 -208 3 28 -62 -168 -111 8 32 70 75 -34 -25 -51 -178 235 -124 90 22 -224 213 -312 208 -68 -15 -95
1681 -95 146 -145 63 122 270 -202 196 46 -198 -188 78 265 -91 -20 -86 -3 109 6 221 -82 -283 8
1703 8 -137 247 -4 4 -200 -267 219 68 99 224 -383 -109 -18 -247 -266 288 -32 37 -153 -130 -108 203 12 173
1727 173 38 13 -107 -109 31 282 -443 -5 46 -153 29 173 274 34 206 42 24 -302 -237 -380 94 -20
$$ packed form
1564c1oN2Q6j39J70N9l72J31j50J71R1L6m5k03m3Q7p2L60n53J73Q8M4J65n0m9
1589@N7j75n4K01J06L43m28m51L94J06l62M05j84J6J29Q0j56p8Q6J15j03k01N14
1612C60l12q6o4J29J92P3l47J52l4m00L48L5k92K74K15k41j02J41J54k26j7K21
1634A73J43K2R5o30K21o3j62K66j44R6J40k38J42j76J75L9k52J04m7O5O2O5l04
1657b08K11K5r0j06N7J19K4L8Nj09Rk6j27M13l59K14o8k46M37n25N20k76N3q0
1681i5K41k91K08N9J48m72L98j50k44J0K66J87l56P1o6Q3J12j03K15l03k01K91
1703Hj45L84k51Qk04o7M86j51L1J25o07K74R1k29j9N54l20O9j90K3K2L11j91J61
1727A73j35k5j20kJ40K51p25M38N1j99J82J44J01k40J72j64j8l26O5j43M74j14
$$ plain form
1749 -20 -146 -264 -237 178 -58 133 -155 -45 135 -150 -168 -47 17 101 -113 -40 101 146 -40 -248 -84 -279
1771 -279 38 124 -71 14 -170 -218 43 1 -35 119 31 89 170 -11 55 -42 94 -276 -139 -17 -194 -59 166
1794 166 101 -235 46 -53 98 0 -51 -230 30 12 -24 126 -67 86 184 118 -179 -264 -140 61 58 -117 -277 -212
1818 -212 164 46 -324 111 -96 -220 -21 74 105 -129 171 78 201 -314 172 -88 -229 50 -234 -6 0 106
1840 106 61 -248 -27 212 -7 -134 7 157 -64 -117 -320 -83 -75 -75 302 -66 -30 -6 -46 53 -239 1 149
1863 149 2 -32 85 106 75 -265 128 210 -160 -132 -21 219 -142 85 -75 -114 -77 -108 96 -332 30 82 25
1886 25 185 -108 81 -180 -97 31 99 11 -31 178 -98 -58 -144 -185 -93 -209 93 97 -111 227 -425 68 227 148
1910 148 23 50 130 -229 81 -113 373 -276 120 -137 -71 91 123 -139 47 140 86 448 213 31 -138 98
$$ packed form
1749b0j26j18K7M15k36J91k88J10J80k85j8J21O4Q4k14P3J41M5j86k08J64j95
1771b79L17Q6j95Q5j84m8K61m2l6J54q8N8Q1j81O6r7J36l70J37J22j77J35K25
1794A66o5l36K81r9J51r8n1j79K60j8l6J50j93J53R8o6k97q5J24K01lj75j60O5
1818b12L76j18l70M35k07j24J99R5L1k34L00r3J23n15M86k60j41K79k84K28OJ06
1840A06m5l09K21K39k19j27J41J50k21n3k03K37Q%L77l68L6K4m0R9k92K40J48
1863A49j47l4J17K1l1l40L93Q2l70K8J11K40l61K27j60l9L7l1K04m28L62N2n7
1886B5J60k93J89k61Q3J28O8q8m2K09k76M0q6m1R2j16L02Mk08L38o52M93J59p9
1910A48j25K7Q0l59L10j94M86o49L96k57O6J62L2k62J86R3n4L62k35j82j69K36
$$ plain form
1932 98 44 -65 -12 -100 -54 -14 20 288 198 -53 -18 -72 32 146 151 137 -162 -315 95 -32 110 57 29 101 162 212
1958 212 81 73 -97 245 -66 47 -214 157 -105 -69 60 -56 -54 35 222 -17 -32 -254 -386 206 136 -218 52
1981 52 104 156 74 263 -87 -35 -296 118 193 85 1 -137 -111 -81 40 7 -326 -44 164 -291 174 56 7 -247
2005 -247 104 -102 88 68 -285 192 -98 57 -94 163 179 -88 -259 -106 -64 47 86 -128 -6 -32 -53 40
2027 40 -12 182 -148 64 -186 -168 -233 21 85 9 104 52 -145 134 -96 31 231 -3 -161 4 43 204 329
2050 329 -233 70 -149 -61 14 101 -261 -40 -12 -163 173 -156 95 -125 101 181 135 56 287 6 -19 -84 238
2073 238 -19 192 168 -58 95 -45 -96 -5 257 -5 96 -11 6 321 102 62 -7 13 86 -53 -219 -171 -187
2096 -187 -79 -82 -185 38 105 238 21 62 -105 220 -43 57 134 96 -286 -91 205 54 67 39 239 56 -335
$$ packed form
1932I8n4j09N3q8M6M0L4K68r0k51L5n4J04J14Nj4k99j53M10j27J42n3k8P2O1N0
1958B12j31qj70L42l11J13k61L71k62L6J29j16KQ9J87k39j5k22j32N92p0l54K70
1981E2N2N2q2J89l50N2k61M14P5j08q4j38K6L0J21l3l33K82K08m55M65j18m9k54
2005b47L51k06J90k0l53M77k90J55j51K57J6k67j71J53M2J11L9k14J22k6k1R3
2027D0n2J94l30K12k50J8o5K54O4p6R5n2j97K79k30J27K00k34j58J65L9J61J25
2050C29n62L03k19Q8P5Q7l62K21K8j51L36l29K51k20K26Q0m6p9K31k81k5o5L22
2073B38k57K11k4k26J53j40n1R1K62k62J01j07J7L15k19m0o9K0P3j39j66M8j6
2096a87J08lj03K23O7J33k17M1j67L25k63J00P7l8l82J95K96j51J3k8K00j83l91
$$ plain form
2119 -335 97 -67 -372 -67 276 196 54 -141 119 -169 -13 187 -46 -8 -46 -141 140 -47 -187 -78 -318
2140 -318 47 -99 222 29 -95 -230 50 94 -9 377 -46 132 108 -15 -76 37 -95 -120 131 -166 124
2161 124 27 -99 -210 -151 279 90 78 -18 84 99 101 260 103 -117 40 -345 -135 179 -109 80 109 -24 194
2184 194 172 -23 0 -152 -25 78 57 -137 123 -84 164 -227 -4 241 -15 1 117 -54 138 -87 285
2205 285 -18 97 -51 197 -172 -205 214 -42 -11 -66 -246 97 -262 134 78 -64 179 -117 -94 293 201 -10
2227 -10 -88 -227 -69 -60 29 145 -14 99 150 33 124 283 -47 284 113 126 -339 284 -193 -75 256 -88 92
2250 92 -140 -253 -66 104 -137 -293 303 310 21 143 108 214 13 -10 -78 105 120 -154 -38 80 58 -251 -107
2273 -107 155 -261 0 -92 26 121 26 353 -56 30 -85 -38 -19 -195 -135 -210 -164 19 171 109 -190 162 -130
$$ packed form
2119c35M32j64l05L05L43q0j42j95K60k88J56K00k33L8l8r5K81j87j40J09k40
2140c18L65j46L21j93j24j35K80M4j03L86m23J78k4j23o1J13j32k5K51k97K90
2161A24r7j26j11N9M30j89j2r6J02J5KJ59j57k20J57l85K10L14k88J89K9j33K18
2184A94k2j95K3j52J27J03k1j94K60k07K48l91K23K45k56J6J16j71J92k25L72
2205B85l03J15j48K48l69l3M19k56L1n5j80L43l59L96n6j42K43k96K3L87r2k11
2227a0p8j39J58RQ9J16j59J13N1j17R1J59l30L31j71J3m65O23m77J18L31l44J80
2250I2k32j13J87J70k41j56N96Pk89J22l5J06k01k3o8J83J5k74J16J18k2l09J44
2273a07K62m16K61r2J18R5r5L27m09Q6j15M7J9j76O0p5M6J83J52o2k99L52k92
$$ plain form
2296 -130 117 -99 238 -65 72 -117 -178 84 -177 36 -94 -177 -113 -150 -128 384 30 -77 165 24 -45 -73
2318 -73 -182 -60 -33 77 -113 27 -68 108 -89 -424 -250 52 147 -222 -132 55 37 -153 -75 138 -42 -242
2340 -242 -6 -160 -40 66 93 -102 -232 21 -25 -66 187 67 19 -262 36 -11 -33 -249 -10 31 193 163 31
2363 31 -260 -126 8 11 -268 -31 64 -39 232 152 -30 -21 -273 91 -113 -1 168 92 -96 -110 -292 -202 296
2386 296 206 -43 217 285 -143 72 275 57 49 13 180 -410 -87 -171 -151 142 -3 64 22 155 71 40 167 40
2410 40 -77 -7 -333 33 69 0 -287 -5 -63 120 -137 211 99 -82 -43 110 -51 -73 200 -22 -23 -34 -187
2433 -187 -217 54 153 -175 -287 130 53 -98 -134 83 -58 -208 -67 212 140 -9 211 237 -223 -21 -308 2
2455 2 -59 -111 161 -178 49 -162 214 79 -162 81 -81 309 -53 54 117 180 -141 -355 253 -334 123 -192
$$ packed form
2296a30K47k16L37l03J37j89o1K62k61K13j30q3O4l7K2N12l54j07K42j41o9k8
2318g3j09J22K7J10j90J40r5J76j97l35J74L02R5l69R0J87j8j90P8K13j80k00
2340b42K36j54J20J06K7j95j30K53m6m1K53j20m8k81K98m7k2k16K39M1J62l0j32
2363C1k91J34J34Lk79K37R5j03K71q0j82Rk52L64k04J12J69p6j88j4j82R0M98
2386B96r0k49K60O8m28K15K03k18ql6J67n90L23q4K0K93j45O7m2J33q4l1J27j27
2410D0j17P0l26L66L6o9k87K82n8J83k57L48j12j81L9J53j61k2K73k22jj1j53
2433a87l0K71R9l28j12M17p7j51l6K17j41j50J41K79p2j49K20K6m60K02k87L10
2455Bo1n2K72l39K27k11L76j35k41K43j62L90l62J07O3O3l21k14O08n87M57l15
$$ plain form
2477 -192 -120 82 -48 -257 -14 -152 -42 6 0 -27 197 -104 -106 294 -84 57 -248 327 86 92 -175 128 105
2500 105 -118 -137 -93 -140 119 -221 -135 -332 -84 -155 -62 91 106 -59 4 369 -116 -50 -93 -315 -290 243 -175 -32
2524 -32 -141 187 -366 -117 -35 -122 -211 335 59 9 77 44 104 2 125 -306 26 -13 75 79 119 -203 -32 -147
2548 -147 -130 101 372 -54 -78 72 103 -283 -61 21 -68 -162 50 -10 94 -52 -149 -96 122 14 -79 -25 -31 -76 -75
2573 -75 -132 95 -64 160 -182 75 22 139 277 -189 -30 -107 -56 -170 -372 -77 38 260 37 92 164 -60
2595 -60 127 59 -260 -48 39 -311 -101 -60 -5 123 -301 -48 103 -4 -291 -108 -273 -344 -72 272 -25 -185
2617 -185 -51 -31 207 136 -17 28 -66 -175 -64 -157 40 -100 -195 12 -147 -189 41 361 1 63 -108 47 209
2640 209 -31 -180 -45 -34 159 -140 68 -27 -64 70 -130 169 -223 -274 -151 -71 -120 -58 -20 -24 245 87 -260
$$ packed form
2477a92P2K02j30k09K43j38J10M8ok7K24l01kM00l78J41l05N75k41Ok67L03k3
2500A05k23j9M4m7K59l40Q6j97K48p1R3J53J5j65O3L65m85O6m3k22K5N33m18J43
2524c2j09L28n53K49Q2q7q9N46k76n0O8l3O0j02J23m31L32l9Q8MM0l22J71j15
2548a47J7K31K71m26k4J50L1l86K22Q2q9r4K12o0J04j46r7N3K18j08r3N4om5J
2573g5n7K27j59K24l42K57n3J17J38m66J59p7N1j14k02K95J15K22k23N5P2k24
2595f0J87o8l19K12Q7l50K10M1N5J28m24K53J51j07k87J83j65p1K72L44k97j60
2617a85J34K0K38p1j53M5r4j09J11r3J97j40r5K07j59m2K30L20l60O2j71J55J62
2640B09k40j49J35J1J93k99K08r5l7J34k00K99l92n1J23Q0m9O2L8mK69j58l47
$$ plain form
2663 -260 73 -147 -211 -128 -115 105 -250 -100 -111 99 20 -314 -212 150 51 -118 53 101 -207 127 7 6 37
2686 37 -82 159 -261 -159 68 208 69 130 -198 -19 -7 83 132 130 161 -52 -496 -104 -129 112 -94 -115 28
2709 28 -204 123 -40 -193 -2 -98 234 -35 286 -256 -20 28 40 61 7 -46 316 -320 106 14 76 14 15 212
2733 212 351 211 125 38 34 53 -31 189 224 -59 -7 -88 -157 218 12 124 137 -66 92 132 116 42 241 -105 49
2758 49 -105 65 45 -44 -104 111 141 179 -10 -57 -10 30 -24 104 9 -138 -238 249 313 -17 -128 -32 -124 -65 330
2783 330 226 -164 -73 166 -25 84 -5 31 51 -161 -29 29 194 -233 -323 125 185 270 28 89 -61 111 122
2806 122 55 234 201 220 -124 127 32 19 -81 105 -32 264 216 130 201 -142 -145 172 -15 90 -45 96 -70
2829 -70 -112 -79 -48 72 -41 76 -37 36 206 443 -80 134 36 180 -268 107 277 -272 43 90 -6 -230 -395
$$ packed form
2663b60L33k20o4Q3J3K20l55J50j1K10p9l34J02L62r9j69J71M8l08L34j20jL1
2686C7j19K41m20J02K27J40j39O1l28J79J2R0M9kL1k13m44L92k5K41k06k1J43
2709B8k32L27j63j53J91r6L32k69L21n42K36M8J2K1n4n3L62o36M26r2O2o2JJ97
2733B12J39j40q6q7mJ9q4K20L5k83N2q1o9L75k06J12J3k03J58M0j6p4J99l46J54
2758D9j54J70k0q9o0K15L0L8j89m7M7M0n4J28r5j47j00M87O4l30j11R6r2N9L95
2783C30j04l90R1K39j91J09q9L6K0k12J32N8J65m27r0M48O0Q5k42O1j50J72J1
2806A22o7J79l3J9l44K51r5j3j00J86j37K96m8q6P1l43lL17j87J05j35J41j66
2829g0m2L3L1J20j13J17j13P3J70K37n23K14r8J44m48L75J70n49L15M7r6k24j65
$$ plain form
2852 -395 -25 -57 -60 -57 82 30 67 207 -59 221 357 20 49 -6 14 -18 -226 231 318 -62 2 -191 178 -180
2876 -180 -230 -383 26 -145 -89 -261 102 134 -13 38 -181 213 16 -19 -165 -27 -44 145 62 78 -103 -36 138
2899 138 30 -126 -180 28 133 -110 222 -254 156 -144 -145 -100 154 97 88 83 -14 13 5 -52 -11 8 39 -136 -233 93
2925 93 39 -90 147 33 -41 156 -59 -9 -89 89 227 190 -100 32 -75 -187 -156 -59 -224 384 -132 -46 -31
2948 -31 180 -70 42 -12 -138 207 -228 189 -15 156 -122 538 -502 -178 49 3 135 61 119 127 5 48
2970 48 150 118 -69 -15 141 31 133 123 184 -221 -18 -154 -201 -236 12 194 -21 -73 -379 89 -92 -280 291
2993 291 -70 -228 -147 -164 69 171 155 -267 -39 -145 -266 118 496 158 130 123 211 -215 -48 -75 -361 30 -95
3016 -95 152 35 6 201 92 323 -28 64 71 -170 -65 45 -144 -32 -107 288 31 84 -19 -73 -38 -59 -218
$$ packed form
2852c95L70l2lLJ39n2L7J40k66K80J36l37K9n5K0l2k08M57Q7l80O4j93L69l58
2876a80n0j53M09j71N6j72L63L2j47N1k19L94j97l5j46J38j7J89q3J6j81O7J74
2899A38j08j56n4K08J05k43L32m76M10l00jM5K54n7rnr7K7qn7M1J9L1j75r7L26
2925I3n4j29K37j14p4J97k15N0q0J78J38l7k90J32j07j12L1R7j65O08n16Q6J5
2948c1K11k50J12n4j26L45m35M17k04J71k78O60j040L24K27m6J32p4N8Qj22M3
2970D8J02l2j87N4J56j10J02j0O1m05K03j36m7l5K48J82k15n2l06M68j81j88N71
2993B91l61j58Q1j7K33J02j6m22K28j06j21L84L78l38k8pQ8m26J67k7k86L91j25
3016i5K47j17k9J95j09K31l51R2Pk41J05J10j89J12p5L95k57N3j03n4L5k1j59
$$ plain form
3039 -218 -191 107 -200 -38 -51 14 22 125 139 19 37 22 356 -133 97 136 -149 -267 58 175 4 230 11
3062 11 -43 -272 -56 -62 -149 -130 7 -147 -50 -140 135 -269 102 131 -234 160 -343 41 -66 7 -152 40 -29 78
3086 78 34 -14 8 23 72 232 -48 -295 19 -5 103 123 157 -133 -54 108 -187 -276 199 125 118 -55 321 -20 119
3111 119 -159 134 -8 19 -256 -53 -79 -29 88 -4 -47 -31 17 75 -15 -11 -71 83 18 -225 202 171 33 16 -7
3136 -7 -48 2 35 -2 17 -108 124 -206 -71 86 73 214 -82 60 376 -14 -56 -253 -3 186 -45 -34 -308
3159 -308 -91 47 94 -213 -244 -22 -10 36 47 171 -138 15 83 262 120 309 -272 -133 -75 74 -61 -19 -62
3182 -62 184 -115 -22 50 -221 -69 -287 -105 -88 -134 -79 -4 104 -16 109 77 122 292 -178 386 -7 164 -194
3205 -194 -98 55 -18 -208 100 -32 34 -119 -92 147 -20 5 -44 7 -70 165 -273 -37 26 -26 180 -44 -213
$$ packed form
3039b18K7K98l07J62j3O5QJ03J4j20J8j5L34m89K30L9k85j18L25J17j71K26k19
3062A1n4k29K16oq7J9J37j54R7r0K75m04L71K9l65L94n03L84j07P3j59J92o9J07
3086G8m4m8K2J5M9J60k80k47L14k4J08K0L4k90P9J62k95q9M75p4pj73L76l41J39
3111A19k78K93j42K7k75K03k6N0J17r2m3J6M8N8r0Mo0J54o5k43M27l1j38j7k3
3136gm1N0L3l7J9j25K32l30J35J57j3J41k96J42L16l90m2j97K50J89k31J1k74
3159c08K17J38M7l07l1K22J2M6J1J24l09J53O8J79j42J89n81J39N8J49j35M2m3
3182f2K46k99R3P2k71J52k18J82J7m6N5P5J08j20J25l2M5J70m70N64l93J71l58
3205a94R6J53p3j90L08j32O6j53K7K39j67K5m9N1p7K35m38K36O3n2K06k24j69
$$ plain form
3228 -213 -9 115 -29 -77 -34 16 -12 -140 89 284 -280 -133 75 45 -75 45 96 250 -191 8 -91 168
3250 168 105 -145 43 -15 -36 23 15 -155 -153 293 -175 -1 -97 103 122 -240 -124 47 16 102 66 -5 -138 -2 62
3275 62 -96 55 -86 -128 193 -7 252 77 -152 79 241 87 91 46 -54 214 -12 135 17 123 201 353
3297 353 158 49 165 69 17 -18 178 -145 43 241 228 170 153 -85 -23 84 -150 -240 166 -52 -7 -74 45
3320 45 -97 -187 -355 232 -48 102 -303 -23 -76 -7 -41 -390 -40 26 -61 85 -243 72 248 -64 39 -140
3342 -140 -17 96 46 -129 24 -291 135 -18 -20 19 88 89 28 49 196 -27 285 -324 -141 -126 -215 -13 -132 -201
3366 -201 86 93 1 411 -114 2 -219 157 24 -152 63 74 -96 295 -4 -187 -174 34 -140 178 -46 39
3388 39 -157 8 -58 -177 53 -181 246 75 40 -33 -179 67 114 -13 56 61 -59 136 57 70 -41 -54 -111 -72
$$ packed form
3228b13K04J24j44m8M3N0k8j28K29J95n64J47K08l0j20J20N1J54m41J99r9K59
3250A68o3k50J88n8k1N9qj70KM46m68J74r6K00J9l62J16J71l1Q6l6p1j33J36O4
3275F2j58J51j41m2L21k00K59j75k29K31J62j54Mm5j00K68k26J47j18J06P8J52
3297C53j95j09J16r6n2l5J96l23J88J98j3n8j7k38O2J07k34r0M06k18M5o7J19
3320D5j42r0j68N87k80J50m05K80n3O9l4l49L50O6q7J46l28L15J76l12J03j79
3342a40J23J13n0j75J53l15M26j53kL9O9Jo1K1J47k23L12o09J83J5q9K02j19o9
3366b01K87Pr2M10n25J16k21L76j33j76K15J1j70L91k99j83J3K08j74L18k24Q5
3388C9j96J65o6j19K30k34M27j71l5p3j46K46M7j27O9Nj20J95p9J3j11j3n7L9
$$ plain form
3412 -72 -172 19 112 108 34 -44 -192 -126 -162 166 -76 158 -218 -134 329 -102 289 -141 -135 84 -49 16 64 163 51
3437 51 303 -150 -71 -273 -2 -26 -169 -142 -50 -70 2 239 150 50 43 -98 0 -65 24 195 -152 -254 194 -104
3461 -104 320 -33 309 -152 -112 52 -423 -212 -29 216 236 300 49 -114 111 -369 42 -47 217 150 -130 150
3483 150 71 -65 -396 -92 -278 35 201 -37 -27 -42 -16 -205 -99 171 -23 -130 83 -115 -29 -95 -172 -10
3505 -10 -308 405 -30 -231 -12 70 32 -4 79 117 -294 -122 242 -178 359 146 -69 148 -172 -105 96 -267
3527 -267 181 -100 312 84 49 -10 -31 -184 -8 302 111 3 -145 92 231 -106 102 106 51 256 31 -359
3549 -359 65 44 -147 -43 -25 -150 100 95 -269 -55 30 -176 17 -195 128 196 -62 -136 240 -106 155 343
3571 343 154 -13 -185 104 216 106 175 -164 -171 -82 -24 -25 28 205 -114 -167 20 -1 156 162 -31 57 -115 166
$$ packed form
3412g2j00J91R3mp4p8j48O6l6L28k42K34l76Q4M63m31L91m30OK19j33O5M8R9j12
3437E1K52m53P9k02K71k4j43K7R2k0P2K37q9j00pj41R8o5Q9J71l47j02M48k98
3461a04M24l53L42m61M0J64m75K11J83K45K0O4k51j63K25m80M11q9K64o7k80K80
3483A50p9j36l31L04j86L13J66k38J0j5K6j89J06K70j94j07K13j98Q6o6p7J62
3505a0k98P13m35k01K19Q2l8l6Q3L8m11J72L64m20N37k13k15K17l20O7K01l63
3527b67M48k81M12k28l5n9k1j53J76L10j91j08j48K37J39l37K08Mn5K05k25l90
3549c59M24k1j91J04J8j25K50nl64K14Q5k06J93k12L23O8k58p4L76l46K61J88
3571C43j89j67j72K89J12j10O9l39pQ9N8jN3J77l19n3J87k1J57Oj93Q8j72K81
$$ plain form
3595 166 113 67 -224 116 113 248 -285 -222 -180 -69 -60 -235 -80 -40 -42 -59 228 -51 112 33 -81 43 -473 85
3619 85 64 141 180 104 161 29 21 -188 34 -25 167 40 -363 56 302 -99 -349 -137 -55 -56 25 -72 188 -108 14
3644 14 118 -91 -79 280 105 158 135 121 -26 -224 -184 -5 132 109 2 152 201 -112 -79 267 -327 65 17
3667 17 62 211 -52 256 -124 33 -340 -62 -189 70 64 197 287 -103 129 -81 -168 505 361 -131 -1 -79
3689 -79 -26 126 -174 -28 43 -259 9 -70 53 147 -116 175 -55 76 49 146 -40 -161 -58 162 -215 -141 96
3712 96 176 97 8 308 -67 -213 -70 -315 -96 -69 190 -181 -130 89 201 -205 -184 175 -119 84 141 -63 70
3735 70 -215 43 -223 -213 -18 -151 51 -284 -266 -77 189 -12 187 -160 52 -51 0 29 56 -607 -44 25
3757 25 -1 -20 33 104 134 120 -139 173 295 122 199 -202 92 274 -17 236 142 -25 -420 -82 -241 140 53
$$ packed form
3595A66n3m6k91L40lJ35n33O3M2J11Rj75J55M0kj7K87k79J63p9j14J24n16N58
3619H5k1P7L9p6N7j32qk09K22n9J92j27m03M19K46m01k50K12Q2jQ1r7K60k96J22
3644A4J04k09J2L59j75N3k3j4j47j98M0J79J37k3j07J50M9l13L3L46n94L92m8
3667A7M5J49k63L08l80J57l73K78j27K59oJ33R0l90K32k10q7O73j44m92J30p8
3689g9N3J52l00J46P1l02K68p9J23R4k63K91k30J31k7R7j86j21J03K20l77P4K37
3712I6Q0p9q9L00l75j46J43k45K19K7K59l71N1K19J12m06K1L59k94K03N7k04J33
3735G0k85K58k66J0J95j33K02l35J8J89K66k01J99l47K12j03N1K9K7o63N63O9
3757B5k6j9N3P1L0j4k59L12J22j73P7m01K94J82k91K53r4j67l95L38j59L81q7
$$ plain form
3780 53 56 -126 -118 209 300 -447 -14 372 119 -58 160 -62 -228 28 -215 84 281 213 68 75 -44 -379 88
3803 88 137 -248 202 177 33 215 86 -142 -103 -72 -3 21 218 123 49 273 86 196 393 165 72 -163 -13
3826 -13 -44 4 113 -34 173 -63 111 -181 136 -195 -141 99 -220 139 254 -113 -87 14 93 -31 -158 159
3848 159 -9 -131 -121 -46 53 -71 -280 -48 -35 111 135 74 -26 -251 -123 27 -41 -59 247 -55 96 -104 -139
3871 -139 -159 284 140 -327 -131 57 16 -95 211 -22 58 88 -140 176 121 98 37 -115 215 -266 -55 -221
3893 -221 92 81 35 328 181 37 299 -139 -213 -25 222 154 56 166 -117 -39 212 -137 30 -172 52 -325
3915 -325 105 -25 -98 15 111 -90 -117 47 -46 -14 43 33 -74 215 -140 -21 334 59 -222 -41 397 -112
3937 -112 -181 77 -141 104 46 107 162 63 -184 -225 -126 -85 -81 -167 19 148 -15 42 15 -238 69 -179 -37 -138
$$ packed form
3780E3Lj82QL27R1p47M33L86k53j77K18k22j66K56k43K99J97o8j45Pj19l35M67
3803H8M9l85M50k5j44J82j29k28L9L1O9K4J97r5p4K24j87J10J97k28r3k35J50
3826a3l1M8J09j47K07k36J74k92L17l31N4K40l19L59J15l67K6J01P9j24j27L17
3848A59j68j22J0P5R9j24k09K32J3J46K4o1j00k25J28J50o8j8L06l02J51k00l5
3871a39k0M43j44m67J96J88m1j11L06k33Q0L0k28L16n5k3o1j52L30m81K11j66
3893b21L13j1m6K93j47j44K62m38p4J88K47o8r8J10k83P8K51l49J67k02K24l77
3915c25M30j30p3J13R6k01k7J64r3L2N7j0j07K89l55J19L55k75k81J81M38n09
3937a12o9K58k18K45n8O1N5r9k47m1R9M1Mq6J86J29j63N7k7k53L07k48J42j01
$$ plain form
3961 -138 -137 -186 -159 -360 4 71 -319 -105 52 19 58 85 -82 154 12 227 -352 222 -10 -160 274 119 -49
3984 -49 96 -85 281 -2 141 161 -107 -167 -215 12 -5 45 23 87 -293 87 -64 166 111 -39 144 -231 1
4007 1 104 -326 -54 -209 -124 -134 59 -73 -145 -128 145 97 70 -343 -112 28 -274 74 -110 179 251 -203 164
4030 164 -1 -195 139 42 127 -30 33 154 31 -212 -145 27 -74 27 7 -61 -53 24 -122 -29 -331 124 -358
4053 -358 -101 46 -104 -165 57 -211 -105 116 -372 -152 -135 -61 -227 53 18 134 201 -133 28 21 -2 215 -170
4076 -170 50 179 -124 -137 132 37 -32 235 240 2 -149 194 -138 -105 75 150 41 72 158 -307 130 -184 -56
4099 -56 -113 -299 106 -92 24 168 -95 108 -234 -356 162 24 -85 -9 -29 -59 220 71 -220 -15 -65 96
4121 96 142 26 438 52 -64 -13 174 -195 94 -134 -328 46 67 142 22 172 39 -171 8 379 -86 12
$$ packed form
3961a38Jm9K7k01L64O7l90K14J57l3L9K7j67K36j42K15n79N74k32j50M34j55j68
3984d9J45j81L66k83J43K0k68o0m8K27j7N0k2O4l80L80j51K30n5j50J83l75K32
4007AJ03m30K72j55Q5j0J93j32p2J7K73m8k7m13K31J40l02L48j84K89P2m54L67
4030A64j65j94L34r7Q5j57O3J21j23k43O7J72j01J01k0o8QP7j46R3l02M55m82
4053c58K57J47j50o1K22k68J06K21m88K20J7P4j66K80l5J16O7l34J61pk3K17l85
4076a70K20J29l03j3K69r5o9K67Nk38j51L43l32L3J80P5j09L1Q6m65M37l14J28
4099e6n7j86M05j98J16J44k63K03l42j22N18j38j09P6k0l0K79j49k91K05n0J61
4121I6M6j16M12l86j16N1J87l69K89k28j94L74K1P5j20J50j33k10J79L71m65R8
$$ plain form
4143 12 115 8 -15 345 69 70 -84 -14 -44 192 115 -19 18 124 -159 -7 -22 85 129 -46 109 -124 -226
4166 -226 -4 275 271 -42 270 34 -226 25 332 -102 -20 322 -18 -4 2 -275 94 -25 12 163 -22 71 247
4189 247 -212 70 87 -64 -85 -118 53 -32 344 112 84 -146 -14 -63 -172 -126 -214 -143 -290 -209 -96 284 411
4212 411 295 2 -166 128 111 36 -93 -156 -198 -167 -109 -99 -72 36 -8 209 171 12 -258 -166 -49 36 154 19
4236 19 92 55 -40 31 44 -87 101 185 -133 115 92 46 -175 96 69 156 304 38 290 50 141 157 302 -91
4260 -91 -151 151 326 -285 -247 -116 -36 -80 92 46 25 66 226 193 -64 -116 -98 -31 -29 -106 12 245 69 -136 -127 93
4286 93 -92 290 94 164 -271 -44 9 -140 24 -103 -253 15 -7 37 166 26 -34 202 -32 351 -211 -6
4308 -6 -126 91 27 31 139 7 39 -52 -33 -153 -253 293 -129 -180 82 46 137 -31 -312 -311 -8 -87 106 212 -14
$$ packed form
4143A2J03j07k3L60k76Jj54P0l0K36p7j34L7J06k83J52j5J07M4j75J55k33j02
4166b26K22K79ml13L12k36k60K51L07m34Q2L42l40J4Ok77L69j19L7J51j85R3J76
4189B47m59K82J7j51k1l3J71q5L76k32k8k30J32m9j09M6q8P1j47Q1J13L80J27
4212D11j16k93j68K94j7p5j29o3m2L1N8J0K7J08m4K17l8j59k70R2J17Q5J18j35
4236A9P3l7r5P1J3j31J88Q4l18K48k3m6k21K71k7Q7J48k66K52k40R1J6J45l93
4260i1o0L02J75o11L8J31Q0m4J72m6k1M1J60l3k57n2J8O7Kp7J18K33j76k05RK20
4286I3j85L82j96P0m35K27N3j49J64j27j50K68k2M4J29j40o0K36k34L83n62K05
4308fj20K17o4MJ08j32L2r1J9j20j00N46m22n1K62l6R1j68k81JL03p9J93J06k26
$$ plain form
4333 -14 157 -112 -12 5 -186 19 16 -58 -88 142 163 -62 101 -77 297 3 -110 197 58 220 238 240 141 173
4357 173 -4 -82 384 -81 141 -59 97 169 29 33 83 -207 -133 144 64 144 83 172 66 18 146 -27 130 -48
4381 -48 -110 199 -169 -252 -33 -99 127 -73 70 -8 293 -12 6 -145 -118 -293 207 122 91 -259 -55 -20 0 353
4405 353 243 -131 174 145 212 -35 -268 99 142 162 355 19 64 -278 -6 -218 137 299 -148 13 26 134
4427 134 -152 74 -166 451 158 -93 -23 -291 48 -120 -46 -191 -298 126 -154 -191 -132 -92 -59 57 -190 -193 3
4450 3 279 283 -106 -37 -372 -48 0 -145 -54 -52 56 88 -241 -150 -126 -215 -157 -133 -366 -150 -76 413 61 -9 -59 -1
4476 -1 69 -157 -152 205 -57 -194 3 -128 -25 145 -150 158 -220 230 -87 -134 -54 -23 -2 -214 16 111 -20
4499 -20 -26 320 -14 -242 -24 86 106 193 -524 -40 -237 -20 4 15 7 -231 -265 102 144 291 -44 42 -223 -176
$$ packed form
4333a4J71k69J00J7j91K05lp4l0K30K1k25J63j78L74k94j13L07j39J62J8Kr9L2
4357A73j77p8M66m65K22k00J56P2j40MN0k90P4K77q0Q0o1Q9j06m8J28j73J57j78
4381d8o2L09l68q3K19o6K26k00J43p8L01l05J8j51K7j75N00q5l1l50K04L5K0L53
4405C53j10l74L05k9O7k47k33L67M3K0J93l36M5l42K72k12L55J62m47J61J3J08
4427A34k86K26k40O17k93k51P0k68L39j68P4j45j07M24k80l7N9M0L3J16k47lJ96
4450CK76Ml89O9l35L24M8j45R1KJ08L2l29R1K4q9N8K4k33K16P4M89l52p0n0N8
4476aP0k26NL57k62j37J97j31J03J70k95L08l78M50l17m7Q0L1K1k12K30R5j31
4499b0oL46l34k28K18J10K0Q7p17M84j97K17K4J1qk38l4L67M2J47l35Q6k65M7
$$ plain form
4523 -176 -95 -123 -2 -20 -121 -32 211 -44 16 -56 -129 -150 -79 164 316 -61 -27 -85 42 -57 94 120 -28 74
4547 74 52 68 62 -157 -42 -241 111 171 157 -83 6 -130 83 170 140 10 -140 -6 -80 19 31 63 55 -39 145 127
4573 127 -57 29 210 62 269 134 -70 -79 92 305 -27 125 -40 -207 133 120 -248 -55 -167 -210 74 -209
4595 -209 -69 -65 42 182 103 132 -191 -39 -172 164 2 106 217 -160 -232 34 -30 66 108 155 250 -218 -1
4618 -1 7 -8 -152 34 -65 -223 -40 -82 -66 107 4 -108 91 132 85 288 -103 140 32 63 -211 -215 4 -6 -250
4643 -250 -20 142 100 -12 80 326 84 68 -33 -186 -42 -73 -45 -207 1 -129 -74 -180 -113 210 -99 -31 -230
4666 -230 -265 229 47 -70 -274 4 -208 110 -131 -116 1 19 127 -20 -58 -40 -179 57 -166 -309 116 127
4688 127 5 153 105 124 348 -49 -161 105 22 -142 19 93 164 -319 -93 -216 -274 -351 111 95 -56 -70 67
$$ packed form
4523a76Q1k8J21j8j01Q9K43k55O0p2p3k1P1K43J52l77L4n8J27r9J51K6j48J02
4547G4k2J6ok19J15j99L52O0j4k40Q9j36K13Q7l0j30j50J34p4R9J2L2qr4J84j8
4573A27j84Q6J81j48K07j35k04rJ71K13l32J52j65j67L40j3l68J93j12m3K84k83
4595b09J40MJ07J40p9K9l23J52j33L36j62J04J11l77p2K66o4R6M2M7R5m68K17
4618aQj5j44J86r9j58J83m2J6J73j03j12J99M1m7K03l91K43j08L1k74mK19j0k44
4643b50K30J62m2j12R2K46k42j6j01j53J44l1K8j62K08j30N5j06O7L23l09O8j99
4666b30l5M94j82j17k04K78k12L18k41J5J17J8J08j47l8J8j39K36k23j43M25J1
4688A27j22J48m8J9K24l97j12K66q3j64J61P4P1m83K26j23n8p7M62j6j51j4J37
$$ plain form
4711 67 177 -152 280 133 7 14 -7 246 19 -126 174 91 353 5 -67 106 24 174 -387 -113 4 205
4733 205 319 -58 104 243 2 -124 185 -54 183 -140 -186 -240 231 456 -61 -307 -41 36 -25 97 166 -29
4755 -29 -33 96 119 142 243 82 218 77 210 -53 -190 176 174 -82 -93 -172 75 9 15 -18 12 -262 -190 302 -24
4780 -24 65 -264 140 -12 -151 241 207 137 -38 62 72 167 -96 -54 -106 -263 39 -9 94 -224 -16 -161 -164 -90
4804 -90 -149 190 -21 35 -118 -137 14 192 280 326 110 -134 -209 318 175 143 136 127 -13 38 198 176 -92 103 -288
4829 -288 -90 54 -203 -167 127 -181 227 27 171 9 -38 164 -233 -102 -55 328 97 118 169 8 29 136
4851 136 -87 106 -126 99 -21 -314 81 281 14 -137 -80 -12 -48 -58 -47 -30 209 -132 176 -236 26 -222
4873 -222 29 -74 289 -82 -77 69 21 -167 -21 -6 111 40 -46 100 12 -244 -55 -50 -25 -14 168 -156 121 88
$$ packed form
4711F7J10l29M32j47j26Pk1K53k27j45L00q3K62l48p2J73q2J50n61K74J17K01
4733B05J14l77J62J39k41j26L09k39K37l23m6n4M71K25n17k46K66P7o1J22O9j95
4755b9mJ29K3K3J01j61J36j41J33k63j37L66kk56j1p9K47o6Ol3L0k74P2M92l26
4780b4Q9l29M04j52j39L92l4p0j75J00J0R5k63M2n2j57L02m8J03l18K08j45lP4
4804i0n9L39k11N6j53j9J51J78Q8M6k16k44p5N27j43l2prj40N1J60k2k68J95l91
4829b88J98J44k57L6K94l08M08k00J44j62m7K02l97J31M7L83k31K1N1j61K1J07
4851A36k23J93k32K25j20k93L95K00k67j51N7O8l6j0J1J7K39l41L08m12K62k48
4873b22K51j03L63l71NJ46m8j88J46J5J17p1q6J46q8k56J89NK5J1J82l24K77l3
$$ plain form
4897 88 74 50 -147 102 207 208 -38 -296 32 -18 -20 -103 59 -141 -268 110 6 87 -5 14 9 201 -48 60 83
4922 83 218 217 -260 266 -48 80 85 146 72 -91 -197 -266 16 5 186 -16 -97 111 127 -76 -59 -21 -179 -48
4946 -48 -8 172 33 121 -155 -445 -159 86 420 -152 -87 -20 -67 -23 138 171 259 -124 -18 80 111 60 -48 -111
4970 -111 33 110 -221 81 139 493 48 284 -229 92 204 88 -32 -57 -407 -374 138 29 147 -116 19
4991 19 27 -26 65 -68 -163 13 341 -51 -216 293 -128 -39 65 270 253 -117 -75 332 211 -193 124 -401 -303
5014 -303 282 -43 -225 17 -39 224 -140 60 76 409 -46 32 -188 -112 286 195 -111 403 -17 107 78 202
5036 202 254 -27 -66 -17 56 23 144 -197 72 -101 48 -27 -28 271 -135 -148 -11 189 -66 -92 -186 20 -227 189
5060 189 -366 221 -139 -26 -14 11 -143 97 260 -21 -43 -52 120 72 -40 -246 -177 108 35 -33 53 -104 187
$$ packed form
4897H8j4k4j97K49J05Jk46k58L28n0kq3J62k00j27L78j04Q1r2J9nJ92k49J08K3
4922H3J35jm77N26l14J28NO1p4j63j06o9K82j1J81k02q1K08J6k03J7L8j58J31
4946d8M0J80j39Q8k76k90K86K45L34n72O5O7m7M4J61L3Q8l83J06R8L1n1j08o3
4970a11J44P7l31L02N8L54m45K36n13L21J12j16j20k5l50L3N12j09J18k63J35
4991A9Qn3R1j33r5J76L28l92j65N09m21Q9J04K05j7l70M2M07j21m04L17n25R8
5014c03N85l25j82K42n6K63l64K00J6L33m55P8k20P6L98r1l06N14m20J24k9J24
5036B02N2k81l9M9P3l3J21l41K69j73J49p5jK99m06j3J37K00k55k6r4K06k47M16
5060A89n55N87l60J13J2K5j54K40J63k81k2rJ72m8j12k06O9K85p3o8Q6j57K91
$$ plain form
5083 187 92 185 228 -66 -167 -28 -176 -43 -386 -77 -136 136 32 -48 98 53 97 70 60 -206 94 43 -314
5106 -314 147 -119 70 208 -48 -27 96 205 159 -101 -277 100 18 140 -156 -233 -103 237 -132 -282 -133
5127 -133 53 -139 2 -18 -248 16 142 -267 333 207 -165 -142 -86 197 -141 -102 -17 -25 -156 171 -58 282
5149 282 7 -1 83 97 -2 142 -319 194 -92 -330 90 -216 204 313 412 169 119 -19 -87 91 -70 -238 68
5172 68 -346 -110 -107 -176 4 100 -44 16 -44 44 115 -120 180 -323 -7 324 35 -10 109 -259 234 118 -159
5195 -159 57 -58 206 -20 303 -198 -239 73 -146 9 -68 312 20 8 137 -83 23 -125 -174 -83 -87 -73 -155
5218 -155 10 -83 5 -57 114 -141 -18 -1 69 -125 6 135 -132 72 144 -70 195 34 235 282 -152 64
5240 64 27 393 102 -130 14 -122 14 -258 70 -87 -135 -197 -123 -29 134 -10 -266 53 -130 185 -48 8
$$ packed form
5083A87r5R3M3k94j01J39j48J33l43L09n9K72j04q0J46m5M4k7j0k66L00n1l57
5106c14M61k66J89J38k56K1J23J09m6k60j76L77q2J22k96p7J30L40l69j50J49
5127a33J86j92J41k0k30K64J26m09O00j26l72K3N6K83l38L9Q5qj31L27k29L40
5149B82k75qQ4J4r9J44m61N13k86k38M20l06M20J09R9k43n0j38o8J78j61j68L06
5172F8m14K36Lo9J80R6j44O0o0Q8P1k35L00n03L16L31k89m5J19l68M93j16k77
5195a59K16j15K64k26L23n01m1L12k19J55p7L80k92j2J29k20J06j48m9R1mJ4q2
5218a55J65r3Q8o2J71k55J23J7P0j94J31J29k67K04P2k14K65j61K01M7m34K16
5240F4l7L66k91k32J44j36J36k72L28j57m8o2P4R4J63j44k56L19j83L15k33N6
$$ plain form
5262 8 -88 -139 -183 14 -261 95 120 -110 223 16 90 -296 -165 -97 33 -26 -165 42 37 -127 -41 60 -147 -84
5286 -84 166 157 -135 -400 -51 0 -175 -54 -48 137 -84 -116 291 -24 -28 -148 -66 -155 110 290 174 -143 -136 84
5310 84 64 206 3 -103 70 -201 56 -93 7 25 204 -146 152 75 -19 -275 171 84 55 210 -133 -340
5332 -340 -61 95 -16 185 -66 10 -8 -51 216 145 -242 62 -76 121 -112 76 22 71 136 151 46 -58 43
5355 43 -133 -37 94 -102 42 62 122 26 191 201 108 -47 173 154 -95 1 -73 18 143 220 -182 33 245 69
5379 69 35 -160 70 -64 -114 223 -65 80 82 131 8 -160 62 -297 86 96 -422 -60 -37 -54 -78 114 134 -179
5403 -179 174 -190 -187 -40 -24 -8 -73 -155 274 -29 -3 173 243 70 146 -50 114 226 -1 -232 50 -21 14 72
5427 72 129 107 130 12 6 91 -157 72 -13 83 -329 -198 108 -54 -136 66 137 26 176 -28 27 128 -8 -93
$$ packed form
5262Hr6n1m4J97k75L56K5k30L33k07P4l86J31O8J30n9j39K07nj64Q6J01k07O3
5286h4K50rk92k65L49N1j75J21OJ85k21l2M07l15mj20Q2q9K65J80j16l17PK20
5310H4k0J42k03j06J73k71K57j49J00J8J79l50K98p7r4k56M46q7k9J55l43k07
5332c40K79J56j11K01k51P6j8m3K67p1l87L04j38J97k33J88n4M9O5J5j05j04J01
5355D3j76R6J31j96J44K0O0r6J65J0r3j55K20j9k49R6p4R1J25P7m02K15K12j76
5379F9l4j95K30j34n0L37k88J45KM9j23j68K22l59L83J0n18L62K3j7k4J92K0l13
5403a79L53l64LJ47J6J6o5q2M29l03K6J76P0j73P6j96J64J12k27k31K82p1L5N8
5427G2N7k2K3j18oQ5k48K29q5R6m12J31L06j62q2K02P1j11J50k04N5J01j36q5
$$ plain form
5451 -93 8 -170 -2 59 -57 119 -55 -79 223 -126 -261 156 -97 228 45 -219 5 -92 112 258 -94
5472 -94 -210 229 -209 -17 59 215 -30 165 175 -160 -15 -25 -129 -17 89 191 -34 78 129 145 -12 -50
5494 -50 -148 81 296 -130 268 11 130 -308 -106 -22 -41 -52 -17 162 115 -108 -110 297 338 -280 -91 -19 51 -28
5518 -28 45 -172 37 4 -4 -160 221 -41 -139 -98 66 33 -16 98 -185 -25 -68 346 -28 -105 -460 -32 51 -227
5542 -227 -357 41 -412 37 -286 -120 -257 -166 20 -166 178 135 -1 17 -213 -155 -107 -117 264 -125 -16 65
5564 65 291 50 75 -165 64 -7 -193 48 453 -94 121 -67 -1 -7 -167 -7 -51 14 14 254 -149 55 -166
5587 -166 -2 -269 144 75 22 212 -211 80 -31 -112 -105 93 20 -95 -68 -234 163 12 -76 -96 -72 -85 -219 100
5611 100 159 71 181 -190 218 -30 -99 -212 149 -203 -51 -281 63 2 50 -173 72 92 -72 180 -153 -47
$$ packed form
5451i3J01j78J68O1j16J76j74k4L02l49j35M17k53L25j83k64K24r7K04J46l52
5472i4j16M39m38J92P6J56k45J95J0l35J45j0j04J12J06J02k25J12N1J6j57l8
5494e0r8K29K15m26L98k57J19m38K02Q4j9j1L5J79m7k23kM07M1o18J89P2P0p9
5518b8P3k17K09l3qj56L81k62r8M1J64l3m9J14k83J60m3M14l74p7l55M28Q3k78
5542b27j30L98m53M49l23J66j37R1J86j86L44m3j36J8k30N8M8j0L81l89J09Q1
5564F5K26k41K5k40K29p1j86K41M05n47K15j88O6oj60J60m4O5%K40m03K04k21
5587a66J64k67M13o9n3J90m23K91j11q1PJ98p3j15K7j66L97j51q8k0K4j3j34L19
5611A00N9q8J10l71M08k48o9j13L61l52J52k30L44o1M8k23K45K0j64K52l33J06
$$ plain form
5633 -47 -123 -67 193 93 69 11 -106 -51 110 -23 -82 -281 -71 117 97 89 239 25 -190 74 -81 47 -42 -81
5657 -81 10 -165 -70 2 -333 15 -93 -108 198 270 -16 -137 6 173 97 135 -3 -132 9 -90 16 147 3
5680 3 -148 -119 -110 -116 -148 96 -37 265 -169 -50 49 28 291 -2 12 174 219 -163 61 -25 83 104 -14 -125 -159
5705 -159 55 -117 -127 -143 52 214 4 -184 154 5 -71 93 -146 123 77 -62 -196 -30 -196 89 -59
5726 -59 -110 -107 245 40 -121 4 -62 102 70 -305 7 135 -197 124 -4 27 68 1 -128 -104 -169 -69 -192 -73
5750 -73 -111 -127 -47 -63 92 -91 -113 -273 81 225 353 65 65 174 296 -10 -309 63 -124 -61 49 -169 427
5773 427 -280 113 -269 -57 309 61 -62 -27 -46 180 277 97 51 199 125 -220 -28 64 -149 274 120 -376
5795 -376 258 -123 245 -84 6 58 -102 18 -57 129 208 220 -80 74 -142 -22 138 -42 -134 -208 181 -148
$$ packed form
5633d7p6N6K60j00k4n8j17N5J61j33n9j99K10J88k0qJ50k14k15K64j55J28q9l9
5657h1R1j75R5P2l35L48j08j5L06P2k86j21J43J67p6L8j38j29J41r9J06J31j44
5680Cj51K9Rol2K44j33L02m34J19R9k1K63k93J4J62M5l82K24q6J08K1j18j11l4
5705a59K14j72j0j6J95J62k10j88L38j49p6J64k39K69m6j39j34J66j66K85j48
5726e9n1LL52k05j61J25o6J64l2l75L12J28l32L21j28L1M1o7j29K4o5J00j23J19
5750g3l8j6Q0j6J55j83k2j60L54J44J28k88%J09J22l06k99L72j87O3J10k18N96
5773D27p07L93l82K12L66k48j23L5j9K26R7j80m6J48p4l45J92R2k13M23j54m96
5795c76O34l81L68l29R0N2j60J20p5J86P9J2l00J54k16J20J60j80r2p4L89l29
$$ plain form
5817 -148 -131 59 -69 -18 -208 -102 -93 116 83 -281 31 -265 14 14 264 128 -106 194 24 -44 34 -30 -73 -179
5841 -179 -52 -73 -190 101 -128 -13 111 -153 273 146 -16 -219 -23 20 -241 -190 301 -25 96 159 142 -44
5863 -44 48 -194 -246 -22 158 -4 397 17 -36 -52 123 220 -73 -134 250 -156 102 -17 398 12 35 143 -149
5886 -149 -100 112 -217 -147 1 -150 96 -41 -220 197 14 136 -215 -3 239 57 295 -57 17 416 203
5907 203 -1 -223 104 123 -98 -17 187 0 116 -108 111 92 -59 60 -58 -12 9 223 -218 214 -222 124
5929 124 155 214 325 -58 -61 -310 184 56 44 -102 173 -20 9 91 -126 187 -8 -139 16 155 7 -202
5951 -202 56 -65 -153 261 -5 -115 182 -136 -197 117 -101 231 209 -186 142 -92 -22 -317 -121 -37 -235 115
5973 115 -105 73 -231 -28 -151 -15 146 45 93 34 310 16 43 -208 121 -112 78 67 -35 195 111 51
$$ packed form
5817a48J7J90j28N1j90J06RK09l3l64L12k96K79%K50j36k34L00j70o8P8o4m3j06
5841a79J27k1j17K91k29J15J24k64M26j27j62k03J96M3k61N1M91l26J21O3j7j86
5863d4R2k42n2K24J80j62M01l80n3j6J75R7k93o1L84m06K58j19M15l86K3J08k92
5886a49M9K12l29P0J48j51K46j37j79M17j83J22l51K12K42j82K38l52P4L99k13
5907B03k04k22L27J9k21Q1K04j87J16k24K19j9j51J19j18M6K1K14m41M32m36L46
5929A24L1N9J11l83lk49M94j28j2j46K75j93K9Q2k17L13j95j31J55J39j48k09
5951b02K58j21q8M14k66j10K97l18o1L14k18L32k2l95L28k34P0k95J96Q4j98L50
5973A15k20J78l04K03j23J36J61j01M8n9K76k94K7k51L29k33J90j1j02K30q4o0
$$ plain form
5995 51 -334 28 -30 -46 -48 -302 -141 236 113 37 6 -222 -135 -265 -16 216 75 191 -96 139 -21 -355 -23
6018 -23 -13 -164 119 75 65 64 -16 -149 -77 -173 1 -143 268 53 103 -91 -133 -73 -24 -65 -279 59 167 344 185
6043 185 76 -176 9 117 116 -90 113 -134 83 -167 -29 83 -112 14 171 90 52 -282 -127 -136 -190 40
6065 40 -112 -371 -106 -200 199 41 -72 85 -294 -195 -78 -96 100 105 132 -17 -6 -125 89 -301 -93 -113 79
6088 79 -70 -20 249 -216 78 -142 -191 -287 36 -101 -10 129 96 57 -3 142 243 414 -150 -216 -301 183 -274
6111 -274 118 -63 26 -18 49 202 -126 -163 -173 39 26 103 55 -141 90 -31 30 73 -303 -88 34 -87 -52 119
6135 119 278 -192 -105 -102 33 -94 -54 -129 62 -267 94 -91 -10 239 -50 -5 138 36 55 -201 -135 138 10
6158 10 23 -235 135 6 43 -254 11 -50 138 -164 -71 13 -62 -53 -318 157 35 -264 -52 -156 25 -65 -129 -353
$$ packed form
5995E1l85L62n8j6kk54J61L77j23p6l1k28Q7j30K49K32j41J16k87K35j60l34L32
6018b3J0j51K83m4j0jq0j33P2r6J74j44M11k15N0j94m2O0M9m1k14L38J08J77j59
6043A85j09k52J85J08jk06K03k47K17k50J38J12j95J26J57q1l8l34J55rn4K30
6065D0j52k59K65r4L99j58j13J57l79R9J17j8J96NK7j49J1j19K14l90K08k0J92
6088G9j49N0K69m65K94k20m9r6L23j37R1J39l3l9o0J45J01J71n64o6q5M84m57
6111b74L92j81Q9m4O7J53l28l7j0K12j3P7m8j96K31j21O1M3l76K15J22j21L5J71
6135A19J59m70Q7LJ35j27M0p5J91l29L61j85Q1K49k89M5J43j02J9k56O6K73j28
6158A0J3k58L70j29L7k97K65o1J88l02R3Q4p5Rk65M75j22k99K12j04J81r0o4k24
$$ plain form
6182 -353 65 -100 -9 32 -125 164 130 141 62 23 -80 -234 -308 -165 155 -6 -73 -90 -16 26 99 -174 35 -94
6206 -94 -12 68 -77 -117 -25 97 -46 -107 28 26 11 -88 103 -143 -204 -60 315 28 128 319 -259 103 -89 206
6230 206 473 340 27 -5 -149 177 30 -14 -226 -34 31 -321 -35 -24 -161 11 -224 216 -49 52 -6 12
6252 12 -132 -159 159 -61 136 -72 26 -110 30 116 252 -247 -150 64 62 -48 -15 -24 -37 217 156 252 -163 -20
6276 -20 59 118 35 -94 -348 169 95 106 -47 66 -85 -26 -179 -134 79 78 -27 251 -274 -132 82 122 -63 36
6300 36 65 -84 -95 -75 322 230 -148 9 -136 54 -132 -90 -122 -10 -185 -229 145 67 46 42 -14 -106 -149 -68 -84 17
$$ packed form
6182c53M18j65R1M1j57K89l4J1p9l9j03j54p4J43L20j61o7j7P4M2P3k73K09j29
6206i4Q2Q0j45m0R2J22j43o1J35kj5r9J91k46o1J44L75k87J00J91n78L62j92K95
6230B06K67j33l13l2j44L26j47m4k12J92O5l52K86J1j37J72k35M40k65J01n8J8
6252A2j44k7L18k20J97k08R8j36J40Q6J36m99R7K14kj10L3rj3K54o1R6m15J43
6276b0P9N9q3j29k54N17p4J1j53J13j51N9j53M5K13jj05K78n25J42K14M0j85R9
6300C6K9j49j1K0L97r2l78J57j45J90j86M2l2J12j75m4L74p8k1mn6r2m3Q1j6J01
$$ [...]
8191b2
##END NTUPLES=NMR FID
##END=
