##TITLE=1H_CA-8666-1
 DMSO, 8 sc, 
 14.11.2019
##JCAMPDX= 6.0         $$ Bruker NMR JCAMP-DX V2.0
##DATA TYPE= NMR FID
##DATA CLASS= NTUPLES
##ORIGIN= UXNMR, Bruker Analytische Messtechnik GmbH
##OWNER= root
$$ XWIN-NMR		Version 3.5
$$ Thu Nov 14 14:20:06 2019 Russian Standard Time (UT+4h)  she@DPX200
##.OBSERVE FREQUENCY= 200.1315
##.OBSERVE NUCLEUS= ^1H
##.DELAY= (6, 6)
##.ACQUISITION MODE= SIMULTANEOUS
##.ACQUISITION SCHEME= undefined
##.AVERAGES= 8
##.DIGITISER RES= 18
##SPECTROMETER/DATA SYSTEM= spect
##.PULSE SEQUENCE= zg30
##.SOLVENT NAME= DMSO
##.SHIFT REFERENCE= (INTERNAL, DMSO, 0, 15.7039)
##AUDIT TRAIL= $$ (NUMBER, WHEN, WHO, WHERE, WHAT)
$$ ##TITLE= Audit trail, XWIN-NMR		Version 3.5
$$ ##JCAMPDX= 5.01
$$ ##ORIGIN= Bruker BioSpin GmbH
$$ ##OWNER= she
$$ F:/spectra/data/she/nmr/H-F/1/audita.txt
$$ ##AUDIT TRAIL=  $$ (NUMBER, WHEN, WHO, WHERE, WHAT)
(   1,<2019-11-14 14:18:48.64 +0400>,<she>,<DPX200>,
      <created by zg, POWCHK disabled, PULCHK disabled
       configuration hash MD5:
       00 E9 B6 7A A2 85 ED C7 34 08 36 98 17 FE 4E 26
       data hash MD5: 16K
       72 62 68 A7 B1 2A E0 A3 29 AF 6E 5B 3B 17 5E F3>)
$$ ##END=
$$ 
$$ hash MD5
$$ 7D 70 4C 21 5A 40 CA 7F B8 69 60 C0 0C 98 97 48
##$RELAX= 
##$RELAX= 
##$RELAX= 
##$RELAX= 
##$RELAX= 
##$RELAX= 
$$ Bruker specific parameters
$$ --------------------------
##$DU= <F:/spectra>
##$EXPNO= 1
##$NAME= <H-F>
##$PROCNO= 1
##$TYPE= <nmr>
##$USER= <she>
##$AMP= (0..31)
100 100 100 100 100 100 100 100 100 100 100 100 100 100 100 100 100 100 
100 100 100 100 100 100 100 100 100 100 100 100 100 100 
##$AQSEQ= 0
##$AQ_mod= 1
##$AUNM= <au_zg>
##$AUTOPOS= <>
##$BF1= 200.13
##$BF2= 200.13
##$BF3= 200.13
##$BF4= 200.13
##$BF5= 200.13
##$BF6= 200.13
##$BF7= 200.13
##$BF8= 200.13
##$BYTORDA= 1
##$CFDGTYP= 0
##$CFRGTYP= 5
##$CHEMSTR= <none>
##$CNST= (0..31)
1 1 145 1 1 1 1 1 1 1 1 1 1 1 1 1 1 1 1 1 1 1 1 1 1 1 1 1 1 1 1 1 
##$CPDPRG= <>
##$CPDPRG1= <>
##$CPDPRG2= <>
##$CPDPRG3= <>
##$CPDPRG4= <mlev>
##$CPDPRG5= <mlev>
##$CPDPRG6= <mlev>
##$CPDPRG7= <mlev>
##$CPDPRG8= <mlev>
##$CPDPRGB= <>
##$CPDPRGT= <>
##$D= (0..31)
0 1.2 0 0 0 0 0 0 0 0.06 0 0.03 0 0 0 0 0.0002 0 0 0 0 0 0 0 0 0 0 0 0 
0 0 0 
##$DATE= 1573726728
##$DBL= (0..7)
120 120 120 120 120 120 120 120 
##$DBP= (0..7)
150 150 150 150 150 150 150 150 
##$DBP07= 0
##$DBPNAM0= <>
##$DBPNAM1= <>
##$DBPNAM2= <>
##$DBPNAM3= <>
##$DBPNAM4= <>
##$DBPNAM5= <>
##$DBPNAM6= <>
##$DBPNAM7= <>
##$DBPOAL= (0..7)
0.5 0.5 0.5 0.5 0.5 0.5 0.5 0.5 
##$DBPOFFS= (0..7)
0 0 0 0 0 0 0 0 
##$DE= 6
##$DECBNUC= <off>
##$DECIM= 24
##$DECNUC= <off>
##$DECSTAT= 4
##$DIGMOD= 1
##$DIGTYP= 9
##$DL= (0..7)
0 120 120 120 120 120 120 120 
##$DP= (0..7)
150 150 150 150 150 150 150 150 
##$DP07= 0
##$DPNAME0= <>
##$DPNAME1= <>
##$DPNAME2= <>
##$DPNAME3= <>
##$DPNAME4= <>
##$DPNAME5= <>
##$DPNAME6= <>
##$DPNAME7= <>
##$DPOAL= (0..7)
0.5 0.5 0.5 0.5 0.5 0.5 0.5 0.5 
##$DPOFFS= (0..7)
0 0 0 0 0 0 0 0 
##$DQDMODE= 0
##$DR= 18
##$DS= 0
##$DSLIST= <SSSSSSSSSSSSSSS>
$$ [...]
##$SUBNAM2= <"">
##$SUBNAM3= <"">
##$SUBNAM4= <"">
##$SUBNAM5= <"">
##$SUBNAM6= <"">
##$SUBNAM7= <"">
##$SUBNAM8= <"">
##$SUBNAM9= <"">
##$SW= 24.0689530833862
##$SWIBOX= (0..15)
0 0 2 0 0 0 0 0 0 0 0 0 0 0 0 0 
##$SW_h= 4816.95568400771
##$TD= 16384
##$TD0= 1
##$TE= 0
##$TE2= 300
##$TE3= 300
##$TEG= 300
##$TL= (0..7)
0 120 120 120 120 120 120 120 
##$TP= (0..7)
150 150 150 150 150 150 150 150 
##$TP07= 0
##$TPNAME0= <>
##$TPNAME1= <>
##$TPNAME2= <>
##$TPNAME3= <>
##$TPNAME4= <>
##$TPNAME5= <>
##$TPNAME6= <>
##$TPNAME7= <>
##$TPOAL= (0..7)
0.5 0.5 0.5 0.5 0.5 0.5 0.5 0.5 
##$TPOFFS= (0..7)
0 0 0 0 0 0 0 0 
##$TUNHIN= 0
##$TUNHOUT= 0
##$TUNXOUT= 0
##$USERA1= <user>
##$USERA2= <user>
##$USERA3= <user>
##$USERA4= <user>
##$USERA5= <user>
##$V9= 5
##$VALIST= <valist>
##$VCLIST= <CCCCCCCCCCCCCCC>
##$VD= 0
##$VDLIST= <DDDDDDDDDDDDDDD>
##$VPLIST= <PPPPPPPPPPPPPPP>
##$VTLIST= <TTTTTTTTTTTTTTT>
##$WBST= 1024
##$WBSW= 4
##$XGAIN= (0..3)
0 0 0 0 
##$XL= 0
##$YL= 0
##$YMAX_a= 417479
##$YMIN_a= -296055
##$ZGOPTNS= <>
##$ZL1= 120
##$ZL2= 120
##$ZL3= 120
##$ZL4= 120
##$ABSF1= 10
##$ABSF2= 0
##$ABSG= 5
##$ABSL= 3
##$ALPHA= 0
##$AQORDER= 0
##$ASSFAC= 0
##$ASSFACI= 0
##$ASSFACX= 0
##$ASSWID= 0
##$AUNMP= <proc_1d>
##$AZFE= 0.1
##$AZFW= 0.1
##$BCFW= 1
##$BC_mod= 2
##$BYTORDP= 1
##$COROFFS= 0
##$CY= 11.3945322036743
##$DATMOD= 1
##$DC= 2
##$DFILT= <>
##$DTYPP= 0
##$F1P= 16.9975609425685
##$F2P= -3.02152046262296
##$FCOR= 0.5
##$FTSIZE= 0
##$FT_mod= 4
##$GAMMA= 1
##$GB= 0.15
##$INTBC= 1
##$INTSCL= 1
##$ISEN= 128
##$LB= 0.24
##$LEV0= 0
##$LPBIN= 0
##$MAXI= 10000
##$MC2= 0
##$MEAN= 0
##$ME_mod= 0
##$MI= 1.114404
##$NCOEF= 0
##$NC_proc= 0
##$NLEV= 6
##$NOISF1= 3.799351
##$NOISF2= 2.8
##$NSP= 1
##$NTH_PI= 0
##$NZP= 0
##$OFFSET= 15.70392
##$PC= 1
##$PHC0= -9457.754
##$PHC1= 17.40088
##$PH_mod= 1
##$PKNL= yes
##$PPARMOD= 0
##$PSCAL= 0
##$PSIGN= 0
##$REVERSE= no
##$SF= 200.130013532006
##$SI= 16384
##$SIGF1= 3
##$SIGF2= 2
##$SINO= 400
##$SIOLD= 16384
##$SREGLST= <1H.CDCl3>
##$SSB= 0
##$STSI= 0
##$STSR= 0
##$SW_p= 3612.71676300578
##$SYMM= 0
##$S_DEV= 0
##$TDeff= 0
##$TDoff= 0
##$TI= <>
##$TILT= no
##$TM1= 0
##$TM2= 0
##$TOPLEV= 0
##$USERP1= <user>
##$USERP2= <user>
##$USERP3= <user>
##$USERP4= <user>
##$USERP5= <user>
##$WDW= 1
##$XDIM= 8192
##$YMAX_p= 0
##$YMIN_p= 0
$$ End of Bruker specific parameters
$$ ---------------------------------
##NTUPLES= NMR FID
##VAR_NAME=  TIME,          FID/REAL,        FID/IMAG
##SYMBOL=    X,             R,               I
##VAR_TYPE=  INDEPENDENT,   DEPENDENT,       DEPENDENT
##VAR_FORM=  AFFN,          ASDF,            ASDF
##VAR_DIM=   8192,          8192,            8192
##UNITS=     SECONDS,       ARBITRARY UNITS, ARBITRARY UNITS
##FACTOR=    0.0002076,     1,               1
##FIRST=     0,             0,               0
##LAST=      1.7004516,     0,               0
##MIN=       0,             -296055,         0
##MAX=       1.7004516,     417479,          0
$$ Real data points
##PAGE= N=1
##DATA TABLE= (X++(R..R)), XYDATA
$$ [...]
2090A507r63j995L94J791K16j653r49J685J385j089j546L73J638K05j683l94J094
$$ 1507 544 -1451 -1057 734 950 -703 -1652 33 1418 329 -1217 -844 794 999 -684 -1078 16
2107A6R74o28j921N15K216j66j930l61J427J576j567j802J036J902m09k082m48
$$ 16 990 362 -1559 -1044 1172 1006 -924 -1285 142 1718 151 -1651 -615 1287 878 -1204 -1652
2124a652K123J097j778j581J039K243m95k084k26J544J208j207k065R79K311l63
$$ -1652 471 1568 -210 -1791 -752 1491 996 -1088 -1314 230 1438 231 -1834 -855 1456 1093
2140A093k043k75J608J318j306j837O86K183k80k228l67J933R93j306j345P49
$$ 1093 -950 -1225 383 1701 395 -1442 -756 1427 1147 -1081 -1448 485 1478 172 -1173 -424
2156d24J435j59j532o57J883M23r61q63N04J279m29j207l41J531J65j302m76R61
$$ -424 1011 852 -680 -1337 546 969 8 -855 -351 928 499 -708 -1049 482 647 -655 -1131 -170
2174a70Q64o59r68J27J164L95j320n46J295Q52q80j240N49J323J19j498n36J651
$$ -170 694 35 -933 -806 358 753 -567 -1113 182 1034 154 -1086 -537 786 905 -593 -1129 522
2192E22P97j240j141N25J786j36j690m66J769L40p31j387O03J397k54j329l57
$$ 522 1319 79 -1062 -537 1249 1113 -577 -1043 726 1066 335 -1052 -449 948 694 -635 -992
2209i92J584L40q53j044P49Q73l10r63j92J588M2j127o33R57O17l40p35j48J282
$$ -992 592 932 79 -965 -216 657 347 -616 -808 780 822 -305 -938 19 636 296 -439 -587 695
2228F95J3j472j29J196O02q01q49M58J051K52j698m29J563R86j478j359J086J482
$$ 695 708 -764 -893 303 905 104 -745 -287 764 1016 -682 -1111 452 1438 -40 -1399 -313 1169
2246A169m0k150m21J695J269j275j640Q17J465J28j624o80J431J510j129j941
$$ 1169 1129 -1021 -1442 253 1522 247 -1393 -576 889 1017 -607 -1287 144 1654 525 -1416
2262a416P03J789l2j377r11J374R70o02j437L69J562n7j176p54J374O03r42r29
$$ -1416 -713 1076 1044 -333 -1244 130 1100 498 -939 -570 992 935 -241 -995 379 982 40 -889
2280h89Q54Q14l15q27n32J173N35j161m60P56J046n09j098l33J510N57j480o97
$$ -889 -35 779 464 -363 -895 278 813 -348 -808 -52 994 485 -613 -946 564 1121 -359 -1056
2298a056R62J196l19j632L39J098L30j353p32R69J549r00j417N7J508L39j182
$$ -1056 -94 1102 783 -849 -510 588 918 -435 -1167 -198 1351 451 -966 -909 599 938 -244
2315b44p94P30J429p74j234L41J554m6j213o32R96O83p39q37J51J027J83q52l42
$$ -244 -1038 -308 1121 347 -887 -546 1008 962 -251 -883 113 796 57 -780 -629 398 581 -271 -613
2334f13M89R11r76n56M99N32l1p13j70J038J99p58o52P37R32p73o15J51R07n2
$$ -613 -124 787 -189 -745 -246 286 255 -458 -628 410 609 -149 -801 -64 868 95 -520 -369 538 486
2354D86q80k84Q74J024q94j286M00J337K04j375o87R73J387q54j841R65J499P0
$$ 486 -394 -678 196 1220 326 -960 -560 777 981 -394 -1081 -108 1279 425 -1416 -451 1048 1118
2372A118j595m72J299Q86q13j235J44J238M68j384o17Q88J036o60j088L33P53
$$ 1118 -477 -949 350 1236 423 -812 -668 570 1038 -346 -963 -75 961 301 -787 -454 299
2389B99K56r80j30Q58K57n33q13M40J012l38j050J15J392L4j076m15N60R37l50
$$ 299 555 -425 -555 303 560 27 -786 -346 666 328 -722 -607 785 819 -257 -672 -112 825 475
2408D75j319P8J232M48j234p74J186J078o32j440J70J656L74j504q69J056J305
$$ 475 -844 -766 466 914 -320 -1094 92 1170 538 -902 -732 924 1298 -206 -1075 -19 1286
2425A286o89j350m09J844N10j185j007O83J242l49j435k55J533M38j147n92O59
$$ 1286 597 -753 -1162 682 1192 7 -1000 -317 925 576 -859 -1114 419 857 -290 -882 -223
2442b23J032o2j216j01P79L66n48q71P40L81j3q95L85M22J86p15k62M57Q92q42
$$ -223 809 747 -469 -570 209 575 27 -844 -104 277 264 -631 -246 176 362 -353 -615 -158 734 -108
2462a08n56O50L43Jp84K7O97L32q63p46R59Q47p53r80M88R32K41q95r27P62J498
$$ -108 -664 -14 329 330 -454 -427 270 602 -261 -1007 -48 799 46 -934 -446 486 727 -168 -1095 -333 1165
2483A165o55j261lJ328L39r37p90P48J121k67j179n15J629L6r27m07M49R22n53
$$ 1165 510 -751 -754 574 913 -24 -814 -66 1055 788 -391 -906 723 759 -168 -575 -126 796 243
2502B43o96o69J759L8q36l49M91O08p42k30Q1Q21l95o19k7Q53K59p36l86N49O66
$$ 243 -453 -1122 637 675 -161 -510 -19 589 -153 -383 -302 519 124 -495 -522 331 590 -146 -532 17 683
2523F83k52r44r0R92N47j165o43Q85J090n40j541Q8J556O21j228j105P84J048
$$ 683 431 -513 -603 389 936 -229 -872 13 1103 563 -978 -890 666 1287 59 -1046 -262 786
2541G86j7j527j33J235Q17r76j136M99J221R8j165m53J226N55o95j111N86P85
$$ 786 769 -758 -891 344 1161 185 -951 -452 769 867 -298 -751 475 1030 335 -776 -190 595
2559E95Q2j103k75Q53M34m40m91K2O36J62j194K67Q79N9o29k85P59M32r06n05
$$ 595 677 -426 -701 152 586 146 -345 -323 313 475 -719 -452 427 486 -143 -428 331 763 -143 -648
2579f48M47N64j4p49p9O21M92o51q36N25J034o02q55n0P95R10r70p31N36Q22p6
$$ -648 -201 363 349 -400 -479 142 634 -17 -853 -328 706 104 -751 -801 -6 904 -66 -797 -261 561 485
2600D85j205o3J127M27p50p04L94R49o7r28l71N98R59o45j023N59P26j54o04k50
$$ 485 -720 -783 344 771 21 -683 -289 660 593 -335 -706 -108 851 206 -817 -258 468 314 -290 -540
2620e40N41M03m20l83N76J78l97k38Q4L44J93n69k37P71M9l96m90O74L04q7r66
$$ -540 1 404 -16 -399 177 355 -42 -280 -196 148 341 -228 -465 306 355 -41 -531 143 447 360 -606
2641f06q3J068N7l07j066P26Q56k73j032K09N72P02j153p72O67J184j48j307j08
$$ -606 -689 379 436 129 -937 -211 645 372 -660 -451 121 823 -330 -1102 -435 749 601 -706 -814
2660h14J019N40l30r38j21J651k20j352m21J073N36q13l57J7J517k97j051j61
$$ -814 205 745 415 -523 -644 1007 787 -565 -986 87 623 -190 -547 -530 987 690 -361 -522
2678e22M16O33k59o61J50O79K4q52j22N07P08j020j23M76O38n18n72PO34j95l77
$$ -522 -106 527 268 -393 -243 436 460 -392 -514 -7 701 -319 -442 34 672 154 -418 -411 223 28 -349
2699c49n63Q39Q61p51r03L37J185j89r61j18N81O54o27r41M45Q96K37r28m25R11
$$ -349 -912 -73 788 37 -866 -529 656 467 -494 -612 -31 623 -4 -945 -500 396 633 -295 -720 191
2719A91N94p92o20K8J418n57k93p59J164R9k92m51j13L47N53o19o16J014L4m01
$$ 191 785 -7 -627 -599 819 262 -31 -790 374 473 181 -270 -383 -36 517 -102 -718 296 330 -71
2739g1l48Q1O40j22k39k53N93J29n33N1m3K46J31o29K83L11J55q65k21J057K65
$$ -71 -419 -338 302 180 -59 -312 281 410 -123 -72 -115 131 262 -367 -84 227 382 -483 -704 353 618
2760F18m76o87N22P52p8j106j36Q58M36o14o01K69P12K44j285m2J003K02l07q98
$$ 618 142 -545 -23 729 651 -455 -591 267 703 89 -512 -243 469 713 -572 -614 389 591 284 -614
2780f14Q2Q79R1r95qP19L27l67k71l21R14Q1q62k77P61J74m60m84L92R23o67n30
$$ -614 -532 347 438 -557 -565 154 481 114 -157 -478 436 517 -345 -622 139 313 -147 -631 -239 684 17 -513
2802e13K09L94Q9l49m33N32N71k91p58L07O80J68q39k99M53O81m50o74J36N37
$$ -513 -304 90 179 -170 -603 -71 500 209 -549 -242 438 606 -233 -532 -79 602 152 -522 -386 151
2822A51K75m99o50J048K78n75n54J17J011J17j043l10N16R52o87o61k96R12N31
$$ 151 426 -73 -723 325 603 28 -526 -409 602 719 -324 -634 -118 834 147 -514 -810 102 633
2841F33p27m87N64O25p26j43J9O37j77m79k21P21J80k41n87K53K36L02n00l43
$$ 633 -94 -581 -17 608 -118 -261 -242 395 218 -261 -482 239 419 178 -409 -156 80 382 -118 -461
2861d61M95K76j17p65M32O83l49n49k58P31N56q34n16L79R61k32j112L26N17L11
$$ -461 34 310 193 -572 -140 543 194 -355 -613 118 674 -160 -676 -297 664 432 -680 -354 163 474
2881D74m03o95L56R49m35q85L04P17R9n92o92R13N75l76r50L23Q20J8o68m81J032
$$ 474 71 -624 -268 681 246 -639 -335 382 481 -111 -803 110 685 309 -641 -318 502 520 -148 -629 403
2902D03K2k13k65k70Q15j75n85%M70K53n00k92M03K42L4l52l02O70J83p64l46
$$ 403 425 212 -53 -323 492 317 -268 -268 202 455 -45 -337 66 308 342 -10 -312 358 541 -223 -569
2923e69M73O25p07l82p5P07N21j015j95N72M35l79o30L51P19K36r86j3J98M60
$$ -569 -96 529 -178 -560 -635 72 593 -422 -617 -45 390 11 -619 -268 451 687 -299 -312 -114 346
2943C46J36r78J0J052L24j022k19M34N78l14q20M4O81K37m81o06M49N62k23m09
$$ 346 482 -496 -486 566 890 -132 -351 83 661 347 -473 -429 252 489 8 -598 -149 413 190 -219
2963b19k66Q27N9n49m53O14L51m05m55O33K94j11o07P4K55L29k51p12J84Q40j35
$$ -219 -485 342 401 -148 -601 13 364 -41 -496 137 431 320 -287 -213 42 371 120 -592 -408 432 297
2984B97o56L4O49M39j159MJ48O33l1p48N7N69M34j038k46N68N72k65q25L03N81
$$ 297 -359 -325 324 763 -396 -392 -244 389 358 -390 -333 236 670 -368 -614 -46 526 261 -564 -261 320
3005C20J2j60o54M57K13ql95k66Q77J6l53n46M18L73j00n98N14K6J2j46n37M42
$$ 320 332 172 -482 -25 188 180 -215 -481 396 412 59 -487 -69 304 204 -394 120 146 158 12 -525 -83
3027h3M28m16m11K68K84L37o60p7M97L26o78j39L93M65l91m70Q3M85J37o03k71
$$ -83 345 -71 -482 -214 70 407 -253 -330 167 493 -185 -324 69 534 143 -327 -244 241 378 -225 -496
3048d96O31K51J1p86n6N23P10q41m91J51Q79m3r54J35Q58ml46k38L01L83Pj138
$$ -496 135 386 397 -389 -445 78 788 -53 -544 -393 486 443 -511 -376 482 478 132 -106 195 578 585 -553
3070e53K53O13M01o44n29O06K54k00m78k9O32J64n62j66K92L04l48m60LO81J21
$$ -553 -300 313 714 70 -459 147 401 201 -277 -306 326 490 -72 -238 54 358 10 -450 -447 234 355
3091C55l64n55P58L00n66j91R5M69j4o40R5M9M57k28k88m5P64r7l99m07M84M82
$$ 355 -9 -564 194 494 -72 -263 -168 301 287 -353 -258 -209 248 20 -268 -313 451 354 -45 -452 32 514
3113E14m58m84J90J149n53o84k94Q51O12p63o85L45P14Kn79k09N54N20r42l03
$$ 514 56 -428 -238 911 358 -326 -620 231 843 80 -605 -260 454 456 -123 -332 222 742 -200 -503
3133e03K14Q60k40o72J12M50L21n85n43M49K77P5r24L11Q91j62l99k38N33J30
$$ -503 -289 571 331 -341 -229 221 542 -43 -586 -137 140 215 -709 -398 493 331 -68 -306 227 357
3153C57k04p48K94O00N8m42k42L73M15l95m04M55K43N8q53j41P45M55m95m17L12
$$ 357 153 -595 -301 299 357 -85 -327 46 461 66 -338 117 360 418 -435 -576 169 624 129 -288 24
3174B4K68J11n10J73L0N79r11j77M78L13J30q29J12M18J25n0q73O21L84l78l91
$$ 24 292 403 -107 66 96 675 -236 -413 65 378 508 -321 -209 209 334 284 -589 32 416 38 -353
3195c53k7L44N67m16p24N69P52m70l69l83N28J73l11k57J77O40m50j46RL84l4
$$ -353 -380 -36 531 115 -609 -40 712 242 -127 -510 18 191 -120 -377 -200 440 -10 -156 -147 237 203
3216B03k98m40M94O69k53p55P2N76rn34L2Q1P70n65k76nQ82k04p39k1N48L19m32
$$ 203 -95 -535 -41 628 375 -380 -308 268 259 -275 -243 -162 608 43 -233 -238 644 440 -299 -320 228 547 115
3239A15n71K00Q19j37p69j59N94L20k79o58M57N15l82j87j21L07O39r02l02N27
$$ 115 -456 -256 563 426 -343 -502 92 412 133 -525 -68 447 65 -122 -243 64 703 -199 -501 26
3259B6K80j13k52L2K08N7l09m26M84M87j95q12K70O72J92m09p13L64N28k61n01
$$ 26 306 193 -59 -27 181 238 -71 -497 -13 474 279 -533 -263 409 601 192 -521 -157 371 110 -391
3280c91L16K87J96n47l8Q6O05o16l92L03M66p4m48m81Q01N68r14J55j34J94O71
$$ -391 -75 212 408 -139 -177 -91 514 -102 -494 -191 275 201 -247 -728 73 641 -273 -118 -252 -58 613
3301F13r54l03P91K89l23l61q2O01L03o39j01L24K31m20l86M62Q1R2n11k27O20
$$ 613 -341 -644 147 436 113 -248 -330 271 574 -65 -166 158 389 -31 -417 45 126 218 -293 -520 100
3322A00M33o27j81M5L26R1m16j28N24L42o53l82M81P12o73o81L50N78M7k02k74
$$ 100 533 -94 -275 -230 96 187 -229 -357 167 509 -144 -526 -45 667 -6 -687 -337 241 288 86 -188
3343a88r6N85j17l49j40N43m8o76L71K36N00m39o35J07L79K25n30j15M82M6j85
$$ -188 -284 301 184 -165 -305 238 190 -486 -115 121 621 182 -453 -346 33 258 -272 -387 95 141 -44
3364d4m03K17P53l3p43m4M94K22k54n80J85O47l74l39K04k53Q22o13n66O62M63
$$ -44 -447 -230 523 490 -253 -297 197 419 165 -415 -230 417 43 -296 -92 -345 477 -136 -702 -40 423
3385D23j46n40NM98o9j82o6j00L68qn31j83O84L9j76m99K73N98j43l36k15M02
$$ 423 277 -263 -258 240 171 -11 -77 -177 191 183 -348 -531 153 192 16 -483 -210 388 245 -91 -306 96
3407I6L13n28j62n3O16j18j07l86N79J77m80k02K16L05j91j12m7J96K1k29m89
$$ 96 409 -119 -281 -334 282 164 57 -329 250 427 -53 -255 -39 266 75 -37 -84 112 133 -96 -585
3428e85O09K17j93m46N76L41j74o54n2K53M25k57n82M34L52l0n48Q9K55J72n15
$$ -585 24 241 48 -398 178 519 345 -309 -361 -108 317 60 -522 -88 264 234 -314 -225 30 202 -313
3449c13J63QM72j2p49K17M13L83m91k69L2O09m40k10K42K07J24n76o5L91N04n56
$$ -313 -150 -142 330 318 -431 -214 199 582 91 -178 -146 463 23 -187 55 262 386 -190 -255 136 640 84
3471H4j80j29N50J04o08n97J002J33n87j8KN29k05j09k58M09J6k04k60L7O01L7
$$ 84 -96 -225 325 429 -179 -776 226 359 -228 -246 -244 285 80 -29 -287 122 138 -66 -326 -289 312 349
3493C49o03l9K70L24l48j39N7M48n0n53R3r6R05n84o69N47L51k41l90n1M44K59
$$ 349 -254 -293 -23 301 -47 -186 -129 319 269 -284 -191 -287 618 34 -635 -88 263 22 -368 -419 25 284
3515B84l79j61j4N50R8o75r5P40k35n08J83J64L31k51j57R2mM11k81p61Q65L44
$$ 284 -95 -256 -270 280 378 -297 -392 348 113 -395 -212 -48 283 32 -125 -33 -37 374 93 -668 197 541
3537E41m70k20m65O69L16l90k50K88K59j28k10k13L66K18K25r30M72L64m96l48
$$ 541 71 -149 -614 55 371 -19 -269 19 278 150 -60 -273 93 311 536 -394 78 442 -54 -402
3557d02L16J56J46k38ON7J39r9k76J53K94r8l39J29K0J01p2l57M72J39j37k64
$$ -402 -86 70 216 -22 -16 41 180 81 -195 -42 252 154 -185 -56 -36 65 -7 -364 108 247 110 -154
3579a54k72O02J02m27k02J72L40l5k68n7J32L44m56n8J49O48m12o44k1O82J94
$$ -154 -426 176 278 -149 -351 -179 161 126 -142 -199 -67 277 -179 -237 -88 560 148 -496 -517 165 359
3600C59o40J0L07J96j72nj37J24L26o10l1O30j78j55j76K3K43L12m91jJ18O82
$$ 359 -281 -271 36 232 60 55 -82 42 368 -242 -273 357 179 24 -152 -129 114 426 -65 -66 52 734
3622G34o82m02J83N03k11p24L15J22M21l3m68K39J89m0m11L56J38K75o45j79K92
$$ 734 52 -350 -167 336 125 -599 -284 -162 259 226 -242 -3 186 146 -265 91 229 504 -141 -320 -28
3643b8L15pn48L2N56j19j55q3L07j01N6k58k02K18L89n76j98N60J48n5o80L39
$$ -28 287 280 -268 -236 320 201 46 -37 270 169 225 -33 -235 -17 372 -204 -402 158 306 251 -429 -90
3665i0K77Q2k79n3%K17K7m75K98k4L66n19l00K35M48J41l78j63L46K21m77L7K00
$$ -90 187 269 -10 -63 -63 154 181 -294 4 -20 346 -173 -473 -238 210 351 -27 -190 156 377 -100 -63 137
3688A37P7j19l15K3M65k4k68n3M78J8n45j9M4L18K97p16l93Q12J89n60j06L44
$$ 137 214 95 -220 -197 268 244 -24 -77 401 419 -126 -145 -101 217 514 -202 -595 217 406 -154 -260 84
3710H4R3j57l06K05J13J90p9l54M10O9j5l45k21L97N0k12k23J62L16N7m19j32
$$ 84 177 20 -286 -81 32 222 143 -211 199 268 253 -92 -313 84 134 -78 -301 -139 177 234 -185 -317
3732c17N69k6j07l69K59J74j94j10K54k41K49l63n5J72J34M22r50R7P70l09l50
$$ -317 252 226 119 -250 9 183 -11 -121 133 -108 141 -222 -277 -105 29 451 -499 -402 368 59 -291
3753b91L93j42M56l86j93j62L51N9k43k30N20J77n70J44J01L41k06l46J7J42L48
$$ -291 102 -40 416 30 -163 -325 26 85 -158 -388 132 309 -261 -117 -16 325 119 -227 -210 -68 280
3774B80l66j47L8L82J8l23k73O62j33n34j11M57L89l38k32K36K87k90K41m58O9
$$ 280 -86 -233 -195 187 205 -118 -391 271 138 -396 -507 -50 339 1 -231 5 292 2 243 -215 -146
3795a46K86l14P3k32P61J5m99k27L99J26j74l25J02M53l04j77j96QL54Kl07m2
$$ -146 140 -174 -101 -333 428 443 -56 -283 116 242 68 -257 -155 298 -6 -183 -379 -371 -17 -15 -322 -364
3817c64N79j19k26L5j58P00m20j56k3M50Pl21j56J47M23l12k11J08N41k38l79
$$ -364 215 96 -130 -95 -253 447 27 -129 -152 298 305 -16 -172 -25 398 86 -125 -17 524 286 -93
3838i3j09M43M1k1p19M74L89k21n00k2N6N62k20m36N72j04pl07jN51n3l13k43
$$ -93 -202 241 282 261 -458 16 405 184 -316 -338 -282 280 60 -376 196 92 85 -222 -223 328 275 -38 -281
3861b81K5N16l29l68K26L14J45o31R7O0M35j84k93j71P24k04n84K41L70j00R7
$$ -281 -256 260 -69 -437 -211 103 248 -383 -286 -226 209 25 -268 -439 285 81 -503 -262 108 8 105
3882A05l76K04K32o0n07M58k90L86k8l49Q6J68M24n77n3j2L64l44j32J70O78j70
$$ 105 -271 -67 165 105 -402 56 -234 152 124 -225 -139 29 453 -124 -177 -189 175 -169 -301 -131 547 377
3904C77o87j46P34k12q7k58K1O49m6q68k66J177j1l55m56L65K94k12j64j84K91
$$ 377 -310 -456 278 66 -21 -279 -258 391 345 -523 -789 388 377 22 -434 -69 225 13 -151 -335 -44
3925d4L94n00m06Q50J0j80l98M48j9J86m61mK89j24l3m5l90O22o3j38r7K60K83
$$ -44 350 -150 -556 294 304 124 -274 174 155 341 -120 -124 165 41 8 -37 -427 195 132 -6 -103 157 440
3948D40k40n12KN80k49K1n39N12N3j71l89M06r6O52o85K28K54l9l01n65N52M79
$$ 440 200 -312 -310 270 21 42 -497 15 68 -103 -492 -86 -182 470 -215 13 267 228 -73 -638 -86 393
3970C93J7q92L85L01O7l00j80m9P94n26l51L21L33k62k56N3J50L52k88k40J01
$$ 393 410 -482 -97 204 271 -29 -209 -258 536 10 -341 -20 313 51 -205 -152 -2 350 62 -178 -77
3991g7M38l1n70L07j25L38j70k06K11L2L52n80j79K57J1k6m40P12K18n38J06l18
$$ -77 361 330 -240 67 -58 280 110 -96 115 147 499 -81 -260 -3 8 -18 -458 254 472 -66 40 -278
4013b78K39jL15m61K58M99o91o3p8L80J76l25k98L21K37l6n96K95L34J40n47j0
$$ -278 -39 -40 275 -186 72 571 -120 -183 -261 119 295 -30 -328 -7 230 194 -402 -107 227 367 -180 -190
4035a90K59mJ62m53Q8N35l57P5n55N07L59m76k4k56M81J96m70k55N06K84m31l10
$$ -190 69 65 227 -226 -138 397 40 115 -440 67 426 -50 -74 -330 151 347 -123 -378 128 412 -19 -329
4057c29MP18j3k79n96L94P4l02J92N4M54o4l81l22M55L12m81K5k54L10L64n57
$$ -329 -325 393 380 101 -495 -101 -27 -329 -137 -83 371 307 -74 -396 59 371 -110 -85 -339 -29 335 -222
4079b22j51N30P8p0n99M57J70p3l55J06K44N8j74k76P1N01o7l91k30L19K53n92
$$ -222 -373 157 235 165 -434 23 193 120 -235 -129 115 173 -1 -277 -206 295 228 -163 -393 -74 179 -413
4101d13M19J15J70n5m29l6K19K78l44j39J74L80k74l49Q7N30J51o22k11M71O7
$$ -413 6 121 291 236 -193 -229 -10 268 -76 -215 -41 339 65 -284 -197 333 484 -138 -349 122 189
4122A89J39l91j9N85k98l80M6J04J88J62o27K61L28j3j77k25J24J48l05K68m2
$$ 189 328 -63 -82 503 205 -175 -129 -25 163 325 -302 -41 287 274 97 -128 -4 144 -161 107 65
4143F5N4J85m56Q3L32q7m03N6J4J52J59m97pK66J78J29m78k64Q85l5l85O1N0J28
$$ 65 119 304 -152 -69 263 176 -227 -171 -157 -5 154 -343 -350 -84 94 223 -255 -519 366 331 -54 7 57 185
4167A85j30j56J13K28j21n20L16J46M39l32k13K36K63j32n62j2M57j0k36r0J40
$$ 185 55 -101 12 240 119 -401 -85 61 500 168 -45 191 454 322 -240 -252 205 195 -41 -131 9
4188IK75m59J0K73R6k47j39J69K8LK57n60N7N76lo68M9L65J37k82R4k90L76K7
$$ 9 284 -175 -165 108 204 -43 -182 -13 15 18 275 -285 -228 348 345 -323 -274 91 228 -54 40 -250 126 153
4212A53m24Q6O5L47k47k33L3N28k48j45M6J25p0n2j07r3M11j80j50jL12k58r2
$$ 153 -271 -185 -120 227 -20 -253 -220 308 60 -85 -39 86 16 -36 -143 -236 175 -5 -155 -156 156 -102 -194
4235a94k05M62L65m77k36j73K77L3n1n6J97J14j41L5L86l69J20q2l26J83K34Q2
$$ -194 -399 63 428 -49 -285 -458 -181 -148 -199 -255 -58 56 -85 -50 336 -33 87 5 -321 -138 96 178
4257A78m20q7O80J49o52j90K80K71n64J44J46P9q7n4n67Q79L82m38n78N60j01
$$ 178 -242 -329 351 500 -152 -342 -62 209 -355 -211 -65 14 -73 -127 -694 185 567 129 -449 111 10
4278A0K63j36k55N5J54k06q4J80K4K68n87K68P5K26k58m41M62L20j24k82r3J18
$$ 10 273 137 -118 -63 91 -115 -199 -19 5 273 -314 -46 29 255 -3 -444 18 338 214 -68 -161 -43
4300d3L70k88j02K6K57Jj27l13L94k4k23r9J31J15N6l08J82K8J04k86j37L93l0
$$ -43 327 39 -63 -37 220 221 94 -219 175 151 -72 -171 -40 75 131 -177 5 33 137 -149 -286 107 77
4323G7K18n94K69oK12m82J07L34J12l37j27j19L69K30m57J1K57K21j42l89K16
$$ 77 295 -299 -30 -36 176 -306 -199 135 247 -90 -217 -336 33 263 -194 -183 74 295 153 -236 -20
4344b0J54r0j88k76K80J97j04N6k33K94L17m50l05L19M56j85l88M3L32j09m48
$$ -20 134 44 -144 -420 -140 57 -47 9 -224 70 387 -63 -368 -49 407 222 -166 -123 209 100 -348
4365c48J80J46K06m20j0K30J76n0k38j16K24J14l74J09Q0L37j14k69K6J31lj5
$$ -348 -168 -22 184 -236 -246 -16 160 110 -128 -244 -20 94 -280 -171 -91 246 132 -137 -111 20 17 2
4387Bk58K99o3O6l08J84O9J57j82n38M81L66m81j97K53J89k30L9J61Q0n1j33J12
$$ 2 -256 43 -20 46 -262 -78 -9 148 -34 -572 -91 275 -206 -403 -150 39 -191 -152 9 89 38 -95 17
4410A7O1J43J15o83j44Q06q7m20L78m47L91J15l51J07L34k71K13m67l03P70l39
$$ 17 78 221 336 -347 -491 315 228 -192 186 -261 130 245 -106 1 335 64 277 -190 -493 277 -62
4431f2j39J34M10j11m09R7R0j73K25l82J73J66l9j91J23J18J51l32j96L31J25
$$ -62 -201 -67 343 232 -177 -80 10 -163 62 -320 -147 19 -20 -211 -88 30 181 -151 -347 -16 109
4452A09nm09N9L97J40k03j10q6K90Q3m67j25M62Nj48j56K10N1k93K16m9J10j20
$$ 109 104 -305 -246 151 291 88 -22 -108 182 265 -202 -327 135 140 -8 -164 46 97 -196 20 -29 81 -39
4475c9R1m02J13M12n5m09J91m8K87l87pJ22L44j12k91n0K76l2n0k05q4M99k47
$$ -39 52 -350 -237 175 120 -289 -98 -146 141 -246 -253 -131 213 101 -190 -240 36 4 -46 -251 -335 164 -83
4498h3n4m1O2P5j39o3M30j00J6l26K63P3j13pl94M53m4K51k84j34J49M52m07j04
$$ -83 -137 -178 -116 -41 -180 -243 187 87 103 -223 40 113 0 -7 -401 52 8 259 -25 -159 -10 442 35 -69
4522f9N3M28m82P7l4L9K9k67O6J97M30k55m97M75M7o0l06kM43j53j20o9j20L29
$$ -69 -16 412 -70 7 -27 12 41 -226 -160 37 467 212 -285 190 237 177 -129 -131 312 159 39 -30 -150 179
4546A79P8o18N1L51J87j11j57q0l8J51O9j51L55M5k37k87L73J84j81n4j83K02
$$ 179 257 -361 -310 41 228 117 -40 -120 -158 -7 62 -89 266 311 74 -213 160 344 163 109 -74 128
4568A28j32k2j07l7K74O0k82JL17j07l27K50k15K37Q1l03Q8R0J29j61k5M1J79
$$ 128 -4 -26 -133 -170 104 164 -118 -117 200 93 -234 16 -199 38 119 -184 -96 -6 123 -38 -63 -22 157
4591A57j69k50N3L37k60J58P8m23M13n4o9q8O8K83n53Q9J62L79k40l57M12j26
$$ 157 -12 -262 -209 128 -132 26 104 -319 94 40 -29 -117 -49 234 -319 -230 -68 311 71 -286 126 0
4613@j82K58o80O03K41n04j49O00j64K57l76j68O15j57j38j42K30K00j87k48J28
$$ 0 -182 76 -604 -1 240 -264 -413 187 23 280 -96 -264 351 194 56 -86 144 344 157 -91 37
4634C7j84J11Qn4J20J61j74O5j25J47K41k11k31J70k51J37j09K72J27k67k84N1
$$ 37 -147 -36 -28 -82 38 199 25 90 -35 112 353 142 -89 81 -170 -33 -142 130 257 -10 -294 -243
4656b43J38n0L11l38k1J89J29j71J6r7K82j99n8m7L06k3m03L49j49K14p9j58J39
$$ -243 -105 -155 156 -182 -203 -14 115 -56 -40 -137 145 -54 -112 -159 147 124 -279 70 -79 135 56 -102 37
4679C7l2J88k91K78J94j87k25j48K62N8j05k01k6K79O4k15r9L58J56l36k24J85
$$ 37 5 193 -98 180 374 187 -38 -186 76 134 29 -172 -198 81 145 -70 -169 189 345 9 -215 -30
4701c0K9J89l79k14L99K18j93m40L31K25l6k39L8L74j64N6k85J38J02M0k26j30
$$ -30 -1 188 -191 -405 -6 212 19 -421 -90 135 99 -140 -102 272 108 164 -121 17 119 159 -67 -197
4723a97L36j23o3j29L10j53n7K50m00K53L2M6m05K65J11L6k35l31K20O67l44j12
$$ -197 139 16 -47 -176 134 -19 -76 174 -226 27 59 105 -300 -35 76 112 -123 -454 -234 433 89 -23
4745b3l21K69P6k67K68j16L40l57LP8J69l2k09m18M88L04J02n16L53j9K05l65
$$ -23 -344 -75 1 -266 2 -114 226 -131 -128 -50 119 87 -122 -540 -52 252 354 -162 191 172 377 12
4767A2q1K12K73j88l45r4J98K32m63M2J95qJ33k59J67J33k14p1J04K93m24j39
$$ 12 -69 143 416 228 -117 -211 -13 219 -244 -202 -7 -15 118 -141 26 159 -55 -126 -22 271 -153 -292
4789b92J95J34J56j57k92J89L11j20k3k6O0kJ9l9k27J92Jk21J48J00o7k58J96
$$ -292 -97 37 193 36 -256 -67 244 124 101 75 135 133 152 113 -114 78 79 -142 6 106 39 -219 -23
4812b3M3p3r3R6N7j19J4k13L93j10R5J79n41J04N07m10K26k13m9m9L17k27p9L27
$$ -23 20 -53 -146 -50 7 -112 -98 -311 82 -28 67 246 -295 -191 316 -94 132 -81 -130 -179 138 -89 -168 159
4836A59l23%Q0K01J25r6j95j9J92rm56j72M70J66M2k51j23M25l35L83m90M76j6
$$ 159 -164 -164 -84 117 242 146 -49 -68 124 115 -341 -513 -43 123 165 -86 -209 216 -119 264 -226 250 234
4859B34l59R4p7K5K54j05J5j53Q7q4k10L42k18J49j72n0J40J18J6j14nJK69L9
$$ 234 -125 -31 -108 -83 171 66 81 -72 15 -69 -279 63 -155 -6 -178 -228 -88 30 46 -68 -73 -72 197 236
4883B36m00K24Kj9r4K06J11p1O5k88K37j72j98o3N1M9K38o9k60K89j01k4L11k61
$$ 236 -164 60 62 43 -51 155 266 195 260 -28 209 37 -161 -224 -173 -124 114 45 -215 74 -27 -51 260 -1
4907aJ36K01o14R6J51L43k22j93Q5j06k72K04L5M71Lp3o12K25M04m41k0J71J45
$$ -1 135 336 -278 -182 -31 312 90 -103 -18 -124 -396 -192 -157 314 317 244 -368 -143 261 -180 -200 -29 116
4930A16j1l74K91o4N05m86j55K71kK88m10j83L90j03j23j00q9L37k4j99k24j6
$$ 116 105 -269 22 -42 463 -23 -178 93 91 379 -31 -214 176 73 -50 -150 -239 98 74 -125 -349 -365
4952c65O35Nm51J53J8k5K28l46J06K07k33k62K26oL74k76m9K91Q6k10m37L09Q9
$$ -365 270 275 -176 -23 -5 -30 198 -148 -42 165 -68 -330 -104 -110 264 -12 -61 230 316 106 -331 -22 67
4975F7J9j19j9N6K48k66J9j44L61O8m98rM89j93m45N55JK04m08j85k9P2P09l92
$$ 67 86 -33 -52 4 252 -14 5 -139 222 290 -208 -217 272 79 -366 189 190 394 -14 -199 -228 -156 553 161
4999A61k7l13J34J48k43L16J31l03l5m10K91M02q5j95r5q8J86k96M17j51M32o89
$$ 161 134 -179 -45 103 -140 176 307 4 -31 -441 -150 252 167 -28 -123 -211 -25 -321 96 -55 377 -312
5021c12J40L08r3L55m57J2k89M97l57K42J09j42J72l11r9N01k19j58l8K84O5k58
$$ -312 -172 136 43 398 -59 -47 -336 161 -196 46 155 13 185 -126 -225 276 57 -101 -139 145 210 -48
5043d8j33K22m8m7O5m98M75kj6l98K68K50l08m6j2K15L78k05j70k17L36j06K73
$$ -48 -181 41 -7 -54 11 -487 -12 -14 -30 -428 -160 90 -218 -264 -276 -61 317 112 -58 -275 61 -45 228
5066B28n74M64k07j49K91m8n6P3q8j30N15k44j10j57J82K99k47m9m8O2p7l7pJ15
$$ 228 -346 118 -89 -238 53 5 -51 22 -66 -196 319 75 -35 -192 -10 289 42 -7 -55 7 -70 -107 -114 1
5090AK99j61k88P7k97L34J21k13K55O7m79K85j40q1M09j79j44J89O6M4j04j53
$$ 1 300 139 -149 -72 -369 -35 86 -127 128 195 -284 1 -139 -220 189 10 -134 55 121 165 61 -92
5112i2Q8j20M37n51K32K58l23r7O6K37J9k10R5N3j0J88l71J18K66m02K0k1m5K19
$$ -92 -4 -124 313 -238 -6 252 -71 -168 -102 135 154 -56 39 92 82 270 -101 17 283 -119 -99 -120 -165 54
5136E4j08Q6j44L21j74j36J70j04J37l67m6J83K10O4j81j92L83K3n44M67j40K68
$$ 54 -54 32 -112 209 35 -101 69 -35 102 -265 -311 -128 82 146 -35 -227 156 179 -365 102 -38 230
5158B30j48k58j48K90L20n30J06p9M13j25j53J06J31J37o77N18m88L54M5N8j8
$$ 230 82 -176 -324 -34 286 -244 -138 -217 196 71 -82 24 155 292 -385 133 -355 -1 44 102 84
5179H4QJ9k29j71K26J47l5k38J97J40k44P6n4L8M0j74L05j73P7n1J64o60N71K75
$$ 84 92 111 -118 -289 -63 84 49 -189 8 148 -96 -20 -74 -36 4 -170 135 -38 39 -12 152 -508 63 338
5203C38j49m09n5M64l61N3L1P4KO7k24QK23K9k38Q9K38l34J64K85j85j6j55k81
$$ 338 189 -220 -275 189 -172 -119 -88 -14 -12 55 -169 -161 62 91 -147 -58 180 -154 10 295 110 94 -61 -342
5227c42K17R0J6K07k30l2M39l61k48R4L21k23J43N0j54J50j39j92j9N16k84Q8
$$ -342 -125 -35 -19 188 -42 -74 365 4 -244 -150 171 -52 91 141 -13 137 -2 -194 -213 303 19 107
5249A07o3m6K05l82q5K03M46k92l14J83M5K59k69O3m0P3j54j42L7P5J68l7P3j86
$$ 107 44 -2 203 -179 -264 -61 385 93 -221 -38 7 266 -3 60 20 93 -61 -203 -166 -91 77 40 113 -73
5273g3J18K0j48k3p1K44n3k97L30q0M6j43K54p7N9k40k58M63J51l17J3o8K26L6
$$ -73 45 65 -83 -106 -177 67 14 -283 47 -33 13 -130 124 47 106 -134 -392 71 222 -95 -82 -150 76 112
5297A12o5M1k73K23J3j69k50M27L12o16K29r9L23k71j34Q7K42j46p4p9K36M9m9
$$ 112 47 88 -185 38 51 -118 -368 59 371 -245 -16 -115 208 -63 -197 -110 132 -14 -88 -167 69 118 69
5320F9j25p9L25N8l13k8K12j58K43n08K12J95j54K1r7J70P4P8N6k71r1J92Q2l73
$$ 69 -56 -135 190 248 -65 -93 119 -39 204 -304 -92 103 -51 -30 -127 43 117 195 251 -20 -111 81 163 -210
5344b10L59j28j2k22K17j10M22m53L7K0K44m8k89K89l8j33k20M39O8P9l37k88
$$ -210 149 21 9 -213 4 -106 316 -137 -100 -80 164 116 -173 116 78 -55 -275 164 232 311 -26 -314
5366c14L55J7R1k66k08O82j16rj43R9p5k59K97n30O12j50j58k0Q4Q9r1q4K8J73
$$ -314 41 58 149 -117 -325 357 241 232 89 188 113 -146 151 -379 233 83 -75 -95 -11 78 -13 -97 -69 104
5390A04M8m78J51K18P1l09q9K01K86N5m37J39Q2l2Lj72K73No7K3k86M74k95m4
$$ 104 152 -326 -175 43 114 -195 -284 -83 203 258 -179 -40 42 10 13 -159 114 119 52 75 -211 263 -32 -76
5414g6j69N12j42j32j69k08O67l01J59k85M6J46O5j33j4K02P0k61k71M15No9l60
$$ -76 -245 267 125 -7 -176 -384 283 -18 141 -144 -98 48 113 -20 -34 168 238 -23 -294 121 126 57 -303
5437c03J18K64j15j36o3O1L90k38l95L96M9K18m82O7K31OJ74j39n0P8j86K02j51
$$ -303 -185 79 -36 -172 -235 -174 216 -22 -417 -21 28 246 -236 -169 62 68 242 103 53 131 -55 147 -4
5460dO3K34j66j80q1L48l32p9J74J51J67k84Q1j19J39K2J14k58K93j70j35J09
$$ -4 59 293 127 -53 -134 214 -118 -197 -23 128 295 11 92 -27 112 134 248 -10 283 113 -22 87
5482H7k78L07n6j45J19j2K2k52J31p6M11j03j0l78r3P49m98k91L07L03k23O9J26
$$ 87 -191 116 60 -85 34 22 44 -208 -77 -153 258 155 145 -233 -326 423 -75 -366 -59 244 21 90 216
5505B16k64P7l08J51l1J34q7j7R9J51J41M6o75M54Jj26j44L67j12j87M9j6J86
$$ 216 -48 29 -279 -128 -159 -25 -112 -129 -30 121 262 308 -367 87 88 -38 -182 185 73 -114 -65 -81 105
5528A05J88j1l02j11J29N9p5l25K72L82k67k44K20k2J83m83K48L77j09M5k82l1
$$ 105 293 282 -20 -131 -2 57 -18 -343 -71 311 44 -200 20 -2 181 -302 -54 323 214 259 -23 -54
5550e4J44J58l61J98n6Q1n6j28j46L37Ql7k04J57J50k94p8J36M5J16j72J82p7
$$ -54 90 248 -113 85 29 110 54 -74 -220 117 125 88 -116 41 191 -103 -181 -45 0 116 -56 126 49
5573D9r6J24j89J05L41m3m38K44J05lK7j77N1M10m52k3q8j90K14J27k01j48L55
$$ 49 -47 77 -112 -7 334 291 -147 97 202 199 226 49 100 510 58 35 -53 -243 -29 98 -103 -251 104
5596A04J33l19Q2m7j69Q3R0J74o0l59M72m02K37O6L7k74L10k17P1K27j0l66J92
$$ 104 237 -82 0 -47 -216 -133 -43 131 71 -288 184 -218 19 85 122 -152 158 -59 12 239 229 -137 55
5619E5P2k87J40K93n15n5L70N8m48M15l14L57J21j35l23M44n5j73N7m44L79R6
$$ 55 127 -160 -20 273 -242 -297 73 131 -317 98 -216 141 262 127 -196 248 193 20 77 -367 12 108
5641A08k24j46K16L11j34n9k02J14L47j81J7k54J57j46j45J8O79l04m63P9K19
$$ 108 -116 -262 -46 265 131 72 -130 -16 331 150 167 -87 70 -76 -221 -203 476 172 -291 -212 7
5662GM62l97J84l59K79j65k91p7L49K92k88p4j87L48Q3n63L69J50N4j98j74K84
$$ 7 469 72 256 -103 176 11 -280 -357 -8 284 -4 -78 -265 83 166 -397 -28 122 176 -22 -196 88
5684H8j52j45J80J63K4j97M7j33J32m3o7K33j60O6P1j55J7r2J47P0k08K24O4j23
$$ 88 -64 -209 -29 134 158 -39 8 -125 7 -36 -103 130 -30 36 107 -48 -31 -123 24 94 -114 110 174 51
5708E1k00l4K34k27J85R0l12L48p1j29j02K07J88m5m67j2L93m47M31k15L49j51
$$ 51 -149 -183 51 -176 9 99 -213 135 64 -65 -167 40 228 183 -284 -296 97 -350 81 -134 215 64
5730F4j44O3j84K34j65l6K32j58K26k37k22P8J10K29k45L30k74K06q5q8J85l42
$$ 64 -80 -17 -201 33 -132 -168 64 -94 132 -105 -327 -249 -139 90 -155 175 -99 107 22 -66 119 -223
5752b23K40q1mj58M93P1l83N0j12J9j15p7N86l64j79N2J31K00O2l34J11p5KJ11
$$ -223 17 -64 -68 -226 267 338 -45 5 -107 -88 -203 -280 306 -58 -237 -185 -54 146 208 -126 -15 -90 -88 23
5776B3j80K08q4n8R6j19K74j70j08l6L03Kj84J72j42k26J98N7n2J21k02K1j31
$$ 23 -157 51 -33 -91 5 -114 160 -10 -118 -154 149 151 -33 139 -3 -229 -31 26 -26 95 -107 -86 -217
5799b17L96l56Q2K88j95J45J72j12L9k94K10j52J1m53J81K73o0k05L98j83k35
$$ -217 179 -177 -95 193 -2 143 315 203 242 -52 158 6 17 -436 -255 18 -42 -247 151 -32 -267
5820b67N06m59L06NK23m26L20l07J16k23R4L8K84k70j50N8L69l6l15J38O0N5K21
$$ -267 239 -220 86 91 314 -112 208 -99 17 -206 -112 -74 210 -60 -210 -152 217 181 -134 4 64 119 340
5843C40m11l1K07k24J0o1M46k48J45m64J33m9K02J26j95m5L50o8k24J90j3j55
$$ 340 -71 -102 105 -119 -109 -170 276 28 173 -291 -158 -207 -5 121 -74 -119 231 163 -61 129 116 -39
5865c9k31L67%k41J41p6Q6r8K9J87l80L11P8j21j2L09j89p8r0n7J5M57m41n4J20
$$ -39 -270 97 97 -144 -3 -79 7 -91 -62 125 -255 56 134 13 1 310 121 43 -47 -104 -89 368 -73 -127 -7
5890gJ45r2Qj71J48N1j41j73J51L14n35K13J34K42m71m8O6NK71K42m56J49m4k07
$$ -7 138 46 54 -117 31 82 -59 -232 -81 233 -302 -89 45 287 -184 -232 -166 -161 110 352 -104 45 1 -206
5914b06J80m4K67J38k34kJ5q0J54l16J60o2k25M74j93k3K67j58k33Q6J85o0k52
$$ -206 -26 -70 197 335 101 99 114 34 188 -128 32 -30 -255 219 26 3 270 112 -121 -35 150 90 -162
5937a62k44M50J14j81k8M1J77J4l8r9j83m0m6L51j95N26j68k23j82R6J80k3k46
$$ -162 -406 44 158 -23 -51 -10 167 181 143 44 -139 -179 -225 126 -69 457 289 66 -116 -20 160 137 -109
5960a09K35J8j33K07k16J8KQ5k32j86M26O0l28J23j21M04j10k50k9K26j88J45
$$ -109 126 144 11 218 2 20 22 107 -125 -311 115 175 -153 -30 -151 253 143 -107 -136 90 -98 47
5982D7l37L28J38o4j77m2J04l08J48N7J23l0K46o14L13P1J16k95R8L01j92m2q
$$ 47 -290 38 176 112 -65 -107 -3 -311 -163 -106 17 -13 233 -381 -68 3 119 -176 -78 223 31 -11 -19
6005a9j30K83J0k66J39J17l5j31l86j35Q97m34J71q7P1K10l41O3k2J32r1J5K2
$$ -19 -149 134 144 -122 17 134 99 -32 -418 -553 344 -90 81 -6 65 275 -66 -3 -25 107 16 31 53
6028E3j7K7J5j62L06l79L4K2L8l3N6J61Pj17K0pL3K26l09J98Q9k56L79j09m88
$$ 53 36 63 78 -84 222 -157 -123 -101 -63 -96 -40 121 128 11 31 24 57 283 -26 172 261 5 384 275 -213
6053b13K51r7L69k39K25l26pJ75k14j02K73N8l1K30n59K47M4k33K7k0l8K37p8
$$ -213 38 -59 310 71 296 -30 -37 138 -76 -178 95 153 122 352 -207 40 84 -149 -122 -142 -180 57 -21
6076b1j8J58l59L31R3k39K01m8l1k08J44j67J28k30N13k28j69n3J10N7Q3J65l27
$$ -21 -39 119 -240 91 184 -55 146 98 67 -141 3 -164 -36 -266 247 19 -150 -203 -93 -36 47 212 -115
6099a15M15m47R5om8J21R6j62N8L01m39k64L75J54j16J99j92j06q2K28mJ1m29
$$ -115 300 -147 -52 -58 -106 15 111 -51 7 308 -131 -395 -20 134 18 217 25 -81 -163 65 61 72 -357
6122c57K67L4J98k98J48N8k49J77j04K39j48k03J09L21k91J8J65r1K08j40k62
$$ -357 -90 -56 142 -156 -8 50 -199 -22 -126 113 -35 -238 -129 192 -99 -81 84 -7 201 61 -201
6143b01J33K99k4m45k14L39J75l8k76J96N6M5K86m35J60k23J58J0j37K08pp0p7
$$ -201 -68 231 207 -238 -452 -113 62 24 -252 -56 0 45 331 -104 56 -167 -9 1 -136 72 65 -5 -82
6166h2j53M95j81j9m8Q4j89j16K49K47k30q4j05J83j2K8l29K43l54J28K41L6o0
$$ -82 -235 260 79 60 12 96 -93 -209 40 287 57 -27 -132 51 39 67 -262 -19 -373 -245 -4 32 -28
6189b8K48j03J16j22K55l12j65L14j17k88K27p0q8Q5J12R9l98K79J33l52NL72
$$ -28 220 117 233 111 366 54 -111 203 86 -202 25 -45 -133 -48 64 163 -235 44 177 -175 -170 202
6211B02j6j57O4m97L36K30k06J62p8J60j63j72j45MM59p5j80J76k3L5m0p6L8J5
$$ 202 186 29 93 -404 -68 162 -44 118 40 200 37 -135 -280 -276 183 108 -72 104 81 116 76 0 38 53
6235E3k86M4K7J51K66l58J55p1j62R5q0J09J65j07r8K47R5k93j7j53M5M02j3k01
$$ 53 -233 -189 -162 -11 255 -103 52 -19 -181 -86 -166 -57 108 1 -97 150 245 -48 -65 -218 -173 229 216 15
6259A5O7J92q9j91K0Nj60PN9k28N70J38m34n9j2J97j86r1J70J42Mj95J8K33l21
$$ 15 82 274 185 -6 14 19 -141 -134 -75 -303 267 405 -29 -88 -100 97 -89 -180 -10 132 136 -59 -41 192 -129
6284a29lK76j69m0J33nJ57l81J16K78l57J83K1k19M5l5K84J60l10k24j9j1O89
$$ -129 -132 144 -25 -65 68 63 220 -161 -45 233 -124 59 80 -139 -94 -129 155 315 5 -219 -238 -249 440
6307D40m94lq7k9Nk14L39L66l17L4j08K18l2j74k8J20%j07J33j44q1K74j76J40
$$ 440 -54 -57 -144 -173 -168 -382 -43 323 6 40 -68 150 118 -56 -84 36 36 -71 62 -82 -163 111 -65 75
6331G5k17M48k74L0l32M65q2j42m3J3J01j77MM6J80p3n5j06K56R0R3j60l39J48
$$ 75 -142 306 32 62 -270 195 113 -29 -72 -59 42 -135 -131 -85 95 22 -33 -139 117 207 300 140 -199 -51
6355e1J29J04k47K53l03K25l61L43j97M6j28j15K78p9r1O6K34jm59J97l3J49j9
$$ -51 78 182 -65 188 -115 110 -251 92 -105 -59 -187 -302 -24 -103 -194 -128 106 105 -354 -157 -190 -41 -60
6378f0j4K2J34j50J01j95M67j00k53R6m10M90M4j18j26j06K83o4k9L2K30J02k87
$$ -60 -74 -52 82 -68 33 -162 305 205 -48 48 -362 128 172 54 -72 -178 105 41 12 44 274 376 89
6401H9n1O9k09M50m34R3m1KK9m8k33J18L06L0k94r7J47J34j35K0K68j5j07l01
$$ 89 38 107 -102 348 -86 7 -34 -32 -3 -51 -284 -166 140 170 -124 -221 -74 60 -75 -55 213 198 91 -210
6425b10L27k3j83j04P6L19J0j31Oor2K23k67J77Q9k42k11J34K53m5q6k06L01j48
$$ -210 117 94 -89 -193 -117 202 212 81 87 81 -11 212 -55 122 211 -31 -242 -108 145 100 14 -192 109 -39
6449c9k0L37j09L5j69J00j48R0l4j12l9NJ63k49L61j95j28J77%P2k7j06J27j65
$$ -39 -59 278 169 204 35 135 -13 77 43 -69 -108 -103 60 -189 172 -23 -151 26 26 98 71 -35 92 -73
6473g3O1J63k00j9J33l24L01k4l09K42j83N26k73M4J6j10J01n7L4k3R0l45K35
$$ -73 -12 151 -49 -68 65 -259 42 18 -291 -49 -232 294 21 65 81 -29 72 15 49 26 116 -229 6
6496FkJ64M4k26m1j07L37k73j98J57L1L86n92J89K03J17k44L9j80K32L83l20l97
$$ 6 4 168 212 -14 -55 -162 175 -98 -296 -139 -108 278 -314 -125 78 195 -49 -10 -190 42 425 105 -292
6519b92N14p0n1J04O1k03j53J11J25O7R2k58P4l22J96qK8L2m16M59j62K16k95
$$ -292 222 152 101 205 266 63 -90 21 146 213 305 47 121 -201 -5 -13 15 47 -369 90 -72 144 -151
6542a51L61j63%k86J57l2o9j12L9K00J10J96%j57R4m31P4J14j8K29o3j30J04K08
$$ -151 210 47 47 -239 -82 -114 -183 -295 -256 -56 54 250 250 93 187 -244 -170 -56 -74 155 92 -38 66 274
6566B74kl50J30L06j97j86O8l20K11J6l38L81l4J83m31K27K70j70J67j38k8J89
$$ 274 272 -78 52 358 161 -25 43 -277 -66 -50 -388 -7 -41 142 -289 -62 208 38 205 67 39 228
6588B28o2l09pK14pj98J63n5J95k7qj30j00J68n59K03M50P3j31l28R3J19K9K3
$$ 228 166 -143 -150 64 57 -141 22 -33 162 135 127 -3 -103 65 -494 -291 159 232 101 -227 -134 -15 14 37
6612C7j18K21J1q6K71l82L06j90k05J53j68L13l3j94J45Q3o6nk94K33K8J32k03
$$ 37 -81 140 151 65 336 -46 260 70 -135 18 -150 163 130 -64 81 164 98 93 -201 32 60 192 -11
6635a1L59k40k6j07J6mL5J05k55R9J87j52N0N2r8j26L1P9j12J45J2m67L96J08
$$ -11 348 108 82 -25 -9 -13 22 127 -128 -29 158 6 56 108 10 -116 -85 -6 -118 27 39 -428 -32 76
6659G6l93L95kn1pk32J10l2J87J05j27j88K63o2O0k44j71K86K25l50N8K17k33
$$ 76 -317 78 76 25 18 -214 -104 -136 51 156 29 -159 104 42 102 -142 -313 -27 198 -152 -94 123 -110
6682a10K77k52k40N42k52M9n1n4J25J23j77O8L0J17j73N9j09j64jJ81o6L23k44
$$ -110 167 -85 -325 217 -35 14 -37 -91 34 157 -20 48 78 195 22 81 -28 -192 -193 -12 -78 245 1
6705Aj7J72q7j3K2l0j76K61k17L02j79J17r5j10J41P6n5l06J99p0K60n6j35k0
$$ 1 -16 156 69 56 78 48 -128 133 -84 218 39 156 61 -49 92 168 113 -193 6 -64 196 140 5 -15
6729a5J68k58K66J9Jl96R4L95k53j29R3J67k92J12n9n2J67k0j56p8L36k52j03
$$ -15 153 -105 161 180 181 -215 -121 274 21 -108 -15 152 -140 -28 -87 -139 28 8 -148 -226 110 -142 -245
6752b45L60k79L02K6k28RK79j80p0l3q4M13l46K72k06r5J99J66j18l04p9L06K46
$$ -245 115 -164 138 164 -64 -55 224 44 -26 -59 -143 270 -76 196 -10 -105 94 260 142 -162 -241 65 311
6775C11Q2k72l76J94J3O6n5j00K06KR9k81P9J62O6m84M34l12J17j2k79M16j62
$$ 311 393 121 -255 -61 -48 18 -37 -137 69 71 170 -111 -32 130 196 -288 146 -166 -49 -61 -340 76 -86
6798h6j30l4L40J06r2j2L8M6j46k7p3l35M81J5q3j81L61j44r0p4K25j41K64L1
$$ -86 -216 -250 90 196 104 92 130 176 30 3 -70 -405 76 91 8 -173 188 44 -46 -120 105 -36 228 259
6822B59j0k33M0j00q1Oj08L63k07O7j17J35k30L61j28M0mn3J84k09J17m2k63J2
$$ 259 249 16 56 -44 -125 -119 -227 136 -71 -4 -121 14 -216 145 17 57 53 0 184 -25 92 50 -213 -201
6846b01K03k24l9R8m3L99r8j51K96l80K89K3o1K53l29p4J56j89J4j70K01J13l7
$$ -201 2 -222 -261 -163 -206 193 95 -56 240 -140 149 172 111 364 35 -39 117 -72 -58 -228 -27 86 49
6869D9l7K2n5J70o7M0j24J75j20r2K58l53J82Q2J7j89n4o1R8j05K35j1j7J35l22
$$ 49 12 34 -21 149 82 122 -2 173 53 -39 219 -134 48 130 147 -42 -96 -157 -59 -164 71 60 43 178 -144
6894a44J93J37J14l8k18K11k66J74m04M68K4j52j30j65J04j15J45k4PJ25j28K82
$$ -144 49 186 300 262 44 255 -11 163 -241 227 251 99 -31 -196 -92 -207 -62 -86 -79 46 -82 200
6916B00l61J48K9K4J13L4Q3l68K42j38L05M1k03k91n1P6J20N8j83K57K25o74O6
$$ 200 -161 -13 16 40 153 187 270 -98 144 6 311 352 149 -142 -193 -117 3 61 -122 135 360 -314 -248
6939b48J62L3K70n56N96m56M26j10J04l51K51l52K2L56j09k40J0L68j72K6N9O4
$$ -248 -86 -53 217 -339 257 -199 227 117 221 -130 121 -231 -209 147 38 -202 -192 176 4 30 89 153
6961A53k15Q5p4J15L9l64J73K29l49K73o7n0q8N0K44l15K20j82K91l37J1J83M9
$$ 153 -62 23 -51 64 103 -261 -88 141 -208 65 -2 -52 -140 -90 154 -161 59 -123 168 -169 -158 25 74
6984G4K93k67k46m9J79m5Q5K27l12J83j19j15K10J06j46Mo8J23l54L43r3K3k28
$$ 74 367 100 -146 -195 -16 -61 24 251 -61 122 3 -112 98 204 58 62 -6 117 -237 106 13 36 -192
7007a92J86J05l19L76l54K36r4o7L70M9k84R5J66m27J32K71k65L4k6J15k02J97
$$ -192 -6 99 -220 156 -198 38 -56 -123 247 296 12 107 273 -154 -22 249 -16 18 -8 107 -95 102
7029A02M2q5o3Oj3N3K1r2K5n8J54L6j48N3J99j93L03k75j05K2p6l0J16j78K27
$$ 102 144 59 -4 2 -11 42 63 -29 -4 -62 92 128 -20 33 232 39 342 67 -38 -16 -92 -122 -6 -184 43
7054D3j85J73l11J31mk2J25N2K13k89j84K23J85J5l04L47k3L4k96J82k66K03K27
$$ 43 -142 31 -280 -149 -153 -175 -50 2 215 -74 -258 -35 150 165 -139 208 185 219 -77 105 -161 42 269
7077B69k31j44j79L19j99M55m98J92L3m5P8J08j45p8R1k6J43k51K2j01M86n16
$$ 269 38 -106 -285 34 -165 290 -208 -16 17 -28 50 158 13 -65 26 0 143 -108 -86 -187 299 -217
7099b17R8L46j28j03j49J41K23k71nJ52P0k93K16k62K52j13j80K09n6Q5OJ25l50
$$ -217 -119 227 99 -4 -153 -12 211 -60 -65 87 157 -136 80 -182 70 -43 -223 -14 -70 15 21 146 -204
7122b04R7j20K30L8n3k85K38K06l76K90j76Q6J83kO6r8k55q5K85J88j99r2K06
$$ -204 -107 -227 3 41 -12 -297 -59 147 -229 61 -115 -29 154 152 218 120 -135 -220 65 253 54 -38 168
7145A68j77k03J84O8k38K06O2nj14lJ23j3J44o1J39k70l62N37k97k50L64J60l48
$$ 168 -9 -212 -28 40 -198 8 70 65 -49 -52 71 58 202 141 280 10 -352 185 -112 -362 2 162 -186
7168a86M18j04k70J39p8L52k81K83k16j70L68l19K48k30k60M6O9J51J49J79l86
$$ -186 232 128 -142 -3 -81 271 -10 273 57 -113 255 -64 184 -46 -306 -260 -191 -40 109 288 -98
7189i8K51o4l57M17j32L7n3m8J98j44q3K6J19k22o1R7k27K46J41O7j5J10l11K61
$$ -98 153 89 -268 149 17 54 1 -47 151 7 -76 -50 69 -153 -214 -117 -344 -98 43 110 95 205 -106 155
7213A55k88R2l07M67j12R4k55R4K8K21L44m36lk34QJ07l45K77NJ06j89K33j78
$$ 155 -133 -41 -348 119 7 101 -154 -60 -32 189 533 97 94 -140 -132 -25 -370 -93 -88 18 -171 62 -116
7236a16j78M30q6N2N2M0j77r6j4m1nJ47l3K8k14J43J13j34o3J85R1k94R0r4J39
$$ -116 -294 136 50 102 154 194 17 -79 -93 -134 -139 8 -25 3 -211 -68 45 -89 -152 33 124 -170 -80 -174 -35
7261c5J23j21M1J46j17l18N14J04n05J04p4K28rO9j24k4j9K22k27j7J58J00l40
$$ -35 88 -33 8 154 37 -281 233 337 -168 -64 -138 90 81 150 26 2 -17 205 -22 -39 119 219 -121
7284a21j49J77Q9J57j66J99l82K94P7m10O35o21J22J45j8j16m3K16k7J61k23J00
$$ -121 -270 -93 -4 153 -13 186 -196 98 175 -235 400 -221 -99 46 28 -88 -131 85 58 219 -4 96
7306I6K1j94L1K3j2J95j77K88j68k33K38Mp0J18k72K23j09P0O9L6k24j78M69k10
$$ 96 117 -77 -46 -23 -35 160 -17 271 103 -130 108 112 42 160 -112 111 2 72 141 177 -47 -225 244 34
7330C4K57m7n88J64K67M7k7j25J88J34o93K84J62r9J9M3J42n9J26k18K46k71k3
$$ 34 291 244 -344 -180 87 134 107 -18 170 304 -389 -105 57 -42 -23 20 162 103 229 11 257 -14 -37
7353c7J77k98K18o0J99m6j5k43P6J19J8o6n8j13M5K8o8n4J9K87NK9k76j6K29J58
$$ -37 140 -158 60 0 199 153 138 -105 -29 90 108 42 -16 -129 -84 -56 -124 -178 -159 128 133 162 -114 -130 99 257
7379B57k55L96l57j08p1J41J48J23l28N1qp3m5N7j74M66l45K21RO5Nj4k44K00
$$ 257 2 398 41 -67 -138 3 151 274 -54 -3 -11 -84 -129 -72 -246 220 -125 96 105 170 175 161 -83 117
7403A17l85L20j92L86j94k54K94j68J18K07l00K26n7l35M17P8m76K04j02J08q5
$$ 117 -268 52 -140 246 52 -202 92 -76 42 249 -51 175 118 -217 200 278 -198 6 -96 12 -73
7424g3j77K34p2NL48m31MOK25oo7N9R8j98O4j25P3K35k44J60k04Q1J39j52K9r5
$$ -73 -250 -16 -88 -83 265 -166 -162 -156 69 63 -4 55 153 -45 19 -106 -33 202 -42 118 -86 -5 134 -18 11 -84
7450h4J26j45O3j57L31l95L55j31K31l47J31j98K83j3j48L41p88N21pk2J33J21
$$ -84 42 -103 -40 -197 134 -261 94 -37 194 -153 -22 -220 63 50 -98 243 -545 -24 -31 -53 80 201
7472B01k25o4j15K34l13L02q6J99n2N7j08k3K07j20j90J73J9K5j07j42o5K00N2
$$ 201 -24 -88 -203 31 -282 20 -66 133 81 138 30 7 214 94 -96 77 96 121 14 -128 -193 7 59
7495E9o2j50K95k61O9L5J9J79j07k4rL11j97m21M77l47J10l8p0J40j8j74J40O9
$$ 59 -3 -153 142 -119 -50 -15 4 183 76 52 43 354 157 -264 213 -134 -24 -62 -132 8 -10 -184 -44 25
7519B5J37k04r8J11M3k93K11J53p8j69L2J42j1J35k08L37l70K89j09J2j73k11
$$ 25 162 -42 -140 -29 14 -279 -68 85 7 -162 -130 12 1 136 -72 265 -105 184 75 87 -86 -297
7541b97J35RM47j79N0j6L0o3j63J02j99L02k18N9Q4l61J83m0K63J59k18n9j15
$$ -297 -162 -153 294 115 165 149 179 116 -47 55 -144 158 -60 -1 83 -278 -95 -135 128 287 69 10 -105
7564a05j5M0J50J00k66J12RPO8J0m1Q1j2k98K22j50J83J47k25J8n0l5K39j49J42
$$ -105 -120 -80 70 170 -96 16 25 32 100 110 69 150 138 -160 62 -88 95 242 17 35 -15 -50 189 40 182
7589A82m2n5n4k31K52j23M25l46j0J33l19L01j02r3L2j37L23o6M6j08j15J82n03
$$ 182 140 85 31 -200 52 -71 354 8 -2 131 -188 113 11 -82 -50 -187 136 70 116 8 -107 75 -428
7612d28N88j28J66L3l04K33j57J10l2j02k7K09l67j8O5M6J39Nn6l9M2K60j04l33
$$ -428 160 32 198 231 -73 160 3 113 81 -21 -48 161 -206 -224 -159 -113 26 31 -25 -64 -22 238 134 -199
7636a99L65j95L62l35J7J28r7j05m3K02n0J0M1M5l01J51n3k53K63J80m43L60J04
$$ -199 166 -29 333 -2 15 143 46 -59 -102 100 50 60 101 146 -155 -4 -57 -310 -47 133 -310 50 154
7659A54J03l90L5J24K12k22M2j17q9k2J66L0J2K9J86j69J48k16K7k49K31k46K28
$$ 154 257 -133 -98 26 238 16 58 -59 -148 -170 -4 26 38 67 253 84 232 16 43 -206 25 -221 7
7682GpJ4J75k87j02J20%J05m4J84k15jJ67k62J04N7l3O1M66n02m5M4j25L49k75
$$ 7 0 14 189 -98 -200 -80 -80 25 -19 165 -50 -51 116 -146 -42 15 -18 43 509 7 -38 6 -119 230 -45
7707d5l0K28J2M9j20p6K14l74J11K11j24k4m6k5K61j1j36j14K21k53j40K76q6
$$ -45 -75 153 165 214 94 18 232 -142 -31 180 56 32 -14 -39 222 211 75 -39 182 -71 -211 65 -21
7730b1R5k08K17l21K05j9o5K18k86L7L26k11k09L48o7pPO7k49J47J%k8J33k10
$$ -21 74 -134 83 -238 -33 -52 -117 101 -185 -148 178 -33 -242 106 39 32 39 106 -143 4 5 5 -23 110 -100
7755a00L46j90k2R6m23M48k36q6K49m4j18j51J05K96Nk96J51j14o1J13j44J73
$$ -100 246 56 34 130 -293 155 -81 -167 82 38 -80 -231 -126 170 175 -121 30 -84 -145 -32 -176 -3
7777co8J59j09j02k0J45R1j53K90l58O4R3J61j30j51J21Kj27j07M10o7j48R0J33
$$ -3 -71 88 -21 -123 -143 2 93 -60 230 -128 -64 29 190 60 -91 30 32 -95 -202 208 141 -7 83 216
7801B16l33J18l5j26J7L3K06j45p2J47m9J8j41J12Q7m6o2K04r6J79m68M32m21
$$ 216 -117 1 -34 -160 -143 -110 96 -49 -121 26 -23 -5 -146 -34 53 7 -55 149 53 232 -236 196 -225
7824b25p4L09m3r3L1J49J46j34k14L3K02j25j86K86M6Q1K0j37R8k85QK40k57J40
$$ -225 -299 10 -33 -126 -95 54 200 66 -148 -115 87 -38 -224 62 108 189 209 72 170 -115 -107 133 -124 16
7848A6k99K68J55J02k80J2J35l29J42J41Q9m73M25J20j47k03J10j38Q5N7j60K88
$$ 16 -283 -15 140 242 -38 -26 109 -220 -78 63 152 -321 104 224 77 -126 -16 -154 -69 -12 -172 116
7870A16k02J48q8o6K7K38k7k21j10J06l4K23j24m1M9J41J20l94Q8R3j25o5K90
$$ 116 -86 62 -26 -92 -65 173 146 -75 -185 -79 -113 110 -14 -55 -6 135 255 -139 -51 42 -83 -148 142
7893A42k44J52j45J54J27j49J33l23O1K08o6l4K43m3ok89OJ72J98p76N46k45K01
$$ 142 -102 50 -95 59 186 37 170 -153 -92 116 50 16 259 216 210 -79 -73 99 297 -479 67 -178 23
7916B3N5J9p8N3k33R9K69j54M31k77l19O5P6k59J03J21m54P95l12p9K29m67N10
$$ 23 78 97 19 72 -161 -62 207 53 484 207 -112 -47 29 -230 -127 -6 -460 335 23 -56 173 -294 216
7939B16l01K15pj67lq4P5K1o8L12j13l9r8J01J05k44j4K3r9K29j35r2J37k44L18
$$ 216 -85 130 123 -44 -47 -131 -56 -35 -103 209 96 57 -41 60 165 -79 -93 -70 -169 60 -75 -167 -30 -274 44
7964D4P3l08J62K06l76K74k09M9J44K3j01j29K76o0L20l92l2O1J06l58L04q2R8
$$ 44 117 -191 -29 177 -199 75 -134 -85 59 82 -19 -148 128 68 388 -4 -36 25 131 -227 77 -5 93
7987I3L3k35L65k74L29j06k33PK26Q1k29J31j89J40p6n1k04K14o8k13K47L0m7
$$ 93 126 -109 256 -18 311 205 -28 -21 205 286 57 188 -1 139 63 12 -192 22 -46 -259 -12 18 -29
8010b9k24K04J03j56J70J83m36J55J33n5J16j95pJ22l6L3K1J53m34J73k8j30K76
$$ -29 -253 -49 54 -102 68 251 -185 -30 103 48 164 -31 -38 84 48 81 102 255 -179 -6 -34 -164 112
8033A12k4m7k95K49q4K55p7j21L34j06m65L98r6J67k08R0r2K3KJ03J92l24j2o9
$$ 112 88 41 -254 -5 -89 166 89 -32 302 196 -269 129 33 200 -8 82 -10 13 15 118 310 -14 -26 -95
8057i5K19j13K7RJ00k05M8m3j44L1K7J35P0k27K71k11K75j61N5rk63L41j48J4
$$ -95 124 11 38 47 147 -58 -10 -53 -197 -166 -139 -4 66 -161 110 -101 174 13 68 59 -204 137 -11 3
8081Cj13K36o6j1j61K90j14J79n70K68J52j05K2L4j15k8O9K75j22p7j34kJ78j91
$$ 3 -110 126 60 49 -112 178 64 243 -327 -59 93 -12 10 44 -71 -99 -30 245 123 46 -88 -90 88 -103
8105a03J29j05l4J81m9j08J16q6J31j1k12L2M44k18j20J49k78L25k33j31L17N6
$$ -103 26 -79 -113 68 19 -89 27 -59 72 61 -151 -119 325 107 -13 136 -142 183 -50 -181 136 192
8127A92m23M14j55k7j23n9j80L86K70k32P1k52O3j05M7J64Rj94L28j07R6r7K60
$$ 192 -231 183 28 1 -122 -181 -361 25 295 63 134 -118 -55 -160 -113 51 60 -134 194 87 183 86 346
8150C46k18k54J31J44kl13L00j20N5J21j34p6j63K97JR9L6l35J77j21j74K90l14
$$ 346 128 -126 5 149 147 -166 134 14 69 190 56 -20 -183 114 115 214 250 -85 92 -29 -203 87 -227
8173b27J46J20K97k98l73K93J08o8k13J61P4M2l02N1K40j71J3M9
$$ -227 -81 39 336 38 -335 -42 66 -2 -215 -54 20 62 -240 -189 51 -120 -107 -58
8191e8
$$ Imaginary data points
##PAGE= N=2
##DATA TABLE= (X++(I..I)), XYDATA
0@%%%qJ6j6J6k4L2l8M6n6P2q8J12j42J66j94K34k80L28l78M39n11N88o74P70q76
$$ 0 0 0 0 -8 8 -8 8 -16 16 -22 24 -32 40 -48 64 -78 88 -106 128 -152 176 -202 237 -274 314 -360 410 -466
28d66R96j126J269j429J604j794K004k237K491k768L071l407L776m180M627n123
$$ -466 530 -596 673 -756 848 -946 1058 -1179 1312 -1456 1615 -1792 1984 -2196 2431 -2692
44b692N675o291O984p771Q672r715J0938j2395J4161j6365J9210k3028K8461l6876
$$ -2692 2983 -3308 3676 -4095 4577 -5138 5800 -6595 7566 -8799 10411 -12617 15844 -21032
58b1032N1780q5980K99300P5165o15288N6821L52020R4181k97099j7855K64709
$$ -21032 30748 -55232 244068 319233 -296055 -239234 112786 206967 -90132 -107987 156722
69A56722R2495k88484j60837J54970J70963q0330o7495O7345J4351j46635k9890
$$ 156722 249217 -39267 -200104 -45134 125829 45499 -21996 45349 59700 -86935 -116825
80a16825J63689Q9412j50612j12530J10438J23551r5715j23810P4549J33798m8174
$$ -116825 46864 136276 -14336 -126866 -16428 107123 11408 -112402 -37853 95945 47771
91D7771j16782K2141R1500j6536n5127L4366M5710o1173n6289Q2613Q9833q4134
$$ 47771 -69011 -46870 44630 28094 -27033 7333 53043 -8130 -64419 18194 108027 23893
103B3893j23682O8071J47599m2174j57175J3140J55705J2866j52376m1152J41096
$$ 23893 -99789 -31718 115881 73707 -83468 -70328 85377 98243 -54133 -95285 45811
114D5811O7805j23785q9557R7633R5951p4281r1300N9674Q6491m8542q7749L3160
$$ 45811 113616 -10169 -99726 -2093 93858 19577 -71723 -12049 74442 25900 -61849 -28689
126b8689Q9360q211p5769n445N5784K248m2574J1914M8254j5832n6026N481N2369
$$ -28689 60671 52460 -23309 -28754 27030 29278 -13296 -1382 46872 31040 -24986 -19505 32864
139C2864L332m2801o050L7341M838m2221j8265L2958K5555j4395j8641q116j5029
$$ 32864 36196 -6605 -12655 24686 29524 -12697 -30962 1996 27551 13156 -5485 -13601 -28630
152b8630M322M1238J5138n4064m2645M9613O2534m0753q6346K4600J11661P857
$$ -28630 -24308 16930 32068 -21996 -64641 -15028 47506 6753 -79593 -54993 56668 64525
164F4525j23936m9324J15328Q8184q2798j04527N0175J11981j8046j08703p223
$$ 64525 -59411 -108735 6593 94777 11979 -92548 -42373 69608 51562 -57141 -64364
175f4364J05811L4428q9731n2079P0097O1056m7816o1761K9761O1851j2883o1416
$$ -64364 41447 75875 -13856 -65935 4162 65218 17402 -44359 -14598 47253 34370 -27046
187b7046m663N3717J7090m3483k5578K8088K5685j4536k5504r41J6984J0905o677
$$ -27046 -31709 22008 39098 -4385 -29963 -1875 23810 9274 -16230 -17171 -187 10718 4041
200D041j4208o307O743J2762K764j4889j1035J5404J7817j6087k4343J1971L0110
$$ 4041 -10167 -16474 -9731 3031 5795 -9094 -20129 -4725 13092 -2995 -27338 -15367 14743
213A4743k163l0207o615K6039J2115k4703j4823K8387K1888l1196l3848K5570
$$ 14743 12580 -17627 -24242 1797 13912 -10791 -25614 2773 24661 -6535 -40383 -14813
225a4813M4437j1753m8769m482M8147J8790m5805l3311M0450M8509k6427n7318
$$ -14813 29624 17871 -30898 -35380 12767 31557 -14248 -47559 -7109 41400 14973 -42345
237d2345M373N4427J7040l8343k8592K3202K9412j1333k5252N853K0441m33j1351
$$ -42345 -37972 16455 33495 -4848 -33440 -10238 19174 7841 -17411 -11558 8883 8450 -2901
250b901q65R88m458N617J6220M02k5386j5053K4258K9790j5424l7529N542L8639
$$ -2901 -3766 -2778 -7236 -1619 14601 15003 -10383 -25436 -1178 28612 13188 -24341 -18799 19840
264A9840L129l7808j5037L2163K7564j9932l5310K740L1093R098j8908j1822O245
$$ 19840 22969 -14839 -29876 2287 29851 9919 -25391 -22651 8442 17540 -1368 -13190 -6945
277f945P643K321k539q387l583J3408J3354j1702k5861J752L4451J4616l4232
$$ -6945 698 3019 480 -7907 -11490 1918 15272 3570 -22291 -20539 13912 28528 -5704
290e704k9198K9240L8551k0947m4596J0800M8633L360m7735j8578M1538L0015
$$ -5704 -34902 -5662 32889 11942 -32654 -21854 26779 30139 -17596 -36174 5364 35379
302C5379l1398l4984K1413L4976j4013l1026P543K7163l270k3055P62K0326P10
$$ 35379 3981 -31003 -9590 25386 11373 -19653 -12110 15053 11783 -11272 -10510 9816 10526
315A0526k0759q13K1541J766k2475l246K2013O001j9106r744J3092J1466m953
$$ 10526 -10233 -11046 10495 12261 -10214 -13460 8553 14554 -4552 -14296 -1204 10262 5309
328E309q553mJ111j456P188Q388j2555j7197J5799K7353j4859l9559P556N0510
$$ 5309 -3244 -3248 -2137 -3593 3595 11983 -572 -17769 -1970 25383 10524 -29035 -21479 29031
342B9031J0160n4064l2293M5841N0521l0517n8463J4183O0114P98n6609j7415
$$ 29031 39191 -14873 -47166 -1325 49196 18679 -39784 -25601 34513 35311 -21298 -38713
354c8713M6583L2082k9450l7656J0240L1291N05j9258j845R020r49l174K345l141
$$ -38713 7870 39952 10502 -27154 -16914 14377 14882 -4376 -6221 2799 1850 -1324 1021 -2120
368b120o394Q032J4373o080k3585l972K6029J4364k2227k0218J8437K0105j6629
$$ -2120 -8514 -482 13891 7811 -15774 -19746 6283 20647 -1580 -21798 -3361 16744 115
381A15k1585J4411K4262q839k4263K149K1121J53j8914J605K0984k489k4345O26
$$ 115 -21470 -7059 17203 8364 -15899 -13750 7371 7524 -11390 -9785 11199 8710 -15635 -15009
395a5009K6209K827k5306m824K5060Q873k4537j5618K4202K2717j8965k6802J3555
$$ -15009 11200 14027 -11279 -16103 8957 17830 -6707 -22325 1877 24594 5629 -21173 -7618
408g618K7933o931k6696J549K3932M389j9269q288J4925Q423j1647p818J0654
$$ -7618 20315 13384 -13312 -11763 12169 16558 -2711 -10999 3926 12349 702 -7116 3538
421C538N855j0708m681R343L132j0928l952J1080O781j0713j2827N918J3818j462
$$ 3538 9393 -1315 -5996 3347 6479 -4449 -8401 2679 9460 -1253 -14080 -8162 5656 4194
435D194j1178j879O808N56k976r52n55J67N488M282p467j2842L818K1062P362
$$ 4194 -6984 -8863 -2055 -1499 -4475 -5427 -5982 -5815 -327 3955 -3512 -16354 -12536 8526 15888
450A5888k2146j7440J9513K4955j3602k9269P355L4824M124l5725j8599L0637
$$ 15888 -6258 -23698 -4185 20770 7168 -22101 -14746 20078 24202 -11523 -30122 515
462E15L1115j9029l5557P619L4388J084l1389r654K7471J8401j9756k5806Q348
$$ 515 31630 12601 -22956 -15337 19051 20135 -11254 -20908 6563 24964 5208 -20598 -12250
475a2250K6284J344k0652o573J3978Q290q504j0664L220J1871L731r727r278M325
$$ -12250 14034 15378 -5274 -11847 2131 10421 1917 -8747 -5527 6344 10075 348 -8930 -4605
489d605R926K965q042p292N526R828l407j3337J273J5153K068j5320p764J3064
$$ -4605 5321 8286 244 -7048 -1522 8306 4899 -8438 -7165 7988 10056 -5264 -13028 36
503C6J1221j0663j5277P615J8092n794k1263J523K2558L517k2481r571J9799J5026
$$ 36 11257 594 -14683 -7068 11024 5230 -16033 -14510 8048 11565 -10916 -20487 -688 14338
517A4338j4291k0234R692K3095l424k1901j048K0691O243j5647r185J0718J2453
$$ 14338 47 -20187 -10495 12600 9176 -12725 -13773 6918 13161 -2486 -11671 -953 11500
530A1500m063j0599J045Q208Q98n130R55K776j045j159J426r06k641O77L512Q82
$$ 11500 7437 -3162 -2117 6091 6989 1859 2814 5590 4545 3386 4812 3906 1265 1942 5454 6336
546F336n058m253L217M546k412m835J463K074k300k486K382N77k425O31K760j196
$$ 6336 1278 -2975 242 4788 2376 -2459 -996 1078 -1222 -3708 -1326 -749 -3174 -2543 217 -979
562i79o034p5R846M040j1028q910J1072J3466q619j6668N909K0090L47k1591q176
$$ -979 -7013 -7088 2758 6798 -4230 -13140 -2068 11398 2779 -13889 -7980 12110 12457 -9134 -17310
577a7310K0613J6460j5525k1707R043K3230j788k2117n534J8509J1690j3397j6392
$$ -17310 3303 19763 4238 -17469 -8426 14804 13016 -9101 -14635 3874 15564 2167 -14225
590a4225O680J7335o0j5173m436J0527P875o304q929J605J0099K816r119n995
$$ -14225 -7545 9790 9730 -5443 -9879 648 8523 2219 -6710 -5105 4994 7810 -1309 -7304
604g304P156Q286l407r147K48J0051L881j0042q326R473J2781p293j6009K748
$$ -7304 -148 8138 4731 -4416 -4168 5883 9764 -278 -8604 869 13650 6357 -9652 -6904
618f904J6500L103j6686r880J4717J5409j1734k0306M638K2148J420k0578q935
$$ -6904 9596 12699 -3987 -13867 850 16259 4525 -15781 -11143 11005 12425 -8153 -17088
631a7088J5945J3704j0965j7445N147J8777N61j7195o185J3621J0276p840j1241
$$ -17088 -1143 12561 1596 -15849 -10702 8075 8636 -8559 -14744 -1123 9153 1313 -9928
644i928K889J1552J818j0030m546Q310P515l995p555j75O771M359m423o324K423
$$ -9928 -7039 4513 6331 -3699 -8245 65 7580 3585 -3970 -4145 2626 6985 2562 -3762 -1339
659a339O898p49o108j605N536L240l587n923J497N898l4n537k67M573k45m721
$$ -1339 5559 4810 -1298 -2903 2633 5873 2286 -3637 -2140 3758 3724 -1813 -2080 2493 2248 -2473
675b473o74M751J860m486l863L984N000l701o281L799P256k025q362p87Q917L996
$$ -2473 -3147 1604 3464 -1022 -4885 -901 4099 398 -5883 -2084 5172 3147 -5215 -6002 2915 6911
691F911p133o780M800Q719l198r607J365R606J619r176m447O588P282l992q835
$$ 6911 -222 -7002 -2202 6517 3319 -6288 -4923 4683 6302 -2874 -7321 -733 6549 2557 -6278
706f278J847R197o84q241j631Q029M242o754o991L841R045r8r841k690R427N289
$$ -6278 -4431 4766 4082 -4159 -5790 2239 6481 -273 -7264 -3423 5622 5524 -4317 -7007 2420 7709
722G709p259p781M484J0521m71j1436m440J0773R280p893j1632M117J2029N03
$$ 7709 450 -7331 -2847 7674 7203 -4233 -8673 2100 11380 3487 -8145 -4028 8001 8504
736H504j2156n100J0995R871q743j3374L867J4685J292j3370o261J0148R836p251
$$ 8504 -3652 -8752 2243 12114 3371 -10003 -6136 8549 9841 -3529 -9790 358 10194 2943
750B943j2491L562J3971J417j4348n990J1388R947o767j2007J937J2506J998j1951
$$ 2943 -9548 -5986 7985 9402 -4946 -10936 452 10399 3632 -8375 -6438 6068 8066 -3885
764c885n312J0498Q516o477j1102J441J1234L649r497o725O864Q472m330r528
$$ -3885 -9197 1301 9817 3340 -7762 -6321 4913 8562 -935 -7660 -796 7676 3346 -6182
778f182J764J0073J925q830o171O068Q721k998r179N53Q431J224p682l473O139
$$ -6182 -4418 5655 7580 -1250 -7421 -1353 7368 4370 -4809 -4256 4175 5399 -2283 -5756 383
793C83O037l696p820Q26Q240J097o895k109N010L592m316m278K534N531j007n897
$$ 383 6420 2724 -5096 -4270 3970 5067 -1828 -3937 1073 4665 349 -3929 -1395 4136 3129 -2768
809b768n13N176J695m667j694M003K129k826l905J640N422l14n601j345N685J917
$$ -2768 -3281 1895 3590 -1077 -2771 1232 3361 535 -3370 -1730 3692 3378 -2223 -3568 2117 4034
825D034m482l033L048M150j268n017p76N534K376n116l646L807M358k334m690
$$ 4034 -448 -3481 -433 3717 2449 -2568 -3344 2190 4566 -550 -4196 -389 3969 1635 -3055
840c055O94M932J144n302l262M971N005l732o368K431O497n7p088k431O848N494
$$ -3055 -2361 2571 3715 -1587 -4849 122 5127 1395 -4973 -2542 3955 3898 -3190 -5621 1227 6721
856F721n947q478M235R508o46r707l358Q871O645o264r577L047J1744J56j1111
$$ 6721 774 -7704 -3469 6039 5393 -4314 -7672 1199 7844 1580 -7997 -4950 6794 6950 -4161
871d161m353R313P808n907r906J408J1138K163j0420n044Q159Q171n641r407J930
$$ -4161 -8514 799 8607 2700 -7206 -5798 5340 7503 -2917 -7961 198 8369 2728 -6679 -4749
886d749R507J929q485n534P522P293n328q495K284R129Q75q440m328O880P571
$$ -4749 4758 6687 -1798 -7332 190 7483 2155 -6340 -4056 5073 5948 -2492 -6820 60 7631
901G631n241r102K258R898L56q665l819P015O690m463q955J371R532J363q407
$$ 7631 2390 -6712 -4454 5444 5800 -2865 -6684 331 7021 2558 -6397 -5026 4506 5869 -2538
916b538m506P015O003l548p558N36P925J949o672m482N734N553l644n847J269
$$ -2538 -7044 -29 5974 2426 -5132 -4596 3329 5278 -1394 -5876 -142 5411 1767 -4080 -2811
931b811N941J010m976l340M366M137l023m697J850M751m36m038j368L762K146
$$ -2811 3130 4140 -836 -4176 190 4327 1304 -3393 -1543 3208 2772 -1266 -2634 1128 3274
946C274k847l138K681L545k099l685J222L722J37l586j729L140L208l186l242
$$ 3274 427 -2711 -30 3515 1416 -2269 -1047 2675 2812 -774 -2503 637 3845 659 -2583
961b583K100L968j540l997l7L586K147l461l216K182M636j562m881O18M951O46
$$ -2583 -483 3485 1945 -2052 -2089 1497 3644 183 -3033 -851 3785 2223 -2658 -2040 2911 3557
977C557m428k452L438M004k165n131O85O270L93o279j886M855M259l258o095J517
$$ 3557 -871 -3323 115 4119 1954 -3177 -2492 3778 4171 -2108 -3994 861 5120 1862 -4233 -2716
993b716P012N88p361k987O442N790n297o456K023P528Q79p733l679P092O157n611
$$ -2716 4296 4884 -2477 -5464 978 6768 1471 -4985 -2962 4566 5445 -2288 -5967 1125 7282 1671
1009A671p508K666Q507q3p261m194P059O149n187p813K911Q071L36p739l379O296
$$ 1671 -5837 -3171 5336 5253 -2008 -6202 857 7006 1819 -5994 -3083 4988 5324 -2415 -5794 502
1025E02O065m160p427J316Q096Q96p684l315O148N496l824p260J191P791J409
$$ 502 6567 2407 -5020 -3704 4392 5288 -2396 -5711 437 5933 2109 -5151 -3960 3831 5240
1040E240p203l527N666N484m010o433J465O744J601o790l959N845N233l784o370
$$ 5240 -1963 -5490 176 5660 1650 -4783 -3318 3426 5027 -1763 -5722 123 5356 1572 -4798
1055d798K027O585J68n828l023M688N228l703n834K031N722q5n288j907M367L307
$$ -4798 -2771 3814 3982 -1846 -4869 -181 5047 1344 -4490 -2459 3263 3178 -2110 -4017 350 3657
1071C657k960m256J180M947k14m392q87L744J434k657k869J856L190m81l480n73
$$ 3657 697 -3559 -2379 2568 2354 -2038 -2925 819 2253 -404 -3273 -1417 1773 1292 -2188 -2761
1087b761L411J226l451j557K799K141j817k671P02L226K84l720q63L516J819k786
$$ -2761 650 1876 -1575 -3132 -333 1808 -9 -2680 -1978 1248 1532 -2188 -3051 465 2284 -502
1103e02k798J696L799n27m273k92M004J722m301k459L627L598k237m393K38M652
$$ -502 -3300 -1604 2195 1668 -2605 -2897 1107 2829 -1472 -3931 -304 3294 1057 -3336 -3098 1554
1119A554J250m748k639M432L538l361m650J929N049J36m952k301M537L939l807
$$ 1554 2804 -1944 -4583 -151 3387 26 -4624 -2695 2354 2490 -2462 -4763 -226 3713 -94
1134i4m817K185N922q12n603j671M868L892l376n524J626O336K01o203k144N389
$$ -94 -4911 -2726 3196 2384 -3219 -4890 -22 3870 494 -5030 -3404 2932 3133 -3070 -5214 175
1150A75M095l323n865J142O861R00o754k809N475M941l961n991J349O701J140
$$ 175 4270 947 -4918 -3776 3085 3985 -2769 -5578 -103 4838 877 -5114 -3765 2936 4076
1165D076o732l345N805N526m456o132J581O702M64n951k890N326M499l678n578
$$ 4076 -2656 -6001 -196 5330 874 -5258 -3677 3025 3489 -2462 -5352 -26 4473 795 -4783
1180d783J734O621R4n840k413M880L667k626n304J468N383N98n797j438M251L078
$$ -4783 -3049 3572 3666 -2174 -4587 293 3960 1334 -3970 -2502 2881 3479 -2318 -3756 495 3573
1196C573k881l907Q59M482J79m310j425M415J790k928l087J562L763j4m078j158
$$ 3573 692 -3215 -2356 2126 2305 -2005 -3430 985 2775 -153 -3240 -1678 2085 2071 -2007 -3165
1212c165L544K493k988l378K575L083j043l027p46L363J966k478l014J933L586
$$ -3165 379 2872 -116 -3494 -919 2164 1121 -1906 -2652 711 2677 199 -2815 -882 2704
1227B704j859k728M96K818M91k349j472K259K162k091k704J845K599q08l128L74
$$ 2704 845 -1883 -1387 1431 1922 -427 -1899 360 2522 431 -2273 -428 2171 1363 -1765 -1391
1243a391K925N35k402k207K699K652j759l388Q51L744Q4l366j841L052K722j700
$$ -1391 1534 2069 -333 -2540 159 2811 1052 -2336 -1485 2259 2343 -1023 -2864 188 2910 1210
1259A210m031R07M785M45m883j414L379L138k129m599J252M714J184n565k053
$$ 1210 -2821 -1914 2871 3316 -1567 -2981 398 3536 1407 -3192 -1940 2774 3958 -1607 -3660
1274c660M543L299k834m616J201N418N36n491k326M500M281l844m753J788N206
$$ -3660 883 4182 1348 -3268 -2067 3351 3887 -1604 -3930 570 4851 1007 -3746 -1958 3248
1289C248L05n367k122M590L938l639m800K084N330j70n249j536M268L176k898
$$ 3248 3553 -1814 -3936 654 4592 953 -3847 -1763 3567 3397 -1852 -3388 880 4056 1158
1304A158m672J335N259K43n298j466M421L064k868m377J192M774P18n223k075
$$ 1158 -3514 -2179 3080 3323 -1975 -3441 980 4044 1176 -3201 -2009 2765 3483 -1740 -3815
1319c815M556L432l197m119J199M613P07m788j962M096L123k715m196J428M442
$$ -3815 741 4173 976 -3143 -1944 2669 3376 -1412 -3374 722 3845 1130 -3066 -1638 2804
1334B804J8m073j731L787K857k898l587J542M340p18l780p46K799K244k429l100
$$ 2804 2822 -1251 -2982 805 3662 764 -2823 -1281 3059 2341 -1439 -2185 614 2858 429 -2671
1350b671J764L147q63l148j12L185M75k364j441J707K117q91k528J81K910J6k317
$$ -2671 -907 2240 1377 -1771 -1883 1302 1777 -587 -2028 -321 1796 905 -1623 -1442 1468 1484 -833
1367h33r88K147J351j708j796M91K843j79k816l60K688J168k519j803J816K308
$$ -833 -1821 326 1677 -31 -1827 -1336 1507 1328 -1488 -1848 840 2008 -511 -2314 -498 1810
1383A810o46l383L00L361J196l141k253K796K746j737l367O94L271J258l787k326
$$ 1810 1164 -2219 -1919 1442 2638 -503 -2756 40 2786 1049 -2318 -1624 1647 2905 -882 -3208
1399c208L193L288j968l722P89L964L97l789j940L333L299k694m013J575M074
$$ -3208 -15 3273 1305 -2417 -1628 2336 2733 -1056 -2996 337 3636 942 -3071 -1496 2578
1414B578k62l863j211L279K619k980l657J708M715n03m526j070L450K516k348
$$ 2578 2316 -1547 -2758 521 3140 160 -3497 -1789 2926 2423 -2103 -3173 277 2793 445
1429D45l771J455M392J9m938j352M364K735k906m208J672M161M81m489j730M202
$$ 445 -3326 -1871 2521 2540 -2398 -3750 614 3349 443 -3765 -2093 2068 2549 -1940 -3670 532
1445E32L142l282m230K045M534Qm302j846L743L169k701l936J609M513k07l984
$$ 532 3674 392 -3838 -1793 2741 2749 -1553 -3399 344 3513 812 -3124 -1515 2998 2791 -1193
1461a193j405L419K744k852l393J470L958k41l912p19L126J923k351k553J265
$$ -1193 -2598 821 3565 713 -2680 -1210 2748 2507 -1405 -2124 1002 2925 574 -1979 -714
1476g14L205n72l430p12L343R69k353j862J279K675p40k780m83L075J068k799
$$ -714 2491 1919 -1511 -2223 1120 2089 -264 -2126 -847 1828 1088 -1692 -2175 900 1968 -831
1492h31j365J469K324r98k358j47K787O89k471j349K338J841j718j943P34K516
$$ -831 -2196 -727 1597 599 -1759 -1906 881 1570 -901 -2250 88 1929 211 -1732 -998 1518
1508A518n4k357o65K148J592k044k240J752K373l93k501o34K466J084k016j683
$$ 1518 1464 -893 -1558 590 2182 138 -2102 -350 2023 1630 -871 -1505 961 2045 29 -1654
1524a654J642K389j340k814O47K545P10k640j195K100K212j740k625Q95K958K99
$$ -1654 -12 2377 1037 -1777 -1130 1415 2125 -515 -1710 390 2602 862 -1763 -868 2090 2389
1540B389l214j239K771J839j868k874Q34L564p2l652r64K999K171k277k964P16
$$ 2389 -825 -2064 707 2546 678 -2196 -1362 2202 2130 -1522 -2486 513 2684 407 -2557 -1841
1556a841L509L55l693j289K949K797k768l514J309M212j41l702j515L129L307
$$ -1841 1668 2023 -1670 -2959 -10 2787 19 -3495 -2186 2026 1885 -1817 -3332 -203 3104
1571C104k791l549J761L987k03m138r44L734K181k242l691J645L700j16l900q46
$$ 3104 313 -3236 -1475 2512 2309 -1829 -2773 961 3142 900 -2791 -1146 2554 2438 -1462 -2308
1587b308L816J620k244k605R05L567k56l798r67L220K025k549k573J469K790n11
$$ -2308 1508 3128 884 -1721 -816 2751 2495 -1303 -2270 950 2975 426 -2147 -678 2112 1601
1603A601l273p17K776K038k654k382J467K561k08k896n56K884J297k037k624J851
$$ 1601 -1672 -2389 387 2425 -229 -2611 -1144 1417 1209 -1687 -2243 641 1938 -99 -2723 -872
1619h72K715j050k502k72K739J263k250j822J546K541j052k944O08K210N50j966
$$ -872 1843 793 -1709 -1981 758 2021 -229 -2051 -505 2036 984 -1960 -1352 858 1408 -558
1635e58r81J738J575j574j767K94K394j0k222o1J710Q57j447j525R54J890l36
$$ -558 -1539 199 1774 200 -1567 -1273 1121 1111 -1111 -1172 538 1395 -52 -1577 -623 1267 931
1652I31k197k14K373P60j786j382J456J852n63k285k69K785M53k306j119K035
$$ 931 -1266 -1480 893 1653 -133 -1515 -59 1793 1230 -1055 -1324 1461 1914 -392 -1511 524
1668E24J568j699j782K32K683N46l018j405K461J856j702k366P73K827m4k914
$$ 524 2092 393 -1389 -1157 1526 2072 -946 -2351 110 1966 264 -2102 -1329 1498 1454 -1460
1684a460j233K736K102k008k625J191K732N2k745j150K523J951j668k892J638
$$ -1460 -2693 43 2145 137 -2488 -1297 1435 1487 -1258 -2408 115 2066 398 -2494 -856
1699h56L031k96l294n39K752J642j898k667P96L730k73l721n12K773J975k172
$$ -856 2175 1879 -1415 -1954 798 2440 542 -2125 -1329 2401 2128 -1593 -2105 668 2643 471
1715D71k424J040L006r7l283j162L386J886k895k367J414K898j97k912j069K958
$$ 471 -1953 -913 2093 1996 -1287 -2449 937 2823 -72 -2439 -1025 1873 1676 -1236 -2305 653
1731F53J690k426k234J385K635k45k738r73K968J684k612k051J418L099q59k675
$$ 653 2343 -83 -2317 -932 1703 1458 -1280 -2253 715 2399 -213 -2264 -846 2253 1394 -1281
1747a281m85K770Q75k269j469J407K297o65k332m35K612P27j883j620J649J850
$$ -1281 -1766 1004 1879 -390 -1859 -452 1845 1180 -1152 -1587 1025 1752 -131 -1751 -102 1748
1763A748j040k061J75K155O84k169j059J674J515j152k222R90J671K41k169n45
$$ 1748 708 -1353 -1178 977 1661 -508 -1567 107 1622 470 -1752 -762 909 1150 -1019 -1564
1779a564K050J048j331j852R57K038l69k129k4J573J098j506j577J071J767n67
$$ -1564 486 1534 203 -1649 -692 1346 977 -1152 -1176 397 1495 -11 -1588 -517 1250 683
1795F83k077N59J567N53j628j508J826J744j303k004N28K268O7j877p80J530J439
$$ 683 -1394 -835 732 1285 -343 -1851 -25 1719 416 -1588 -1060 1208 1275 -602 -1382 148 1587
1812A587r05k221L34K792j38k375o37K187J277j709j943P36K713j22k526q33K508
$$ 1587 682 -1539 -1205 1587 1449 -926 -1563 624 1901 192 -1751 -1015 1698 1576 -950 -1783 725
1829G25J124j529k123Q84K329l6k710j000K729J854k354j964J331K099p1k629
$$ 725 1849 320 -1803 -919 1410 1374 -1336 -2336 393 2247 -107 -2071 -740 1359 1288 -1341
1845a341o08K155K153k242k416J457K587n65k479l64K198J379j780k213J073K916
$$ -1341 -1949 206 2359 117 -2299 -842 1745 1180 -1299 -1663 535 1914 134 -2079 -1006 1910
1861A910q72k680k56K755J140j770k098J395K417p85k755m1K378J104j938j602
$$ 1910 1038 -1642 -1898 857 1997 227 -1871 -476 1941 1156 -1599 -1640 738 1842 -96 -1698
1877a698J465K037o06k343k75K468P06j888j346J433J584o61k074JJ802R01j477
$$ -1698 -233 1804 1198 -1145 -1420 1048 1754 -134 -1480 -47 1537 876 -1198 -1197 605 1506 29
1894B9j848J511J962j129k129N20J888K90j731r30J485J352q63j963N88J830k9
$$ 29 -1819 -308 1654 525 -1604 -1084 804 1094 -637 -1567 -82 1270 407 -1556 -968 862 833
1911H33j496p24J368J411r85j759O30J846l07j470l38J502N70j014j324R24J523
$$ 833 -663 -1387 -19 1392 407 -1352 -722 1124 817 -653 -991 511 1081 67 -1257 -333 1190
1928A190o22j480j45K256J51j707p77J208J313o44j699K28J817L00j903m10J312
$$ 1190 568 -912 -1057 1199 1350 -357 -1134 74 1387 743 -956 -728 1089 1389 -514 -924 388
1945C88J159q53k010N81J999L3j636j221K040J455j577j792R03J738j79k108o62
$$ 388 1547 694 -1316 -735 1264 1297 -339 -1560 480 1935 358 -1434 -531 1207 1028 -1080 -1742
1962a742J897J338j320k297J391J860k51j721r17K092J131j232k345J373J942
$$ -1742 155 1493 173 -2124 -733 1127 876 -845 -1762 330 1461 229 -2116 -743 1199
1977A199Q2k329m93J927J049j494j929J203K120j15k381j69J884J070j571j710
$$ 1199 1281 -1048 -1541 386 1435 -59 -1988 -785 1335 1220 -1161 -1330 554 1624 53 -1657
1993a657J169K016k40k398k70K046R99j540j516J311J516j31k138m53J921J167
$$ -1657 -488 1528 1288 -1110 -1380 666 1665 125 -1391 -80 1436 1305 -833 -1286 635 1802
2009A802k016j222J240J626m23k123J26K094L35j376j651J180J942n52k397J39
$$ 1802 -214 -1436 -196 1430 1007 -1116 -990 1104 1439 63 -1588 -408 1534 982 -1415 -1276
2025a276K106M27j489j319J018J823r30j630j41J946L82j641p26J105J256n50
$$ -1276 830 1257 -232 -1551 -533 1290 360 -1270 -1411 535 917 -724 -1450 -345 911 361
2041C61j645K95J506J19j495p90J494R80r15j038K37J746l2j606j40J192N62j154
$$ 361 -1284 -989 517 636 -859 -1649 -155 825 -90 -1128 -891 855 823 -783 -923 269 831 -323
2059c23l07N94Q95k58j120k10J757L14j782n74J277J377j141j404M48J135L50
$$ -323 -630 -36 859 601 -519 -729 1028 1342 -440 -1014 263 1640 499 -905 -457 678 1028
2076A028j178j127J395J356j184j457K82K033r1j962l29R63J407j138j629N30
$$ 1028 -150 -1277 118 1474 290 -1167 -885 1148 1057 -905 -1234 -271 1136 -2 -1631 -1101
2092a101K148k34j542p12J514J250j168j358J86K106k87j539l54J445J076j423
$$ -1101 1047 813 -729 -1441 73 1323 155 -1203 -1017 1089 802 -737 -1091 354 1430 7
2108Gj162L68K079l93k053J50J781O63j611j054J065J463n64j831j00J975P53
$$ 7 -1155 -787 1292 899 -1154 -1004 777 1440 -171 -1225 -160 1303 739 -1092 -1192 783 1536
2125A536j715j610J627J417m25k013l43K333O95j520j206J001K214j101k180O6
$$ 1536 -179 -1789 -162 1255 830 -1183 -1526 807 1502 -18 -1224 -223 1991 890 -1290 -1224
2141a224J936J193j736j534J392J560m61k172j89J993M71j452j330J289J054j50
$$ -1224 712 1905 169 -1365 27 1587 1126 -1046 -1235 758 1229 -223 -1553 -264 790 640
2157F40j665k19J996M23j443j197J257J203o83j422L08J120L78j446o7Q80Q53
$$ 640 -1025 -1244 752 1175 -268 -1465 -208 995 312 -1110 -802 318 696 -750 -817 63 916
2174I16p77r43M45J173k35j144k73J393P05j246j383J191J208j71j722J82J097
$$ 916 139 -804 -359 814 579 -565 -838 555 1260 14 -1369 -178 1030 859 -863 -681 416
2191D16R01j261j074P35J350m09j386O7J090P52j190q86L74J607k08j534j56J384
$$ 416 1317 56 -1018 -283 1067 658 -728 -661 429 1181 -9 -895 -521 1086 878 -656 -812 572
2209E72J69q60q90Q45J015l85j075r5J283M54j360m44R88R29p19j221N33R78O2
$$ 572 741 -119 -1009 -164 851 466 -609 -704 579 1033 -327 -771 217 1146 427 -794 -261 717 779
2228G79j617K28J042N16j351o98O81J517l58j721o0J694O85j706q16J194J132
$$ 779 -838 -610 432 948 -403 -1101 -420 1097 739 -982 -1042 652 1337 -369 -1185 9 1141
2245A141k46j545m44J510J010j542j498J070J712O0k345P8J567Q86j288j619Q57
$$ 1141 895 -650 -1094 416 1426 -116 -1614 -544 1168 1228 -1117 -1039 528 1414 126 -1493 -636
2262f36J637J67k007k02J421P10p45j169M25J493l35j748M85Q95Q35j402j029
$$ -636 1001 1168 -839 -1041 380 1090 345 -824 -399 1094 759 -989 -504 391 1226 -176 -1205
2279a205J155R72m77r25O8P37Q94j482q15J026P56l30j321O17J035q0j205m08
$$ -1205 -50 922 445 -480 -412 325 1219 -263 -1078 -52 704 374 -947 -330 705 625 -580 -988
2297i88J242O00n35j535O34J459k29j014p08J354R72q42j329K16J371J42j396
$$ -988 254 854 319 -1216 -582 877 648 -366 -1074 280 1252 410 -919 -703 668 810 -586
2314e86k10J093P15q80q13p2J292Q7r87m17Q93P76r13r76L88J020K83j182j13
$$ -586 -796 297 1012 132 -681 -753 539 626 -361 -778 115 891 -22 -998 -610 410 693 -489 -602
2333f02N39M76p3q16L75Q15m21o51K12N40K15q95l21R11N61j144o25Q43Q68k74
$$ -602 -63 413 340 -476 -101 714 293 -358 -146 394 609 -286 -607 304 865 -279 -904 -61 807 533
2353E33j074l54J282N49j207p66P84J205r3j717KJ138Q27j071j124O60J231j54
$$ 533 -541 -895 387 936 -271 -1037 -253 952 859 -858 -856 282 1109 38 -1086 -426 805 651
2371F51j379n48J608Q86r06j356N16J329k46j062n78J295N71n04j237O52J161
$$ 651 -728 -1276 332 1218 312 -1044 -528 801 555 -507 -1085 210 781 277 -960 -308 853
2388H53k97j238k45J096N67o99p88N44Q03Q0j256n5J235M96j276m62N33P91k35
$$ 853 556 -682 -927 169 736 37 -751 -207 596 676 -580 -635 600 1096 -180 -642 -109 682 447
2407D47j302M19J064J52j044p70J201J060r35j354O65J194K25j690k74P33J452
$$ 447 -855 -436 628 780 -264 -1034 167 1227 292 -1062 -397 797 1022 -668 -942 -209 1243
2424A243o69j799K89J650M02j574n98R34J116n60j057l13J661J82j303p23J081
$$ 1243 574 -1225 -936 714 1116 -458 -1056 -122 994 434 -623 -936 725 907 -396 -1119 -38
2441c8Q68l76j165K03J015O7r97k62O79P13o07q15K72J048p9j017j14P13M32q49
$$ -38 830 454 -711 -508 507 574 -423 -685 -6 707 100 -715 -443 605 526 -491 -605 108 540 -309
2461c09r3N38L23m14o05M25O65m4q21m89J126P48p40p99P9J314K5j360k21Q33
$$ -309 -402 136 459 45 -560 -135 530 486 -335 -824 302 1050 310 -489 -410 904 929 -431 -652 181
2481A81P62n90j238O33R12J83j264n40J418N37q79j195O31R84M01j184n85Q39
$$ 181 943 353 -885 -252 660 843 -421 -961 457 994 115 -1080 -449 535 936 -248 -833 6
2499FR29j084k94j54J173L8q07k57P07L60n21q18N31P19k97o68N7P96L57r75m49
$$ 6 935 -149 -443 -597 576 614 -193 -450 257 617 96 -722 -191 528 231 -437 -380 416 773 -202 -651
2520f51P57P32p35o85K14R74j9j043l31Q56J009p93j026J50J563P0j439n43J104
$$ -651 106 838 103 -582 -368 606 587 -456 -787 69 1078 285 -741 -591 972 1042 -397 -940 164
2539A64J044o29j697M76J118M32j177o79Q39J026l60j164m3Q43O78r48q76Q60
$$ 164 1208 579 -1118 -642 476 908 -269 -948 -109 917 557 -607 -650 193 871 -77 -953 -93
2557i3R39l23r98j46J267J40q84n80Q71K75m33o24K85P39J02q30k30L34L73l68
$$ -93 846 523 -475 -621 646 786 -98 -678 193 468 35 -589 -304 435 537 -293 -523 -189 184 -184
2577a84o61P70N23k52o99K22R16o9p10p16N92J124j95j479O3J165M14q78p56N56
$$ -184 -845 -75 448 196 -503 -281 635 566 -144 -860 -268 856 661 -818 -755 410 824 -54 -810 -254
2597b54R97k53j038P3J037M43j046j081Q76J005j19j138k94R78N17n52o17L49
$$ -254 743 490 -548 -475 562 1005 -41 -1122 -246 759 640 -498 -792 186 703 151 -466 -117
2615a17O52k91q66L01Q08n4m82m33K71O80o50k11K98L73l5m83k39O89L98r54k30
$$ -117 535 244 -622 -321 487 433 -49 -482 -211 469 -181 -392 -94 279 244 -239 -478 211 609 -345 -575
2636e75M82O38m92r48L55J030J26r58o79R54J036n38j224J89J220J14j050n46
$$ -575 -93 545 53 -895 -540 490 616 -342 -1021 -67 969 431 -793 -604 616 730 -320 -866
2654h66Q76Q32o07j050J62R14N85q75q69L28J366j3j390k15J326K1o64p14N15
$$ -866 10 842 235 -815 -653 261 846 -29 -898 -570 796 783 -607 -822 504 525 -139 -853 -338
2673c38Q78k36o37KR20M4o95p35J138K62m03n10p6J050l81n67j66L90P25n81m66
$$ -338 540 304 -333 -331 589 633 -62 -797 341 603 200 -310 -386 664 283 -284 -450 -60 665 84 -382
2694c82L34M09J5q81n5R08M09r04o60P01O84q9r47m22J261M11q50p90N45J173
$$ -382 -48 361 376 -505 -560 348 757 -147 -807 -106 578 489 -458 -880 381 792 -58 -848 -303 870
2714H70j65j014m39R32O67q79n72K87J433l92j268j05Q05M99m26p11J93N53M0
$$ 870 705 -309 -748 184 851 -28 -600 -313 1120 728 -540 -645 160 659 233 -478 -285 268 308
2733C08o72j32O59N56o22l47L60K74k00l05J56K48J6n36k59M87M40n37k39J66
$$ 308 -364 -496 163 719 97 -250 110 384 184 -121 35 283 299 -237 -496 -9 431 -106 -345 -179
2753a79Q18j39q47k7O11M01n16r18O46J036l93j215K38Q19L77p83r35R18P10l64
$$ -179 639 500 -347 -374 237 638 122 -796 -150 886 493 -722 -484 335 712 -71 -1006 -88 622 258
2773B58p40J83N22O36n26r79j1J046j04q67K47O55M53m34q86K11P10j82m81k07
$$ 258 -482 -299 223 859 333 -646 -657 389 285 -582 -335 320 773 339 -547 -336 374 192 -289 -496
2793d96O99ml83k23L25J18P0n96j0R09q1p19j47P44P14p36m40p6R16j54q32k08
$$ -496 203 199 -184 -407 -82 36 106 -490 -500 409 328 -391 -538 206 920 184 -256 -332 584 430 -402 -610
2815f10N37Q86r12n20M72N56J67p87o76Q31P54n26j038N17R79J7j094l55Q54Q19
$$ -610 -73 813 -99 -619 -147 409 576 -211 -887 -56 698 172 -866 -349 630 647 -447 -802 52 871
2835H71p29r58K07J243m36m87k65P99J49n09j59N6Q52l49n81m24Q70R9l62r7l9
$$ 871 142 -816 -609 634 198 -289 -554 245 394 -115 -274 -218 634 285 -296 -720 150 249 -113 -210 -249
2856b49N93j72k00n25Q58J8m16m11P05L31n00l99o1O85m8n88l29Q19K66l96k99
$$ -249 344 172 -28 -553 305 323 -93 -504 201 532 32 -367 -428 257 209 -379 -708 111 377 -19 -318
2877c18J08N53L62j095R4M16K59o6p41j69R74J09p03k91N11M67l27p90L13N92
$$ -318 -210 343 705 -390 -296 120 379 313 -428 -597 377 486 -217 -508 3 470 143 -647 -334 258
2897B58L06q29m17R13j63Kl84j77P37j7n63q2O77J18o51j46L18K03J07m47j1M54
$$ 258 564 -265 -682 231 68 70 -314 -491 246 229 -334 -416 261 379 -272 -418 -100 103 210 -237 -248 206
2919B06Jl19k62N50O21n12n73K29K50K10n74k27N27N62m70m69k91J089K29j010
$$ 206 207 -112 -374 176 797 285 -288 -59 191 401 -173 -400 127 689 219 -250 -541 548 777 -233
2939b33n16P99L21Pj291L39R38J40n56l99N64L92n10p43K21J043op35l5L82Q7
$$ -233 -749 50 371 378 -913 -574 364 504 -52 -451 113 505 -5 -748 -527 516 510 -225 -260 122 209
2960B09J07o34L4P89l45n83J26L32K26j5n60l1P53j31l59k04K05P27o88k81J80
$$ 209 316 -318 -284 505 160 -423 -297 35 261 246 -314 -345 408 277 -82 -286 -81 646 -42 -323 -143
2981a43P12l32n05k51N40K30j03l85K27L83j67n18j26N81J45m80j40M49O22p08
$$ -143 569 237 -268 -519 21 251 148 -237 -10 373 206 -312 -438 143 288 -192 -332 117 739 31
3001C1m78o9J025K37j024J63K00N4k28l39M12K57L24j049j02O11L31k32l56K12
$$ 31 -447 -516 509 746 -278 -115 85 139 -89 -428 -16 241 565 -484 -586 25 356 124 -232 -20
3021b0M13O0p21j32P37J59n76r5M6M79r5l44j58N35j72j97o6J01M60l00n27J52
$$ -20 393 453 -268 -400 337 496 -80 -175 -129 350 255 -89 -247 288 116 -81 -147 -46 414 114 -413 -261
3043b61N55k6o86L84L8P86n26p55J78P90k61j73o96M62P35n71m02K21O31no82
$$ -261 294 268 -418 -34 4 790 264 -491 -313 477 216 43 -653 -191 544 -27 -429 -208 423 418 -264
3064b64l8K93Q20o32n99J67M89K8o08M0J65P26m27o50J43N20L84r80k22R40P5
$$ -264 -302 -9 811 179 -420 -253 236 264 -344 -304 -139 587 160 -490 -347 173 557 -423 -645 295 370
3085C70j72p97O40P9L6p9q09N43M19l47m73O32N03k68o42O4M39N24q72k66L84
$$ 370 198 -599 41 120 156 77 -732 -189 230 -117 -590 42 545 277 -365 -301 138 662 -210 -476 -92
3106i2O83j72p88P2N12L99r13r5L35M74k45o93o0P78K10j16o07K77O62k83p47
$$ -92 591 419 -369 -297 215 614 -299 -394 -59 415 170 -523 -583 195 405 289 -318 -41 621 338 -409
3127d09N2P66n5n79m3K77L14m1l94m01P62K95n95j55K56M85j88n82k50O05J79
$$ -409 -357 409 354 -225 -268 9 323 282 -112 -513 249 544 -51 -206 50 535 347 -235 -485 120 299
3148B99k43n39Q44K54n09l46k2K01K32m29K22J50K70l08m70L23P84n40o23L12
$$ 299 56 -483 361 615 106 -240 -262 -61 171 -258 -36 114 384 76 -394 -71 713 173 -450 -138
3168a38M38J46m96m73K27N44N5o87m3O90J5m78m35O83J60R3n33j81Q68P5p71l77
$$ -138 300 446 -50 -523 -296 248 303 -384 -427 263 278 -200 -635 48 208 301 -232 -413 455 530 -241 -618
3190f18N13M11L0r13K36M30L85m97o23Q20K88m44l88k35Q64M48r11k18M51L85
$$ -618 -105 306 336 -577 -341 89 474 -23 -646 174 462 18 -370 -605 259 707 -204 -422 29 414
3210D14k03p66M75N26j72l90l29M39L65m81j63rM22P8m76K8N11kq0p64M28N00
$$ 414 211 -555 -80 446 274 -116 -445 -6 359 -122 -285 -294 128 206 -270 -242 269 267 187 -577 -149 351
3232C51K44j079R0O01J79o23j27N25J82j95n32j3N89L77o79m09M19P57n43n59
$$ 351 595 -484 -394 207 386 -237 -364 161 343 148 -384 -397 192 569 -110 -519 -100 657 114 -445
3252d45K10K35N76o21m98O73K35k65l49j33M12J2j96j85M79P36n71q71L23N61
$$ -445 -235 0 576 -45 -543 130 365 100 -249 -382 30 42 -154 -339 140 876 305 -566 -243 318
3272C18J1m80k89O07K15l72n17K43O17o5k11k40NO92m80j83M6N36k27l98l45N71
$$ 318 329 -151 -440 167 382 10 -507 -264 353 288 77 -163 -158 534 54 -129 -83 453 226 -172 -517 54
3294E4K61k06l70j3P66j29m60k81N59K30o86p8K04M93k08o80L13N83j59j2l80
$$ 54 315 109 -261 -274 492 363 -97 -378 181 411 -275 -353 -149 344 136 -544 -231 352 193 181 -199
3315a99oN22m53n3o7N77l1m01k08L13M20m76l32J11N89j8m70l79Q64M34p30m27
$$ -199 -205 317 -136 -189 -256 321 290 -111 -319 -6 414 -62 -394 -283 306 288 -182 -561 303 737 7 -420
3337d20K91N75k71m09m75Q55L64m98k98J52M69j90m61l43J041j89m5p14L67O71
$$ -420 -129 446 175 -234 -709 146 510 12 -286 -134 335 145 -316 -659 382 193 148 -566 -199 472
3357D72p2p24Q7M55K65o86k77N58L50p3l41k52L19L62o19l36L45O47l99j79j07
$$ 472 400 -324 -237 218 483 -203 -480 78 428 355 14 -238 81 443 -176 -512 -167 480 81 -98 -205
3378b05K52J98j04n34O58j91L37q75K07N66j7k57m68M77J73L2m95K8P40k08m52
$$ -205 47 245 141 -393 265 74 411 -464 -257 309 292 35 -433 44 217 249 -246 -218 522 314 -138
3399a38k01L22J93P1q39P33R3mj50m65O48O2k60k56O7M52j86p0l33K38K26l24
$$ -138 -339 -17 176 247 -592 141 234 230 80 -385 263 325 65 -191 -124 328 142 72 -261 -23 203 -121
3421a21j85J02N32o2o33J98L54J36o10m56P42M81l11l42l8M49K89n64k23p3M53
$$ -121 -306 -204 328 266 -367 -169 185 321 -289 -745 -3 478 167 -175 -213 236 525 -39 -262 -335 118
3442A18K7m23P9L96K77m62k09K71L53l67l41L43N42l0q53j05N36K87j91q88K77
$$ 118 145 -278 -199 197 474 12 -197 74 427 60 -281 62 604 574 -279 -384 152 439 248 -640 -363
3463c63N67j2n1l80K28N23m64k54j97L99J83l19p7L82M68m36n90J88M90l5k58
$$ -363 204 192 141 -239 -11 512 48 -206 -403 -4 179 -140 -217 165 633 197 -393 -205 285 250 -8
3484hm76L82L29j85k27m6Q55J60r39OK27J25k22l21J53N24m7m80K69Q0K40l49
$$ -8 -484 -102 227 42 -185 -231 624 784 -155 -149 78 203 -19 -340 -187 337 290 -190 79 159 399 50
3506E0l04K97J98j07n28J93L71K46j72l65J57N46q38k67K98J95L23l80j85L13
$$ 50 -254 43 241 134 -394 -201 170 416 244 -121 36 582 -256 -523 -225 -30 293 -87 -272 41
3526D1M03k91m70L9O32j10k27m82M29L71j81m94K91O04l22j66l48L39N86p29k78
$$ 41 444 153 -317 -278 354 244 17 -465 -36 335 154 -340 -49 555 233 67 -281 58 644 -85 -363
3547c63M73L3R0m73n0L76K23l52m04Q4O37j3m81J74mJ00M6n07L80L66l06j79J76
$$ -363 110 143 233 -240 -290 86 309 -43 -447 -363 274 261 -220 -46 -50 50 96 -411 -31 335 29 -150 26
3570B6j88M25j46k00J11K88j49o08K35K89L09l40k75L07J64J7r04L39K03K59k00
$$ 26 -162 263 117 -83 28 316 167 -441 -206 83 392 52 -223 84 248 265 -639 -300 -97 162 -38
3591c8m48O05N43o22k30l8L99p2l43q1K17O19o13l25M9O60k29k76j6J19L36K54
$$ -38 -486 119 662 40 -190 -228 171 99 -244 -325 -108 511 -102 -427 -378 282 53 -223 -239 -120 216 470
3613D70n49m4M65j26l42l36O46J91l78l70J33M73P0n12K00K63J78m43m53L35N20
$$ 470 -79 -123 342 216 -126 -462 184 375 -3 -373 -240 233 303 -209 -9 254 432 -11 -464 -129 391
3634C91j81n11J25O67j97l03j48K51P5k42j65OM36J36k78o17N61L68k14o24O9
$$ 391 210 -301 -176 491 294 -9 -157 94 169 -73 -238 -232 204 340 62 -555 6 374 160 -464 -395
3655c95L13N46m87l40N02K27m79l62J80M49O5p84L09N8M03O6n00k9M43p0j89k84
$$ -395 -82 464 -23 -363 139 366 -113 -475 -295 154 219 -565 -256 -198 205 271 -229 -258 185 115 -74 -358
3677c58j9N55j05l93j98J026m62k27j22J51L88l10k2P8L44l00n07L46K12R8j50
$$ -358 -377 178 73 -320 -518 508 46 -181 -303 -152 236 -74 -96 -18 326 26 -481 -135 77 175 25
3698B5k57J10K84j34O1k88L64j08j34j93J36M36j47m21l8L84L25n78q6L33K83
$$ 25 -232 -122 162 28 89 -199 165 57 -77 -270 -134 302 155 -266 -304 80 405 -173 -259 74 357
3719C57l07k44RL82m3k00m88N52O9j6k11j17M79j2n41J11J81L95l90k55N1L47
$$ 357 50 -194 -185 197 154 -46 -534 18 87 71 -140 -257 222 210 -331 -220 -39 356 -34 -289 -238 109
3741A09Q5n85M88j47K63l45k0RJ46Oj81l87O23P1k35J55j27%K75m00j07N58J29
$$ 109 194 -391 97 -50 213 -132 -152 -143 3 9 -172 -559 64 135 -100 55 -72 -72 203 -197 -304 254 383
3764C83l75l94O48p9k70Q7k39L49J42l21j96Q0O23m12k45l10P56J71o03M3O3J66
$$ 383 8 -386 262 183 -87 0 -239 110 252 -69 -265 -185 438 26 -219 -529 227 398 -205 -162 -99 67
3786F7j0m57J95M52l31K7n4J65J00n2l97L31J29m4l61J02M53j80O7o53K31O60
$$ 67 57 -400 -205 247 -84 -57 -111 54 154 102 -295 36 165 121 -240 -138 315 135 202 -451 -220 440
3808D40m56m0l37L87L11k34m21K1N52j0k75O0K92k06j80l63N72j37J98m38j03
$$ 440 -16 -56 -393 -6 305 71 -350 -329 223 213 -62 -2 290 84 -96 -459 113 -24 174 -264 -367
3829c67N20J26k67l65P29k77J13m04o2M17R3m12o3J19L64k26k95K19K88K18p00
$$ -367 153 279 12 -353 376 99 212 -192 -254 163 256 -156 -219 -100 264 38 -257 -38 250 468 -232
3850b32k5J56K12J39o51L48M15N3n70J09K9M43n43q5J03M93j81m68K88%L14n58
$$ -232 -257 -101 111 250 -401 -53 362 415 -155 -46 -17 426 -117 -202 -99 394 213 -255 33 33 347 -211
3872b11J92m8M32n17n1K43L07L47q11l6J22M24m83k10L54p1N81p89j91L80K92
$$ -211 -19 -67 365 -152 -203 40 347 694 -117 -153 -31 393 -90 -300 54 -17 564 -225 -416 -36 256
3893B56J8l92K12q2J58l94n5J45N49l87j52O3Q9J72m23m8K84L68m55l13J91M79
$$ 256 274 -118 94 12 170 -224 -279 -134 415 28 -124 -61 28 200 -223 -271 13 381 -74 -387 -196 283
3915B83J26n88m3L68j71M3j52M25o8q3m18J94ML24l59k85N38J35Q9l56l59N04
$$ 283 409 -179 -222 146 -25 18 -134 291 223 140 -278 -84 -80 244 -115 -400 138 273 362 6 -353 151
3937A51k8q8m35K75M31J1k55k77K06j2j08k10J89O08k37k12k44K99j1j03l86L19
$$ 151 123 35 -400 -125 306 317 62 -215 -9 -21 -129 -339 -150 458 221 9 -235 64 53 -50 -436 -117
3959a17M66j32n37L22J6J62l18j76M49p8J79o13K50J10K52k31n23O59K31l95j54
$$ -117 349 217 -320 2 18 180 -138 -314 135 57 236 -377 -127 -17 235 4 -519 140 371 -24 -178
3980a78j18M97J47p91k4M58kK32l40n4L49J62k30n38N27j13J45k77K18K0o7j8
$$ -178 -296 201 348 -443 -467 -9 -11 221 -119 -173 176 338 108 -430 97 -16 129 -148 70 90 23 5
4002Ek15M13J65k69l18J01N64m37j12n4P0L80l04k60N66k32r0l87L53K62j91j22
$$ 5 -210 203 368 99 -219 -118 446 9 -103 -157 -87 293 -11 -271 295 63 -27 -414 -61 201 10 -112
4024a12q1O3K68qj64m6K2J90k41j90M78N88o95l47K83M06l16m67K60J34K72k6
$$ -112 -193 -130 138 130 -34 -80 -58 132 -109 -299 179 767 72 -275 8 414 98 -369 -109 25 297 271
4046B71k39k9M00k54l11r8M20M36m05m41o7O49j74m80L89k89P03o32J22K16k39
$$ 271 32 3 403 149 -162 -260 160 596 191 -250 -317 332 158 -322 67 -222 481 -151 -29 187 -52
4067e2P7NJ62j09K12k84l08rM97j05Nl96P67j22k93j98J38K44lo00P4K20J87R4
$$ -52 25 30 192 83 295 11 -297 -306 191 86 91 -305 462 340 47 -151 -13 231 228 -372 -298 -78 109 203
4091B03m83K21J46j7j11k40L10K04o1k91K59j82J45r3l43L78L5l56N6K89K34j77
$$ 203 -280 -59 87 70 -41 -281 29 233 172 -119 140 -42 103 10 -333 45 80 -276 -220 69 303 126
4113A26j85K72L4m6k60k30M54L41m76m11J42M78Q6k90j60J4M98j93m55J86J71
$$ 126 -59 213 247 201 -59 -289 165 506 30 -381 -239 239 325 35 -125 -111 387 194 -261 -75 96
4134I6Oj03l81M23M70k55p62J17O64k07j01k32K61Q5k66k5J70J43L7m14j23O58
$$ 96 102 -1 -382 41 511 256 -506 -389 275 68 -33 -265 -4 81 -185 -210 -40 103 140 -274 -397 261
4156B61j6j22l12L96Jl31P1O2R5J26l53j07J6M91l34K8j38K68J49o18K98O4L23
$$ 261 245 123 -189 207 208 -123 -52 10 105 231 -122 -229 -213 278 -56 -28 -166 102 251 -367 -69 -5 318
4179C18m59j13M15n5k8n55K54M13l38K69l91K86K12Q1k69m32K39J14j18L1q9N79
$$ 318 -141 -254 161 106 78 -477 -223 190 -148 121 -270 16 228 309 40 -392 -153 -39 -157 -126 -215 364
4201C64j91l42J54m8M52k80l37j16N58j34l48L61k39L08k04j53J25K20l1j44J6
$$ 364 173 -169 -15 -63 389 109 -228 -344 214 80 -268 93 -146 162 -42 -195 -70 150 119 -25 -9
4222iJ24K19k03l92J23L24j19k86J34L29l35j24j33L00K06J56p21N26j66L7k34
$$ -9 115 334 131 -261 -138 186 67 -219 -85 244 -91 -215 -348 -48 158 314 -407 119 -47 -10 -244
4243b44kK55j2n8k62J87L04j37k25M0L49J34m14JK0K76r9p5k45K37k9r5j41K61
$$ -244 -246 9 -3 -61 -323 -136 168 31 -194 -154 195 329 -85 -84 -64 212 113 38 -207 30 1 -94 -235 26
4267B6J84j44n9l66O89J10m96k66L44k3J94j21m84L23O87r13NK50K20nk80J37
$$ 26 210 66 7 -359 330 440 -56 -322 22 -1 193 72 -412 -89 598 -315 -310 -60 160 155 -125 12
4289A2J2J75n6m21K61R1k39k09J86L66m43M13o92N10J35k07K3j58M22Ol58k93
$$ 12 24 199 143 -278 -17 74 -165 -374 -188 178 -265 148 -544 -34 101 -106 -83 -241 181 187 -171 -464
4311d64M79K11m29k91K91M31k20o7j25L0K14k52n3J81J74p9q7q4J85K05n65K23
$$ -464 15 226 -203 -494 -203 228 8 -59 -184 -154 60 -192 -245 -64 110 31 -56 -140 45 250 -315 -92
4333i2K96j7m6l45m9M60k44j01m4p3K76Q3l81N9K92J43K64p32R8K27j76k64L76
$$ -92 204 187 141 -204 -253 207 -37 -138 -182 -255 21 104 -277 -218 74 217 481 -251 -153 74 -102 -366 10
4356A0pK77l05M3J29j15M2m23K83L72j02l54RL98j26j9l04J4j59M68l78J3L57
$$ 10 3 280 -25 18 147 32 74 -349 -66 306 204 -150 -141 257 131 112 -192 -178 -337 131 -247 -234 123
4379A23ol11j58K07L55o1l70q0M48k38O0j54M8M07k25j34k25N02J37l52n4k19
$$ 123 117 -194 -352 -145 210 149 -221 -301 147 -91 -31 -185 -137 270 45 -89 -314 188 325 -27 -81 -300
4401c00L55O3j45j2J20k54K35j17J32K68m75P4J07O1k7k01J27mj66K65l56k4L90
$$ -300 55 118 -27 -39 81 -173 62 -55 77 345 -130 -56 51 112 85 -116 11 7 -159 106 -250 -274 116
4424A16N5j88o3q5Q3M01l22k00Q8N09l34n57O82j65k03l80O48M46m90m07K25L06
$$ 116 171 -17 -80 -165 -82 319 -3 -203 -115 394 60 -497 185 20 -183 -563 85 531 41 -366 -141 165
4446A65Q1m36l1R4K78oj45q5N4K60l04o8j29P9K54r5k31L61L71o48j5L02O8l1
$$ 165 246 -190 -221 -127 151 145 0 -85 -31 229 -75 -143 -272 -193 61 -34 -265 96 467 -181 -196 106 174 143
4470A43j95k26L43j97M68n25KM47J12m82j80L10J70J13l94N2J63Mj49N4l7L10
$$ 143 -52 -278 65 -132 336 -189 -187 260 372 -110 -290 20 190 303 -91 -39 124 128 -21 33 -4 306
4492C06m61k59N99N1l54L8n1L24n0k86m3QK65k04K4J70J2O8j64m1l0K41k16K8
$$ 306 -155 -414 185 236 -118 -80 -131 193 143 -143 -186 -178 87 -117 -93 77 89 157 -7 -48 -78 163 -53 -25
4516b5j4K29l0k14j05K08R8r9m90J63L34k52N3J6J23J11O0j49m8J67l46Q9j8N02
$$ -25 -39 190 160 -54 -159 49 147 48 -442 -279 55 -197 -144 -128 -5 106 166 17 -31 136 -210 -121 -139 363
4540C63q3j13j68j20J83K95o64kO05j75p5j8o7Q2J55k66p6L20O4m82M17q5K40
$$ 363 280 167 -1 -121 62 357 -307 -309 296 121 46 28 -39 43 198 -68 -144 176 240 -242 175 90 330
4563C30k91m46P4M68j82J31m28L39J00k0l52O2K9K40j60j39K7K91p7J68j22J53
$$ 330 39 -407 -333 135 -47 84 -344 -5 95 75 -277 -215 -186 54 -106 -245 -218 73 -4 164 42 195
4585A95K49n93K33k9L79n40J69k45M50j71k41m48O60j92J39l36J76M79l43Q6j04
$$ 195 444 -149 84 55 434 -106 63 -182 268 97 -144 -592 68 -124 15 -321 -145 334 -9 77 -27
4606b7J67Kk08l86R7M38j35j13J33K24J62l66K7j61J63n0Nk18K20K24j67r1l27
$$ -27 140 142 -66 -452 -355 83 -52 -165 -32 192 354 -12 15 -146 17 -33 -28 -246 -26 198 31 -60 -387
4629c87N84k84k72J82M90r8l71j51R0L32j7j58m15O74l65J64l03K47L34o6l91
$$ -387 197 -87 -359 -177 313 215 -156 -307 -217 115 98 -60 -475 199 -166 -2 -305 -58 276 210 -181
4650a81O7L57j98p9j63J5J49r3n6j1K88J57n77K96j10L83j33k96P2L39j8l85K22
$$ -181 -114 243 45 -34 -197 -182 -33 -126 -182 -193 95 252 -325 -29 -139 244 111 -185 -113 226 208 -177 45
4673D5qJ00P8m85J95K9L6j14L17k21O59q22l5N8K54L5l84J72J63M6m3m65K24O40
$$ 45 37 137 215 -270 -75 -46 -10 -124 193 -28 631 -191 -226 -168 86 121 -263 -91 72 118 75 -390 -166 474
4697D74m90j55k16L21K58k64j79O32r4k01k86K65J92j16m98K28j58J48J18k82
$$ 474 -16 -171 -387 -66 192 -72 -251 381 287 86 -200 65 257 141 -357 -129 -287 -139 -21 -303
4717c03K46J73j35k56K37J62k56Q6O9j72J70j7j63p2K56j47l3O9J67J63l02L1
$$ -303 -57 116 -19 -275 -38 124 -132 -46 23 -149 21 4 -159 -231 25 -122 -155 -86 81 244 -58 -27
4739b7k06K55P8k47K2J00K45L5k41o7p3K12j51Q4J77J02j53j98q7K07k07J53k34
$$ -27 -233 22 100 -147 -125 -25 220 255 14 -53 -126 86 -65 19 196 298 145 -53 -140 67 -140 13 -221
4762b21J68J81jl64LL0L87k58j02K25M8M1m12J35J33K68o19L15L84j79k13j40
$$ -221 -53 128 127 -237 -234 -204 183 -75 -177 48 96 137 -275 -140 -7 261 -358 -43 341 162 -51 -191
4784a91j31M82p3j03k15O3M56n66k76O77l7P6l87j37M21J20j08j94J32R6j17Q9
$$ -191 -322 160 87 -16 -231 -168 288 -278 -554 123 86 162 -225 -362 59 179 71 -123 9 105 -12 77
4806G7M0J32j3k84k30J14J67K08m44K27M04k39j78j26K36l86O32k75k16K0K03
$$ 77 117 249 236 -48 -278 -164 3 211 -233 -6 398 159 -19 -145 91 -295 337 62 -154 -134 69
4827F9k55M0K6L92j48j8j10J81j01j34j75J28L54k06m61N57q0K23k92j70K46n3
$$ 69 -186 -146 -120 272 124 106 -4 177 76 -58 -233 -105 249 43 -418 139 59 282 -10 -180 66 13
4849A3o1k73J28N18m06K84m49J82M12l31k34O9K60K15m66k6J24K24k08k47m9O86
$$ 13 -48 -321 -193 325 -81 203 -246 -64 348 17 -217 -148 112 327 -139 -165 -41 183 -25 -272 -321 365
4871C65k82O5m98K93j48J39j60J09M51l71Q3j59O2Q1r8m7n4L44j9m12L32P1m0
$$ 365 83 148 -350 -57 -205 -66 -226 -117 334 -37 46 -113 -51 30 -68 -115 -169 175 156 -256 76 147 107
4894A07k2k89L88p0m87K31P8J45K39m45J38j37K89k10j08j26J62J90l54J24Q8
$$ 107 85 -204 184 114 -373 -142 -64 81 320 -125 13 -124 165 -45 -153 -279 -117 73 -281 -157 -69
4915f9J29K74k65k02N00l84L21m10J81Q8kk67o5J46J42l65J83m0K05p8k4j33L57
$$ -69 60 334 69 -133 367 -17 304 -106 75 163 161 -106 -171 -25 117 -248 -65 -105 100 22 -2 -135 222
4938B22J63l94j16m4J36l2p0L07jl2k17r5rL45K7j12k16L20k94J29K3J72k88j53
$$ 222 385 -9 -125 -169 -33 -65 -135 172 171 139 -78 -173 -182 163 190 78 -138 182 -112 17 40 212 -76 -229
4962b29Q5L89O6j45l11K95l3J86k29m18K30J62j70jM1L56k33k55J29J28K64n54
$$ -229 -144 245 311 166 -145 150 117 303 74 -344 -114 48 -122 -123 -82 274 41 -214 -85 43 307 -247
4984b47L40n0J07K35n76j4M05j40%j95LL10j20l02K91q7K36r5k20q2L35o4k78
$$ -247 93 43 150 385 -191 -205 200 60 60 -135 -132 178 58 -244 47 -40 196 101 -119 -201 134 70 -208
5007b08J99L2K69k92k15J67K40k75J45j3J03P5k15j92J8L62K72p49J26oJ79k4
$$ -208 -9 23 292 0 -215 -48 192 -83 62 49 152 227 12 -180 -162 200 472 -277 -151 -157 22 -2
5029bn7j34M64rn05K35K10k68j03J55m4R1J35n28K47K03L5j26p3j69J80J03R1
$$ -2 -59 -193 271 262 -243 -8 202 -66 -169 -14 -58 33 168 -360 -113 90 125 -1 -74 -243 -63 40 131
5052A31r6j05K10j48L4%J09J45o01L01K09j47j22r4M30j89j59Q1j4J85l98J32
$$ 131 35 -70 140 -8 26 26 135 280 -321 -20 189 42 -80 -174 256 67 -92 -11 -25 160 -238 -106
5074a06j79K22L6q5m3K37PJ02m53J71J86m5n2j66pJ76J38l88Q4J01J84m15J89
$$ -106 -285 -63 -27 -112 -155 82 89 191 -262 -91 95 50 -2 -168 -175 1 139 -249 -165 -64 120 -295 -106
5097a06J46K15l97K81l85K81J37m9l01K1L00k08J11l07L30j6p9j74J67M91m18
$$ -106 40 255 -142 139 -246 35 172 123 -178 -157 143 -65 46 -261 69 53 -26 -200 -33 458 40
5118D0k41Q6r6L21l26L11k38J85l68K46K6L84m54K65m3j18K42k35M4q2K21J54
$$ 40 -201 -115 -211 110 -216 95 -143 42 -326 -80 -54 330 -124 141 98 -20 222 -13 31 -51 170 324
5140C24m61kK66J02j03n42P6N05j49k19j43J62L82k73KJ85m1r8k01pK66k11K55
$$ 324 -137 -139 127 229 126 -416 -340 165 16 -203 -346 -184 198 -75 -73 112 71 -27 -228 -235 31 -180 75
5163G5j09L74j30P3n70J46M73J10m76k69O29k81J05l39K42n5K75k43r6K45r9m
$$ 75 -34 340 210 283 -287 -141 332 442 -34 -303 326 45 150 -189 53 -2 273 30 -66 179 80 76
5185G6j79P5K05j02k18K38j04J53J54n58L62k65M76n48OL35n7K61n11J66L11j01
$$ 76 -103 -28 177 75 -143 95 -9 144 298 -260 102 -163 313 -235 -229 106 49 310 -201 -35 276 175
5207A75m14K69J31o8R3l96j31O65l96L3J08N5K00m11j38J51L60K5l62K99m08L15
$$ 175 -239 30 161 93 186 -210 -341 324 -72 -39 69 124 324 -87 -225 -74 286 311 -51 248 -160 155
5229A55K1j22K08k60K6J01j35K0L52l12m09K61k7K70j53N1j35K14k01j32J34L2
$$ 155 176 54 262 2 28 129 -6 14 366 54 -355 -94 -121 149 -4 47 -88 126 -75 -207 -73 -41
$$ [...]
8191B05
##END NTUPLES=NMR FID
##END=
