##TITLE=1H_CA-8665
 DMSO, 8 sc, 
 13.11.2019
##JCAMPDX= 6.0         $$ Bruker NMR JCAMP-DX V2.0
##DATA TYPE= NMR FID
##DATA CLASS= NTUPLES
##ORIGIN= UXNMR, Bruker Analytische Messtechnik GmbH
##OWNER= root
$$ XWIN-NMR		Version 3.5
$$ Wed Nov 13 15:45:25 2019 Russian Standard Time (UT+4h)  she@DPX200
##.OBSERVE FREQUENCY= 200.1315
##.OBSERVE NUCLEUS= ^1H
##.DELAY= (6, 6)
##.ACQUISITION MODE= SIMULTANEOUS
##.ACQUISITION SCHEME= undefined
##.AVERAGES= 8
##.DIGITISER RES= 18
##SPECTROMETER/DATA SYSTEM= spect
##.PULSE SEQUENCE= zg30
##.SOLVENT NAME= DMSO
##.SHIFT REFERENCE= (INTERNAL, DMSO, 0, 15.7039)
##AUDIT TRAIL= $$ (NUMBER, WHEN, WHO, WHERE, WHAT)
$$ ##TITLE= Audit trail, XWIN-NMR		Version 3.5
$$ ##JCAMPDX= 5.01
$$ ##ORIGIN= Bruker BioSpin GmbH
$$ ##OWNER= she
$$ F:/spectra/data/she/nmr/H-F/1/audita.txt
$$ ##AUDIT TRAIL=  $$ (NUMBER, WHEN, WHO, WHERE, WHAT)
(   1,<2019-11-13 15:44:04.87 +0400>,<she>,<DPX200>,
      <created by zg, POWCHK disabled, PULCHK disabled
       configuration hash MD5:
       00 E9 B6 7A A2 85 ED C7 34 08 36 98 17 FE 4E 26
       data hash MD5: 16K
       18 BC 72 7A 75 A7 21 AA FA 98 D3 0C 3E A6 F9 05>)
$$ ##END=
$$ 
$$ hash MD5
$$ 14 0A 99 AC BC EE 38 F9 F4 4D C3 4E CE 70 92 56
##$RELAX= 
##$RELAX= 
##$RELAX= 
##$RELAX= 
##$RELAX= 
##$RELAX= 
$$ Bruker specific parameters
$$ --------------------------
##$DU= <F:/spectra>
##$EXPNO= 1
##$NAME= <H-F>
##$PROCNO= 1
##$TYPE= <nmr>
##$USER= <she>
##$AMP= (0..31)
100 100 100 100 100 100 100 100 100 100 100 100 100 100 100 100 100 100 
100 100 100 100 100 100 100 100 100 100 100 100 100 100 
##$AQSEQ= 0
##$AQ_mod= 1
##$AUNM= <au_zg>
##$AUTOPOS= <>
##$BF1= 200.13
##$BF2= 200.13
##$BF3= 200.13
##$BF4= 200.13
##$BF5= 200.13
##$BF6= 200.13
##$BF7= 200.13
##$BF8= 200.13
##$BYTORDA= 1
##$CFDGTYP= 0
##$CFRGTYP= 5
##$CHEMSTR= <none>
##$CNST= (0..31)
1 1 145 1 1 1 1 1 1 1 1 1 1 1 1 1 1 1 1 1 1 1 1 1 1 1 1 1 1 1 1 1 
##$CPDPRG= <>
##$CPDPRG1= <>
##$CPDPRG2= <>
##$CPDPRG3= <>
##$CPDPRG4= <mlev>
##$CPDPRG5= <mlev>
##$CPDPRG6= <mlev>
##$CPDPRG7= <mlev>
##$CPDPRG8= <mlev>
##$CPDPRGB= <>
##$CPDPRGT= <>
##$D= (0..31)
0 1.2 0 0 0 0 0 0 0 0.06 0 0.03 0 0 0 0 0.0002 0 0 0 0 0 0 0 0 0 0 0 0 
0 0 0 
##$DATE= 1573645444
##$DBL= (0..7)
120 120 120 120 120 120 120 120 
##$DBP= (0..7)
150 150 150 150 150 150 150 150 
##$DBP07= 0
##$DBPNAM0= <>
##$DBPNAM1= <>
##$DBPNAM2= <>
##$DBPNAM3= <>
##$DBPNAM4= <>
##$DBPNAM5= <>
##$DBPNAM6= <>
##$DBPNAM7= <>
##$DBPOAL= (0..7)
0.5 0.5 0.5 0.5 0.5 0.5 0.5 0.5 
##$DBPOFFS= (0..7)
0 0 0 0 0 0 0 0 
##$DE= 6
##$DECBNUC= <off>
##$DECIM= 24
##$DECNUC= <off>
##$DECSTAT= 4
##$DIGMOD= 1
##$DIGTYP= 9
##$DL= (0..7)
0 120 120 120 120 120 120 120 
##$DP= (0..7)
150 150 150 150 150 150 150 150 
##$DP07= 0
##$DPNAME0= <>
##$DPNAME1= <>
##$DPNAME2= <>
##$DPNAME3= <>
##$DPNAME4= <>
##$DPNAME5= <>
##$DPNAME6= <>
##$DPNAME7= <>
##$DPOAL= (0..7)
0.5 0.5 0.5 0.5 0.5 0.5 0.5 0.5 
##$DPOFFS= (0..7)
0 0 0 0 0 0 0 0 
##$DQDMODE= 0
##$DR= 18
##$DS= 0
##$DSLIST= <SSSSSSSSSSSSSSS>
$$ [...]
##$SUBNAM2= <"">
##$SUBNAM3= <"">
##$SUBNAM4= <"">
##$SUBNAM5= <"">
##$SUBNAM6= <"">
##$SUBNAM7= <"">
##$SUBNAM8= <"">
##$SUBNAM9= <"">
##$SW= 24.0689530833862
##$SWIBOX= (0..15)
0 0 2 0 0 0 0 0 0 0 0 0 0 0 0 0 
##$SW_h= 4816.95568400771
##$TD= 16384
##$TD0= 1
##$TE= 0
##$TE2= 300
##$TE3= 300
##$TEG= 300
##$TL= (0..7)
0 120 120 120 120 120 120 120 
##$TP= (0..7)
150 150 150 150 150 150 150 150 
##$TP07= 0
##$TPNAME0= <>
##$TPNAME1= <>
##$TPNAME2= <>
##$TPNAME3= <>
##$TPNAME4= <>
##$TPNAME5= <>
##$TPNAME6= <>
##$TPNAME7= <>
##$TPOAL= (0..7)
0.5 0.5 0.5 0.5 0.5 0.5 0.5 0.5 
##$TPOFFS= (0..7)
0 0 0 0 0 0 0 0 
##$TUNHIN= 0
##$TUNHOUT= 0
##$TUNXOUT= 0
##$USERA1= <user>
##$USERA2= <user>
##$USERA3= <user>
##$USERA4= <user>
##$USERA5= <user>
##$V9= 5
##$VALIST= <valist>
##$VCLIST= <CCCCCCCCCCCCCCC>
##$VD= 0
##$VDLIST= <DDDDDDDDDDDDDDD>
##$VPLIST= <PPPPPPPPPPPPPPP>
##$VTLIST= <TTTTTTTTTTTTTTT>
##$WBST= 1024
##$WBSW= 4
##$XGAIN= (0..3)
0 0 0 0 
##$XL= 0
##$YL= 0
##$YMAX_a= 518032
##$YMIN_a= -164894
##$ZGOPTNS= <>
##$ZL1= 120
##$ZL2= 120
##$ZL3= 120
##$ZL4= 120
##$ABSF1= 10
##$ABSF2= 0
##$ABSG= 5
##$ABSL= 3
##$ALPHA= 0
##$AQORDER= 0
##$ASSFAC= 0
##$ASSFACI= 0
##$ASSFACX= 0
##$ASSWID= 0
##$AUNMP= <proc_1d>
##$AZFE= 0.1
##$AZFW= 0.1
##$BCFW= 1
##$BC_mod= 2
##$BYTORDP= 1
##$COROFFS= 0
##$CY= 11.3945322036743
##$DATMOD= 1
##$DC= 2
##$DFILT= <>
##$DTYPP= 0
##$F1P= 16.9975609425685
##$F2P= -3.02152046262296
##$FCOR= 0.5
##$FTSIZE= 0
##$FT_mod= 4
##$GAMMA= 1
##$GB= 0.15
##$INTBC= 1
##$INTSCL= 1
##$ISEN= 128
##$LB= 0.24
##$LEV0= 0
##$LPBIN= 0
##$MAXI= 10000
##$MC2= 0
##$MEAN= 0
##$ME_mod= 0
##$MI= 1.114404
##$NCOEF= 0
##$NC_proc= 0
##$NLEV= 6
##$NOISF1= 3.799351
##$NOISF2= 2.8
##$NSP= 1
##$NTH_PI= 0
##$NZP= 0
##$OFFSET= 15.70392
##$PC= 1
##$PHC0= -9456.732
##$PHC1= 15.20088
##$PH_mod= 1
##$PKNL= yes
##$PPARMOD= 0
##$PSCAL= 0
##$PSIGN= 0
##$REVERSE= no
##$SF= 200.130013532006
##$SI= 16384
##$SIGF1= 3
##$SIGF2= 2
##$SINO= 400
##$SIOLD= 16384
##$SREGLST= <1H.CDCl3>
##$SSB= 0
##$STSI= 0
##$STSR= 0
##$SW_p= 3612.71676300578
##$SYMM= 0
##$S_DEV= 0
##$TDeff= 0
##$TDoff= 0
##$TI= <>
##$TILT= no
##$TM1= 0
##$TM2= 0
##$TOPLEV= 0
##$USERP1= <user>
##$USERP2= <user>
##$USERP3= <user>
##$USERP4= <user>
##$USERP5= <user>
##$WDW= 1
##$XDIM= 8192
##$YMAX_p= 0
##$YMIN_p= 0
$$ End of Bruker specific parameters
$$ ---------------------------------
##NTUPLES= NMR FID
##VAR_NAME=  TIME,          FID/REAL,        FID/IMAG
##SYMBOL=    X,             R,               I
##VAR_TYPE=  INDEPENDENT,   DEPENDENT,       DEPENDENT
##VAR_FORM=  AFFN,          ASDF,            ASDF
##VAR_DIM=   8192,          8192,            8192
##UNITS=     SECONDS,       ARBITRARY UNITS, ARBITRARY UNITS
##FACTOR=    0.0002076,     1,               1
##FIRST=     0,             0,               0
##LAST=      1.7004516,     0,               0
##MIN=       0,             -164894,         0
##MAX=       1.7004516,     518032,          0
$$ Real data points
##PAGE= N=1
##DATA TABLE= (X++(R..R)), XYDATA
$$ [...]
$$ plain form
2349 999 -525 -314 1011 704 -1592 -1158 1158 1048 -432 -609 332 305 -239 93 125 -519 -792 130 352
2368 352 -1002 -768 790 165 -1370 -743 750 329 -1015 -618 -322 -345 -317 172 -591 -951 -580 481 49
2387 49 -1039 -792 809 460 -1076 -113 622 -39 -288 224 21 -198 169 519 -318 -655 202 944 372
2406 372 -363 -481 523 792 -111 -206 197 1 361 662 -102 -271 794 855 36 -396 666 832 624 -123
2426 -123 134 284 497 371 -54 -88 162 452 902 157 -483 132 977 186 -490 -34 169 361 -11 -125
2446 -125 -47 490 323 -140 -371 -497 102 455 -136 -633 -307 320 0 -245 -309 -182 213 12 -641 -844 -107
2467 -107 318 -197 -346 -475 -31 286 32 -719 -743 265 426 -253 49 -176 -175 385 405 -462 -364 522 383
2488 383 -112 -72 41 367 393 52 -325 134 658 258 166 -485 135 820 524 -493 -477 355 820 17 -156
$$ packed form
2349I99j524K11J325l07k296M34K316j10j480j77R41k7n44L32L2o44k73R22K22
2368C52j354K34J558o25j535O27J493m21j344L97K96k3K8M89p63l60L71J061m32
2387D9j088K47J601l49j536R63P35o61k49N12k03k19L67L50q37l37Q57P42n72
2406C72p35j18J004K69r03r5M03j96L60L01p64j69J065O1q19m32J062J66k08p47
2426a23K57J50K13j26m25l4K50K90M50p45o40O15Q45p91o76M56K03J92l72j14
2446a25P8N37j67m63k31j26N99L53n91m97L26O27l20k45o4J27L95k01o53k03P37
2467a07M25n15j49j29M44L17k54p51k4J008J61o79L02k25JN60K0q67R8Q86j39
2488C83m95M0J13L26K6l41l77M59N24m00r2o51O20O85k96j017J6Q32M65q03j73
$$ plain form
2509 -156 169 297 549 295 -204 -193 520 418 -222 -604 117 733 551 -199 -286 198 548 0 -151 -574 -477
2530 -477 412 641 -464 -531 73 474 -211 -541 -73 261 76 -455 -414 -159 -42 21 -30 -628 -804 374 767
2551 767 -860 -1094 71 345 -532 -629 -177 -620 -350 61 -138 -709 -665 154 308 -887 -999 291 20
2570 20 -1174 -1347 216 263 -1063 -483 -228 -1147 -380 644 177 -1526 -980 636 319 -840 -419 303
2588 303 129 -927 -431 719 -246 -394 570 503 -788 88 1851 500 -1316 66 1786 633 -825
2605 -825 313 657 631 271 1403 723 -732 -15 1392 1089 -425 510 2159 -1 -944 1046 1840 26
2623 26 -738 729 562 105 952 1459 -39 -1426 609 2419 467 -1226 157 1337 184 -328 1516
2640 1516 880 -1605 -526 1464 391 -599 732 890 -1386 -1246 1660 2180 -1197 -1828 451 1298 -601
$$ packed form
2509a56L25J28K52k54m99J1P13j02o40l82P21O16j82p50q7M84L50n48j51m23R7
2530d77Q89K29j105o7O04M01o85l30M68L34j85n31M1K55J17O3n1n98j76J178L93
2551G67j627k34J165K74q77r7M52m43K70M11j99n71M4Q19J54j195j12J290k71
2570B0j194j73J563M7j326N80K55r19P67J024m67j703N46J616l17j159M21P22
2588C03j74j056M96J150r65j48R64o7j291Q76J763j351j816J382J720j153j458
2605h25J138L44k6l60J132o80j455P17J407l03j514R35J649k160r43J990P94j814
2623B6p64J467j67m57Q47N07j498j387K035J810j952j693J383J180j153n12J844
2640A516o36k485J079J990j073r90J331J58k276J40K906N20l377o31K279Q47j899
$$ plain form
2657 -601 -187 841 -982 -2166 1015 2339 -1053 -2060 396 868 -1268 -536 1670 -29 -2845 -767
2673 -767 1545 356 -1505 200 281 -1986 -1126 2076 1474 -2860 -2626 1570 1146 -1446 -486 857 -1685
2690 -1685 -2217 1350 1831 -1737 -2209 585 628 -1759 -48 2194 -409 -3293 -692 2609 479 -1770
2706 -1770 -426 207 -1657 -531 2961 980 -3573 -1394 2530 1151 -1439 329 942 -1410 -2058 2052
2722 2052 2396 -1015 -2292 697 914 -887 717 2622 -1017 -3439 704 4129 247 -2292 193
2737 193 796 -1172 539 2811 264 -2947 -600 2925 1123 -1441 320 1612 -1922 -1668 2802 2808
2753 2808 -2136 -2082 1547 1106 -645 1322 1739 -2275 -3176 2191 3458 -1102 -2371 334 1123 -699
2769 -699 323 3031 -381 -3441 -433 3451 705 -1391 609 614 -2294 -996 3851 2010 -3258 -2284
$$ packed form
2657f01M14J028j823j184L181J324l392j007K456M72k136P32K206j699k816K078
2673g67K312j189j861J705Q1k267Q60L202o02m334K34M196m24k592R60J343k542
2690a685n32L567M81l568m72K794M3k387J711K242k603k884K601L301k130k249
2706a770J344O33j864J126L492j981m553K179L924j379k590J768O13k352o48M110
2722B052L44l411j277K989K17j801J604J905l639k422M143L425l882k539K485
2737A93O03j968J711K272k547l211K347L525j802k564J761J292l534K54M470O
2753B808m944N4L629m41j751J967M17m014r01N367J267m560j269K705P89j822
2769f99J022K708l412l060L008L884k746k096K000Nk908J298M847j841n268R74
$$ plain form
2785 -2284 1555 1399 -780 788 947 -2117 -2108 2734 3426 -1723 -2781 839 988 -1586 539 2874 -702
2802 -702 -3680 273 3222 248 -1765 261 66 -2274 55 3507 521 -4038 -1868 2301 1472 -1323
2818 -1323 281 671 -2274 -1689 3015 2611 -2363 -2019 1253 547 -1227 1144 2233 -1673 -3279 1288
2834 1288 3495 161 -1834 156 459 -1173 933 3453 -116 -3911 -460 3545 804 -1546 758
2849 758 730 -2275 -634 3322 1934 -2166 -1604 1096 761 -987 1209 1488 -2338 -2905 1838 3330 -1096
2866 -1096 -2430 437 639 -1191 958 2349 -1187 -3541 177 2990 32 -1655 553 432 -1881
2881 -1881 -345 2849 1249 -2623 -1427 1559 716 -963 964 734 -2437 -1986 2583 2305 -1919 -2097
2897 -2097 985 600 -798 521 1616 -1131 -2591 919 2108 -381 -1364 382 105 -1901 86 2851
$$ packed form
2785b284L839j56k179J568J59l064RM842O92n149j058L620J49k574K125K335l576
2802g02k978L953K949k974k013K026j95k340K329L452k986m559K170M169q29k795
2818a323J604L90k945N85M704m04m974L44L272p06j774K371J089l906j606M567
2834A288K207l334j995J990L03j632K106K520l569l795L451M005k741k350K304
2849G58k8l005J641L956j388m100N62K700l35j748K196K79l826n67M743J492m426
2866a096j334K867K02j830K149J391l536k354L718K813k958j687K208j21k313
2881a881J536L194j600l872J196K986q43j679J927k30l171M51M569k78m224j78
2897b097L082l85j398J319J095k747j460L510J189k489r83J746k77k006J987K765
$$ plain form
2913 2851 362 -3311 -1100 2033 324 -1096 472 -49 -2338 -753 2274 996 -2266 -1572 1269
2928 1269 419 -1394 359 1065 -1514 -2223 709 1818 -666 -1257 433 -233 -1173 797 2171 -850
2944 -850 -2480 -210 1961 479 -788 328 431 -1278 -179 1810 735 -1533 -639 1466 433 -667
2960 -667 1286 1377 -1199 -1221 1509 1669 -277 -772 459 162 -582 946 1417 -634 -1742 281 1904
2977 1904 113 -871 518 179 -802 -50 1348 247 -1283 -269 943 -142 -581 967 254 -1219
2993 -1219 -651 1165 1147 -786 -995 326 430 -411 239 791 -586 -1149 594 1071 -515 -875 594 113
3011 113 -974 -91 1029 106 -1109 -174 582 20 -443 391 353 -762 -563 928 660 -820 -228 574
3029 574 128 -316 95 307 -332 -463 359 522 -268 -86 390 -88 -675 -263 802 -96 -883 -18 731 92
$$ packed form
2913B851k489l673K211L133j709j420J568n21k289J585L027j278l262O94K841
2928A269q50j813J753P06k579p09K932J109k484n91J690o66r40J970J374l021
2944h50j630K270K171j482j267J116J03j709J099J989j075k268Q94K105j033j100
2960f67J953R1k576k2K730J60j946m95J231k97p44J528M71k051j108K023J623
2977A904j791r84J389l39r81P52J398j101j530J014J212j085m39J548p13j473
2993a219N68J816j8j933k09J321J04q41O50N52j377n63J743M77j586l60J469m81
3011A13j087Q83J120r23j215R35P56n62m63Q34l8j115J99J491k68j480N92Q02
3029E74m46m44M11K12o39j31Q22J63p90J82M76m78n87M12J065q98p87Q65P49o39
$$ plain form
3049 92 -493 168 232 -552 44 411 -225 -781 281 591 16 -46 -66 317 -344 -352 80 178 -389 -176 63 48
3071 48 -597 518 588 -108 -529 277 352 -313 -110 -21 -90 -138 175 295 181 -385 -69 397 -158 -353 309 368
3093 368 -235 -202 571 92 -315 -83 347 -117 4 306 -247 -275 -2 225 75 117 -55 -92 349 -246 -217 -2
3115 -2 -36 -34 -335 -38 -200 -177 80 -79 73 -247 -252 61 64 -430 -38 -52 -70 -356 -101 135 -408 46 -95 -409
3139 -409 -128 466 16 -135 19 126 -17 -11 -186 -76 -91 210 -202 -12 -113 192 275 99 -90 26 357
3160 357 -34 -47 -2 51 -103 204 234 -281 -112 374 -42 15 -114 -180 -174 277 43 -20 77 42 -3 -48 -191 9
3184 9 57 184 26 -356 438 -8 97 -68 -57 212 266 -33 252 345 384 72 172 168 196 260 386 -109 -42 576
3208 576 330 52 309 388 132 129 252 10 -71 313 276 114 151 81 305 293 25 163 381 257 -91 272 477
$$ packed form
3049I2n85O61O4p84N96L67o36n56J062L10n75o2k0L83o61qM32R8n67K13K39j5
3071D8o45J115P0o96m21Q06P5o65K03Q9o9m8L13J20j14n66L16M66n55j95O62N9
3093C68o03L3P73m79m07K32M30m64J21L02n53k8K73K27j50M2j72l7M41n95K9K15
3115bl4Kl01K97j62K3K57j59J52l20nL13Lm94L92j4j8k86K55K36n43M54j41l14
3139d09K81N94m50j51J54J07j43Oj75J10j5L01m12J90j01L05Q3j76j89J16L31
3160C57l91j3M5N3j54L07L0n15J69M86m16N7j29o6OM51k34o3R7l5m5m5j43K00
3184IM8J27j58l82P94m46J05j65J1K69N4k99K85R3L9l12J00mK8O4J26m95O7O18
3208E76k46k78K57P9k56lJ23k42q1L84l7j62L7p0K24j2k68J38K18j24l48L63K05
$$ plain form
3231 477 3 -265 201 244 -115 -54 416 262 -468 205 380 48 -300 -268 215 -243 -347 98 95 -267 -180 382
3253 382 127 -449 -207 355 -344 -306 -35 88 -674 -650 31 -65 -389 -357 -248 -198 -573 -251 356 -336 -1033 -378
3275 -378 208 -811 -589 133 -779 -1136 -407 344 -224 -926 -320 -44 -226 -335 62 224 -923 -536 105
3294 105 387 -514 -189 293 -499 -418 345 836 -463 -504 563 535 -266 -19 343 -102 -437 278 1127 389
3314 389 -540 119 1095 46 -277 913 508 -818 -341 1301 870 -575 -70 733 -168 -367 1041 988
3332 988 -620 -917 683 959 -466 -135 673 -73 -1118 714 1454 48 -1032 528 725 -239 229
3349 229 1088 338 -886 92 1422 807 -725 -117 719 -129 -343 1297 841 -951 -892 918 600 -170
3367 -170 195 856 -847 -1041 873 1623 -534 -1528 139 678 -411 -260 805 -557 -1873 -332 1479
$$ packed form
3231D77m74k68M66M3l59O1M70j54p30O73J75l32l48L2M83m58j04M45ll62Q7N62
3253C82k55n76K42N62o99L8K71J23p62K4O81r6l24L2J09N0l75L22O07o92o97O55
3275c78N86j019K22P22r12l57P29P51n68p02O06K76j82j09L97J62j147L87O41
3294A05K82r01L25M82p92Q1P63M91j299m1J067k8q01K47L62m45l35P15Q49p38
3314C89r29O59R76j049l23J190m05j326M77J642m31j445N05Q03r01j99J408n3
3332I88j608k97J600K76j425L31Q08p46j045J832P40j406j080J560J97r64M68
3349B29Q59p50j224R78J330o15j532O08Q36q48k14J640m56j792N9J810l18p70
3367a70L65O61j703j94J914P50k157r94J667N39j089J51J065j362j316J541J811
$$ plain form
3384 1479 32 -1765 -257 152 -851 -662 974 197 -2198 -964 912 170 -1096 -421 -37 -1143
3400 -1143 -1239 910 1072 -1610 -1869 571 567 -439 15 706 -772 -1656 616 1970 -39 -1532 131
3417 131 1015 -851 283 1593 -198 -1801 -300 1707 1099 -658 144 450 -804 -566 2035 1400 -1593
3434 -1593 -1336 1070 1212 -585 357 1045 -811 -1281 1017 1717 -756 -1575 144 488 -459 208 1380
3451 1380 -471 -2326 -203 1989 340 -1089 -297 291 -1015 -2 2005 1008 -1849 -1030 1306 1153
3467 1153 -945 141 769 -1249 -1012 1520 2077 -1086 -1432 747 494 -718 463 1448 -638 -2061
3483 -2061 676 2229 -48 -1286 226 411 -651 -17 1742 343 -2052 -783 1360 762 -973 235
3499 235 454 -1146 -990 1860 1295 -1804 -1701 713 567 -778 467 802 -1165 -1776 770 1922 -613
$$ packed form
3384A479j447j797J508M09j003J89J636p77k395J234J876p42j266O75L84j106
3400a143r6K149J62k682k59K440mj006M54O91j478q84K272J354k009j493J663
3417A31Q84j866J134J310j791j603J501K007o08j757Q02L06j254K38K601o35k993
3434a593K57K406J42j797R42O88j856m70K298P00k473q19J719L44r47O67J172
3451A380j851j855K123K192j649j429P92N88j306J013K007r97k857Q19K336j53
3467A153k098J086O28k018K37K532N57l163l46K179k53j212J181R85k086j423
3483b061K737J553k277j238J512J85j062O34J759j399k395J269K143n98j735J208
3499B35K19j600J56K850n65l099J03K414j46j345J245L35j967o11K546J152k535
$$ plain form
3516 -613 -1756 -287 625 -648 94 1639 -284 -2476 -229 1821 252 -1161 -27 149 -1182 -323
3532 -323 1878 574 -2041 -1171 1268 780 -737 346 470 -1192 -1386 1493 1738 -780 -1704 648 762
3549 762 -871 453 1242 -710 -1898 267 1901 -76 -1324 79 160 -725 51 1680 570 -1770
3565 -1770 -918 1386 658 -913 281 375 -921 -760 1478 1178 -1295 -1023 661 417 -413 180 1042 -1047
3583 -1047 -1241 715 1262 62 -1285 135 363 -579 56 1333 -194 -1713 -14 1487 280 -753
3599 -753 516 488 -880 -426 1497 696 -1205 -843 856 624 -480 163 799 -809 -1109 989 1303 -557
3617 -557 -1039 625 514 -580 266 1109 -200 -1714 80 981 136 -632 201 242 -658 -329 1147 195
3635 195 -1256 -506 929 -8 -604 284 361 -1115 -701 744 816 -1022 -757 296 -22 -377 -148 392 -710
$$ packed form
3516f13j143J469R12j273P42J545j923k192K247K050j569j413J134J76j331Q59
3532c23K201j304k615Q70K439m88j517J083J24j662j94K879K45k518r24K352J14
3549G62j633J324P89j952j188K165J634j977j248J403Q1q85P76J629j110k340
3565a770Q52K304p28j571J194R4j296J61K238l00k473K72J684k44q30N93Q62k089
3583a047j94J956N47j200j347J420K28r42O35J277j527j519J699J501j207j033
3599g53J269k8j368M54J923q01j901L62J699k32j104O43O36j608l00K098L14j860
3617e57m82J664j11j094Q46Q43j309j514J794R01q45p68Q33M1r00L29J476r52
3635A95j451P50J435r37n96Q88P7j476M14J445P2j838K65J053l18l55K29N40j102
$$ plain form
3654 -710 -1266 143 748 -241 -895 -132 248 -837 -53 382 -110 -812 -320 790 -18 -385 194 251 -668
3673 -668 -439 609 811 -358 -293 645 244 -517 237 766 -299 -447 646 793 -186 -56 550 115 -78
3692 -78 647 838 76 -661 290 890 244 -206 290 391 -490 -72 567 428 -548 -140 451 185 7 233
3712 233 143 -259 -565 723 232 -307 -474 210 358 -115 51 361 -101 -774 333 182 -85 -251 263 29
3732 29 -550 -59 722 -144 -642 -159 -31 43 -78 -189 -67 -319 -654 -124 74 -153 -326 366 -63 -167 -266
3753 -266 -251 -241 -220 58 99 -309 -218 -403 -277 -377 -325 173 -148 -503 4 -87 -239 -551 -78 -123 -465 -602 203
3776 203 121 -133 -265 46 37 48 -323 -201 -279 -65 46 392 -215 273 241 213 -98 -46 446 311 -362 67 352
3799 352 175 100 33 274 377 209 178 94 148 248 565 428 -15 310 497 259 164 492 553 91 69 371 264
$$ packed form
3654g10n56J409O05r89o54P63L80j085P84M35m92p02M92J110q08l67N79N7r19
3673f68K29J048K02j169O5R38m01p61P54N29j065j48J093J47r79J30O06m35j93
3692g8P25J91p62p37R51O00o46m50M96J01q81M18O39j39r76M08N91k66j78K26
3712B33r0m02l06J288m91n39j67O84J48m73J66L10m62o73J107j51k67j66N14k34
3732B9n79M91P81q66m98M83J28P4j21j11J22k52l35N30J98k27j73O92m29j04r9
3753b66J5J0K1K78M1m08R1j85J26j00N2M98l21l55N07r1j52l12M73m5l42j37Q05
3776B03q2k54j32L11rJ1l71J22p8K14J11L46o07M88l2k8l11N2M92j35o73M29K85
3799C52j77p5o7K41J03j68l1q4N4J00L17j37m43L25J87k38r5L28O1m62k2L02j07
$$ plain form
3822 264 92 210 323 106 427 424 84 77 153 -134 41 13 277 33 142 186 -222 255 62 -41 160 359
3844 359 -318 58 138 -283 264 199 -61 -283 -10 -114 -33 -48 -104 -441 -12 -1 -119 95 -51 -196 -19 -365
3866 -365 -274 -460 -253 160 -451 -152 222 53 -258 -278 -266 -366 -109 -488 -166 -31 -468 -32 151 -9 -237
3887 -237 17 -209 -5 111 50 -59 -83 -57 10 -397 -307 -17 -19 -17 55 -221 -92 -65 -314 121 -78 -294 -193 8
3911 8 -14 -311 336 145 -199 -90 -92 -177 57 73 127 229 -263 -2 -72 119 -282 -80 -163 -186 -230 525 58 -535
3935 -535 59 229 -214 244 274 -34 6 13 383 83 -219 -216 259 84 95 489 440 25 -299 275 256 49 9
3958 9 147 -105 39 -81 388 48 -285 -39 36 65 -143 23 114 -268 -207 156 418 -457 -309 237 -373 -506
3980 -506 195 291 -377 -539 -88 175 -546 -171 256 116 -349 -177 533 165 -507 -80 211 -278 -215 464 68
$$ packed form
3822B64j72J18J13k17L21ll40pP6k87J75k8K64k44J09M4m08M77j93j03K01J99
3844C59o77L76Q0m21N47o5k60k22K73j04Q1j5n6l37M29J1j18K14j46j45J77l46
3866c65R1j86K07M13o11K99L74j69l11k0J2j00K57l79L22J35m37M36J83j60k28
3887b37K54k26K04J16o1j09k4K6O7m07R0K90kKP2k76J29K7k49M35j99k16J01K01
3911Hk2k97O47j91l44J09kq5K34J6N4J02m92K61p0J91m01K02q3k3m4P55m67n93
3935e35N94J70m43M58L0l08M0PL70l00l02LM75j75J1L94m9m15l24N74j9k07m0
3958IJ38k52J44j20M69l40l33K46P5K9k08J66R1l82O1L63K62q75J48N46o10j33
3980e06P01R6o68j62M51K63p21L75M27j40m65J72P10l68o72M27K91m89O3O79l96
$$ plain form
4001 68 -831 -54 560 -30 -500 -159 211 -160 -154 352 161 -654 -116 208 264 -434 -45 227 113 -501 322
4022 322 693 -131 -757 185 313 -249 -226 340 -260 -457 -146 868 322 -741 65 459 -193 -537 407 281
4042 281 -816 -370 912 521 -574 -114 647 -171 -443 217 549 -527 -967 349 449 -165 -26 394
4060 394 -179 -720 399 796 -18 -804 115 562 -381 59 734 350 -1166 -366 768 491 -494 44 367
4079 367 -105 -194 837 914 -811 -775 249 410 -526 -122 558 -462 -961 650 1296 -193 -1374 88
4097 88 344 -239 -275 562 -358 -1292 -208 1136 460 -911 -335 551 -405 -347 967 657 -1232 -881 521
4116 521 762 -412 -111 319 -779 -309 777 873 -716 -1113 191 354 -123 -91 720 -514 -1204 295
4134 295 1139 253 -1305 -214 271 -403 56 1018 63 -1426 -586 953 404 -545 -34 517 -381 -395 913
$$ packed form
4001F8q99P77O14n90m70L41L70l71ON06j91q15N38L24N6o98L89K72j14o14Q23
4022C22L71q24o26R42J28n62K3N66o00j97L11J014n46j063Q06L94o52l44R44j26
4042B81j097M46J282l91j095M60P61q18k72O60L32j076m40J316J00o14J39M20
4060C94n73n41J119L97q14p86R19M47r43M40O75l84j516Q00J134k77r85N38L23
4079C67m72q9J031P7j725L6J024J61r36M04O80j020m99J611O46j489j181J462
4097H8K56n83l6Q37r20r34J084J344o76j371N76Q86r56N8J314l10j889L51J402
4116E21K41j174L01M30j098M70J086R6j589l97J304J63m77L2Q11j234o90J499
4134B95Q44q86j558J091M85o74M59R62r55j489Q40J539n49r49N11N51q98j4J308
$$ plain form
4153 913 1044 -1104 -979 636 592 -294 -143 710 -661 -782 568 1278 81 -1017 123 636 -88 -30
4171 -30 825 203 -1343 -273 1113 398 -685 -100 568 -598 -309 1097 674 -1288 -962 849 586 -269
4189 -269 -39 479 -355 -708 1028 1255 -556 -771 98 433 -275 -137 843 -361 -1506 114 1414 -118
4207 -118 -722 -50 355 -734 -294 855 89 -1313 -889 805 624 -357 -109 220 -305 -807 729 1042
4225 1042 -971 -887 325 356 -305 150 657 -702 -1052 474 1035 -332 -986 -350 461 -439 -91 614 91
4244 91 -1344 -349 876 181 -697 -58 93 -806 -283 887 418 -1069 -602 524 395 -206 -314 499 -526
4263 -526 -749 554 1248 -186 -1004 -61 535 -524 139 781 -179 -1247 -25 1081 270 -614 287 275
4281 275 -581 -58 854 295 -1300 -599 692 500 -262 -134 403 -445 -639 885 792 -618 -539 261 80
$$ packed form
4153I13J31k148J25J615m4q86J51Q53j371j21J350P10j197j098J140N13p24N8
4171c0Q55o22j546J070J386p15j083N85O68j166K89J406m23j962L26J811k63q55
4189b69K30N18q34l53J736K27j811k15Q69L35p08J38R80j204j145J620J300j532
4207a18o04O72M05j089M40J149p66j402M24J694j81r81K48L29n25n02J536L13
4225A042k013Q4J212L1o61M55N07j359l50J526N61j367o54O36Q11r00L48P05n23
4244I1j435R95J225o95q78O39J51q99N23J170m69j487M67J126j29o01j08Q13j025
4263e26k23J303O94j434q18R43N96j059O63O42r60j068J222J106q11q84R01j2
4281B75q56N23R12n59j595P01J291j92p62J28N37q48j94J524r3j410P9Q00j81
$$ plain form
4300 80 -483 318 496 -391 -1001 -48 922 38 -363 287 173 -384 -101 855 231 -1149 -268 677 56 -608
4320 -608 -105 248 -400 -245 720 208 -397 -652 332 442 -181 -25 290 -483 -435 322 804 -148 -553 153
4340 153 444 -291 27 484 119 -584 -156 549 24 -587 73 136 -211 -201 754 308 -394 -372 419 369 -567
4361 -567 76 343 -394 -573 308 336 27 -237 214 -25 -56 -1 174 195 -485 81 441 -153 -384 60 130 -245
4383 -245 -339 598 129 -601 -247 227 -3 -84 -182 145 -122 -379 611 118 -306 -396 383 181 -335 78 385
4404 385 -1 -380 -74 294 -83 -177 147 89 -370 97 77 73 -462 -77 -120 19 -280 -119 190 10 -171 110
4426 110 346 -325 -97 148 151 19 -11 182 -155 -310 -163 28 71 -60 -175 -24 -109 27 149 188 -557 -53
4448 -53 333 -70 -139 -95 341 -34 -105 363 36 -234 -17 262 131 -156 -9 -207 157 -320 285 201 -348 -148
$$ packed form
4300H0n63Q01J78q87o10R53R70q84m01O50j14n57K83R56o24j380Q81R45o21o64
4320f08N03L53o48J55R65n12o05k55R84J10o23J56L15p73M8P57M82r52m05P06
4340A53K91p35L18M57l65p03M28P05n25o11O60O3l47J0R55m46p02K2P91n0r36
4361e67O43K67p37j79Q81K8l09k64M51k39l1N5J75K1o80N66L60n94k31M44P0l75
4383b45r4R37m69p30L54M74k30q1r8L27k67k57R90m93m24r0P79k02n16M13L07
4404C85l86l79L06L68l77r4L24n8m59M67k0mn35L85m3J39k99J61L09j80j81K81
4426A10K36o71K28K45Lj32l0J93l37j55J47J91M3j31j15J51q5J36J22L9p45N04
4448e3L86m03o9M4M36l75p1M68l27k70K17K79j31k87J47j98L64m77O05q4n49K00
$$ plain form
4470 -148 116 116 -147 -87 -1 41 319 395 319 -321 63 -49 247 154 -27 188 62 23 -55 103 307 -285 -49
4493 -49 378 -82 -160 106 18 -79 -132 148 185 -247 -228 58 -86 38 -156 -184 166 -64 -187 124 54 -355 -137
4516 -137 235 13 271 -53 172 29 -141 214 -364 -19 -29 203 93 84 -10 111 -78 -147 140 -28 -471 -17
4538 -17 91 -224 54 297 46 -315 127 119 -42 -245 -48 33 153 75 -12 239 23 14 -116 -123 111 -280 270
4561 270 225 -95 -57 12 130 -280 -183 -98 -20 160 50 -42 -80 -153 -136 232 -57 236 -39 25 -353 198 -92 -289
4585 -289 -201 39 25 -19 -77 48 -331 -65 70 68 -102 -69 93 45 1 -116 16 128 -138 -118 -48 327 -306 86
4609 86 134 -134 48 90 -96 -121 -20 493 -67 45 -15 81 -304 -172 -88 205 -157 -152 86 281 -245 167 482
4632 482 -130 -246 222 75 -176 -86 202 137 -161 64 49 -43 -67 -148 115 142 227 52 92 -177 -160 367 168
$$ packed form
4470a48K64%k63O0Q6M2K78P6p6o40L84j12K96r3j81K15j26l9p8J58K04n92K36
4493d9M27m60p8K66q8r7n3K80L7m32J9K86j44J24j94k8L50k30j23L11p0m09K18
4516a37L72k22K58l24K25j43j70L55n78L45j0K32j10rr4J21j89o9K87j68m43M54
4538a7J08l15K78K43k51l61M42qj61k03J97Q1J20p8q7K51k16rj30pK34l91N50
4561B70m5l20L8O9J18m10R7Q5P8J80j10r2l8p3J7L68k89K93k75O4l78N51k90j97
4585b89Q8K40j4m4n8J25l79K66J35kj70L3J62m8m4j17J32J12k66K0P0L75o33L92
4609H6M8k68J82M2j86k5J01N13n60J12o0R6l85J32Q4K93l62NK38J95n26M12L15
4632D82o12j16M68j47k51R0K88o5k98K25j5r2k4q1K63K7Q5j75M0k69J7N27j99
$$ plain form
4655 168 -88 55 477 -94 148 4 249 -207 5 302 76 -22 94 109 110 -109 365 422 -39 -313 90 297
4677 297 -33 -29 -6 -16 49 -42 654 167 -263 81 59 351 -122 272 187 -34 -325 293 337 -242 -70 270 -30
4700 -30 -229 285 248 -703 -464 544 224 -267 -182 15 -112 -79 69 750 -47 -498 -112 410 121 -74 201
4721 201 83 -461 -310 640 287 -412 -103 614 -81 -23 300 206 -693 -584 339 422 -243 -472 131 -20 -242
4742 -242 28 610 73 -652 226 714 68 -102 422 -110 -553 -254 641 143 -529 -579 129 -172 -230 525 127
4763 127 -462 -515 532 269 -156 -428 167 -35 -576 194 975 -271 -525 244 574 -360 -213 470 -115 -468
4783 -468 56 783 255 -1063 121 256 167 -212 575 216 -840 -183 632 341 -781 -5 405 -117 -370
4802 -370 553 444 -514 -636 560 514 -139 -162 748 -123 -696 400 763 -297 -900 122 614 -36 107
$$ packed form
4655A68k56J43M22n71K42j44K45m56K12K97k26r8J16J5Jk19M74N7m61k74M03K07
4677B97l30MK3j0O5r1O96m87m30L44k2K92m73L94q5k21k91O18M4n79J72L40l00
4700c0j99N14l7r51K39J008l20m91Q5J97j27L3J48O81p97m51L86N22k89j95K75
4721B01j18n44J51R50l53o99L09P17o95N8L23r4q99J09R23Q3o65k29O03j51k22
4742b42K70N82n37p25Q78M88o46j70N24n32m43K99Q95m98o72n0P08l01n8P55l98
4763A27n89n3J047k63m25k72N95k02n41P70P81j246k54P69L30r34J47O83n85l53
4783d68N24P27n28j318J184J35q9l79P87l59j056O57Q15k91j122P76M10n22k53
4802c70R23j09r58j22J196m6o53k3R10q71n73J096L63j060o03J022M92o50J43
$$ plain form
4821 107 770 -62 -734 54 897 490 -377 -8 166 -188 -152 749 286 -565 -791 382 417 120 -150 483
4841 483 -255 -485 406 955 -226 -898 108 340 34 20 443 -297 -779 -7 812 -24 -818 -154 435 -352
4861 -352 74 1015 458 -854 -140 804 351 -375 64 431 -490 -391 629 556 -480 -879 232 715 -125
4880 -125 27 629 -261 -939 354 1082 -16 -518 140 247 -209 128 817 59 -877 -152 919 396 -710
4899 -710 -74 193 -387 -214 768 382 -707 -433 675 604 -705 -79 483 -222 -853 345 774 -392 -548
4918 -548 103 131 -153 -213 295 -197 -568 118 862 17 -745 -117 361 -536 26 572 -64 -378 -109 452 359
4939 359 61 67 -59 -182 -672 360 570 -358 -715 0 367 92 -11 546 -371 -904 167 439 -190 -587
4959 -587 -34 356 -294 -155 617 108 -679 -345 651 -210 -514 -142 307 -365 -347 630 275 -512 -670 252
$$ packed form
4821A07O63q32o72P88Q43m07q67L69J74l54L6R01m63q51k26J173L5k97k70O33
4841D83p38k30Q91N49j181o72J006K32l06j4M23p40m82P72Q19q36p94O64N89p87
4861c52M26R41n57j312P14R44m53p26M39L67r21R9J020p3j036l99J111M83q40
4880a25J52O02q90o78J293P28j098n02O58J07m56L37O89p58r36P25J071n23j106
4899g10O36K67n80J73R82l86j089K74J108p1j309O26N62p05o31J198M29j166j56
4918e48O51K8k84o0N08m92l71O86P44q45p62O28M78q97N62N46o36l14K69N61r3
4939C59k98Oj26j23m90J032K10r28l57P15L67k75j03N57r17n33J071K72o29l97
4959e87N53L90o50J39P72n09p87L34R96q61l04L72M49o72J8R77l55p87j58R22
$$ plain form
4979 252 284 29 -133 -12 -610 -193 491 859 -4 -636 530 308 -73 -165 626 -63 -822 -216 645 117
4999 117 -326 91 -84 -98 78 610 238 -412 -384 622 228 -85 -74 223 199 -182 554 503 -351 -503 126
5020 126 473 -256 47 424 -109 -398 -79 603 71 -429 -48 27 -23 -229 347 180 -466 -202 283 389 -148
5041 -148 -29 377 -283 -414 530 352 -89 -323 312 98 10 127 218 -108 -437 149 457 56 -239 -93 -191
5062 -191 -36 -58 270 -91 -615 -121 151 -241 -340 -52 -11 -162 2 1 124 -575 -231 224 273 37 70 -160
5084 -160 4 -348 385 98 -237 -281 -77 -197 -393 30 368 10 -157 11 143 252 -308 -119 -152 170 -45
5105 -45 -9 45 -523 -11 297 94 7 20 196 -219 -279 -112 83 15 -423 13 234 68 52 10 220 -330 79
5128 79 318 -68 -105 57 267 167 -35 94 32 37 -5 381 -59 232 -17 -36 -259 -143 62 36 45 18 238 -123
$$ packed form
4979B52L2k55j62J21n98M17O84L68q63o32J166k22l81r2P91o89p59O06Q61n28
4999A17m43M17j75j4J76N32l72o50K8J006l94l13J1K97k4l81P36n1q54j52O29
5020A26L47p29L03L77n33k89L19O82n32n00L81P5n0k06N76j67o46K64M85J06n37
5041a48J19M06o60j31R44j78m41k34O35k14q8J17R1l26l29N86L08m01k95J46r8
5062a91J55k2L28l61n24M94K72l92r9K88M1j51J64jJ23o99L44M55M9k36L3k30
5084a60J64l52P33k87l35m4K04j20j96M23L38l58j67J68J32J09n60J89l3L22k15
5105d5L6N4n68N12L08k03q7J3J76m15o0J67J95o8m38M36K21j66j6m2K10n50M09
5128G9K39l86l7J62K10j00k02J29o2Nm2L86m40K91k49j9k23J16K05k6Rk7K20l61
$$ plain form
5152 -123 -86 238 234 -204 -67 11 263 -42 -151 -194 250 0 -109 0 132 78 -297 447 -64 -73 97 153 298
5175 298 -293 252 142 77 -167 163 235 3 -55 21 56 -111 44 -42 -138 -183 359 -230 20 -42 180 -85 -66
5198 -66 260 130 12 -199 -166 -104 -24 119 143 -182 47 201 187 -106 -2 19 107 -160 -5 -69 -48 -123 -131 125
5222 125 64 -49 -123 -15 -67 27 -53 58 148 -18 31 244 94 130 -363 162 64 25 119 129 17 66 -94 -26 -148
5247 -148 -89 53 10 72 6 164 -83 14 -1 -51 -6 -170 159 -25 142 -88 -98 85 -173 19 10 -285 -410 304
5271 304 20 -93 -34 65 -48 -25 -126 14 236 -163 -252 -164 131 222 320 106 -77 201 118 17 -58 265 117
5294 117 -216 -160 307 -165 -57 26 -80 22 4 266 -40 -304 -142 296 13 165 156 -29 21 -19 26 113 -199
5317 -199 -32 53 152 -194 -52 145 -243 0 -16 -198 -20 -54 -115 66 -172 -252 281 131 40 140 172 229 -82
$$ packed form
5152a23L7L24mm38J37P8K52l05j09m3M44k50j09J09J32n4l75P44n11rJ70N6J45
5175B98n91N45j10o5k44L30P2k32n8P6L5j67J55q6r6m5N42n89K50o2K22k65J9
5198f6L26j30j18k11L3O2Q0J43K4l25K29J54j4k93J04K1Q8k67J55o4K1p5qK56
5222A25o1j13p4J08n2R4q0J11R0j66M9K13j50L6m93N25r8l9R4J0j12M9j60O8j22
5247a48N9J42m3O2o6J58k47R7j5n0M5j64L29j84J67k30j0J83k58J92rk95j25P14
5271C04k84j13N9R9j13K3j01J40K22l99q9Q8K95R1R8k14j83K78q3j01p5L23j48
5294A17l33N6M67m72J08Q3j06J02j8K62l06k64J62M38k83J52rj85N0m0M5Q7l12
5317a99J67Q5R9l46J42J97l88K43j6j82J78l4o1J81k38q0N33j50r1J00L2N7l11
$$ plain form
5340 -82 132 130 62 199 195 126 -368 -339 128 135 -211 149 77 -213 -320 -246 135 -1 -164 -18 -130 -326 -106 319
5364 319 -87 -342 264 158 79 -416 81 172 -207 -39 239 -74 -200 -132 126 -127 -285 82 365 -364 -401
5385 -401 610 652 -216 -152 404 17 30 -87 -122 -68 -586 -128 30 121 -118 191 -35 13 -153 771 -33 -305
5407 -305 -102 194 -81 -141 28 69 -374 -259 55 339 -135 -155 241 -319 -291 -96 321 -138 -512 -110 48
5428 48 -310 -89 9 -15 -516 185 437 187 -533 -22 236 15 -282 -72 -102 -369 -248 212 363 -363 -272 41
5450 41 84 -193 314 470 -329 -528 244 308 -326 66 -73 -158 -190 224 680 -44 -255 -6 391 53 -317 374
5472 374 -101 -570 -33 604 -39 -351 -160 134 -107 -190 373 593 -202 -392 324 232 -181 0 222 -23 -238
5493 -238 200 512 38 -578 -42 329 -155 -146 134 -390 -469 328 527 316 -473 106 135 -27 -336 388 377 -554
$$ packed form
5340h2K14ko8J37mo9m94K9M67Pl46L60p2k90j07P4L81j36j63J46j12j96K20M25
5364C19m06k55O06j06p9m95M97R1l79J68K78l13j26O8K58k53j58L67K83p29l7
5385d01J011M2q68O4N56l87J3j17l5N4n18M58J58R1k39L09k26M8j66R24q04k72
5407c05K03K96k75o0J69M1m43J15L14K84m74k0L96n60K8J95M17m59l74M02J58
5428D8l58K21R8k4n01P01K52k50p20N11K58k21k97K10l0k67J21M60J51p26R1L13
5450D1M3k77N07J56p99j99P72O4o34L92j39q5l2M14M56p24k11K49L97l38l70O91
5472C74m75m69N37O37o43l12J91K94k41q3N63K20p95j90P16r2m13J81K22k45k15
5493b38M38L12m74o16N36L71m84RK80n24p9P97J99k11p89N79K9j62l09P24j1r31
$$ plain form
5515 -554 -383 272 249 -528 -260 201 -91 -242 426 537 -318 -509 328 157 30 37 430 -41 -543 187 709
5536 709 -323 -444 -112 336 -357 56 166 35 -645 -166 672 61 -346 -25 142 -396 -198 367 138 -410
5556 -410 -657 331 478 -266 -428 83 -245 -489 191 582 -2 -480 21 413 -110 168 581 162 -643 -176
5576 -176 648 184 -731 -265 -63 -189 -42 307 729 -577 -502 702 492 -398 24 124 -262 -158 436 550
5596 550 -263 -706 263 331 -266 3 312 4 -492 -49 493 -165 -473 -194 377 -240 15 409 179 -456
5616 -456 -218 701 473 -328 -135 217 -160 12 516 302 -344 -391 376 486 -119 83 420 -405 -245 252
5636 252 491 68 -252 -13 26 -163 265 651 -11 -686 12 468 -11 -381 9 -243 -351 137 523 138
5656 138 -409 -508 277 143 -224 -112 -86 -83 -390 194 238 -270 -330 -42 144 45 -269 636 73 -420 32 554
$$ packed form
5515e54J71O55k3p77K68M61k92j51O68J11q55j91Q37j71j27PL93m71n02P30N22
5536G09j032j21L32M48o93M13J10j31o80M79Q38o11m07L21J67n38J98N65k29n48
5556d10k47R88J47p44j62N11l28k44O80L91n84m78N01L92n23K78M13m19q05M67
5576a76Q24m64r15M66K02j26J47L49M22j306P5J204k10q90M22J00l86J04N94J14
5596E50q13m43R69O8n97K69L09l08m96M43N42o58l08K79N71o17K55L94k30o35
5616d56K38R19k28q01J93L52l77J72N04k14o46m7P67J10o05K02L37q25J60M97
5636B52K39m23l20K39L9j89M28L86o62o75O98M56m79l70L90k52j08M88L86l85
5656A38n47r9P85j34l67J12K6Ll07N84M4n08o0K88J86r9l14R05n63m93M52N22
$$ plain form
5678 554 -1 -223 -269 131 -174 -217 334 419 -311 -212 584 375 -319 31 225 -133 -212 288 491 -343 -213 246
5700 246 110 -203 -37 223 114 -498 363 432 -231 -401 -150 -58 -258 -79 50 -19 -571 61 284 203 -191
5721 -191 190 259 -236 -302 253 17 -155 -188 -179 316 52 -133 170 -76 -126 145 318 86 -187 68 104 -11
5743 -11 -36 391 -7 -373 35 185 31 -138 -306 71 -165 103 -76 91 -351 -109 219 -32 14 26 133
5764 133 253 -257 477 440 -94 -364 294 133 -133 -31 -48 -103 25 57 14 70 -7 -220 -47 49 -11 111 181
5787 181 -347 -65 505 61 -111 31 -74 -151 -160 244 -18 -15 -201 140 -24 70 165 -42 -131 59 -17 99 -250
5810 -250 150 -61 20 -248 -54 47 -22 -181 -211 71 54 -89 -136 -45 -97 138 179 89 99 -167 -69 93 -196 189
5834 189 313 248 -135 -98 119 -150 -292 -133 105 -171 -68 11 49 25 -93 99 34 -205 -46 151 -97 -453
$$ packed form
5678E54n55k22m6M00l05m3N51Q5p30R9P96k09o94L50J94l58p9N00K03q34J30M59
5700B46j36l13J66K60j09o12Q61O9o63j70K51R2k00J79J29o9n52O32K23q1l94
5721a91L81O9m95o6N55k36j72l3RM95k64j85L03k46n0K71J73k32k73K55L6j15
5743a1k5M27l98l66M08J50j54j69j68L77k36K68j79J67m42K42L28k51M6J2J07
5764A33J20n10P34l7n34k70O58j61k66J02j7n5J28L2m3N6p7k13J73R6o0J22P0
5787A81n28K82N70m44j72J42j05p7rM04k62Lj86L41j64R4R5k07q9J90p6J16l49
5810b50M00k11Q1k68J94J01o9j59l0K82j7j43m7R1n2K35M1r0J0k66R8J62k89L85
5834A89J24o5l83L7K17k69j42J59K38k76J03P9L8k4j18J92o5k39J59J97k48l56
$$ plain form
5856 -453 63 -89 201 75 -49 21 -181 141 -4 -97 -97 92 91 -19 119 37 188 -453 26 -60 62 175 9
5879 9 15 -342 -5 277 -69 -83 15 -131 139 -60 -245 -4 -217 229 -31 -130 259 184 91 232 -207 -132 -23
5902 -23 240 7 -73 -243 81 35 260 -89 269 128 73 -299 -138 -276 -284 -33 -116 -94 94 147 -303 38 195
5925 195 141 -48 62 164 225 -114 70 -186 38 158 -63 217 -52 -91 -129 158 -61 -71 39 -58 168 135
5947 135 193 -295 137 12 118 19 193 -33 -87 94 103 -64 10 -128 54 141 -199 -32 -135 -82 -66 2 259
5970 259 -338 -30 107 4 72 4 10 187 -71 -75 -13 -263 -89 91 -48 119 -144 64 113 -49 -54 172 -44
5993 -44 -301 219 69 -27 98 61 -99 147 41 176 48 14 178 1 226 -169 175 98 112 -12 -59 139
6015 139 -372 1 103 58 -24 74 61 -10 192 -27 221 0 -331 142 122 100 126 -157 25 -17 117 171 -151
$$ packed form
5856d53N16j52K90j26j24P0k02L22j45r3%J89jj10J38q2J51o41M79q6J22J13j66
5879IOl57L37K82l46j4R8j46K70j99j85K41k13M46k60r9L89p5r3J41m39P5J09
5902b3K63k33q0j70L24m6K25l49L58j41n5l72J61j38qK51q3K2J88N3m50L41J57
5925A95n4j89J10J02O1l39J84k56K24J20k21K80k69l9l8K87k19j0J10r7K26l3
5947A35N8m88M32j25J06r9J74k26n4J81Rj67P4j38J82Q7l40J67j03N3J6O8K57
5970B59n97L08J37j03O8o8OJ77k58mO2k50J74J80j39J67k63K08M9j62nK26k16
5993d4k57N20j50r6J25l7j60K46j06J35j28l4J64j77K25l95L44p7J4j24m7J98
6015A39n11L73J02m5q2R8j3p1K02k19K48k21l31M73k0k2K6k83J82m2J34N4l22
$$ plain form
6038 -151 -217 249 112 133 -17 275 90 -655 31 40 322 257 328 29 -118 177 200 -28 -185 -181 156 90 -48
6061 -48 138 102 -90 43 270 -140 -393 -145 -497 -157 -104 120 267 -237 -33 13 335 83 -97 -10 -85 -65
6083 -65 -220 309 240 -267 -144 266 -233 197 131 131 -232 -82 152 284 -223 -245 448 227 -132 7 370 -11
6105 -11 -140 108 308 54 -173 191 84 -66 -148 289 26 -129 -148 284 -36 -112 226 -94 -362 -214 391
6126 391 196 -507 -281 100 -166 16 171 298 -158 -230 255 279 -225 -220 219 31 8 99 194 126 -281 106 172
6149 172 -270 -153 81 6 -395 -284 258 -56 -249 170 311 -123 -261 132 62 -257 -308 211 98 -238 -149
6170 -149 246 165 -450 68 157 -116 -642 250 467 -413 -33 12 -415 -338 -196 214 -126 -569 -158 567 -34
6191 -34 37 22 322 -592 -455 98 475 -225 -48 619 -13 79 434 258 -342 -390 -48 300 -227 -196 238 -72
$$ packed form
6038a51o6M66j37K1j50K92j85p45O86RK82o5P1k99j47K95K3k28j57ML37o6j38
6061d8J86l6j92J33K27m10k53K48l52L40N3K24J47n04K04M6L22k52j80Q7p5K0
6083f5j55N29o9n07J23M10m99M30o6%l63J50K34J32n07k2O93k21l59J39L63l81
6105a1j29K48K00k54k27L64j07j50q2M37k63j55j9M32l20p6L38l20k68J48O05
6126C91j95p03K26L81k66J82J55J27m56p2M85K4n04NM39j88k3R1R5o8m07L87O6
6149A72m42J17K34p5m01J11N42l14j93M19J41m34j38L93p0l19n1N19j13l36Q9
6170a49L95q1o15N18Q9k73n26Q92K17q80L80M5m27P7J42M10l40m43M11P25o01
6191c4P1j5L00r14J37N53L77p00J77O67o32R2L55j76o00m8L42L48n27L1M34l10
$$ plain form
6213 -72 -288 207 626 280 -530 -134 168 -139 -280 156 -219 -461 30 573 87 -129 -28 110 28 -4 60
6234 60 414 -523 -527 425 -80 236 -156 277 13 -568 209 246 -77 -216 62 -145 -234 -94 272 106 -286 21
6256 21 402 380 -382 -35 7 -279 -93 99 69 -645 -90 650 350 -482 -244 295 -147 79 536 309 -526
6277 -526 -367 158 378 90 13 138 -79 -211 87 415 69 -276 25 -20 -118 -24 433 -92 -529 -22 395
6298 395 18 -135 -26 -20 -23 -42 317 87 -67 -451 52 292 46 -149 187 -271 -6 419 301 -100 -470 -37
6320 -37 299 256 90 198 276 -489 -72 466 62 -484 10 -44 -161 -189 237 208 -122 -253 397 -49 -95 -46 -82
6343 -82 -40 -303 305 241 -452 -90 31 363 -116 -259 207 130 -476 159 346 227 -343 227 338 -215 60
6364 60 321 465 -346 155 421 331 -418 221 223 51 194 332 88 -132 -55 75 -33 -472 -230 255 -114 -81
$$ packed form
6213g2k16M95M19l46q10L96L02l07j41M36l75k42M91N43m86k16J01J38q2l2O4
6234F0L54r37mR52n05L16l92M33k64n81P77L7l23j39K78k07q9J40L66j66l92L07
6256B1L81k2p62L47M2k86J86J92l0p14N55P40l00q32K38N39m42K26M57k27q35
6277e26J59N25K20k88p7J25k17j32K98L28l46l45L01m5r8R4M57n25m37N07M17
6298C95l77j53J09Olj9L59k30j54l84N03K40k46j95L36m58K65M25j18m01l70M33
6320c7L36m3j66J08P8p65M17N38m04n46M94n4j17k8M26k9l30j31O50m46m6M9l6
6343h2M2k63O08o4o93L62J21L32m79j43M66p7o06O35J87j19n70N70J11n53K75
6364F0K61J44q11N01K66r0p49O39Kj72J43J38k44k20P7J30j08m39K42M85l69L3
$$ plain form
6386 -81 209 315 119 -286 65 43 -11 104 199 -304 -303 -47 354 123 -55 -111 277 -27 -43 107 158 76 182
6409 182 143 -13 -298 -203 40 62 -125 -198 240 -65 83 -18 10 -55 -101 382 -39 27 133 426 111 -285 -73
6432 -73 169 -7 80 288 31 -94 -71 5 -68 101 104 78 -47 -144 -133 -47 -1 0 -2 292 4 15 65 -333 -257 210
6458 210 171 61 -90 -176 263 -260 -292 122 -50 10 -114 88 -343 -511 -25 319 -163 213 -43 106 64 -6
6480 -6 352 -147 64 2 -81 -13 -90 -241 122 -368 -142 163 100 287 -87 51 102 -22 289 106 94 -14 118
6503 118 116 -250 -75 40 142 9 -163 146 94 -185 41 84 12 -32 -7 -65 -249 -65 387 80 80 -14 -87 -120
6527 -120 141 -185 -141 255 -296 85 33 -133 29 162 204 32 -180 162 107 -311 93 -81 -119 387 -182 175
6549 175 172 149 -110 -192 -63 -168 -157 182 -14 189 -124 -20 380 -75 28 -198 110 82 224 -96 109 -148
$$ packed form
6386h1K90J06j96m05L51k2n4J15R5n03JK56M01k31j78n6L88l04j6J50N1q2J06
6409A82l9j56k85R5K43K2j87p3M38l05J48j01K8o5m6M83m21O6J06K93l15l96K12
6432g3K42j76Q7K08k57j25K3P6p3J69Lk6j25r7J1Q6M6JkK94k88J1N0l98P6M67
6458B10l9j10j51q6M39n23l2M14j72O0j24K02m31j68M86L44m82L76k56J49m2p0
6480fL58m99K11o2q3O8p7j51L63m90K26L05o3J87l74J38N1j24L11j83j2j08J32
6503A18kl66J75J15J02j33j72L09n2k79K26M3p2m4K5n8j84J84M52l07%r4p3l3
6527a20K61l26M4L96n51L81n2j66J62J33M2j72k12L42n5m18M04j74l8N06n69L57
6549A75lk3k59q2J29j05J1L39j96K03l13J04M00m55J03k26L08k8J42l20K05k57
$$ plain form
6571 -148 -216 -16 132 4 -20 -43 -118 -218 -129 17 -8 -29 27 -126 144 139 -266 -128 160 329 -202 -55 13 99
6595 99 -130 128 -90 244 -239 92 76 -160 64 145 -47 -138 -96 50 -28 51 304 -59 73 -60 -95 -217 217
6618 217 130 197 111 -16 48 3 23 -130 -76 -158 -33 314 202 -315 -262 62 -85 44 90 -124 173 -127 90
6641 90 -51 -118 -103 123 193 118 73 176 220 -50 -190 -80 -48 27 205 -83 71 31 350 -188 158 -20 -34 170
6665 170 159 -46 275 120 -35 270 117 -33 -100 -5 -25 152 -13 -101 104 6 135 -149 -367 -170 53 287
6687 287 -57 242 55 -70 -188 48 327 23 -91 201 104 152 -185 -26 -218 -96 106 149 -4 242 -71
6708 -71 -145 -140 24 4 105 -217 35 23 267 86 -331 -13 -3 232 390 20 0 -57 -147 114 223 -114 157
6731 157 -24 65 251 339 -23 -97 -22 21 -39 42 -41 -11 -67 -48 194 220 -169 -250 89 -235 141 35 161 93 -146
$$ packed form
6571a48o8K00J48j28k4k3p5j00Q9J46k5k1N6j53K70nm05J38K88J69n31J47O8Q6
6595I9k29K58k18L34m83L31j6k36K24Q1j92r1M2J46p8P9K53l63J32j33l5j22M34
6618B17q7O7q6j27O4m5K0j53N4q2J25L47j12n17N3L24j47J29M6k14K97l00K17
6641I0j41o7J5K26P0p5m5J03M4k70j40J10L2P5J78k88J54m0L19n38L46j78j4K04
6665A70j1k05L21j55j55L05j53j50o7R5k0J77j65q8K05r8J29k84k18J97K23K34
6687B87l44K99j87j25j18K36K79l04j14K92r7M8l37J59j92J22K02M3j53K46l13
6708g1p4NJ64k0J01l22K52j2K44j81m17L18J0K35J58l70k0n7r0K61J09l37K71
6731A57j81Q9J86Q8l62p4P5M3o0Q1q3L0n6J9K42K6l89q1L39l24L76j06J26o8k39
$$ plain form
6756 -146 -221 -26 309 -109 -110 -64 -192 116 199 -3 -199 -147 238 133 5 -84 72 -190 2 82 1 -118 -160
6779 -160 183 17 -151 51 488 -1 -66 323 -14 74 -364 313 -150 84 167 226 -107 -202 311 144 -92 23
6801 23 -108 -168 -10 -379 252 64 -236 -121 23 48 -26 -37 40 -154 -209 241 396 -152 -182 327 -136 142 135
6824 135 62 43 -190 -57 -57 234 -195 -131 26 42 333 132 36 -351 -81 -85 112 -48 -225 101 -165 -82 357
6847 357 239 -226 -168 477 -34 -192 202 -83 -198 -499 10 481 -306 131 173 72 -104 -81 192 87 -202
6868 -202 -16 310 -110 -71 -45 25 -295 -250 543 171 -275 131 -190 207 -9 -160 -33 -187 -310 108 78 -86
6890 -86 -266 -3 46 -251 66 180 -343 -537 -52 215 -147 -17 38 18 -349 -137 276 -77 -578 -137 381
6911 381 268 -329 352 129 -307 -211 233 241 -313 -237 -122 -75 -90 95 184 -252 -244 -48 138 -143 -383 320 4
$$ packed form
6756a46p5J95L35m18jM6j28L08Q3k02j96N2L85j05j28q9J56k62J92Q0q1j19m2
6779a60L43j66j68K02M37m89o5L89l37Q8m38O77m63K34Q3N9l33r5N13j67k36J15
6801B3j31o0J58l69O31j88l00J15J44K5p4j1P7j94n5M50J55n48l0N09m63K78p
6824A35p3j9k33J33%K91m29O4J57J6K91k01r6l87K70mJ97j60j77L26k66Q3M39
6847C57j18m65N8O45n11j58L94k85j15l01N09M71p87M37M2j01j76K3K73j05k89
6868b02J86L26m20L9K6P0l20M5P93l72m46M06l21L97k16j51J27j54j23M18l0j64
6890h6j80K63M9k97L17J14n23j94M85K67l62J30N5k0l67K12M13l53n01M41N18
6911C81j13n97O81k23m36R6M44Qn54P6J15M7j5J85Q9m36QJ96J86k81k40P03l16
$$ plain form
6934 4 -400 -3 327 63 -459 -83 154 222 54 142 241 -432 -303 254 -20 -337 7 -144 -94 -124 314 402 -231
6957 -231 26 174 187 -54 -239 73 -362 -314 297 298 -216 -501 352 -116 -91 44 254 -111 -23 183 16 103
6979 103 -364 -361 290 -56 -117 92 157 -300 -135 154 97 -130 -187 131 -265 -187 -18 329 -47 -268 161 263
7001 263 123 15 11 194 -215 -240 115 -86 -120 -121 111 -20 -48 186 179 -389 -93 446 58 -96 -356 -215 -70
7024 -70 -161 483 206 -210 -265 122 206 -9 -145 213 -106 -358 187 288 -49 -134 32 -190 -6 45 113 -105
7046 -105 -391 -18 237 -112 -175 227 26 -325 -92 55 170 -123 -131 162 196 -26 40 19 -71 -237 21 120 -325
7069 -325 -355 -136 -9 -76 -356 -91 -19 -236 29 263 233 -329 -60 208 -234 -32 142 43 -338 -84 283 129
7091 129 -227 -65 110 -189 -36 49 179 -98 -74 288 534 -107 98 298 144 -399 -238 15 -71 -2 -69 7
$$ packed form
6934Dm04L97L30k64n22L76K37O8j68Q8R9o73J29N57k74l17L44j51N0l0M38Q8o33
6957b31K57J48J3k41j85L12m35M8O11Jn14k85Q53m68K5J35K10l65Q8K06j67Q7
6979A03m67LO51l46o1K09O5m57J65K89n7k27n7L18l96P8J69L47l76k21M29J02
7001B63j40j08mJ83m09k5L55k01l4jK32j31k8K34pn68K96N39l88j54k60J41J45
7024g0r1O44k77m16n5L87Q4k15j36L58l19k52N45J01l37q5J66k22J84N1O8k18
7046a05k86L73K55l49o3M02k01l51K33J47J15k93qK93L4k22O6k1r0j66K58R9m45
7069c25l0K19J27o7k80K65P2k17K65K34l0n62K69K68m42K02J74r9l81K54L67j54
7091A29l56J62J75k99J53Q5J30k77K4L62K46o41K05K00j54n43J61K53q6O9o7P6
$$ plain form
7113 7 -21 -41 -51 225 79 -146 144 39 -260 -157 -42 74 -159 347 -59 -183 -228 244 131 -297 262 -253
7135 -253 -175 -104 42 117 -340 -172 67 -69 -114 101 -44 211 -106 194 51 -41 -335 71 65 73 209 -53 31
7158 31 -202 188 310 80 -417 -267 101 189 -73 -28 338 -197 -78 32 -104 16 -67 311 179 -129 -188 228
7180 228 -306 85 -157 -66 48 -268 130 75 -174 78 338 40 52 12 122 -173 45 -116 71 64 16 304
7202 304 -69 117 5 -129 159 75 -207 -97 -99 43 47 -28 -67 -143 219 32 31 235 -311 -16 -217 179 -69
7225 -69 50 38 -76 151 250 -44 296 42 330 -61 -223 165 -33 81 307 -378 -48 -135 126 167 -15 -96
7247 -96 -8 -149 71 281 -37 34 65 -13 15 48 99 -171 206 -155 -300 137 -170 18 177 71 -159 -302 52
7270 52 -109 -360 275 50 -103 -63 189 4 -73 36 160 -53 86 -121 -60 -114 150 -1 19 -84 -244 51
$$ packed form
7113Gk8k0j0K76j46k25K90j05k99J03J15J16k33N06m06j24m5M72j13m28N59n15
7135b53P8P1J46P5m57J68K39j36m5K15j45K55l17L00j43r2k94M06oQJ36k62Q4
7158C1k33L90J22k30m97J50L68Q8k62M5L66n35J19J10j36J20q3L78j32l08n9M16
7180B28n34L91k42R1J14l16L98n5k49K52K60k98J2m0J10k95K18j61J87pm8K88
7202C04l73J86j12j34K88q4k82J10kJ42Mp5l9p6L62j87jK04n46K95k01L96k48
7225f9J19j2j14K27R9k94L40k54K88l91j62L88j98J14K26o85L30q7K61M1j82q1
7247i6Q8j41K20K10l18P1L1p8K8L3N1k70L77l61j45M37l07J88J59j06k30j43L54
7270E2j61k51O35k25j53M0K52j85p7J09J24k13J39k07O1n4K64j51K0j03j60K95
$$ plain form
7292 51 92 53 -113 180 -218 -187 -75 -135 -14 -59 -58 84 225 33 128 76 69 92 325 -8 242 468 -95 19
7316 19 -252 175 37 154 -204 -48 -5 -182 -77 228 26 4 -47 44 -113 114 -136 201 94 -133 122 -62
7338 -62 -11 -74 -70 28 -35 -127 114 138 27 52 261 -43 -55 73 27 18 -89 -124 64 -130 67 94 -230 -12 -41 -181
7364 -181 95 -114 -53 -56 -246 62 149 -11 11 48 -64 135 39 130 -97 -134 -133 -63 -70 57 -80 -128 -205 38 153
7389 153 134 -37 36 220 -17 -194 181 54 -314 -310 -1 -38 132 -114 41 46 64 -83 23 147 -58 127 237
7412 237 73 -315 -67 -279 -158 -113 136 57 74 -20 165 -314 -12 -7 -89 147 208 127 338 -277 -204 132 -234
7435 -234 -143 -201 -77 105 183 -289 270 -46 6 226 -121 111 6 -5 210 142 -163 -222 -75 96 -89 207
7457 207 -129 114 269 -37 -187 123 105 -187 -265 17 163 -172 -7 83 204 57 43 82 -196 -84 -186 326
$$ packed form
7292E1M1l9j66K93l98L1J12o0J21m5JJ42J41j92R5n2pK3K33l33K50K26n63J14
7316A9k71M27j38J17l58J56M3j77J05L05k02k2n1R1j57K27k50L37j07k27K55j84
7338f2N1o3MR8o3r2K41K4j11K5K09l04j2J28m6rj07l5J88j94J97K7l24K18k9j40
7364a81K76k09O1lj90L08Q7j60K2L7j12J99r6R1k27l7JP0pJ27j37m8p7K43J15
7389A53j9j71P3J84k37j77L75j27l68ML09l7J70k46J55NJ8j47J06J24k05J85J10
7412B37j64l88K48k12J21M5K49p9J7r4J85m79L02Nq2K36O1q1K11o15P3L36l66
7435b34R1n8J24J82P8m72N59l16N2K20l47K32j05j1K15o8l05n9J47J71j85K96
7457B07l36K43J55l06j50L10j8k92p8K82J46l35J65R0J21j47j4L9k78J12j02N12
$$ plain form
7479 326 132 25 119 97 -9 239 26 219 -55 -160 131 -90 -362 -31 -44 20 -306 183 292 38 -56 -287
7501 -287 114 -121 -49 39 154 -598 107 287 -32 256 138 110 -79 179 143 209 -309 -471 -7 -297 -168 -129
7523 -129 -11 -476 9 367 253 33 -91 234 -15 -338 -118 139 -114 -585 60 224 0 -113 -20 265
7543 265 -10 -140 192 24 -277 56 324 31 -226 -216 436 43 -66 -14 415 -113 -179 276 -37 10 205
7564 205 -62 -241 35 221 456 -265 -6 -218 43 144 256 253 190 -206 -263 127 -159 -166 106 -44 -84 23
7586 23 -64 4 -298 -168 263 63 -100 182 81 -92 -469 234 12 -363 -37 160 64 -347 227 76 91 -113
7608 -113 130 140 -107 53 95 0 -249 77 225 57 -223 -76 194 -168 -155 22 139 15 -95 241 177 -155
7630 -155 -246 117 282 -187 54 130 -251 -253 -71 112 86 -273 -1 -143 -196 -108 157 -182 -517 -17 307 -172
$$ packed form
7479C26j94j07R4k2j06K48k13J93k74j05K91k21k72L31j3O4l26M89J09k54r4k31
7501b87M01k35P2Q8J15p52P05J80l19K88j18k8j89K58l6O6n18j62M64k90J29L9
7523a29J18m65M85L58j14k20j24L25k49l23K20K57k53m71O45J64k24j13R3K85
7543B65k75j30L32j68l01L33K68k93k57J0O52l93j09N2M29n28o6M55l13M7J95
7564B05k67j79K76J86K35p21K59k12K61J01J12lo3l96n7L90k86pK72j50m0J07
7586B3q7O8l02J30M31k00j63K82j01j73l77P03k22l75L26J97r6m11N74j51J5k04
7608a13K43J0k47J60M2r5k49L26J48j68k80J47K70l62J3J77J17j24j10L36o4l32
7630a55r1L63J65m69K41P6l81kJ82J83k6l59K72j42n3Q8K65l39l35N00L24m79
$$ plain form
7652 -172 1 233 -185 -1 -278 -145 -94 -122 31 109 143 32 273 66 3 -53 142 202 191 -64 -135 -204 16
7675 16 255 17 -63 -155 181 264 182 -73 99 264 -331 14 182 76 109 2 224 81 39 80 20 -359 -45
7698 -45 212 106 -142 233 118 171 -49 210 39 -271 -107 137 198 -275 -112 20 80 78 188 410 -11 -278
7720 -278 107 284 -151 -299 248 256 -85 -245 258 103 -184 -27 5 12 -55 34 96 -23 -459 -67 136 -125 -200
7743 -200 169 337 227 28 259 -55 -140 11 306 5 9 -36 -54 -125 -67 333 122 -3 45 224 -57 -76 140
7766 140 171 151 -98 -40 -75 97 -146 116 17 -184 -216 226 161 -404 373 36 -122 -116 248 12 -112 -20 44 19
7790 19 -337 -78 3 2 -105 193 192 -151 139 -172 76 15 80 -95 60 -113 59 165 -113 -370 -111 132 -140
7813 -140 -35 308 -163 169 150 126 -183 -132 -50 46 -75 11 73 228 107 -42 306 128 -180 -90 163 56 55
$$ packed form
7652a72J73K32m18J84k77J33N1k8J53P8L4j11K41k07o3n6J95O0j1k55p1o9K20
7675A6K39k38q0r2L36Q3q2k55J72J65n95L45J68j06L3j07K22j43m2M1o0l79L14
7698d5K57j06k48L75j15N3k20K59j71l10J64K44O1m73J63J32O0kJ10K22m21k67
7720b78L85J77m35j48N47Ql41j60N03j55k87J57L2Po7Q9O2j19m36L92K03k61p5
7743b00L69J68j10j99K31l14q5J51K95l01Mm5j8p1N8M00k11j25M8J79k81j9K16
7766A40L1k0k49N8l5J72k43K62r9k01l2M42o5n65P77l37j58OL64k36j24R2O4k5
7790A9l56K59Q1jj07K98jl43K90l11K48o1O5j75J55j73J72J06k78k57K59K43k72
7813a40J05L43m71L32j9k4l09N1Q2R6j21Q6O2J55j21j49L48j78l08R0K53j07j
$$ plain form
7836 55 -28 50 -98 101 -120 473 -125 40 -92 -288 21 -179 56 -40 -37 168 72 -160 56 86 -75 302 219
7859 219 -20 -209 -60 -94 50 123 -182 11 104 -31 -80 301 233 -92 124 -24 217 -314 -94 -184 -50 -237
7881 -237 139 -115 72 134 -82 -93 41 -267 -135 -39 -101 150 -109 -129 176 -13 -245 -7 153 302 -99 142
7903 142 -231 81 16 -159 -95 25 12 75 93 23 -237 49 512 -51 -24 -26 111 -37 226 31 167 -167 -184
7926 -184 -316 250 196 17 57 120 -34 23 -37 36 -398 -62 192 -75 238 200 -293 40 125 244 184 -52 140
7949 140 159 18 -139 -189 -193 17 -47 40 261 -74 97 -154 122 -222 160 -124 -62 30 -50 -40 128 -49 -66 122
7973 122 -173 -220 -173 86 -26 62 141 123 44 -153 -228 136 -170 68 47 331 -36 -30 77 96 -71 200 13 -23
7997 -23 267 79 -158 -168 56 138 105 112 -25 -197 -36 -119 294 -61 -228 -68 179 74 113 236 18 38 -264
$$ packed form
7836E5q3P8j48J99k21N93n98J65j32j96L09k00K35r6LK05r6k32K16L0j61L77q3
7859B19k39j89J49l4J44P3l05J93R3j35m9L81o8l25K16j48K41n31K20r0J34j87
7881b37L76k54J87O2k16j1J34l08J32R6o2K51k59k0L05j89k32K38J60J49m01K41
7903A42l73L12o5j75O4J20j3O3J8p0k60K86M63n63K7kJ37j48K63j95J36l34j7
7926a84j32N66n4j79M0O3j54N7o0P3m34L36K54k67L13l8m93L33Q5J19o0k36J92
7949A40J9j41j57n0mK10o4Q7K21l35J71k51K76l44L82k84O2R2q0J0J68j77j7J88
7973A22k95m7M7K59j12Q8P9j8p9j97p5L64l06K38k1K84l67OJ07J9j67K71j87l6
7997b3K90j88k37j0K24Q2l3Pj37j72J61q3M13l55j67J60K47j05L9J23k18K0l02
$$ plain form
8020 -264 53 -104 -37 -187 224 -128 -106 -79 77 -32 77 -16 -159 -12 -268 273 -150 -65 0 398 78 172
8042 172 5 -29 -98 128 -291 -172 177 -29 -68 -428 -155 -56 63 -122 175 217 105 -33 110 159 162 -6 -267
8065 -267 240 58 36 147 -328 104 11 73 147 99 103 192 72 -101 16 46 -9 75 -26 178 -231 -17 46 98
8089 98 -89 -334 -181 -94 68 146 -54 229 -32 187 -214 -175 180 243 125 -295 275 111 -82 -209 -130 205
8111 205 188 313 120 -57 -65 27 140 -333 -102 -124 186 -33 -122 -28 117 -59 -40 147 -128 152 -141 122 -209
8134 -209 -55 347 106 -53 -333 130 165 -26 224 -75 71 -43 256 277 76 -142 -80 -156 -42 97 318
8155 318 -289 -45 254 15 102 -329 35 100 -103 -324 350 512 -166 -37 -11 -47 -100 -105 -83 -301 182 -153 117
8178 117 -112 -452 -110 39 -70 190 356 -198 -263 -49 264 -238 -132
$$ packed form
8020b64L17j57O7j50M11l52K2K7J56j09J09r3j43J47k56N41m23Q5O5L98l20R4
8042A72j67l4o9K26m19J19L49k06l9l60K73R9J19j85K97M2j12j38J43M9Lj68k61
8065b67N07j82k2J11m75M32r3O2P4m8MQ9j20j73J17L0n5Q4j01K04m09K14O3N2
8089I8j87k45J53Q7J62P8k00K83k61K19m01L9L55O3j18m20N70j64j93j27P9L35
8111B05j7J25j93j77qR2J13m73K31k2L10k19q9R4J45j76J9J87k75K80k93K63l31
8134b09J54M02k41j59k80M63L5j91K50k99J46j14K99K1k01k18O2p6J14J39K21
8155C18o07K44K99k39Q7m31L64O5k03k21O74J62o78J29K6l6n3nK2k18M83l35K70
8178A17k29l40L42J49j09K60J66n54o5K14L13n02J06
8191a32
$$ Imaginary data points
##PAGE= N=2
##DATA TABLE= (X++(I..I)), XYDATA
$$ plain form
0 0 0 0 0 -8 8 -8 8 -16 16 -24 32 -32 48 -56 64 -80 96 -112 136 -160 186 -216 253 -288 333 -382 435
27 435 -494 560 -632 712 -801 897 -1005 1120 -1248 1388 -1541 1711 -1897 2101 -2325 2577
43 2577 -2853 3161 -3507 3896 -4341 4851 -5445 6145 -6987 8022 -9328 11037 -13385 16822
57 16822 -22368 32835 -59677 276117 518032 60235 -55776 -67254 47919 179329 365686
68 365686 331526 168345 37192 27852 -18592 -5829 122216 239681 156535 50861 56999
79 56999 56221 -69356 -107536 18413 121642 92244 56849 12607 -93798 -146657 -41880 38089
91 38089 -22988 -64718 20397 50465 -62021 -144652 -101870 -66304 -72270 -12096 67244 16329
103 16329 -93951 -114431 -102448 -122925 -56299 89717 93761 -66515 -141161 -67115 -27944 -64101
$$ packed form
0@%%%qJ6j6J6k4L2m0N6o4Q0j04J20j44J76k08K48k96L46m02M69n41O21p15Q17
27D35r29J054j192J344j513J698j902K125k368K636k929L252l608L998m426M902
43B577n430O014o668P403q237R192j0296J1590j3132J5009j7350K0365k4422L0207
57A6822l9190N5203r2512L35794K41915m57797j16011j1478J15173J31410J86357
68C65686l4160j63181j31153r340m6444J2763J28045J17465q3146j05674O138
79E6999p78j25577l8180J25949J03229k9398l5395m4242j06405n2859J04777P9969
91C8089o1077m1730Q5115L0068j12486q2631M2782L5566n966O0174P9340n0915
103A6329j10280k0480J1983k0477O6626J46016M044j60276p4646P4046L9171l6157
$$ plain form
115 -64101 -46839 12446 9678 -17400 -3934 -31502 -124325 -127221 -3765 56131 -8185 -33093
127 -33093 -1396 -58554 -152576 -107317 10235 25531 -24604 -36884 -56917 -105501 -87938 -21933
139 -21933 -39243 -102487 -59236 39739 10068 -108012 -128814 -62908 -42767 -38532 14139 23968
151 23968 -50099 -82004 -40405 -35572 -52352 8228 70701 16261 -58353 -18827 46393 15075
163 15075 -34522 4109 65119 67764 57124 52846 4243 -35464 31899 119877 93408 29598
175 29598 51877 81788 31569 1003 56737 95808 66153 47139 63515 53117 26817 39419
187 39419 51569 15180 7871 78611 108342 21665 -50516 -8778 43785 30258 20301 34619
199 34619 13385 -17840 -437 13595 -20109 -28430 20570 35584 -16224 -37171 5559 13187
$$ packed form
115f4101J7262N9285k768k7078J3466k7568r2823k896J23456N9896o4316k4908
127c3093L1697n7158r4022M5259J17552J5296n0135j2280k0033m8584J7563O6005
139b1933j7310o3244M3251R8975k9671j18080k0802O5906K0141M235N2671R829
151B3968p4067l1905M1599M833j6780O0580O2473n4440p4614L9526O5220l1318
163A5075m9597L8631O1010K645j0640m278m8603l9707O7363Q7978k6469o3810
175B9598K2279K9911n0219l0566N5734L9071k9655j9014J6376j0398k6300J2602
187C9419J2150l6389p309P0740K9731q6677p2181M1738N2563j3527r957J4318
199C4619k1234l1225J7403J4032l3704q321M9000J5014n1808k0947M2730P628
$$ plain form
211 13187 -39201 -51306 3094 31522 7577 -9765 -21774 -47550 -33301 26081 32229 -25090
223 -25090 -34599 15745 20799 -25965 -34370 2984 15517 213 2767 10817 -4482 -14783 -311
236 -311 -443 -18460 2861 45664 22586 -40398 -38361 14892 24489 -4198 -9199 1585 -175 776
250 776 4980 -12035 -29977 -7942 26229 13640 -23632 -18567 10756 -982 -31757 -17859 16301
263 16301 14176 -5960 -12866 -18765 -19529 4122 18283 -8489 -28565 -1356 25656 2354 -30751
276 -30751 -21626 9575 14721 719 -3360 -2426 -5789 -1383 3985 -8056 -10993 14890 25701 -6403
290 -6403 -28060 -3440 19905 7235 -10888 -6378 6940 12136 5682 -7020 -15996 -7198 14985
303 14985 19229 -5107 -18646 1599 16224 -3692 -18191 -1909 13455 8718 -1937 -8954 -9891
$$ packed form
211A3187n2388j2105N4400K8428k3945j7342j2009k5776J4249N9382O148n7319
223b5090r509N0344N054m6764q405L7354J2533j5304K554Q050j5299j0301J4472
236c11j32j8017K1321M2803k3078o2984K037N3253R597k8687n001J0784j760R51
250G76M204j7015j7942K2035L4171j2589l7272N065K9323j1738l0775J3898L4160
263A6301k125k0136o906n899p64K3651J4161k6772k0076K7209K7012k3302l3105
276c0751R125L1201N146j4002m079R34l363M406N368j2041k937K5883J0811l2104
290f403k1657K4620K3345j2670j8123M510J3318N196o454j2702q976Q798K2183
303A4985M244k4336j3539K0245J4625j9916j4499J6282J5364m737j0655p017r37
$$ plain form
316 -9891 1277 11251 1250 -13049 -5890 13824 13380 -10177 -21594 -2639 16333 8468 -7477
329 -7477 -7728 76 5013 4198 -5769 -12553 1471 17026 6727 -14142 -12198 5404 11059 -919
343 -919 -11140 -3703 9918 9018 -4774 -12882 -6868 6064 11892 157 -13444 -6049 9970 5817
357 5817 -10892 -12612 1120 9994 4683 -8471 -13042 -2151 7529 831 -10118 -9467 1720 7751
371 7751 -892 -15730 -12881 3764 7808 -4514 -12805 -7068 1848 3813 -6147 -14850 -6220 7734
385 7734 5795 -7420 -12032 -3888 5927 4782 -6817 -10277 2700 11446 3137 -7804 -6510 4429
399 4429 11805 6818 -4435 -2804 9942 13209 3466 -3387 1981 12508 16212 6586 -3045 3626
413 3626 15706 14019 3850 768 7543 15633 14158 1968 -2785 8036 16540 10311 1038 727
$$ packed form
316i891J1168R974j0001j4299P159J9714m44k3557j1417J8955J8972p865j5945
329g477k51P804M937q15r967o784J4024J5555j0299k0869J944J7602N655j1978
343i19j0221P437J3621r00j3792q108O014J2932N828j1735j3601P395J6019m153
357E817j6709j720J3732Q874n311j3154m571J0891R680o698j0949O51J1187O031
371G751q643j4838K849J6645M044j2322q291N737Q916J965r960q703Q630J3954
385G734j939j3215m612Q144R815j145j1599l460J2977Q746q309j0941J294J0939
399D429P376m987j1253J631J2746L267r743o853N368J0527L704r626r631O671
413C626J2080j687j0169l082O775Q090j475j2190m753J0821Q504o229r273l11
$$ plain form
427 727 7778 13295 7874 -2875 -1914 9564 12871 4026 -3908 -1717 6577 10103 935 -6804 -156
442 -156 9079 6431 -1897 -5490 -1755 6476 7641 -1481 -7428 1288 8843 3522 -5475 -5545 3088 8710
458 8710 2596 -5744 -3728 3858 5382 1235 -4199 -5583 2204 8412 -825 -12224 -6242 5084 1874
473 1874 -7478 -9655 -5838 -2627 -3863 -9776 -13196 -10296 -5190 -5515 -13762 -19680 -11986 -3185 -11502
488 -11502 -23579 -18190 -7039 -9441 -16851 -17886 -17588 -15064 -8427 -8839 -18355 -19939 -8638 -2678 -11330
503 -11330 -17431 -8693 930 -4096 -10653 -4293 2483 -302 -194 3684 123 860 13823 15618 793
518 793 -1306 16496 24070 12139 6196 14018 19657 16859 16235 19122 15042 11729 19684 23885 12368
533 12368 8703 21972 22551 5172 4633 21817 20963 4806 2830 10116 8979 6637 10780 6437 -6647
$$ packed form
427G27P051N517n421j0749R61J1478L307q845p934K191Q294L526r168p739O648
442a56R235k648q328l593L735Q231J165r122n947Q716P555n321q997p0Q633N622
458H710o114q340K016P586J524m147n434j384P787O208r237j1399N982J1326l210
473A874r352k177L817L211j236n913l420K900N106l25q247n918P694Q801q317
488a1502j2077N389J1151k402p410j035K98K524O637m12r516j584J1301N960q652
503a1330o101Q738R623n026o557O360O776k785J08L878l561P37J2963J795j4825
518G93k099J7802P574j1931n943P822N639k798o24K887m080l313P955M201j1517
533A2368l665J3269N79j7379n39J7184q54j6157j976P286j137k342M143m343j3084
$$ plain form
548 -6647 -4508 11575 11431 -8218 -12195 3617 4708 -9302 -5907 4864 -4531 -14956 -4153 2459
562 2459 -8012 -8415 2074 -4773 -18195 -6811 12191 2772 -18052 -12709 5525 3915 -5766 -873
576 -873 1404 -11045 -7669 12373 8655 -12940 -8726 9076 1222 -11728 2301 12646 -6246
589 -6246 -18340 -639 10083 -2833 -9820 -2081 -6400 -16455 -2454 13321 -6630 -30410 -12995
602 -12995 8628 -4970 -18860 -6315 -4801 -22007 -16255 5769 -1004 -22690 -16669 -1042 -9131
615 -9131 -16094 959 6480 -18382 -26367 3578 17432 -5621 -14928 676 690 -8085 9507 22247
629 22247 -2642 -18700 7797 25917 7814 -810 15084 13859 -4127 5750 31680 22644 -4216
642 -4216 1420 22021 15231 7027 23363 22118 -8033 -6483 29770 32128 -886 -5638 13792 9713
$$ packed form
548f647K139J6083j44j9649l977J5812J091j4010L395J0771r395j0425J0803O612
562B459j0471m03J0489o847j3422J1384J9002r419k0824N343J8234j610r681M893
576h73K277j2449L376K0042l718k1595M214J7802p854j2950J4029J0345j8892
589f246j2094J7701J0722j2916o987P739m319j0055J4001J5775j9951k3780J7415
602a2995K1623j3598j3890J2545J514j7206N752K2024o773k1686O021J5627q089
615i131o963J7053N521k4862p985K9945J3854k3053r307J5604J4q775J7592J2740
629B2247k4889j6058K6497J8120j8103q624J5894j225j7986R877K5930r036k6860
642d216N636K0601o790q204J6336j245l0151J550L6253K358l3014m752J9430m079
$$ plain form
656 9713 -737 15374 22306 -5613 -18584 8197 22650 49 -8769 6717 1094 -19429 -2177
669 -2177 25146 4111 -28584 -14053 10806 108 -8794 5519 -1230 -27627 -15653 20091 12869
682 12869 -21485 -19527 3938 -1237 -11609 6253 12826 -17302 -27523 6744 20304 -5992 -12817
695 -12817 4733 -4221 -18663 6638 27442 -3049 -29839 -6000 18069 4276 -6181 6260
707 6260 -305 -20818 -6244 25698 12742 -21750 -14310 10609 1138 -9054 11607 12208 -21621
720 -21621 -23793 14356 20811 -8728 -13635 2031 -5153 -13291 10215 21940 -10838 -30856 -692
733 -692 21295 996 -10219 5390 -1172 -20632 -821 28059 7494 -24616 -9177 13314 1459
746 1459 -3887 14410 8233 -21949 -14709 22775 22699 -9888 -12521 6762 1019 -6439 15083 21199
$$ packed form
656I713j0450J6111O932k7919j2971K6781J4453k2601q818J5486n623k0523J7252
669b177K7323k1035l2695J4531K4859j0698q902J4313o749k6397J1974L5744p222
682A2869l4354J958K3465n175j0372J7862O573l0128j0221L4267J3560k6296o825
695a2817J7550q954j4442K5301K0804l0491k6790K3839K4069j3793j0457J2441
707F260o565k0513J4574L1942j2956l4492P440K4919r471j0192K0661O01l3829
720b1621k172L8149O455k9539m907J5666p184q138K3506J1725l2778k0018L0164
733f92K1987k0299j1215J5609o562j9460J9811K8880k0565l2110J5439K2491j1855
746A459n346J8297o177l0182P240L7484p6l2587k633J9283n743p458K1522O116
$$ plain form
760 21199 -13322 -24990 10191 24425 -1605 -8173 7948 -1705 -16960 5926 27078 1647
772 1647 -24640 -6292 14346 2182 -4150 10054 2043 -23087 -10397 23810 15160 -18171 -13857
785 -13857 6997 -1307 -7532 12434 12060 -19436 -21490 11316 17545 -6354 -9978 3968 -4246 -14299
799 -14299 6921 21957 -4781 -25572 -2746 16248 680 -5379 8069 -862 -20211 -2306
811 -2306 24828 8484 -18709 -7931 9442 885 -3799 12409 8858 -16569 -13869 16055 17642
824 17642 -6635 -8109 6604 -1645 -9115 11840 20032 -8306 -20889 4956 16845 -288 -3657
837 -3657 7285 -1545 -14026 3208 21269 3738 -17073 -4538 10859 1039 -3644 9813 5242
850 5242 -16310 -9180 16759 11863 -10473 -6977 5408 -2733 -6835 10053 11256 -11427 -15553 6279
$$ packed form
760B1199l4521j1668L5181J4234k6030o568J6121r653j5255K2886K1152k5431
772A647k6287J8348K0638j2164o332J4204q011k5130J2690L4207q650l3331M314
785a3857K0854q304o225J9966l74l1496k054L2806O229k3899l624J3946q214j0053
799a4299K1220J5036k6738k0791K2826J8994j5568o059J3448q931j9349J7905
811b306K7134j6344k7193J0778J7373q557m684J6208l551k5427K700K9924J587
824A7642k4277j474J4713q249p470K0955Q192k8338j2583K5845J1889j7133l369
837c657J0942q830j2481J7234J8061j7531k0811J2535J5397r820m683J3457m571
850E242k1552P130K5939m896k2336L496J2385q141m102J6888J203k2683m126K1832
$$ plain form
864 6279 12572 -3173 -5828 3631 -2546 -11801 2914 15735 -2014 -16914 -2081 9207 -1698
877 -1698 -4020 7274 335 -14532 -3867 14174 5781 -10656 -5236 4508 -1508 -4080 7607 6906
891 6906 -10231 -10736 8404 10594 -4780 -4372 5213 -1288 -7658 5856 12548 -4007 -11149 3244
905 3244 8964 -650 -920 6262 954 -8218 900 12983 4454 -8046 -1457 7385 709 -1616 7950
920 7950 6030 -7542 -4343 10093 7228 -4394 -735 5076 -513 -3140 5848 8069 -3444 -6392
934 -6392 3513 6951 -889 -1972 4051 48 -6556 1071 8569 -416 -7838 -605 4195 -2491 -2844
949 -2844 3398 64 -7231 -3443 4292 1126 -5755 -3944 537 -2794 -4868 373 1732 -6628 -8183
964 -8183 513 1237 -5957 -4855 271 -4458 -7370 -1519 1453 -5111 -7326 -2982 -1111 -4640 -4803 -1464
$$ packed form
864F279O293j5745k655R459o177r255J4715J2821j7749j4900J4833J1288j0905
877a698k322J1294o939j4867J0665J8041q393j6437N420R744o016k572J1687p01
891F906j7137n05J9140K190j5374M08R585o501o370J3514O692j6555p142J4393
905C244N720r614k70P182n308r172R118J2083q529j2500O589Q842o676k325R566
920G950j920j3572L199J4436k865j1622L659N811n589k627Q988K221j1513k948
934f392R905L438p840j083O023m003o604P627P498q985p422P233M800o686l53
949b844O242l334p295L788P735l166o881J811M481l331k074N241J359q360j555
964h183Q696P24p194J102N126m729k912N851K972o564k215M344J871l529j63L339
$$ plain form
980 -1464 -2734 -6965 -4358 888 -1691 -6887 -3612 -43 -3800 -4974 194 -204 -5386 -4033 1159
995 1159 -702 -3553 -2041 192 -1775 -2528 314 1861 -953 -2370 1044 2656 -238 -354 2592 1775
1011 1775 -925 1953 4744 2029 615 3236 3871 2464 2683 4296 3926 2722 3492 4523 4741 3380
1027 3380 3408 5476 4671 3158 4792 5823 3618 3139 5706 4955 3177 4236 5155 3986 3645 4541 4323
1044 4323 3631 3454 3271 3715 3352 2584 2887 3720 2333 2089 3030 2491 1185 2085 2463 1332 1352 1998 1208
1063 1208 675 1220 901 427 670 415 2 260 -102 -857 -231 -407 -1416 -1018 -565 -1789 -2177 -1345 -2200
1082 -2200 -2901 -2118 -2504 -3262 -3078 -2990 -3756 -3772 -3685 -4600 -4337 -4193 -4860 -5029 -4279 -5205 -5612 -4782 -4964 -5737 -4740
1103 -4740 -4933 -5784 -5133 -4665 -5527 -5108 -4574 -4874 -4817 -4085 -4582 -4004 -3156 -3117 -3483 -2429 -2346 -2751 -1361 -1210
$$ packed form
980a464j270m231K607N246k579n196L275L569l757j174N168l98n182J353N192
995A159j861k851J512K233j967p53K842J547k814j417L414J612k894j16K946q17
1011A775k700K878K791k715j414K621O35j407K19J613l70j204P70J031K18j361
1027C380K8K068q05j513J634J031k205m79K567p51j778J059R19j169l41Q96k18
1044D323o92j77j83M44l63p68L03Q33j387k44R41n39j306R00L78j131K0O46p90
1063A208n33N45l19m74K43k55m13K58l62p55O26j76j009L98M53j224l88Q32q55
1082b200p01P83l86p58J84Q8p66j6Q7r15K63J44o67j69P50r26m07Q30j82p73R97
1103d740j93q51O51M68q62M19N34l00N7P32m97N78Q48L9l66J054Q3m05J390J51
$$ plain form
1123 -1210 -1967 -768 310 -240 -564 1316 1170 724 1738 2069 1805 2172 2593 2530 2877 2792 3128 3720 3791
1142 3791 2742 3428 4594 3119 2619 4809 3934 2429 3511 4449 3226 2667 3757 3620 2241 2237 3304
1159 3304 3564 2250 1207 2279 3123 1652 1391 2914 2431 168 2021 3341 834 11 2037 2029 9
1176 9 792 2519 1434 -421 337 2178 1650 -98 706 1859 43 -1192 2093 2912 -1203 -1672 2032
1193 2032 1486 -1755 -148 2132 -1243 -2973 288 1478 -1973 -3137 -963 -670 -3258 -2636 344 -1464
1209 -1464 -5984 -4321 401 -1863 -6070 -3160 -1600 -6093 -5328 253 -1632 -7373 -6099 -986 -2559
1224 -2559 -5298 -2869 -1151 -4927 -6590 -1240 1707 -3564 -6030 -800 193 -3993 -1249 3760 -1079
1239 -1079 -6284 -108 5763 590 -2828 1855 2663 -1484 868 6579 4078 -2983 -543 6243 4763
$$ packed form
1123a210p57J199J078n50l24J880j46m46J014L31k64L67M21o3L47q5L36N92P1
1142C791j049O86J166j475n00K190q75j505J082R38j223n59J090j37j379mJ067
1159C304K60j314j043J072Q44j471k61J523m83k263J853J320k507q23K026qk020
1176IP83J727j085j855P58J841n28j748Q04J153j816j235L285Q19m115m69L704
1193B032n46l241J607K280l375j730L261J190l451j164K174K93k588O22K980j808
1209a464m520J663M722k264m207K910J560m493P65N581j885n741J274N113j573
1224b559k739K429J718l776j663N350K947n271k466N230R93m186K744N009m839
1239a079n205O176N871n173l418M683Q08m147K352N711k501p061K440O786j480
$$ plain form
1254 4763 -2 3321 6440 -334 -1776 7788 9130 -460 -1792 5379 5124 382 4097 7260 21
1269 21 -4052 3780 9486 1924 -2879 2728 3745 -1881 465 8142 3077 -7012 -1878 7367 2702
1284 2702 -3295 1859 3245 -4767 -3284 7737 5879 -6134 -5779 3209 2878 -2549 1575 4140 -4297
1299 -4297 -7683 3342 8750 -2330 -7481 1317 2232 -5007 363 7940 -1454 -11181 -1944 7680 903
1314 903 -5328 165 292 -6831 -3378 7888 3719 -10361 -7901 4229 2431 -4858 174 3208 -7779
1329 -7779 -9494 5303 7987 -6351 -8943 1120 183 -5597 1041 6636 -4823 -12748 -884 9357
1343 9357 384 -7234 -705 716 -6823 -1619 10134 2265 -12715 -5308 7918 2772 -4382 2320
1357 2320 3042 -7716 -5877 10051 9275 -6498 -7764 3674 3640 -2607 3960 7961 -5079 -11460 5081
$$ packed form
1254D763m765L323L119o774j442R564J342r590j332P171k55m742L715L163p239
1269B1m073P832N706p562m803N607J017n626K346P677n065j0089N134R245m665
1284B702n997N154J386q012J483J1021j858j2013L55Q988l31n427M124K565q437
1299d297l386J1025N408j1080n151Q798R15p239N370P577r394r727R237R624o777
1314I03o231N493J27p123L453J1266m169j4080K460J2130j798p289N032L034j0987
1329g779j715J4797K684j4338k592J0063r37n780O638N595j1459p925J1864J0241
1343I357q973p618O529J421p539N204J1753p869j4980P407J3226n146p154O702
1357B320P22j0758J839J5928p76j5773j266J1438l4o247O567M001j3040o381J6541
$$ plain form
1372 5081 13558 -416 -6982 2187 2363 -4896 2898 12485 208 -12531 -1752 10725 3785 -3553
1386 -3553 2580 2349 -7501 -3179 12699 8605 -9459 -7779 6171 3820 -3182 4517 5883 -8519
1400 -8519 -10300 8190 12197 -3294 -7908 1967 1477 -4531 3270 10259 -2913 -13856 -628 11427
1414 11427 1868 -6008 1313 851 -8605 -1105 13375 4363 -13030 -6470 7158 2877 -3033 3311
1428 3311 2840 -9888 -7516 9706 10323 -6208 -9027 2902 1703 -4447 4060 9242 -5890 -13781
1442 -13781 3025 12572 -675 -6389 1811 12 -7199 2004 12652 1046 -13309 -3860 9095
1455 9095 3263 -3247 2972 2378 -8815 -4789 11958 8746 -8572 -7102 4887 2124 -3214 5274
1469 5274 6888 -7750 -10377 6579 11298 -1642 -6061 1743 635 -4544 3396 11205 -1271 -12420
$$ packed form
1372E081Q477j3974o566R169J76p259P794R587j2277j2739J0779J2477o940p338
1386c553O133k31r850M322J5878m094j8064J680J3950k351p002P699J366j4402
1400h519j781J8490M007j5491m614R875m90o008P801O989j3172j0943J3228J2055
1414A1427r559p876P321m62r456P500J4480r012j7393O560J3628m281n910O344
1428C311m71j2728K372J7222O17j6531k819J1929j199o150Q507N182j5132p891
1442a3781J6806R547j3247n714Q200j799p211R203J0648j1606j4355R449J2955
1455I095n832o510O219n94j1193M026J6747l212j7318J470J1989k763n338Q488
1469E274J614j4638k627J6956M719j2940m419P804j108n179P940P809j2476j1149
$$ plain form
1483 -12420 -787 10540 2225 -4049 3450 1574 -7988 -1243 12244 5695 -8913 -4941 5679
1496 5679 2415 -1721 4695 4741 -7543 -7051 8404 10519 -3611 -6181 3030 1614 -3960 4418 9238
1511 9238 -3843 -10287 2648 9553 54 -3702 2665 320 -6513 482 10516 2490 -9565 -3707
1525 -3707 5860 1689 -3036 2937 2361 -8403 -5741 8288 6202 -7084 -5872 2510 -641 -4466
1539 -4466 3001 4689 -6530 -9575 1629 5918 -2673 -5664 39 -1488 -7210 -502 6283 -2304
1553 -2304 -11298 -3584 4025 -2005 -5336 117 -1589 -9134 -4495 4891 967 -8672 -6348 537 -1968
1568 -1968 -5032 19 1254 -7317 -8250 1795 3996 -4672 -5916 110 -1911 -5650 914 4686 -3650
1583 -3650 -8113 -428 4140 -962 -2816 1665 644 -4439 -443 6665 2474 -4789 -1202 4756 2075
$$ packed form
1483a2420J1633J1327q315o274P499j876r562O745J3487o549j4608L972J0620
1496E679l264m136O416M6j2284M92J5455K115j4130k570R211j416n574Q378M820
1511I238j3081o444J2935O905r499l756O367k345o833O995J0034q026j2055N858
1525c707R567m171m725N973n76j0764K662J4029k086j3286J212Q382l151l825
1539d466P467J688j1219l045J1204M289q591k991N703j527n722O708O785q587
1553b304q994P714P609o030l331N453j706p545M639R386l924r639K324O885k505
1568a968l064N051J235q571r33J0045K201q668j244O026k021l739O564L772q336
1583c650m463P685M568n102j854M481j021n083L996P108m191p263L587N958k681
$$ plain form
1598 2075 -823 4683 4481 -2237 -1101 7285 6403 -244 945 5149 3024 1290 5526 7313 1557
1613 1557 -849 5617 8508 3170 1721 5948 4970 988 4459 9079 4427 -60 3910 7010 3565
1628 3565 2639 6115 4802 452 2152 6995 5630 897 1591 4754 3233 1290 4113 4814 66 -929
1644 -929 3995 4174 -151 -11 2475 983 -1210 1436 2951 -490 -2780 -232 1473 -933 -1988 -526
1660 -526 -880 -3721 -2724 407 -1427 -4826 -3480 -1086 -3380 -4903 -2229 -2451 -5570 -5273 -2544 -3120
1676 -3120 -5484 -5313 -4146 -4980 -5802 -4584 -3367 -5270 -6556 -4722 -3168 -5410 -6145 -3604 -4181 -6166
1692 -6166 -4535 -2700 -4420 -5305 -3804 -2927 -4120 -4092 -2623 -2793 -3464 -3162 -1944 -1552 -2607 -2047 -802
1709 -802 -1130 -2072 -384 424 -859 -748 762 1202 -37 501 1571 1312 1183 1973 2140 2085 2014 2403 3085
$$ packed form
1598B075k898N506k02o718J136Q386q82o647J189M204k125j734M236J787n756
1613A557k406O466K891n338j449M227r78l982L471M620m652m487L970L100l445
1628C565r26L476j313m350J700M843j365m733O94L163j521j943K823P01m748r95
1644i29M924J79m325J40K486j492k193K646J515l441k290K548J705k406j055J462
1660e26l54k841R97L131j834l399J346K394k294j523K674k22l119K97K729n76
1676c120k364J71J167q34q22J218J217j903j286J834J554k242p35K541n77j985
1692f166J631J835j720q85J501Q77j193K8J469j70o71L02J218L92j055N60J245
1709h02l28r42J688Q08j283J11J510M40j239N38J070k59j29P90J67n5p1L89O82
$$ plain form
1728 3085 2936 2406 3045 3628 2872 2939 4013 3589 3114 3329 4160 3275 3526 3948 3648 3218 3634 3712 3690 3413
1748 3413 3252 3342 3477 3029 2833 3225 3293 2270 2897 3442 2329 2491 2454 2281 1834 1966 1946 1598 1517 1452 996
1769 996 1424 1108 364 721 793 -71 -189 366 -679 -652 -419 -708 -1109 -740 -654 -1375 -1209 -1136 -1430 -1501 -1066
1790 -1066 -1654 -1585 -1147 -1790 -1808 -1874 -1878 -1891 -1784 -1958 -1905 -1759 -1409 -1997 -2164 -1375 -1930 -2075 -1194 -1476 -1597 -1323
1812 -1323 -1356 -1430 -1105 -1434 -1193 -1080 -895 -1165 -855 -633 -1049 -1023 -294 -539 -855 -329 -110 -843 -595 47 -349
1833 -349 -567 -68 293 -287 -296 -227 25 -57 -520 317 682 230 208 891 675 -223 275 1294 113 -308 534
1854 534 569 135 338 1115 518 -71 178 1317 846 -199 76 1352 397 -383 781 1369 -308 -895 956
1873 956 1144 -578 -249 1218 -357 -1229 648 1017 -353 -858 239 708 -213 -490 927 245 -1657
$$ packed form
1728C085j49n30O39N83p56O7J074m24m75K15Q31q85K51M22l00m30M16P8k2k77
1748C413j61R0J35m48j96L92O8j023O27N45j113J62l7j73m47J32k0l48q1o5m56
1769I96M28l16p44L57P2q64j18N55j045K7K33k89m01L69Q6p21J66P3k94p1M35
1790a066n88O9M38o43j8o6mj3J07j74N3J46L50n88j67P89n55j45Q81k82j21K74
1812a323l3p4L25l29K41J13J85k70L10K22m16K6P29k45l16N26K19p33K48O42l96
1833c49k18M99L61n80rO9K52q2m63Q37L65m52k2O83k16q98M98J019j181m21Q42
1854E34L5m34K03P77n97n89K49J139m71j045K75J276r55p80J164N88j677n87J851
1873I56J88j722L29J467j575q72J877L69j370n05J097M69r21k77J417o82j902
$$ plain form
1890 -1657 -634 1538 596 -1478 184 976 -726 -1336 1548 1244 -1539 -1122 1243 559 -1118 -134 912
1907 912 -665 -1448 726 2178 -460 -2078 711 1407 -1039 -346 1849 -172 -2735 303 2806 126
1923 126 -1971 471 1000 -1196 -410 2310 1228 -2279 -1463 2220 1501 -1390 98 1500 -1063 -1796
1939 -1796 2378 2802 -1913 -2777 1779 1460 -1477 412 1992 -629 -2831 579 3106 -59 -2516 52
1955 52 1513 -1325 -531 3089 678 -4252 -1646 3344 1157 -2356 -438 1237 -2177 -1575 3180 2643
1971 2643 -3009 -2877 1990 1574 -1424 -249 1821 -1836 -3662 1640 4457 -855 -3710 898 1891 -1572
1987 -1572 427 3963 -299 -4787 42 4946 1406 -2770 290 1686 -1947 -510 4470 2618 -3917
2002 -3917 -2605 3786 2694 -1611 854 2809 -2261 -3356 4142 5693 -2434 -4137 1800 2417 -1077
$$ packed form
1890a657J023K172r42k074J662P92j702o10K884l04k783M17K365o84j677R84J046
1907I12j577p83K174J452k638j618K789O96k446O93K195k021k563L038K503k680
1923A26k097K442N29k196P86K720j082l507Q16L683p19k891J488J402k563p33
1939a796M174M24m715q64M556l19k937J889J580k621k202L410K527l165k457K568
1955E2J461k838P94L620k411m930K606M990k187l513J918J675l414O02M755n37
1971B643n652J32M867m16k998J175K070l657j826N302K817n312k855M608R93l463
1987a572J999L536m262m488M829M904l540m176L060J396l633J437M980j852o535
2002c917J312O391j092m305K465J955n070j095P498J551q127j703N937O17l494
$$ plain form
2017 -1077 1033 3443 -1491 -5045 1035 5879 721 -3694 44 1642 -2353 -659 5068 1266 -6371
2032 -6371 -2801 4542 1927 -2624 -556 1010 -4133 -3133 4433 3869 -4625 -5680 1216 1796 -2611
2047 -2611 -561 2382 -3325 -6466 1270 5464 -1795 -5496 -278 553 -3543 -416 4507 -1426 -8061
2062 -8061 -1958 4515 1020 -3824 -897 128 -4007 -1939 5245 2798 -6585 -4879 3572 2360 -2652
2077 -2652 259 2479 -4106 -5001 3849 5874 -2149 -4716 1176 1771 -1615 1339 5175 -1192 -6392
2092 -6392 521 7610 2008 -3390 890 2311 -2567 653 7282 2990 -5371 -1982 5494 3466 -883
2107 -883 2204 3061 -3017 -2755 6401 7021 -2113 -4057 2630 3330 -670 2395 5012 -2075 -5598 3234
2123 3234 8048 14 -3760 1275 1823 -2199 1029 6299 799 -6457 -1826 5549 2131 -2204 574
$$ packed form
2017a077K110K410m934l554O080M844n158m415L738J598l995J694N727l802p637
2032f371L570P343k615m551K068J566n143J000P566n64q494j055O896N80m407
2047b611K050K943n707l141P736M194p259l701N218Q31m096L127M923n933o635
2062h061O103O473l495m844K927J025m135K068P184k447r383J706Q451j212n012
2077b652K911K220o585q95Q850K025q023k567N892N95l386K954L836o367n200
2092f392O913P089n602n398M280J421m878L220O629m292q361L389P476k028m349
2107h83L087Q57o078K62R156O20r134j944O687P00m000L065K617p087l523Q832
2123C234M814q034l774N035N48m022L228N270n500p256M631P375l418m335K778
$$ plain form
2138 574 1540 -4251 -2365 5937 4548 -5586 -5032 2645 1722 -1958 986 2150 -4579 -5629 3078 5059
2154 5059 -2570 -5216 -1 225 -3205 -93 4191 -1791 -7761 -1902 4407 11 -4124 -388 -638
2169 -638 -5129 -1766 4944 1048 -6989 -4735 2406 895 -2729 -179 745 -4633 -4813 2702 4145 -3699
2185 -3699 -5140 865 337 -2999 1009 4036 -2868 -6450 650 5178 -60 -3358 357 281 -2707 511
2201 511 5150 864 -5082 -1391 5088 2094 -1756 1549 2401 -2564 -1753 5171 4649 -2228 -2034 3075
2217 3075 1884 -387 2959 3774 -1845 -3337 3270 5704 154 -2345 1467 1595 -942 1159 4695
2232 4695 515 -4314 262 4135 606 -1720 1407 1436 -2815 -1060 4403 2645 -3063 -2546 1916 1205
2248 1205 -900 1268 1418 -2893 -2904 2547 3476 -2222 -2871 1236 957 -2151 315 2765 -766 -3573
$$ packed form
2138E74R66n791J886Q302j389j0134N54P677r23l680K944J164o729j050Q707J981
2154E059p629k646N215K26l430L112M284n982n970N859O309m396m135L736k50
2169f38m491L363O710l896q037K254P141j511l624K550R24n378j80P515J443p844
2185c699j441O005n28l336M008L027o904l582P100M528n238l298L715p6k988L218
2201E11M639m286n946L691O479k994l850L305Q52m965Q11O924n22o877J94N109
2217C075j191k271L346Q15n619j492O607K434n550k499L812J28k537K101L536
2232D695m180m829M576L873l529k326L127K9m251J755N463j758n708N17M462p11
2248A205k105K168J50m311j1N451R29n698o49M107k79l108K466K450l531k807
$$ plain form
2264 -3573 304 2830 -156 -1708 706 308 -2475 -335 3533 1100 -3891 -1482 2270 900 -1512
2279 -1512 628 673 -2366 -1716 2768 1755 -2479 -1678 1103 277 -1818 338 1602 -1231 -3180 158
2295 158 2220 -329 -1719 26 -93 -2406 -291 2540 -313 -3510 -565 1830 -266 -1434 169
2310 169 350 -1531 -840 1479 777 -1588 -1223 841 42 -1230 1053 1685 -1116 -2174 986 2115 -212
2327 -212 -1392 857 43 -638 625 1375 -330 -1549 473 1628 -492 -927 553 1046 -647 -1005 1199
2344 1199 849 -1129 -629 708 -143 -814 722 744 -1844 -1061 1117 1036 -919 -1106 218 282 -183 -397
2362 -397 323 -510 -635 294 802 -863 -782 1035 375 -1093 -716 1167 371 -822 -264 391 169 191 302
2381 302 -80 -72 442 1200 635 -600 -133 865 979 -388 -19 724 437 138 457 444 81 641 1024 221
$$ packed form
2264c573L877K526k986j552K414l98k783K140L868k433m991K409L752j370k412
2279a512K140M5l039O50M484j013m234Q01K781q26k095K156J264k833j949L338
2295A58K062k549j390J745j19k313K115K831k853l197K945K395k096j168J603
2310A69J81j881O91K319p02k365L65K064p99j272K283O32k801j058L160J129k327
2327b12j180K249q14o81J263P50j705j219K022J155k120m35J480M93j693l58K204
2344A199l50j978N00J337q51o71J536K2k588P83K178q1j955j87J324O4m65k14
2362c97P20q33j25R29N08j665Q1J817o60j468L77J883p96j193N58O55k22K2J11
2381C02l82QN14P58n65j235M67R98J14j367L69P43k87k99L19j3l63N60L83q03
$$ plain form
2401 221 -322 301 1115 673 -386 38 808 736 -412 -274 448 63 356 114 -80 -618 544 1152 -106
2420 -106 -751 408 363 -25 -131 -209 -49 359 101 -329 -443 -6 188 60 -181 -620 -9 590 -153 -1055
2440 -1055 -127 -38 -33 -293 -530 -374 262 12 -372 -559 -351 113 279 -227 -881 -270 679 -233 -417 -288 290
2461 290 255 211 191 -608 -11 432 54 -133 -248 -53 495 352 -837 -300 514 420 -150 -139 248 102 713
2482 713 -19 -434 -336 579 267 -268 -493 54 701 79 -235 -373 161 436 -157 -124 -118 110 461 159 -663
2503 -663 -592 301 248 -186 -340 -45 544 330 -208 -593 -407 29 -62 -710 -595 -94 434 -87 -894 -779 -104
2524 -104 302 -376 -401 -222 -217 605 344 -927 -756 -6 272 -451 -938 179 409 -29 -485 -591 190 -239
2544 -239 -57 -148 -469 -447 248 477 -938 -1080 10 782 -426 -626 210 -105 -314 206 -255 -541 -269 265
$$ packed form
2401B21n43O23Q14m42j059M24P70p2j148J38P22l85K93k42j94n38J162O08j258
2420a06o45J159m5l88j06p8J60M08k58m30j14M37J94j28k41m39O11N99p43r02
2440a055R28Q9Nk60k37J56O36k50l84j87K08M64J66n06o54O11R49r12j84J29N78
2461B90l5m4k0p99N97M43l78j87j15J95N48j43j189N37Q14r4n70J1L87j46O11
2482G13p32m15R8R15l12n35k25N47O47o22l14j38N34K75n93L3OK28L51l02q22
2503f63P1Q93n3m34j54K95N89k14n38l85J86M36r1o48J15N01N28n21q07J15O75
2524a04M06o78k5J79NQ22k61j271J71P50K78p23m87J117K30m38m56j06P81m29
2544b39J82r1l21K2O95K29j415j42J090P72j208k00Q36l15k09N20m61k86K72N34
$$ plain form
2564 265 310 -240 -481 712 881 -551 -777 1062 777 -262 14 758 172 226 1183 731 -740 -167 1527
2583 1527 1230 -230 -359 951 911 -251 410 1431 463 -236 934 904 40 481 1418 713 -933 373
2601 373 2273 859 -747 16 846 444 433 1067 514 -854 -139 1492 523 -1147 -400 1303 62 -1314
2619 -1314 405 1654 -631 -1337 166 523 -422 1 454 -943 -1517 224 1922 -562 -2406 -535
2635 -535 1147 -361 -1506 329 121 -1855 -938 1410 317 -1627 -251 669 -1318 -1668 1121 1257
2651 1257 -2017 -2191 234 1274 -444 -751 280 -930 -1812 707 1761 -1164 -2588 -54 1399 -1086
2667 -1086 -876 1700 -111 -2659 -620 1882 521 -1539 -298 257 -1233 -631 2083 1170 -2569 -2262
2683 -2262 1973 1985 -1375 -827 736 -571 -1177 1649 2252 -1322 -1831 1128 1672 -673 109 1701 -8
$$ packed form
2564B65M5n50k41J193J69j432k26J839k85j039K76P44n86N4R57m52j471N73J694
2583A527k97j460j29J310m0j162O61J021r68o99J170l0q64M41R37p05j646J306
2601C73J900j414j606P63Q30m02j1O34n53j368P15J631r69j670P47J703j241j376
2619a314J719J249k285p06J503L57r45M23M53j397n74J741J698k484j844J871
2635e35J682j508j145J835k08j976R17K348j093j944J376R20j987l50K789J36
2651A257l274j74K425J040j718l07J031j210q82K519J054k925j424K534J453k485
2667a086K10K576j811k548K039K502j361k060J241N55j490O02K714r13l739L07
2683b262M235J2l360N48J563j307o06K826O03l574n09K959N44k345P82J592j709
$$ plain form
2700 -8 -2504 -40 3392 807 -2051 -557 1187 -475 277 2742 593 -3093 -939 3328 2051 -1356
2716 -1356 -103 1440 -531 -1037 2028 2235 -1494 -2143 1331 1937 -582 -16 1664 -1112 -3097 1267
2732 1267 4115 9 -3416 -287 1373 -506 235 2149 -248 -3341 -553 3341 960 -2333 -315
2747 -315 1211 -1458 -1149 2237 2056 -2823 -2783 1601 1978 -1094 94 1312 -1951 -2409 2335 3349 -1594
2764 -1594 -3302 695 1843 -723 -298 1712 -428 -3394 27 3524 596 -2704 -25 1087 -1555
2779 -1555 -947 2984 1439 -3951 -2203 2573 1879 -1327 -710 393 -1964 -1786 2698 2588 -2225 -3240
2795 -3240 1361 2054 -1036 -436 1987 -1058 -3731 755 3760 59 -2554 -34 701 -1135 235 3013
2811 3013 294 -3875 -1562 3702 1871 -1695 -204 1135 -1110 -1242 3067 2466 -2497 -2458 1798 1709
$$ packed form
2700hk496K464L432k585k858J494J744j662P52K465k149l686K154M267j277l407
2716a356J253J543j971n06L065K07l729o49L474O06k519N66J680k776j985M364
2732A267K848m106l425L129J660j879P41J914k397l093K788L894k381l293K018
2747c15J526k669L09L386j81m879M0M384L77l072J188J218l263m58M744J014m943
2764a594j708L997J148k566M25K010k140k966L421L497k928l300K679J112k642
2779a555O08L931j545n390J748M776o94l206O17J103k357J78M484j10m813j015
2795c240M601O93l090O00K423l045k673M486L005l701k613K520P35j836J370K778
2811C013k719m169K313N264j831l566J491J339k245j32M309o01m963L9M256q9
$$ plain form
2827 1709 -1003 622 1826 -1388 -2631 1475 3720 -262 -3045 56 1098 -537 421 2420 -464
2842 -464 -3865 -20 3697 937 -2616 -224 931 -1628 -991 2461 1397 -3087 -1818 2004 1007 -1067
2858 -1067 103 788 -2029 -2401 1995 3184 -1872 -3306 492 1653 -665 212 1678 -1148 -3148 618
2874 618 3067 -529 -2006 192 852 -1265 -305 2581 783 -3079 -1532 2208 1419 -885 203 469
2890 469 -1971 -1560 2736 2266 -2660 -2380 1220 1573 -859 89 1254 -896 -2215 887 2311 -396
2906 -396 -2234 85 602 -1234 -263 2231 67 -3084 -541 2355 675 -1416 -192 583 -1370 -333
2922 -333 2294 1179 -1951 -1367 1743 1015 -758 35 1532 -715 -1508 1386 2645 -737 -1772 976
2938 976 884 -676 584 1941 -556 -2228 552 2251 400 -1231 -108 730 -303 -123 1930 777
$$ packed form
2827A709k712J625J204l214j243M106K245l982k783L101J042j635R58J999k884
2842d64l401L845L717k760l553K392J155k559O37L452j064m484J269L822r97k074
2858a067J170O85k817l72M396J189n056j434L798J161k318Q77J466k826k000L766
2874F18K449l596j477K198O60k117R60K886j798l862J547L740p89k304J088K66
2890D69k440M11M296m70m926K80L600L53k432R48J165k150j319L102J424k707
2906c96j838K319N17j836R71K494k164l151K543K896j680k091J224P75j953J037
2922c33K627j115l130N84L110p28j773P93J497k247p93K894J259l382j035K748
2938I76r2j560J260J357k497j672K780J699j851j631J123Q38j033J80K053j153
$$ plain form
2954 777 -2034 -550 1652 745 -991 339 884 -1290 -1015 1740 1611 -706 -1187 437 439 -190 -20 617
2972 617 -953 -1411 659 1678 -603 -1343 30 643 -836 -430 960 175 -1594 -253 1085 -428
2988 -428 -802 289 225 -982 -638 1069 969 -1102 -1106 691 652 -442 10 769 -783 -1075 539 1268 -765
3007 -765 -775 555 128 -821 -133 793 197 -789 -331 779 170 -789 21 146 -734 -174 999 306 -1080
3026 -1080 -655 704 489 -640 71 423 -413 -629 608 644 -298 -23 177 80 -519 -170 706 -81 -1093
3045 -1093 -114 657 -204 -423 268 201 -432 -273 489 -245 -736 -157 682 -28 -704 34 78 -139 -319 -41
3065 -41 272 -157 -89 17 241 -346 -46 32 -526 -586 331 752 35 -148 204 -207 85 -60 123 47 -205 -81
3087 -81 330 159 -157 110 456 -214 -557 750 76 -496 -130 307 275 9 225 -214 -17 258 -3 -205
$$ packed form
2954G77k811J484K202r07j736J330N45k174K75K755j29k317m81J624Ko29J70O37
2972F17j570m58K070J019k281p40J373O13j479M06J390p85j769J341J338j513
2988d28l74J091o4j207L44J707j00k071mJ797l9j094M52P59j552k92J614P29k033
3007g65j0J330m27r49O88R26n96r86M58J110o09r59Q10J25q80N60J173o93j386
3026a080M25J359k15j129P11L52q36k16J237L6r42K75K00r7n99L49Q76p87j012
3045a093R79P71q61k19O91o7o33J59P62p34m91N79Q39p10o76P38M4k17j80K78
3065d1L13m29O8J06K24n87L00P8n58o0R17M21p17j83L52m11K92j45J83p6k52J24
3087h1M11j71l16K67L46o70l43J307o74n72L66M37l2k66K16m39J97K75k61k02
$$ plain form
3107 -205 -244 -53 239 232 -138 -356 171 173 -259 -144 -162 -165 -128 66 24 -507 -101 -35 -24 114 -56 175 -28 166
3131 166 -273 279 120 104 268 131 -29 172 371 99 -181 101 324 22 -128 -52 212 218 228 237 -92 164
3153 164 98 -60 261 117 159 356 201 -204 73 224 -80 29 30 105 -198 291 285 -40 121 -222 114 95 6
3176 6 -218 200 421 -84 122 60 286 -119 -198 -89 -346 222 243 -25 -109 152 -49 -151 314 -220 -142 136
3198 136 -66 195 -92 168 -1 32 -357 -241 243 23 -350 -56 116 40 -192 -356 187 -196 62 -127 -79
3219 -79 -227 -305 230 55 -99 -401 71 109 -627 -62 334 -104 -325 -137 -12 -400 -141 65 4 -268 -214 262
3241 262 49 -412 -102 34 -298 -249 -289 121 -571 -583 47 -305 -812 -499 -39 -228 -342 -51 -177 -606 -598 -81
3263 -81 -13 -327 -495 -66 -251 -534 111 498 -419 -922 171 516 -470 -301 550 -89 -564 308 785 180
$$ packed form
3107b05l9J91K92pl70k18N27Km32J15j8lL7J94m2n31M06O6J1J38j70K31k03J94
3131A66m39N52j59j6J64j37j60K01J99k72k80K82K23l02j50P6K64OJ0Rl29K56
3153A64o6j58L21j44M2J97j55m05K77J51l04J09JP5l03M89ol25J61l43L36j9q9
3176Fk24M18K21n05K06o2K26m05p9J09k57N68K1k68q4K61k01j02M65n34P8K78
3198A36k02K61k87K60j69L3l89J16M84k20l73K94J72p6k32j64N43l83K58j89M8
3219g9j48p8N35j75j54l02M72L8p36N65L96m38k21J88J25l88K59K06o1k72N4M76
3241B62k13m61L10J36l32M9m0M10o92j2O30l52n07L13M60j89j14K91j26m29QN17
3263h1O8l14j68M29j85k83O45L87r17n03J093L45r86J69Q51o39m75Q72M77o05
$$ plain form
3283 180 -461 51 705 230 10 498 562 -149 -95 1224 907 -389 -27 901 692 -451 698 1164 -115
3302 -115 -454 654 938 156 109 895 -106 -353 673 1074 395 -874 -137 804 -5 -213 826 519 -744
3321 -744 -295 819 464 -777 -67 683 115 -490 478 831 -851 -671 832 983 -426 -589 442 -79
3339 -79 -757 291 1399 -369 -1569 282 717 -231 -136 795 257 -1159 -163 1352 284 -1085 -168 432
3357 432 -181 -822 603 275 -1357 -1511 922 357 -1190 -838 178 -336 -1095 420 805 -1432 -1761 -207
3375 -207 368 -694 -812 3 -646 -1625 -148 1215 -340 -1902 -221 639 -585 -499 463 153 -1877 -803
3393 -803 1364 673 -1088 -567 631 -413 -290 1420 1482 -1001 -1238 999 1673 -214 -332 1026 -207
3410 -207 -742 1131 2201 -207 -1660 509 1233 -119 -199 1394 155 -1588 63 2061 955 -1247
$$ packed form
3283A80o41N12O54m75k20M88O4p11N4J319l17j296L62R28k09j143J149M66j279
3302a15l39J108K84p82m7P86j001k47J026M01o79j269P37R41q09k08J039l07j263
3321g44M49J114l55j241P10P50n68o05R68L53j682J80J503J51j409j63J031n21
3339g9o78J048J108j768j200J851M35r48R5R31n38j416R96J515j068j369R17O00
3357D32o13o41J425l28j632j54K433n65j547L52J016n14p59J515L85k237l29J554
3375b07N75j062j18Q15o49r79J477J363j555j562J681Q60j224Q6R62l10k030J074
3393h03K167o91j761N21J198j044J23J710O2k483k37K237O74j887j18J358j233
3410b07n35J873J070k408j453K169P24j352q0J593j239j743J651J998j106k202
$$ plain form
3426 -1247 -445 790 -468 -466 1521 1116 -1732 -1050 1446 1432 -805 -113 745 -647 -1175 1114 1833 -859
3444 -859 -1961 467 1044 -235 -432 811 -235 -1831 247 2180 329 -1748 -369 823 -360 -103
3460 -103 1479 624 -1848 -565 1849 1227 -929 -626 948 -114 -640 1380 1695 -1489 -1945 647 1275
3477 1275 -221 -389 1130 -724 -1758 700 2134 -310 -2074 -289 965 -394 -148 886 -74 -1943
3493 -1943 -569 2081 584 -1411 -627 349 -952 -345 1369 912 -2007 -1618 1276 1137 -418 25 910
3510 910 -630 -1432 1077 1856 -756 -1732 272 1225 -256 -306 930 -372 -2065 136 2337 697 -1439
3527 -1439 -159 1027 -209 -217 1479 285 -1715 -1009 1761 849 -532 -35 548 -646 -1024 1336 1586
3544 1586 -958 -1771 670 1059 -656 165 958 -742 -1305 498 1852 -130 -1464 -128 536 -510
$$ packed form
3426a247Q02J235j258KJ987m05k848O82K496j4k237O92Q58j392n28K289P19k692
3444h59j102K428N77j279j97J243j046j596K078J933j851k077J379J192j183K57
3460a03J582q55k472J283K414o22k156L03J574j062n26K020L15l184m56K592O28
3477A275j496j68J519j854j034K458J434k444j764J785J254j359K46J034r60j869
3493a943J374K650j497j995P84R76j301O07J714m57k919L89K894j39j555M43Q85
3510I10j540q02K509P79k612r76K004R53j481n0J236j302j693K201K201j640k136
3527a439J280J186j236qJ696j194k000P06K770r12j381M97N83j194l78K360K50
3544A586k544q13K441L89j715Q21P93j700n63J803J354j982j334J336O64j046
$$ plain form
3560 -510 44 1247 211 -1562 -517 1949 647 -1357 -338 415 -757 -419 1453 1092 -1237 -1241 1128
3577 1128 1316 -693 -74 646 -581 -1128 722 1641 -487 -1270 9 849 -361 128 1137 -152 -1720
3594 -1720 -87 1739 121 -1121 8 487 -477 -11 1307 795 -1485 -735 965 765 -696 -347 725
3611 725 -745 -831 874 1210 -897 -1067 306 391 -613 128 802 -384 -1278 312 1259 -59 -1087 -75
3629 -75 704 -628 -83 797 31 -1048 -634 1061 -69 -791 -336 241 -506 -639 882 718 -832 -713
3647 -713 419 333 -622 -243 518 -146 -1044 588 1088 -190 -955 126 647 -478 307 1068 102 -1090
3665 -1090 310 1142 505 -270 366 409 -17 5 905 700 -454 -555 777 675 -110 245 603 -317 -322 806
3685 806 688 -205 -435 256 610 130 351 652 -231 -665 253 725 465 -390 123 198 -234 67 280 187 -814
$$ packed form
3560e10N54J203j036j773J045K466j302k004J019P53j172L38J872l61k329mK369
3577A128J88k009O19P20j227n47J850R19k128p83J279Q40j210M89J009j289j568
3594a720J633J826j618j242J129M79r64M66J318n12k280P50J700k00j461L49J072
3611G25j470q6J705L36k107j70J373Q5j004P41O74j186q94J590R47j318j028J012
3629g5P79j332N45Q80p66j079M14J695j130p22M55N77p47j33J521j64j550J19
3647g13J132q6r55L79P61o64q98J632N00j278p65J081N21j125P85P61r66j192
3665a090J400Q32o37p75O36M3m26K2R00k05j154j01J332j02p85L55L58r20nJ128
3685H06j18q93k30O91L54m80K21L01q83m34R18M72k60q55N13P5m32L01K13r3j001
$$ plain form
3706 -814 -209 394 121 -330 -167 -36 -314 -436 165 454 -187 -511 197 269 -423 -231 150 20 -323 3
3726 3 231 -119 -580 178 -26 -162 -79 218 -329 -203 -267 85 8 -103 -196 225 -354 -379 50 182 -392 -541
3748 -541 5 71 -562 -72 44 -149 -447 146 288 -389 22 43 2 -264 -65 18 52 -13 46 202 379 -65
3770 -65 -69 248 72 114 355 323 -188 129 161 171 148 378 324 209 -44 532 440 394 -35 339 537 75 -16 442
3794 442 442 -64 190 522 152 -142 210 97 94 -15 1 390 175 78 72 -214 178 -172 339 135 2 -126 -23
3817 -23 -36 -62 24 -155 -138 -112 -61 -83 -79 -58 -134 -299 -297 45 96 -231 -124 -1 -293 -98 -377 -33 -359 -34 51
3842 51 60 -327 -410 -92 -263 -130 -197 -281 79 124 48 -214 11 -18 -325 -134 -206 -422 -34 291 -340 -300 215 -98
3866 -98 -150 105 -324 61 -76 -205 280 73 33 -22 -2 127 116 -56 -75 -256 186 -51 312 -307 -178 227
$$ packed form
3706h14O05O03k73m51J63J31k78j22O01K89o41l24P08P2o92J92L81j30l43L26
3726CK28l50m61P58k04j36Q3K97n47J26o4L52p7j11r3M21n79k5M29J32n74j49
3748e41N46O6o33M90J16j93k98N93J42o77M11K1m1k66J99Q3L4o5N9J56J77m44
3770f5mL17j76M2K41l2n11L17L2J0k3K30n4j15k53N76r2m6m29L74J98m62r1M58
3794D42%n06K54L32l70k94L52j13lj09J6L89k15r7ok86L92l50N11k04j33j28J03
3817b3j3k6Q6j79J7K6N1k2MK1p6j65KL42N1l27J07J23k92J95k79L44l26L25Q5
3842E1Rl87q3L18j71J33o7q4L60M5p6k62K25k9l07J91p2k16L88L25o31M0N15l13
3866i8n2K55m29L85j37j29M85k07m0n5K0J29j1j72j9j81M42k37L63o19J29M05
$$ plain form
3888 227 -20 215 99 -49 63 374 222 33 114 106 140 13 215 281 -14 -33 -29 125 166 162 93 108 122 139 -104
3913 -104 109 -16 -96 241 -292 -114 165 244 239 -60 360 300 240 201 -163 81 -295 -255 285 43 -274 -57 348
3936 348 217 24 -173 105 -6 -102 326 474 -59 -363 16 -101 -368 -12 157 -330 -417 214 490 -172 -254
3957 -254 247 137 -653 2 299 -80 -269 14 145 91 15 448 253 -381 -272 204 -68 -400 -243 403 -189
3978 -189 -245 281 315 -522 -316 444 442 3 -210 306 -360 -509 298 423 -24 -583 -15 147 151 -180 -100 79
4000 79 -313 -289 592 233 -553 83 556 110 -187 444 422 -683 -343 314 452 -289 -378 304 -133 -213 290
4021 290 788 -309 -861 239 779 -162 -324 427 -237 -589 280 606 219 -846 30 627 156 -262 310
4040 310 302 -719 -344 906 520 -286 -370 447 6 -423 677 692 -918 -967 307 637 -59 -358 -108 66
$$ packed form
3888B27k47K35j16j48J12L11j52j89Q1qL4j27K02O6k95j9MJ54M1mo9J5J4J7k43
3913a04K13j25q0L37n33J78K79P9nk99M20o0o0l9l64K44l76M0N40k42l17K17M05
3936C48j31j93j97K78j11r6M28J48n33l04L79j17k67L56J69m87q7O31K76o62q2
3957b54N01j10p90O55K97l79j89K83J31n4p6M33j95o34J09M76k72l32J57O46n92
3978a89n6N26L4q37K06P60km39k13N16o66j49Q07J25m47n59N68J62Ml31Q0J79
4000G9l92K4Q81l59p86O36M73m46k97O31k2j105L40O57J38p41q9O82m37q0N03
4021B90M98j097n52J100N40r41j62P51o64l52Q69L26l87j065Q76N97m71m18N72
4040C10qj021L75J250l86q06q4Q17m41m29J100J5j610m9J274L30o96k99K50J74
$$ plain form
4060 66 -615 130 1233 40 -833 -94 686 -210 -184 396 3 -1123 -180 902 533 -701 -63 564 -426
4079 -426 -266 489 708 -911 -964 649 959 -291 -360 744 -114 -301 515 985 -388 -1072 148 756 -328
4098 -328 -168 402 -151 -1115 -147 1070 225 -897 -135 582 -31 -342 706 464 -1285 -846 933 808
4116 808 -330 -325 569 -294 -478 701 1048 -678 -1150 430 885 -110 -321 442 -117 -948 12 1498 -34
4135 -34 -1206 28 754 24 -44 638 56 -1013 -414 1122 623 -578 -507 338 -48 -599 557 996 -958
4154 -958 -1106 680 940 -521 -252 458 -83 -809 908 1438 -654 -1248 48 746 -37 -167 486 -67
4172 -67 -1210 -321 1111 331 -1214 -351 596 -265 -494 779 210 -1325 -695 1081 717 -773 -267 459
4190 459 -347 -326 858 933 -639 -1297 217 694 -229 -508 433 -107 -1273 464 1536 34 -1196 -273
$$ packed form
4060F6o81P45J103j193q73P39P80q96K6N80l93j126R43J082l69j234O38O27r90
4079d26J60P55K19j619n3J613L10j250o9J104q58j87Q16M70j373o84J220O08j084
4098c28J60N70n53r64R68J217q45j122P62P17o13l11J048k42j749M39J779j25
4116H08j138NQ94q63j84J179L47j726m72J580M55r95k11P63n59q31R60J486j532
4135c4j172J234P26p30o8O82n82j069N99J536m99j201P1Q45l86n51J156M39j954
4154i58j48J786K60j461K69P10n41p26J717N30k092n94J296O98p83j30O53n53
4172f7j143Q89J432p80j545Q63R47q61k29J273n69j535O30J776l64j490N06P26
4190D59q06K1J184P5j572o58J514M77r23k79R41n40j166J737J072j502j230R23
$$ plain form
4208 -273 508 -332 -95 709 -22 -1256 -350 1114 700 -727 -544 495 -109 -408 602 955 -908 -1291
4226 -1291 671 1049 -241 -53 454 -601 -866 699 1233 -316 -1183 55 647 -165 129 641 -162 -1019
4244 -1019 -421 1249 481 -767 -95 413 -102 -284 1206 764 -737 -765 875 495 -464 198 440 -369
4262 -369 -581 880 1217 -555 -985 263 601 -203 -116 593 -100 -1057 165 1064 120 -787 63 406 -172
4281 -172 -47 986 61 -1043 -685 990 456 -769 -111 319 -215 -762 790 621 -846 -643 412 647
4299 647 -397 -221 437 -298 -767 510 989 -83 -997 -73 477 156 -13 713 -48 -826 -242 736 436
4318 436 -567 -63 390 -280 65 602 690 -727 -737 366 362 -453 266 224 -520 -491 213 1037 -133 -394 55
4339 55 492 -6 -298 508 17 -738 -102 627 166 -536 -152 352 -72 -13 491 319 -651 -431 560 418 -169
$$ packed form
4208b73P81q40K37Q04p31j234R06J464m14j427J83J039o04k99J010L53j863l83
4226a291J962L78j290J88N07j055k65J565N34j549q67J238N92q12K94N12q03q57
4244a019N98J670p68j248O72N08n15j82J490m42j501k8J640l80r59O62K42q09
4262c69k12J461L37j772m30J248L38q04Q7P09o93r57J222Q99r44r07Q50L43n78
4281a72J25J033r25j104L58J675n34j225O58M30n34n47J552j69j467K03J055K35
4299F47j044J76O58p35m69J277M79j072r14R24N50l21j69P26p61p78N84R78l00
4318D36j003N04M53o70L45N37Q8j417j0J103mq15P19m2p44K9P04Q24j170k61M49
4339E5M37m98k92Q06m91p55O36P29m61p02L84N04m24N9N04j72r70K20R91j42n87
$$ plain form
4360 -169 -153 130 -141 -382 500 450 -302 -547 52 123 -287 -158 275 -22 -408 201 525 6 -470 -26 171
4381 171 -236 -299 698 39 -514 -5 408 206 -77 214 148 -182 -330 107 151 -514 -294 423 181 -328 180
4402 180 286 108 -250 1 293 -222 -494 229 146 68 -256 121 -108 -365 187 193 216 -502 -159 39 -60 -47
4424 -47 258 173 -213 -167 242 204 -186 -36 195 -254 -293 313 166 -78 -266 55 -28 177 225 171 383 -197 -70
4447 -70 72 -42 -298 356 22 -223 -90 135 -55 -351 -233 228 42 -162 -176 112 -33 -61 65 431 -142
4468 -142 -95 232 38 -103 3 228 -88 -44 -161 128 -11 49 53 97 202 104 191 119 74 -73 41 103 -136 -250
4492 -250 -104 -168 -57 -6 -173 -107 43 -36 130 -234 48 7 57 -175 -8 67 -76 4 -129 384 296 106 14
4515 14 60 141 -73 63 -232 -506 -257 301 -119 5 257 2 -158 142 268 57 -84 268 138 -85 -52
$$ packed form
4360a69J6K83k71k41Q82n0p52k45N99P1m10J29M33k97l86O09L24n19m76M44J97
4381A71m07o3R97o59n53N09M13k02k83K91o6l30j48M37M4o65K20P17k42n09N08
4402A80J06j78l58K51K92n15k72P23q3p8l24L77k29k57N52OK3p18L43J98r9J3
4424d7L05q5l86M6M09l8l90J50K31m49l9O06j47k44j88L21q3K05M8n4K12n80J27
4447g0J42j14k56O54l34k45J33K25j90k96J18M61j86k04j4K88j45k8J26L66n73
4468a42M7L27j94j41J06K25l16M4j17K89j39O0MM4J05r8Q7p2m5j47J14O2k39j14
4492b50J46o4J11N1j67O6J50p9J66l64K82m1N0k32J67P5j43Q0j33N13q8j90r2
4515A4M6Q1k14J36k95k74K49N58m20J24K52k55j60L00J26k11j41L52j30k23L3
$$ plain form
4536 -52 50 -112 299 -238 -61 138 -95 -14 -69 266 -69 -75 -92 -37 -206 -157 44 -188 -225 -22 174 204 -48
4559 -48 -172 -171 -152 72 474 108 157 97 216 -239 204 69 194 -66 127 95 50 -74 85 6 -466 18 -85
4582 -85 108 -174 272 80 55 -51 60 493 -45 135 74 -98 -365 265 182 172 -32 -111 -198 -65 -64 -221 247
4605 247 -14 -182 -104 -7 48 259 17 241 -241 138 11 -48 -142 170 -76 -33 -36 7 42 59 -128 198 -96 -28
4629 -28 -97 83 -116 -379 -38 413 -171 22 40 152 -189 -60 201 -81 -258 89 423 -72 151 48 249
4650 249 -14 175 43 17 -166 -22 139 223 -520 -122 251 -196 -269 328 111 -146 -135 130 13 103 -42 103
4672 103 -152 -74 -190 324 353 -77 191 76 -290 44 248 118 -404 -89 222 179 -194 -121 -7 -636 -260
4693 -260 444 441 -64 -358 126 194 -223 191 304 -46 -252 239 369 -161 -178 38 -88 22 44 388 -223 -463
$$ packed form
4536e2J02j62M11n37J77J99k33Q1n5L35l35oj7N5j69M9K01k32l7K03J96L0k52
4559d8j24JJ9K24M02l66M9o0J19m55M43j35J25k60J93l2m5j24J59p9m72M84j03
4582h5J93k82M46j92k5j06J11M33n38J80o1j72k67O30q3j0k04p9q7J33Jj57M68
4605B47k61j68P8R7N5K11k42K24m82L79j27n9r4L12k46M3lM3L5J7j87L26k94O8
4629b8o9J80j99k63L41M51n84J93J8J12l41J29K61k82j77L47L34m95K23j03K01
4650B49k63J89j32k6j83J44J61Q4p43L98L73m47p3N97k17k57J1K65j17R0j45J45
4672A03k55P8j16N14K9m30K68j15l66L34K04j30n22L15L11m3l73P3J14o29L76
4693b60P04ln05k94M84O8m17M14J13l50k06M91J30n30j7K16j26J10K2L44o11k40
$$ plain form
4715 -463 79 410 -82 -107 246 221 -342 -298 621 238 -737 -339 123 213 -245 337 236 -442 -445 366 440 16
4737 16 -381 33 149 -314 160 223 -10 -554 165 536 -198 -253 359 125 -753 45 595 278 -609 -164 407
4758 407 -113 -135 151 56 -753 -196 379 917 -426 -488 103 -16 -302 438 489 -252 -694 483 660 -57 -200
4779 -200 73 -87 -582 58 681 229 -644 -180 514 -144 -120 293 457 -754 -99 796 327 -567 -507 374
4799 374 -236 -99 303 496 -596 -869 518 832 -155 -277 283 -132 -354 459 688 -259 -1001 59 690
4818 690 -138 -210 343 221 -773 -120 865 114 -794 -93 332 -47 -424 534 264 -419 -626 507 709 -391
4838 -391 -359 382 -299 -390 573 616 -467 -967 123 609 -364 -4 361 -18 -644 8 811 -79 -745 -210
4858 -210 365 -79 -289 494 232 -1084 -309 696 413 -750 -395 454 -167 -36 465 802 -339 -609 421
$$ packed form
4715d63N42L31m92k5L53k5n63M4R19l83r75L98M62R0m58N82j01o78lQ11P4m24
4737A6l97M14J16m63M74O3k33n44P19L71p34n5O12k34q78P98N50l17q87M45N71
4758D07n20k2K86r5q09N57N75N38j343o2N91j19k86P40N1p41m42J177J77p17j43
4779b00K73j60m95O40O23m52q73M64O94o58K4M13J64j211O55Q95m69q94O0Q81
4799C74o10J37M02J93j092k73J387L14r87j22N60m15k22Q13K29r47p42J060O31
4818F90q28p2N53j22r94O53R85p51r08P01M25l79l77R58k70o83k07J133K02j100
4838c91L2P41o81r1R63M3j083n00J090M86r73L60L65l79o26O52Q03q90o66N35
4858b10N75m44k10P83k62j316P75J005k83j163L55Q49o21J31N01L37j141k70J030
$$ plain form
4877 421 809 -388 -160 396 -340 -474 304 752 -431 -939 270 641 -81 -190 376 -107 -980 -78 822
4896 822 428 -626 -183 180 34 -435 328 308 -549 -528 1026 759 -288 -417 164 -177 -718 566 752
4915 752 -150 -763 38 636 -36 -278 480 -531 -761 57 787 143 -758 5 524 -245 -311 298 110 -865
4935 -865 -448 548 426 -430 -407 165 48 -228 523 815 -537 -684 380 711 90 -203 208 -60 -639 450
4955 450 785 -115 -554 -144 321 -403 90 594 -126 -657 -108 716 331 -271 -89 374 25 -220 296 427
$$ packed form
4877D21L88j197K28N56p36j34P78M48j183n08J209L71p22j09N66m83q73R02R00
4896H22l94j054M43L63j46m69P63k0q57K1J554k67j047j29N81l41n41J284J86
4915G52r02o13Q01N98o72k42P58j011k30Q18P30o44r01P63N19p69o6O09j88r75
4935h65M17R96j22q56K3N72j17k76P51K92j352j47J064L31o21k93M11k68n79J089
4955D50L35r00m39M10M65p24M93N04p20n31N49Q24l85o02J82M63l49k45N16J31
$$ [...]
8191@
##END NTUPLES=NMR FID
##END=
