##TITLE=1H_CA-8663-3
 DMSO, 8 sc, 
 13.11.2019
##JCAMPDX= 6.0         $$ Bruker NMR JCAMP-DX V2.0
##DATA TYPE= NMR FID
##DATA CLASS= NTUPLES
##ORIGIN= UXNMR, Bruker Analytische Messtechnik GmbH
##OWNER= root
$$ XWIN-NMR		Version 3.5
$$ Wed Nov 13 15:52:36 2019 Russian Standard Time (UT+4h)  she@DPX200
##.OBSERVE FREQUENCY= 200.1315
##.OBSERVE NUCLEUS= ^1H
##.DELAY= (6, 6)
##.ACQUISITION MODE= SIMULTANEOUS
##.ACQUISITION SCHEME= undefined
##.AVERAGES= 8
##.DIGITISER RES= 18
##SPECTROMETER/DATA SYSTEM= spect
##.PULSE SEQUENCE= zg30
##.SOLVENT NAME= DMSO
##.SHIFT REFERENCE= (INTERNAL, DMSO, 0, 15.7039)
##AUDIT TRAIL= $$ (NUMBER, WHEN, WHO, WHERE, WHAT)
$$ ##TITLE= Audit trail, XWIN-NMR		Version 3.5
$$ ##JCAMPDX= 5.01
$$ ##ORIGIN= Bruker BioSpin GmbH
$$ ##OWNER= she
$$ F:/spectra/data/she/nmr/H-F/1/audita.txt
$$ ##AUDIT TRAIL=  $$ (NUMBER, WHEN, WHO, WHERE, WHAT)
(   1,<2019-11-13 15:51:12.59 +0400>,<she>,<DPX200>,
      <created by zg, POWCHK disabled, PULCHK disabled
       configuration hash MD5:
       00 E9 B6 7A A2 85 ED C7 34 08 36 98 17 FE 4E 26
       data hash MD5: 16K
       52 62 EA 73 4B 05 9D A8 A7 06 8A C5 27 2F 18 53>)
$$ ##END=
$$ 
$$ hash MD5
$$ 14 38 52 3B 1B BA EC 4E 22 38 08 5B 53 6B 1B 8A
##$RELAX= 
##$RELAX= 
##$RELAX= 
##$RELAX= 
##$RELAX= 
##$RELAX= 
$$ Bruker specific parameters
$$ --------------------------
##$DU= <F:/spectra>
##$EXPNO= 1
##$NAME= <H-F>
##$PROCNO= 1
##$TYPE= <nmr>
##$USER= <she>
##$AMP= (0..31)
100 100 100 100 100 100 100 100 100 100 100 100 100 100 100 100 100 100 
100 100 100 100 100 100 100 100 100 100 100 100 100 100 
##$AQSEQ= 0
##$AQ_mod= 1
##$AUNM= <au_zg>
##$AUTOPOS= <>
##$BF1= 200.13
##$BF2= 200.13
##$BF3= 200.13
##$BF4= 200.13
##$BF5= 200.13
##$BF6= 200.13
##$BF7= 200.13
##$BF8= 200.13
##$BYTORDA= 1
##$CFDGTYP= 0
##$CFRGTYP= 5
##$CHEMSTR= <none>
##$CNST= (0..31)
1 1 145 1 1 1 1 1 1 1 1 1 1 1 1 1 1 1 1 1 1 1 1 1 1 1 1 1 1 1 1 1 
##$CPDPRG= <>
##$CPDPRG1= <>
##$CPDPRG2= <>
##$CPDPRG3= <>
##$CPDPRG4= <mlev>
##$CPDPRG5= <mlev>
##$CPDPRG6= <mlev>
##$CPDPRG7= <mlev>
##$CPDPRG8= <mlev>
##$CPDPRGB= <>
##$CPDPRGT= <>
##$D= (0..31)
0 1.2 0 0 0 0 0 0 0 0.06 0 0.03 0 0 0 0 0.0002 0 0 0 0 0 0 0 0 0 0 0 0 
0 0 0 
##$DATE= 1573645871
##$DBL= (0..7)
120 120 120 120 120 120 120 120 
##$DBP= (0..7)
150 150 150 150 150 150 150 150 
##$DBP07= 0
##$DBPNAM0= <>
##$DBPNAM1= <>
##$DBPNAM2= <>
##$DBPNAM3= <>
##$DBPNAM4= <>
##$DBPNAM5= <>
##$DBPNAM6= <>
##$DBPNAM7= <>
##$DBPOAL= (0..7)
0.5 0.5 0.5 0.5 0.5 0.5 0.5 0.5 
##$DBPOFFS= (0..7)
0 0 0 0 0 0 0 0 
##$DE= 6
##$DECBNUC= <off>
##$DECIM= 24
##$DECNUC= <off>
##$DECSTAT= 4
##$DIGMOD= 1
##$DIGTYP= 9
##$DL= (0..7)
0 120 120 120 120 120 120 120 
##$DP= (0..7)
150 150 150 150 150 150 150 150 
##$DP07= 0
##$DPNAME0= <>
##$DPNAME1= <>
##$DPNAME2= <>
##$DPNAME3= <>
##$DPNAME4= <>
##$DPNAME5= <>
##$DPNAME6= <>
##$DPNAME7= <>
##$DPOAL= (0..7)
0.5 0.5 0.5 0.5 0.5 0.5 0.5 0.5 
##$DPOFFS= (0..7)
0 0 0 0 0 0 0 0 
##$DQDMODE= 0
##$DR= 18
##$DS= 0
##$DSLIST= <SSSSSSSSSSSSSSS>
$$ [...]
##$SUBNAM2= <"">
##$SUBNAM3= <"">
##$SUBNAM4= <"">
##$SUBNAM5= <"">
##$SUBNAM6= <"">
##$SUBNAM7= <"">
##$SUBNAM8= <"">
##$SUBNAM9= <"">
##$SW= 24.0689530833862
##$SWIBOX= (0..15)
0 0 2 0 0 0 0 0 0 0 0 0 0 0 0 0 
##$SW_h= 4816.95568400771
##$TD= 16384
##$TD0= 1
##$TE= 0
##$TE2= 300
##$TE3= 300
##$TEG= 300
##$TL= (0..7)
0 120 120 120 120 120 120 120 
##$TP= (0..7)
150 150 150 150 150 150 150 150 
##$TP07= 0
##$TPNAME0= <>
##$TPNAME1= <>
##$TPNAME2= <>
##$TPNAME3= <>
##$TPNAME4= <>
##$TPNAME5= <>
##$TPNAME6= <>
##$TPNAME7= <>
##$TPOAL= (0..7)
0.5 0.5 0.5 0.5 0.5 0.5 0.5 0.5 
##$TPOFFS= (0..7)
0 0 0 0 0 0 0 0 
##$TUNHIN= 0
##$TUNHOUT= 0
##$TUNXOUT= 0
##$USERA1= <user>
##$USERA2= <user>
##$USERA3= <user>
##$USERA4= <user>
##$USERA5= <user>
##$V9= 5
##$VALIST= <valist>
##$VCLIST= <CCCCCCCCCCCCCCC>
##$VD= 0
##$VDLIST= <DDDDDDDDDDDDDDD>
##$VPLIST= <PPPPPPPPPPPPPPP>
##$VTLIST= <TTTTTTTTTTTTTTT>
##$WBST= 1024
##$WBSW= 4
##$XGAIN= (0..3)
0 0 0 0 
##$XL= 0
##$YL= 0
##$YMAX_a= 608668
##$YMIN_a= -549386
##$ZGOPTNS= <>
##$ZL1= 120
##$ZL2= 120
##$ZL3= 120
##$ZL4= 120
##$ABSF1= 10
##$ABSF2= 0
##$ABSG= 5
##$ABSL= 3
##$ALPHA= 0
##$AQORDER= 0
##$ASSFAC= 0
##$ASSFACI= 0
##$ASSFACX= 0
##$ASSWID= 0
##$AUNMP= <proc_1d>
##$AZFE= 0.1
##$AZFW= 0.1
##$BCFW= 1
##$BC_mod= 2
##$BYTORDP= 1
##$COROFFS= 0
##$CY= 11.3945322036743
##$DATMOD= 1
##$DC= 2
##$DFILT= <>
##$DTYPP= 0
##$F1P= 16.9975609425685
##$F2P= -3.02152046262296
##$FCOR= 0.5
##$FTSIZE= 0
##$FT_mod= 4
##$GAMMA= 1
##$GB= 0.15
##$INTBC= 1
##$INTSCL= 1
##$ISEN= 128
##$LB= 0.24
##$LEV0= 0
##$LPBIN= 0
##$MAXI= 10000
##$MC2= 0
##$MEAN= 0
##$ME_mod= 0
##$MI= 1.114404
##$NCOEF= 0
##$NC_proc= 0
##$NLEV= 6
##$NOISF1= 3.799351
##$NOISF2= 2.8
##$NSP= 1
##$NTH_PI= 0
##$NZP= 0
##$OFFSET= 15.70392
##$PC= 1
##$PHC0= -9462.646
##$PHC1= 24.00088
##$PH_mod= 1
##$PKNL= yes
##$PPARMOD= 0
##$PSCAL= 0
##$PSIGN= 0
##$REVERSE= no
##$SF= 200.130013532006
##$SI= 16384
##$SIGF1= 3
##$SIGF2= 2
##$SINO= 400
##$SIOLD= 16384
##$SREGLST= <1H.CDCl3>
##$SSB= 0
##$STSI= 0
##$STSR= 0
##$SW_p= 3612.71676300578
##$SYMM= 0
##$S_DEV= 0
##$TDeff= 0
##$TDoff= 0
##$TI= <>
##$TILT= no
##$TM1= 0
##$TM2= 0
##$TOPLEV= 0
##$USERP1= <user>
##$USERP2= <user>
##$USERP3= <user>
##$USERP4= <user>
##$USERP5= <user>
##$WDW= 1
##$XDIM= 8192
##$YMAX_p= 0
##$YMIN_p= 0
$$ End of Bruker specific parameters
$$ ---------------------------------
##NTUPLES= NMR FID
##VAR_NAME=  TIME,          FID/REAL,        FID/IMAG
##SYMBOL=    X,             R,               I
##VAR_TYPE=  INDEPENDENT,   DEPENDENT,       DEPENDENT
##VAR_FORM=  AFFN,          ASDF,            ASDF
##VAR_DIM=   8192,          8192,            8192
##UNITS=     SECONDS,       ARBITRARY UNITS, ARBITRARY UNITS
##FACTOR=    0.0002076,     1,               1
##FIRST=     0,             0,               0
##LAST=      1.7004516,     0,               0
##MIN=       0,             -549386,         0
##MAX=       1.7004516,     608668,          0
$$ Real data points
##PAGE= N=1
##DATA TABLE= (X++(R..R)), XYDATA
$$ [...]
$$ plain form
2898 -3527 8808 7740 -5065 -10349 146 9928 5051 -7288 -8658 2930 10762 1949 -9474
2911 -9474 -6212 6083 9235 -1308 -9991 -3903 8349 7825 -4674 -9917 -60 9478 4878 -7046
2925 -7046 -8468 2893 9953 2065 -9104 -6378 6065 9138 -1566 -9574 -3476 7921 7575 -4188
2939 -4188 -9583 -453 9475 4996 -6772 -7946 2389 9712 1941 -8772 -6241 5657 9082 -1368
2953 -1368 -9713 -3278 7479 7257 -4025 -9340 -318 9185 4614 -6776 -7719 2848 9263 1753
2967 1753 -8457 -6002 5641 8651 -1516 -9460 -3206 7363 6911 -3934 -8940 -230 9048 4450
2981 4450 -6398 -7670 2632 9289 1798 -8310 -5948 5368 8252 -1379 -8984 -3254 7463 7113
2995 7113 -4094 -9171 -204 8847 4434 -6673 -7481 2627 8960 1812 -8049 -5563 5175 8492
$$ packed form
2898c527J2335j068j2805n284J0495R782m877j2339j370J1588P832q813j1423
2911i474L262J2295L152j0543q683O088J2252n24j2499n243R857R538m600j1924
2925g046j422J1361P060p888j1169K726J2443L073j0704q008O098J1397l46j1763
2939d188n395R130R928m479j1768j174J0335P323p771j0713K531J1898L425j0450
2953a368q345O435J0757k22j1282n315R022R503m571j1390r43J0567O415p510
2967A753j0210K455J1643L010j0167p944O254J0569m52j0845n006Q710R278m598
2981D450j0848j272J0302O657p491j0108K362J1316K884r631p605N730J0717l50
2995G113j1207n077Q967R051m413j1107q08J0108O333p148r861K486J0738L317
$$ plain form
3009 8492 -1399 -8850 -2998 7365 6731 -3740 -8580 -81 8650 4416 -6378 -7520 2816 8738
3023 8738 1399 -7846 -5761 5040 8337 -1011 -9028 -3064 7224 6399 -4115 -8711 -233 8582
3037 8582 4726 -6704 -7814 2560 8784 1503 -7989 -5970 4989 8328 -972 -8974 -3123 7509
3051 7509 6545 -3925 -8456 -449 8412 4697 -6363 -7880 2543 8841 1875 -8034 -5700 4923
3065 4923 8109 -962 -8713 -3418 7195 6630 -4057 -8490 -359 8140 4754 -5951 -7800 2345
3079 2345 8982 1608 -8061 -5501 4580 8170 -1191 -8819 -3625 7165 6821 -3831 -8664 -474
3093 -474 8263 4942 -5774 -7403 2082 8804 2012 -7739 -5935 4989 8094 -287 -8643 -3797 6804
3108 6804 6799 -3685 -8123 -684 8018 4725 -5853 -7219 1809 8696 2221 -7816 -5752 4410 7990
$$ packed form
3009H492r891p451N852J0363o34j0471m840Q499Q731m234j0794j142J0336N922
3023H738p339r245K085J0801L297r348q017N964J0288q25j0514m596Q478Q815
3037H582l856j1430j110J0374O224p281r492K019J0959L339r300q002N851J0632
3051G509r64j0470m531Q007Q861l715j1060j517J0423O298o966r909K334J0623
3065D923L186r071p751N295J0613n65j0687m433Q131Q499l386j0705j849J0145
3079B345O637p374r669K560J0081L590r361p628N194J0790l44j0652m833Q190
3093d74Q737l321j0716j629R485O722o792r751J804J0924L105q381q356M846J0601
3108F804nj0484m438P439Q702l293j0578j366R028O887o475j0037K064J0162L580
$$ plain form
3123 7990 -616 -8257 -3928 6524 6927 -3323 -8331 -742 8123 4520 -5336 -7428 1493 8377 2353
3138 2353 -7469 -6043 4537 7691 -389 -7980 -3979 6327 7044 -3068 -8361 -1009 7751 4652
3152 4652 -5301 -7260 1262 8181 2623 -7100 -6045 4180 7785 -267 -7813 -3722 6024 6890 -2848
3167 -2848 -8124 -1020 7510 4824 -4907 -7102 1434 7877 2615 -6807 -5738 4084 7559 -154 -7725
3182 -7725 -3564 5664 6428 -2807 -7952 -1160 7195 4807 -4926 -7136 1583 7527 2399 -6625 -5741
3197 -5741 4060 7566 -109 -7412 -3496 5679 6373 -2402 -7648 -1279 7023 4713 -4788 -7005 1157
3212 1157 7420 2539 -6370 -5763 3650 6912 277 -7127 -3533 5353 6313 -2177 -7727 -1469 6733
3227 6733 4624 -4764 -7028 1301 7155 2439 -6436 -5455 3571 7195 142 -7143 -3447 5208 5941
$$ packed form
3123G990q606p641M329J0452M03j0250n008P589Q865l603r856k092Q921O884o024
3138B353r822J426J0580L154q080p591M001J0306P17j0112n293P352Q760l099
3152D652r953j959Q522O919n558r723J055J0225L605q052p546M091R746Q66r738
3167b848n276P104Q530k686r731k195Q536O443n262r422J069R822L475p713p571
3182g725M161R228P64r235n145O792Q355k388r733k210Q719N944n128r024Q84
3197e741R801L506p675p303L916R175O94q775n246O369Q302k310r501k217Q162
3212A157O263m881q909O07R413L262o635p404L594Q886R60q490n550O258Q202
3227F733k109r388k264Q329N854m716q875R81R026L624p053p285L696Q655P33
$$ plain form
3242 5941 -2277 -7306 -1504 6495 4626 -4735 -6728 1161 7172 2361 -5917 -5371 3246 7277 220
3257 220 -7111 -3581 5396 5885 -2219 -7121 -1549 6624 4700 -4359 -6798 951 7380 2226 -6104
3272 -6104 -5099 3360 7154 202 -7081 -3466 5299 6152 -2349 -6924 -1148 6445 4840 -4170 -6655
3287 -6655 1143 7303 2218 -5977 -4878 3354 6955 161 -6712 -3656 5050 5786 -2354 -7023 -1296
3302 -1296 6438 4651 -3894 -6762 983 6892 2321 -5772 -5347 2939 6607 84 -6724 -3746 4956
3317 4956 6030 -2258 -6945 -1219 5969 4538 -4022 -6598 1169 7097 2360 -5745 -5230 3036 6710
3332 6710 -61 -6498 -3513 5164 6068 -2023 -6759 -1178 6066 4262 -3772 -6450 830 6863 2363
3347 2363 -5475 -5111 2906 6385 270 -6527 -3769 4846 6011 -1998 -6723 -1413 6191 4173 -3859
$$ packed form
3242E941q218n029N802P999j869r361j993P889O011m811q278N46Q617M031p057
3257B20p331L530Q977M89q104m902N572Q173j924r059k439P749O429n154q330
3272f104J005Q459L794o952p283L615Q765Q53q501m575N776P593j605r010k485
3287f655P798O160n085q195J099Q232L601o794o873L056Q706P36q140m669N727
3302a296P734j787q545k868P745N909m571q093M25Q286L668o523o808K978Q702
3317D956J074q288m687N726P188j431q560k576P767N928m737q105N15Q266L674
3332F710o771o437K985Q677R04q091m736N581P244j804q034k678P280O033m500
3347B363p838L64Q017L479o115o797K758Q615J165q009m725N310P604k018q032
$$ plain form
3362 -3859 -6138 690 6608 2501 -5732 -5118 2956 6227 487 -6309 -3220 4612 5620 -1865 -6376
3377 -6376 -1404 5791 4109 -3817 -5757 633 6532 2661 -5187 -5056 2943 6310 342 -6086 -3387
3392 -3387 4439 5529 -1637 -6436 -1371 5977 4102 -3880 -6056 626 6154 2718 -5197 -5263 2731
3407 2731 6064 114 -5957 -3120 4061 5160 -1647 -6124 -1541 5443 4346 -3476 -5738 446 6212
3422 6212 2558 -4953 -4701 2651 6419 182 -6014 -3272 4009 5128 -1256 -6293 -1608 5476 3943
3437 3943 -3544 -5845 480 5739 2446 -4611 -4999 2663 5868 524 -5699 -3150 4197 5540 -1354
3452 -1354 -5982 -1758 5287 4085 -3397 -5363 823 5912 2174 -4535 -4844 2021 5933 724 -5788
3467 -5788 -3196 3838 4859 -1258 -5876 -1699 5429 4340 -3311 -5499 747 5618 2365 -4273 -4438
$$ packed form
3362c859k279O828N918m107q233O14Q074L271n740o796L089P832J008p485m511
3377f376M972P195j682p926j940O390N899l871p848J31P999L367n968o428K699
3392c387P826J090p166m799N065P348j875p982k176O682N528l436p915o6P994
3407B731L333n950o071K837P181J099o807m477M583O984j097p822k262O184N766
3422F212l654p511K52P352L768o237o196K742P281J119o384n037M685P084j533
3437C943p487k301O325N259l293p057l88P662L205n344o223K549P347J343o894
3452a354m628M224P045j202p482j966O186N089l738o709l09O865L912n209o512
3467e788K592P034J021o117m618M177P128j089p651k188O246M871l253o638j65
$$ plain form
3482 -4438 2409 5886 502 -5587 -3347 3787 4938 -1143 -5644 -1677 5034 4108 -3237 -5683 188
3497 188 5549 2329 -4463 -4544 1916 5556 735 -5496 -3500 3939 4826 -1324 -5631 -1322 4870 4023
3513 4023 -2882 -5476 731 5385 2246 -4364 -4150 1951 5569 946 -5302 -3174 3733 5110 -1348
3528 -1348 -5352 -1498 4762 3899 -2829 -5337 489 5058 2493 -4147 -4476 2092 5143 544 -5181
3543 -5181 -3107 3204 4714 -1349 -5530 -1438 4570 4003 -2576 -5133 255 5228 2276 -3882 -4262
3558 -4262 1844 5450 642 -4855 -3360 3466 5114 -842 -5141 -1604 4736 3733 -2657 -5131 -47
3573 -47 5459 2458 -4061 -4275 1810 5268 528 -4771 -3163 3070 4724 -1013 -5033 -1380 4373 3526
3589 3526 -2638 -4856 57 4987 2550 -4110 -4214 1773 5311 708 -4657 -2963 2800 4954 -741
$$ packed form
3482d438O847L477n384o089K240P134J151o081m501L967O711r26p345k446N871
3497A88N361l220o792q1O460L640m821o231J996P439Q87o150m307M309O192q47
3513D023o905k594O207M654l139o610K14O101L618m623o248K128O907J377o458
3528a348m004L854O260q63o728k508N826M569k565o640l29O568L051m599n725
3543e181K074O311J510o063m181M092O008n67o579k557N388M973k952o158l80
3558d262O106L606m808n497J495O826J648n956m299L537O340j003o390k474N084
3573d7N506l001o519k14O085L458m740n299J608O233J654n737m020L653N753q47
3589C526o164k218M913M930k437o660j04N987L538m603n365J694N763K154n695
$$ plain form
3604 -741 -5305 -1922 4380 3480 -2577 -4806 0 4867 2481 -4006 -4211 1687 5178 829 -4676 -2921
3620 -2921 3014 4401 -776 -5145 -1825 4228 3469 -2212 -4837 -30 4685 2523 -3873 -4087 1454
3635 1454 4719 800 -4475 -2696 3012 4736 -913 -4726 -2037 4088 3593 -2189 -4772 0 4542
3650 4542 2478 -3499 -4217 1344 4814 1030 -4543 -3084 2832 4372 -238 -4806 -1728 4077 3591
3665 3591 -2047 -4719 20 4321 2294 -3336 -4290 1259 4779 1004 -4266 -3045 2736 4421 -545
3680 -545 -4910 -2023 3743 3854 -2111 -4751 -87 4294 2513 -3531 -4184 1014 4579 1135 -4334 -3073
3696 -3073 2603 4266 -554 -4554 -1866 3765 3617 -1921 -4628 -196 4421 2273 -3153 -3832 1115
3711 1115 4634 1127 -4263 -3020 2737 4574 -508 -4324 -1942 3640 3457 -1927 -4617 -147 4603
$$ packed form
3604g41m564L383O302r00o057k229M806M867k386o487k05N898L491m349n505J755
3620b921N935J387n177m369L320O053p59n681k625M807M715k162o396k14N541
3635A454L265l919n275J779N708J724n649l813K689O125m95n782k583M772M542
3650D542k064n977p18N561L470l784n573J459N916J540m610m568L078N805m86
3665C591n638k672M739M301k027n630r54N549L520l775n270J221N781J685m966
3680e45m365K887N766J11n965k640M664M381j781o044o53N198L565l444n469J261
3696c073N676J663m820m000K688N631j48n538k707M432M617k148n426o79M947
3711A115L519l507n390J243N757J837n082l816K382N582j83n384k690M470M750
$$ plain form
3726 4603 2355 -3310 -3700 878 4504 1129 -4074 -2811 2514 4532 -253 -4471 -2064 3526 3339
3741 3339 -1654 -4396 -589 4307 2026 -2963 -3727 1109 3943 1301 -4125 -3073 2312 4504 -364
3756 -364 -3987 -1723 3386 3207 -1906 -4600 -390 4383 2330 -2859 -3816 1100 4228 1169 -3622 -2938
3772 -2938 2118 4297 -333 -4359 -1808 3269 3386 -1304 -4301 -541 4082 2525 -2658 -3894 929
3787 929 4261 1057 -3631 -3117 1907 3962 -159 -4200 -1930 3277 3415 -1511 -4218 -531 3995 2484
3803 2484 -2616 -3683 1040 3932 1315 -3567 -2785 1778 3960 -147 -4471 -1508 3184 3239 -1590 -3954
3819 -3954 -891 3649 2532 -2715 -3942 924 4108 902 -3048 -3068 1796 4036 24 -4192 -1984
3834 -1984 3252 3143 -1222 -3686 -739 3643 2508 -2325 -3886 731 3982 1257 -3426 -2908 1879
$$ packed form
3726D603k248n665l90M578L626l375n203J263N325K018m785m218K407N590j87
3741C339m993k742L807M896k281m989p64M836K834k642n426J052N385K192m868
3756c64l623K264N109j79n113k694M210M773k053n189r57M916L128l059m791O84
3772b938N056K179m630m026K551N077J17m690k997L760M623j557n183j236M823
3787I29L332l204m688N14N024K055m121m041K270N207J38m926k707L687M526j511
3803B484n100j067M723K892k617m882P82M563K182m107m324K963M692N5m829k364
3819c954L063M540j117n247j227M866L184l206l950k0M864K240m012m216K208
3834a984N236j09m365k464K947M382j135m833j561M617L251k725m683N18M787
$$ plain form
3849 1879 3741 24 -3558 -1881 2806 3378 -1048 -3891 -669 3421 2675 -2381 -3654 974 3854
3864 3854 1305 -3009 -2801 1975 3516 334 -3734 -1896 2799 3336 -1468 -3804 -832 3706 2535
3879 2535 -2074 -3674 425 3976 1276 -3141 -2902 1713 3703 138 -3507 -1822 2641 3403 -1319
3894 -1319 -3910 -515 3366 2330 -2305 -3570 437 3567 1361 -3042 -2692 1652 3629 19 -3494
3909 -3494 -1979 2741 3276 -1082 -3699 -835 3273 2377 -2031 -3267 554 3781 1575 -2758 -2837 1286
3925 1286 3532 366 -3645 -1919 2430 3387 -611 -3812 -748 3136 2192 -1756 -3170 68 3704
3940 3704 1297 -2636 -2914 1668 3472 260 -3226 -2342 2168 3417 -1007 -3648 -707 2996 2440 -2141
3956 -2141 -3271 387 3125 1432 -2685 -2706 1438 3383 358 -3183 -1758 2580 2868 -697 -3404 -737
$$ packed form
3849A879J862l717l582J677M687N72m426k843L222M090p46n056j273M628K880
3864C854k549m314K08M776J541l182m068J838M695N37m804k336K972M538j171
3879B535m609j600M099L551k700m417K39M615J990l565l645J685M463P62m722
3894a319k591L395L881j036m635j265M007L130k206m403L50M344J977l610l513
3909c494J515M720N35m358k617K864M108q96m408j236L821L227k206m333p9M123
3925A286K246l166m011J726M349R57l998l201L064L884r44l948j414L238L636
3940C704k407l933k78M582J804l212l486Q84M510J249m424k641K941L703n56m581
3956b141j130L658K738j693m117k1M144J945l025l541J425M338K88l565k707K667
$$ plain form
3972 -737 3237 2448 -1762 -3297 110 3154 1282 -2891 -2855 1490 3414 277 -3075 -2216 2235 3126
3988 3126 -588 -3426 -923 3019 2258 -1857 -3082 273 3547 1267 -2511 -2854 1372 3309 -68
4003 -68 -3286 -1942 2304 3000 -703 -3312 -1066 3055 2409 -1755 -3119 158 3347 1415 -2576 -2511
4019 -2511 1158 3217 350 -3337 -2090 2252 2712 -591 -3135 -860 2905 2250 -1739 -3271 444
4034 444 3139 1389 -2679 -2602 1295 3138 569 -2958 -1989 2202 2770 -747 -2976 -1194 3130 2287
4050 2287 -1802 -3082 344 3327 1472 -2201 -2623 870 3221 410 -2786 -1920 1979 3195 -589
4065 -589 -3253 -951 2812 2166 -1488 -3202 208 3184 1261 -2499 -2431 1019 3238 572 -2925 -1857
4081 -1857 2306 2933 -436 -3214 -1075 2848 2209 -1816 -3061 -160 2925 1511 -2285 -2466 806 2963
$$ packed form
3972g37L974p89m210j535L407L044j872m173L6M345J924l137l352Q59M451Q91
3988C126l714k838K503L942p61m115j225L355L274k280l778l43M226J937l377
4003f8l218J344M246O96l703k609K246M121o46m164j364L277L189j932l991O5
4019b511L669K059k867l687J247M342M60l303k544K275L765o55l989j532L715
4034D44K695j750m068P7L897J843k569l527R69M191N68l517k229J782M324q43
4050B287m089j280L426K983j855l673m22L493K351k811l196Q66L899J216l784
4065e89k664K302L763o46l654j714L410K976j923l760O8L450K219k666l497J068
4081a857M163O27l369k778K139L923o39m025j245K901L085j414l796j81L272K157
$$ plain form
4097 2963 325 -2820 -1876 2116 2775 -689 -3247 -760 2439 2073 -1395 -2781 -273 2915 1276 -2233
4113 -2233 -2293 1068 2834 704 -2949 -1850 1514 2854 -390 -3437 -1057 2537 1930 -1462 -2747 61
4129 61 3020 1575 -2200 -2614 931 2909 397 -2682 -2334 2006 2689 -711 -3215 -889 2532 2111
4145 2111 -1107 -2809 -22 2617 1616 -2417 -2599 1241 2906 447 -2598 -2026 1729 2687 -504 -3036
4161 -3036 -1068 2485 2114 -1466 -2667 -66 2791 1171 -1910 -2341 815 3173 398 -2416 -1750 1684
4177 1684 2815 -43 -2825 -887 2201 2143 -1412 -2754 -204 2593 1448 -1924 -2193 818 2946 683
4193 683 -2668 -1709 1750 2663 -299 -2755 -870 2394 2290 -1019 -2522 -134 2518 1404 -1898 -2643
4209 -2643 855 2542 434 -2770 -1494 1393 2661 -256 -2932 -1225 2397 2164 -1412 -2822 -322
$$ packed form
4097B963k638l145R44L992O59l464k558K487L199l66l468j386K508L188j639l509
4113b233o0L361J766k130l653J099L364J340l244l047K380L594o07l392j285K808
4129F1K959j445l775m14L545J978k512l079L48M340O83l400k504K326L421m21
4145B111l218j702K787K639j001m033j82L840J665k459l045N72L755R58l191k532
4161c036J968L553l71l580j201K601K857j620l081m31L156K358k775k814O66L434
4177A684J131k858k782J938L088n8l555j342K550K797j145l372k69L011K128k263
4193F83l351R59L459R13k962k456J885L264j04l309j503K388K652j114l302p45
4209b643L498J687k108l204J276K887J268k917k676J707L622k33l576j410K500
$$ plain form
4224 -322 2442 1141 -2012 -2472 585 2950 863 -2394 -1845 1417 2618 -100 -2564 -1134 2242 2086
4240 2086 -1102 -2614 -76 2648 1449 -1852 -2388 657 2781 789 -2343 -1773 1763 2503 -162 -2820
4256 -2820 -1314 2004 2004 -1375 -2468 -182 2741 1585 -1796 -2729 778 2660 861 -2183 -1816 1757
4272 1757 2545 42 -2605 -1247 1822 2439 -1209 -2775 -225 2280 1149 -1837 -2202 463 2414 694
4288 694 -2395 -1885 1222 2587 -275 -2597 -1087 1963 2060 -950 -2512 -432 2302 1451 -1634 -2302
4304 -2302 573 2390 502 -2494 -1841 1654 2561 -174 -2539 -809 1911 2257 -1073 -2576 -477 2442
4320 2442 1392 -1474 -2244 571 2645 511 -2156 -1769 1109 2333 -242 -2721 -1147 1741 2019 -935
4336 -935 -2405 -459 2507 1685 -1377 -2140 646 2667 757 -2026 -1816 1321 2608 -79 -2426 -1362
$$ packed form
4224c22K764j301l153m60L057K365k087l257N49L262J201k718k464J430L376j56
4240B086l188j512K538K724j199l301n36L045K124j992l132N70L536P40k665k658
4256b820J506L318%l379j093K286K923j156l381r33L507J882j799l044L67L573
4272A757P88k503k647J358L069O17l648j566K550K505j131k986l65K665J951j720
4288F94l089N10L107J365k862k322J510L050R7l010j562K080K734q51l085o68
4304b302K875J817j888k996O53L495R07k735k365J730K720L46l330j503K099K919
4320B442j050k866p70K815K074k134k667L87K878J224k575k479J574K888K78k954
4336i35j470J946K966q22l062p63K786K021j910k783K10L137J287k687k347J064
$$ plain form
4352 -1362 2074 1923 -716 -2403 -279 2343 1381 -1892 -2242 479 2420 609 -2045 -1764 1293 2350
4368 2350 21 -2290 -1021 1827 1935 -723 -2516 -493 2155 1294 -1341 -2455 414 2446 594
4383 594 -1996 -1589 1173 2492 -5 -2584 -919 1829 1985 -836 -2272 -387 2183 1580 -1511 -2127
4399 -2127 524 2189 424 -1915 -1718 1287 2021 -134 -2469 -902 1930 1922 -809 -2448 -303 2230
4415 2230 1381 -1228 -2347 410 2290 593 -1990 -1728 1073 2371 137 -2253 -1195 1719 1872 -740
4431 -740 -2340 -455 2164 1599 -1387 -2097 419 2416 567 -1814 -1763 1015 2255 -31 -2050 -1093
4447 -1093 1534 1999 -510 -2411 -349 2200 1493 -1496 -1969 230 2263 549 -1905 -1759 1182 2371
4463 2371 -140 -1951 -982 1512 1936 -899 -2191 -263 2007 1497 -1266 -2024 346 2194 943 -2026
$$ packed form
4352a362L436j51k639j687K124K622r62l273l50K721J941j811k654K81L057J057
4368B350k329k311J269K848J08k658j793K023K648q61k635j114K869K032j852
4383E94k590M07K762J319k497k579J665K748J56k821j436J885K570o03l091o16
4399b127K651J665j765k339J97L005P34k155k335J567K832qk731j639K145K533
4415B230q49k609j119K757J880j697k583K62K801J298k234k390J058K914J53k612
4431g40j600J885K619n65k986p10K516J997j849k381N1K778J240k286k019R57
4447a093K627M65k509j901K062K549p07k989m73K199K033j714k454J46K941J189
4463B371k511j811R69K494M24k835j292J928K270n10k763p58K370J848j251k969
$$ plain form
4479 -2026 -1615 917 1735 1 -2240 -1026 1545 1936 -622 -2189 -312 2016 1417 -1391 -1799 176
4495 176 1974 822 -1925 -1537 992 2006 -80 -2025 -934 1541 1832 -537 -2110 -126 2089 1152
4511 1152 -1292 -1957 427 2165 828 -1788 -1488 989 2109 93 -2016 -942 1355 1908 -861 -2291
4527 -2291 -436 1659 1470 -969 -2078 64 1948 829 -1373 -1661 949 2271 150 -1828 -986 1440
4543 1440 1834 -345 -2004 -428 2206 1246 -1285 -1854 383 2122 709 -1572 -1593 760 2050 -50
4559 -50 -1931 -818 1573 1604 -507 -1780 -64 1902 1358 -939 -1775 452 1985 892 -1444 -1634 616
4576 616 1837 77 -2189 -1081 1589 1611 -290 -1701 -648 1665 1336 -1274 -1984 73 1919 504
4592 504 -1775 -1571 634 1968 199 -1916 -1016 1224 1778 -300 -1759 -470 1751 1322 -1172 -1919
$$ packed form
4479b026M11K532Q18j734k241J214K571L91k558j567J877K328n99k808m08J975
4495A76J798j152k747L88K529J014k086j945J091K475K91k369j573J984K215r37
4511A152k444o65K384J738j337k616L00K477J120k016k109J074K297N53k769j430
4527b291J855K095j89k439j109K142J884j119k202k88K610J322k121j978Q42K426
4543A440L94k179j659J576K634r60k531n69K237J739j413k281k1K353J290k100
4559e0j881J113K391L1k111j273J716J966n44k297q36K227J533j093k336j90K250
4576F16J221j760k266J108K670K2j901j411J053K313l29k610p10K057J846j415
4592E04k279K04K205J334j769k115R00K240N54k078j459J289K221m29k494p47
$$ plain form
4608 -1919 344 2064 854 -1563 -1670 820 1937 453 -1952 -998 1450 1719 -467 -2004 -374 1397
4624 1397 1429 -756 -1810 -3 1958 1061 -1551 -1918 682 1745 558 -1539 -1003 1157 1766 -616
4640 -616 -2053 -301 1482 1541 -1081 -1637 389 1729 792 -1362 -1688 604 1675 414 -1718 -1024 1117
4657 1117 1533 -432 -1770 -638 1347 1610 -686 -1865 46 1654 883 -1471 -1587 658 1557 467
4673 467 -1555 -1178 1048 1626 -418 -1924 -395 1587 1287 -764 -1829 51 2043 752 -1418 -1647
4689 -1647 923 1623 121 -1660 -1069 1107 1423 -589 -2026 -305 1737 1369 -799 -1732 -80 1818
4705 1818 858 -1368 -1485 554 1861 398 -1742 -1249 1018 1727 -123 -1703 -482 1566 970 -963
4721 -963 -1920 90 1447 1178 -1232 -1544 632 1834 336 -1089 -1161 874 1742 -268 -1540 -648 1362
$$ packed form
4608a919K263J720j210k417j07K490J117j484k405R54K448K69k186j537J630J771
4624A397L2k185j054J807J961q97k612l67K600J063j187k097N36K160O09k382
4640f16j437J752J783N9k622n56K026J340r37k154l26K292J071j261k132O94K141
4657A117M16j965j338J132J985K63k296j179J911J608p71k354j16K245Q99j090
4673D67k022L77K226N78k044j506J529J982l00k051j065J880J992j291k170k29
4689a647K570P00j502j781N91K176L16k012j437J721K042l68k168r33J652J898
4705A818r60k226j17K039J307j463k140M93K267P09j850j580J221K048n96j933
4721i63r57K010J357k69k410l12K176J202j498j425p2K035Q68k010j272Q92K010
$$ plain form
4738 1362 1267 -582 -1616 -66 1315 733 -1241 -1540 679 1659 265 -1469 -839 765 1503 -223 -1480
4755 -1480 -812 1274 1269 -704 -1662 83 1427 940 -1182 -1503 411 1465 53 -1521 -837 1156 1554
4772 1554 -457 -1721 -910 1562 973 -912 -1467 242 1555 924 -902 -1251 182 1664 274 -1494
4788 -1494 -1036 1094 1375 -329 -1592 -634 1224 1329 -677 -1660 111 1344 894 -1047 -1365 533 1460
4805 1460 434 -1657 -885 1018 1587 184 -1330 -686 1123 1551 -717 -1603 150 1285 479 -1071
4821 -1071 -1314 405 1416 745 -1405 -1155 809 1468 -314 -1224 -559 1355 1022 -821 -1571 -207 1438
4838 1438 482 -992 -1178 518 1594 242 -1319 -836 912 1451 -132 -1466 -610 873 1336 -773
4854 -773 -1521 -32 1494 882 -885 -1233 508 1725 413 -1372 -709 787 1394 -408 -1576 -673 781
$$ packed form
4738A362r5j849j034J550J381n82j974k99K219R80j394j734O30J604P38j726j257
4755a480O68K086nj973r58J745J344m87k122l21J914J054j412j574O84J993L98
4772A554k011j264Q11K472n89j885n55J709J313o31j826l49J433J482j390j768
4788a494M58K130K81j704j263R58J858J05k006r83J771J233m50j941l18J898R27
4805A460j026k091P72J903N69j403j514O44J809M28k268q86J753J135q06j550
4821a071k43J719J011o71k150K50J964O59j782r10O65J914l33j843p50J364J645
4838A438r56j474j86J696J076j352j561M83J748N39j583j334Q56J483M63k109
4854g73p48J489J526o12j767l48J741J217j312j785O63J496O07j802j168R03J454
$$ plain form
4871 781 1275 -451 -1551 -226 1457 910 -1109 -1147 271 1339 609 -1110 -1057 897 1352 -341 -1781
4888 -1781 -756 1296 1076 -172 -1729 -332 1346 729 -1042 -1176 433 1325 510 -1230 -884 683
4904 683 1199 91 -1556 -691 939 929 -574 -1404 -183 1369 771 -625 -1330 578 1635 329 -989
4921 -989 -673 776 1302 -113 -1456 -543 1068 1290 -756 -1393 13 1106 869 -839 -1091 254 1434
4938 1434 518 -1167 -1001 769 1188 -97 -1245 -614 1123 1220 -470 -1364 -450 1073 1012 -1008 -1351 208
4956 208 1469 221 -1287 -1050 643 1439 274 -1072 -800 945 1193 -534 -1242 -243 985 785 -714
4973 -714 -1306 74 1042 667 -1050 -680 453 1390 -21 -1171 -1100 1170 1063 -497 -1332 -72 1140
4990 1140 850 -676 -1373 8 1440 461 -1262 -1025 608 1461 -49 -1069 -664 654 992 -279 -1063
$$ packed form
4871G81M94j726j100J325J683n47k019l8J418J068p30j719N3J954M55j693j440
4888a781J025K052k20j248j557J397J678o17j771j34J609Q92q15j740L46J567
4904F83N16j108j647Q65J630j0j503q30J221J552n98j396p05J908J057j306j318
4921i89L16J449N26j415j343R13J611K22k046o37J406J093k37j708k52J345J180
4938A434r16j685J66J770M19j285j148O31J737R7j690q94R14J523o1k020l43J559
4956B08J261j248j508K37J693P96j165j346K72J745K48j727p08R99J228k00j499
4973g14n92J380R68l75j717L70J133R37j411j150P1K270j07j560q35J260J212
4990A140k90j526o97J381J432r79j723K37J633Q53j510j020M05J318L38j271p84
$$ plain form
5007 -1063 -121 1135 623 -694 -1364 203 1078 184 -857 -1182 350 968 -174 -1316 -509 802 1292
5024 1292 -472 -1150 14 1003 742 -506 -1039 44 1169 580 -746 -920 803 807 3 -1208 -630 990
5042 990 1021 -324 -972 -182 1026 836 -724 -1045 260 1175 342 -832 -748 488 875 -106 -890 -310 587
5061 587 1054 -209 -1187 -194 993 592 -799 -1041 7 1228 457 -925 -1226 424 947 23 -1055
5078 -1055 -692 638 1109 -346 -1250 -132 942 766 -707 -998 175 1114 352 -656 -992 340 1035
5095 1035 -227 -1253 -559 626 1017 -403 -983 5 1203 687 -617 -860 -103 1118 278 -877 -969
5112 -969 443 1141 174 -1370 -592 741 1030 -438 -1305 -627 1179 808 -629 -897 190 1153 305 -738
5130 -738 -993 295 1124 186 -1070 -669 706 725 -228 -1173 -285 872 511 -739 -1203 -145 1425 440
$$ packed form
5007a063R42J256n12j317o70J567Q75q94j041l25J532O18j142j142Q07J311M90
5024A292j764o78J164R89k61j248n33J083J125n89j326j74J723Mq04j211N78J620
5042I90L1j345o48P90J208j90j560l21J305R15q33j174Q4J236L87r81p84N80Q97
5061E87M67j263r78R93J187m01j391k42J048J221p71j382l01J650N23r24j078
5078a055L63J330M71j455r04J118J074j76j473k91J173R39p62j008l36J332O95
5095A035j262j026O94J185L91j420n80R88J198n16j304k43P57J221q40j155r2
5112i69J412O98r67j544P78J333K89j468q67O78J806l71j437k68J087R63q48j043
5130g38k55J288Q29r38j256M01J375J9r53r45Q88J157l61j250m64J058J570r85
$$ plain form
5148 440 -1005 -940 415 1138 273 -901 -746 912 970 -281 -821 -298 1018 719 -529 -1170 304 1212
5166 1212 397 -982 -981 594 813 163 -1293 -344 710 1099 -392 -884 -687 897 599 -715 -1305 55
5184 55 968 559 -1136 -938 336 952 579 -1020 -669 624 884 -91 -1230 -370 701 555 -656 -1396
5202 -1396 -108 1184 514 -971 -975 205 1204 255 -639 -710 708 911 -107 -956 -398 642 765 -263
5220 -263 -1371 61 836 522 -945 -858 31 901 368 -608 -625 553 707 -183 -829 -437 860 807 -439
5239 -439 -1157 274 779 597 -946 -663 58 941 554 -1012 -457 755 1108 -174 -977 -339 1057 651
5257 651 -497 -916 -300 666 579 -908 -741 457 924 305 -754 -892 444 588 -109 -1180 -431 653
5275 653 941 -241 -1366 -123 1162 377 -863 -800 178 1013 300 -600 -622 482 674 117 -1211 -181
$$ packed form
5148D40j445O5J355P23q65j174J55J658N8j251n40N23J316k99j248o41J474R08
5166A212q15j379JJ575K19o50j456R49J054L89j491m92J97J584k98j314n90J360
5184E5R13m09j695J98J274O16l73j599L51J293K60r75j139Q60J071j46j211p40
5202a396J288J292o70j485mJ180R99r49q94p1J418K03j018q49N58J040J23j028
5220b63j108J432P75l14j467Q7Q89Q70n33r76j7J178J54q90o46L92J297n3j246
5239d39p18J431N05j82j543K83P21Q83l87j566N55J212L53j282q03O38J396m06
5257F51j148m19O16R66q7j487J67J198M67o19j059j38J336J44o97j071P49J084
5275F53K88j182j125J243J285p85j240O3R78Q35p13r00k2J104J92n57j328J030
$$ plain form
5293 -181 966 541 -453 -1074 0 944 573 -522 -781 239 869 -19 -814 -574 522 860 -65 -760
5311 -760 -324 581 742 -518 -958 98 792 537 -439 -636 322 843 125 -789 -648 501 830 -17 -804
5330 -804 -198 973 875 -262 -782 -147 737 343 -674 -832 418 1251 165 -833 -547 669 746 170 -930
5349 -930 -101 591 568 -404 -837 118 1035 697 -778 -886 381 891 302 -847 -749 457 1015 223 -998
5368 -998 -511 847 965 -409 -1065 22 782 411 -264 -885 368 839 238 -975 -798 608 760 142
5386 142 -689 -200 429 760 -204 -944 -330 765 389 -485 -593 159 1104 155 -648 -674 552 909 -206
5405 -206 -1000 -393 851 885 27 -910 -307 796 690 -530 -636 291 598 414 -556 -860 696 939 -149
5424 -149 -689 -11 563 513 -392 -1078 -85 807 889 -612 -1064 38 1063 293 -777 -484 453 1087 -132
$$ packed form
5293a81J147m25r94o21J074R44l71j095k59J020O30q88p95K40J096L38r25o95
5311g60M36R05J61j260m40J056O94k55r76j97R58N21p18r14J41J149L29q47p87
5330h04O06J171r8j137n20O35Q84l94j017j58J250Q33j086r98K86J216P7n76j100
5349i30Q29O92k3r72m33R55R17l38j475j08J267N10n89j149R8J206N58p92j221
5368i98M87J358J18j374o56J087P60l71o75o21J253M71o01j213J77J406J52o18
5386A42q31M89O29L31r64p40O14J095l76q74j08P52R45r49q03k6J226L57j115
5405b06p94O07J244L4q58r37O03J103j06j220j06R27L07j84r70l04J556K43j088
5424a49n40O78N74n0r05o86R93Q92Q2j501m52J102J025p70j070K93R37O34j219
$$ plain form
5443 -132 -959 -424 705 717 -242 -690 -506 930 695 -626 -784 -99 891 -19 -695 -505 508 885 -266
5462 -266 -952 -467 325 503 -247 -676 56 555 413 -648 -647 82 543 57 -613 -696 343 763 246 -842
5482 -842 -325 764 784 -389 -751 -266 594 271 -477 -813 -187 729 413 -498 -752 488 668 -106 -944
5501 -944 -194 802 583 -321 -724 -131 530 456 -650 -890 -93 836 423 -749 -603 554 610 -185 -423 -377
5521 -377 579 398 -213 -731 -278 516 411 -609 -624 336 757 220 -554 -410 338 680 -11 -565 -243 455
5541 455 900 -267 -681 -120 656 494 -369 -674 99 893 335 -885 -517 433 521 -65 -883 -245 499 575
5561 575 -309 -710 -33 661 389 -471 -1014 -251 846 267 -818 -608 472 642 -10 -578 -102 559 482
5580 482 -326 -968 -172 780 511 -514 -859 92 714 76 -796 -493 413 451 334 -755 -621 639 755
$$ packed form
5443a32q27N35J129J2r59m48J84J436k35j321j58O85R90r10o76J90J013L77j151
5462b66o86M85P92J78p50m29P32M99j42j061JP29M61m86o70q3J039M20n17j088
5482h42N17J089K0j173l62M85Q60l23p48l36O26R16l16r11k54J240J80p74q38
5501i44P50R96k19r04m03N93O61p4j106k40P97R29m13j172J46J157N6p95k38M6
5521c77R56j81o11n18M53P94j05j020j5R60M21n37p74J44P48L42o91n54L22O98
5541D55M45j167m14N61P76j62q63l05P73P94n58j220L68R50Q8n86q18O38P44P6
5561E75q84m01O77O94k72q60n43P63J097n79j085K10J080J70o52n68M76O61p7
5580D82q08o42P96R52k69j025l45R51O22o38q72L03R06L8j17j089J34J260J16
$$ plain form
5599 755 -169 -564 194 870 348 -437 -672 -85 443 231 -795 -392 124 547 -223 -589 -317 436 837 -224
5619 -224 -549 -133 722 663 -460 -646 -111 917 529 -437 -515 486 490 -26 -662 -233 580 451 -176 -991
5639 -991 -293 787 641 -597 -637 252 534 242 -656 -675 227 764 231 -503 -115 543 498 194 -768 -151
5659 -151 915 151 -671 -714 2 833 396 -567 -452 60 583 -166 -498 -391 607 816 -69 -666 -129 559
5679 559 318 -548 -641 -3 538 173 -311 -537 222 659 186 -382 -374 330 636 9 -562 -227 698 488 -409
5700 -409 -854 62 815 366 -251 -381 170 572 -17 -849 -586 395 688 -79 -913 -22 484 519 -457 -398 372
5721 372 496 90 -336 -540 92 418 71 -674 -512 426 540 -67 -542 -378 421 566 -358 -677 74 546
5741 546 362 -452 -496 213 735 -7 -621 -431 466 609 -189 -401 -466 339 393 -78 -596 134 472 76 -383
$$ packed form
5599G55r24l95P58O76n22p85k35N87N28k12j026M03N16M23p70l66K72P53M01j061
5619b24l25M16Q55n9j123j86N35J028l88r66p8J001Mn16o36M29Q13j29o27q15
5639i91O98J080j46j238m0Q89K82k92q98j9R02N37n33p34L88O58m5l04r62O17
5659a51J066p64q22m3P16Q31m37r63J15N12N23p49l32J07R98K09q85n97N37O88
5679E59k41q66r3O38N41l65m84k26P59M37m73n68QP04L06o27n71L35R25k10q97
5700d09m45R16P53m49o17j30N51M02n89q32K63R81K93p67q34Q91N06L5r76N9P70
5721C72J24m06m26k04O32L26l47p45J62R38J14o07m75J64P99J45r24l19P51M72
5741E46j84q14m4P09N22p42o14J90Q97J43p98k12o5Q05N4m71n18P30L38l96m59
$$ plain form
5762 -383 -519 207 294 475 -486 -357 323 624 -68 -562 -353 257 534 -294 -452 122 732 503 -525 -574
5782 -574 205 429 7 -306 -140 488 613 -60 -411 -94 393 397 -274 -352 -20 526 271 -541 -535 82 525 -176
5804 -176 -708 -576 345 477 101 -504 94 692 198 -394 -305 15 571 339 -485 -800 163 311 264 -604 -139
5825 -139 22 488 253 -443 -318 308 155 -76 -535 -165 487 418 -145 -540 256 580 -67 -384 -314 409 434
5846 434 -345 -472 -263 448 264 -132 -484 21 578 240 -629 -402 143 255 387 -589 -293 304 787 -104
5866 -104 -545 -352 480 145 -162 -231 -259 361 154 -544 -579 256 591 227 -337 -282 373 88 34 -555 -479 395
5888 395 467 -273 -234 168 506 305 -538 -383 245 907 -69 -741 -303 549 639 -143 -355 -135 181 418 -178
5909 -178 -456 84 638 339 -371 -492 16 461 484 -163 -307 411 328 -256 -651 -139 319 521 -169 -803 -99
$$ packed form
5762c83j36P26Q7J81r61J29O80L01o92m94K09O10K77q28j58N74O10k29j028m9
5782e74P79K24m22l13J66O28J25o73l51L17M87Mo71p8L32N46k55q12OO17M43p01
5804a76n32J32R21J32l76o05N98N98m94n92Q9L20N56k32q24l15R63J48m7q68M65
5825a39J61M66k35o96J25O26j53k31m59L70O52o9n63l95P96L24o47l17P0P23K5
5846D34p79j27K09P11j84l96l52N05N57l38q69K27N45J12J32r76K96N97M83q91
5866a04m41J93Q32l35l07o9k8O20k07o98l5Q35L35l64n64N5O55k85n4n89P6Q74
5888C95P2p40L9M02L38k01q43J55O28O62r76o72M38Q52R0p82k12K20L16K37n96
5909a78k78N40N54k99p10j21N08M45K3o47j44P18q3n84l95N12M58K02o90o34P04
$$ plain form
5930 -99 303 390 -232 -425 134 500 351 -474 -600 144 366 -7 -238 -278 405 536 -61 -603 -90 449 -12
5951 -12 -379 -242 299 171 196 -343 -397 283 335 -23 -252 -291 280 156 -317 -589 -235 384 244 -230 -431 438
5973 438 594 141 -537 -266 91 501 -27 -247 -275 256 306 -384 -289 -216 672 220 -392 -390 -115 261 -43 -482
5995 -482 -232 273 492 249 -478 -160 460 266 -186 -335 -63 537 397 -168 -401 247 272 279 -332 -277 142
6016 142 254 -54 -409 -254 297 432 35 -297 -378 301 384 -422 -469 125 335 262 -125 -570 254 473 84
6037 84 -408 -258 183 114 -91 -575 -222 451 661 -546 -438 209 94 310 -517 -504 -102 359 -132 -550 -289
6058 -289 245 409 -283 -433 136 469 314 -264 -529 333 429 -27 -521 -496 153 603 289 -218 -80 411 547
6079 547 -233 -338 -195 407 71 -202 -263 12 444 -10 -155 -348 34 512 114 -335 -526 373 277 -253 -228
$$ packed form
5930i9M02Q7o22j93N59L66j49q25j26P44K22l73k31m0O83J31n97n42N13N39m61
5951a2l67J37N41j28K5n39n4O80N2l58k29l9N71j24m73k72L54O19j40m74k01Q69
5973D38J56m53o78K71L57M10n28k20k8N31N0o90R5P3Q88m52o12KK75L76l04m39
5995d82K50N05K19k43p27L18O20j94m52j49K72O00j40n65k33O48K5Po11N5M19
6016A42J12l08l55J55N51J35l97l32q1O79Q3q06m7N94K10p3l87m45Q24K19l89
6037H4m92J50M41o9k05m84L53O73K10j207J08O47j15K16q27J3M02M61m91m18K61
6058b89N34J64o92j50N69L33j55n78k65Q62R6m56m94K5O49M50l14n07J38M91J36
6079E47p80j05J43O02l36k73o1K75M32m54j45j93L82M78l98m49j91Q99r6n30K5
$$ plain form
6100 -228 -55 283 591 162 -471 -184 291 225 -464 -263 34 585 172 -361 -296 188 546 -63 -665 158 150
6121 150 312 -102 -626 48 709 202 -292 -332 -142 216 183 -293 -181 283 195 77 -480 -296 281 383 -168
6142 -168 -270 -123 90 287 -478 -206 463 524 220 -417 -251 286 405 -247 -387 131 150 -107 -432 -436 132
6163 132 203 299 -264 -370 -153 348 -168 -440 -198 357 121 51 -473 19 375 340 -90 -112 176 341 318 -487
6185 -487 -288 259 622 -86 -239 -363 171 409 -169 -397 -176 316 407 -209 -405 -51 303 54 -476 -608
6205 -608 153 570 15 -265 -240 148 208 -88 -383 5 356 429 -295 -323 85 305 154 -87 -198 44 287
6226 287 251 -413 -402 404 244 -104 -366 -71 508 371 -273 -339 43 455 431 -354 -363 -121 542 252 -393 -368
6248 -368 343 427 -51 -598 -102 475 307 -134 -551 -98 390 406 -179 -83 79 348 275 -72 -59 299 387 -27
$$ packed form
6100b28J73L38L08m29o33K87M75o6o89K01K97N51m13n33O5M84L58o09o02Q23q
6121A50J62m14n24O74O61n07m94m0J90L58l3m76J12M64q8j18n57J84N77J02n51
6142a68j02J47K13J97p65K72O69O1l04o37J66N37J19o52j40N18J9k57l25mN68
6163A32P1R6n63j06K17N01n16k72K42N55k36p0n24M92L56l5m30k2K88J65k3q05
6185d87J99N47L63p08j53j24N34K38n78k28K21M92R1o16j96L54L54k49n30j32
6205f08P61M17n55k80K5L88O0k96k95L88L51P3p24k8M08K20j51k41j11K42K43
6226B87l6o64J1Q06j60l48k62K95N79j37o44o6L82M12k4p85rK42O63k90o45K5
6248c68P11Q4m78n47M96N77j68m41m17M53M88J6n85R6J62K69p3l47J3L58Q8m14
$$ plain form
6270 -27 -491 -79 294 428 72 -497 -81 256 -65 -381 -333 176 360 -148 -183 -331 334 309 -42 -604 -221
6291 -221 434 63 102 -422 -217 257 415 -148 -397 19 366 44 -414 -132 180 448 115 -212 -125 507 485
6312 485 -243 -275 8 360 219 -315 -623 108 346 -26 -299 -201 164 356 -231 -369 -174 188 194 -194 -221 64
6334 64 164 301 -408 -300 -159 288 344 -230 -121 369 455 77 -268 -151 307 557 65 105 5 55 197 -103
6356 -103 -283 428 359 191 -200 -147 424 402 -7 -254 -69 178 311 -10 -374 -54 464 452 60 -70 -38 254
6378 254 449 -102 -460 112 404 -16 -463 -338 29 408 -165 -509 -26 465 203 181 -117 86 147 82 -331
6399 -331 -162 220 454 221 -377 -223 269 162 -179 -395 20 297 417 -111 -285 197 156 431 35 -191
6419 -191 202 542 -225 -130 -242 258 382 -147 -156 -49 108 100 -148 -293 124 358 173 -103 -245 191 330 -173
$$ packed form
6270b7m64M12L73J34l56n69M16L37l21l16M8N09J84n08l5j48O65k5l51n62L83
6291b21O55l71L9n24K05M74J58n63k49M16L47l22m58K82L12K68l33l27Q7O32k2
6312D85p28l2K83L52j41n34l08P31K38l72k73R8L65J92n87j38J95L62Ol88k7K85
6334F4J00J37p09J08J41M47N6n74J09M90Q6l78l45J17M58K50m92M0j00N0J42l00
6356a03j80P11o9j68l91N3N71k2m09k47J85K47J33l21l64L20N18j2l92j30L2K92
6378B54J95n51l58N72K92m20m47J25L67L79n73l44M83M91k62k2k98K03O1o5m13
6399c31J69L82K34k33n98J54M92j07l41k16M15K77J20n28j74M82m1K75l96k26
6419a91L93L40p67R5j12N00J24n29rJ07J57qk48j45M17K34j85k76j42M36J39n03
$$ plain form
6441 -173 -29 -146 -101 465 -264 -130 211 308 369 -263 -167 -242 242 118 -156 -366 170 362 41 -98 -432 -5
6463 -5 283 -133 -178 103 334 538 -268 -233 45 -110 164 -170 -205 199 243 -79 131 -21 169 188 107 -186 -132
6486 -132 228 148 -367 -442 281 246 47 -102 -374 -197 162 74 -362 -297 417 307 -182 -484 -169 -50 36 -429
6508 -429 -200 150 225 -124 -105 -377 -76 51 -68 -319 -82 442 476 136 -372 53 279 103 -284 -277 87 393
6530 393 -114 -446 -227 171 467 128 -245 -409 343 449 -114 -277 -288 129 264 -407 -523 193 299 129
6550 129 -281 -132 203 343 -45 -318 -79 277 229 50 -310 -268 138 359 -83 -141 105 349 -89 -337 -358
6571 -358 26 273 83 -421 -336 284 260 -133 -403 -410 102 396 -184 -176 64 224 322 -133 -174 392 271 156 -502
6594 -502 -102 3 500 -20 -512 -131 331 144 14 -211 -69 374 130 -344 -141 82 374 -79 -510 -302
$$ packed form
6441a73J44j17M5N66p29J34L41R7O1o32R6p5M84j24k74k10N36J92l21j39l34M27
6463eK88m16m5K81K31K04q06L5K78j55K74l34l5M04M4l22K10j52J90J9q1k93N4
6486a32L60q0n15p5P23l5j99j49k72J77L59q8m36O5P14j10m89l02L15J19Q6m65
6508d29K29L50P5l49J9k72L01J27j19k51K37N24L4l40n08M25K26j76l87PL64L06
6530C93n07l32K19L98K96l39l73j64P52J06n63j63j1M17J35o71j16P16J06j70
6550A29m10J49L35J40l88k73K39L56m8j79l60M2M06K21m42n8K46K44m38k48k1
6571c58L84K47j90n04Q5O20k4l93k70pN12K94n80QK40J60R8m55m1N66j21j15o58
6594e02M00J05M97n20m92L81M62j87j30k25J42M43k44m74K03K23K92m53m31K08
$$ plain form
6614 -302 91 281 -123 -207 -81 1 148 -458 -534 -284 498 374 -59 -238 522 254 194 51 -264 272 319 32
6636 32 -232 -372 140 161 -275 152 -98 92 227 -453 -334 269 323 124 12 -39 193 -155 -50 -324 -146
6657 -146 147 -12 -180 -382 117 98 89 -31 -277 270 290 146 -98 -341 199 321 -31 -273 -141 -37 453
6678 453 -140 -275 -172 149 316 -506 -283 151 406 60 -191 -94 130 170 -191 -411 -74 271 86 -159 -267
6699 -267 -13 -125 43 10 -265 110 150 141 -276 -225 5 372 18 -221 -161 253 110 2 -154 49 419 -31
6721 -31 -279 -23 -214 19 72 -426 -176 135 -26 -6 -91 43 25 388 52 -221 -96 -69 345 -239 -111 6
6743 6 216 22 -165 -113 -29 307 -163 -195 -48 58 344 36 -291 -141 320 293 -157 -301 -27 322 -151 -208
6765 -208 86 -136 32 -73 -242 17 -2 60 -137 52 -199 282 168 30 -262 -114 314 -58 -233 -224 30
$$ packed form
6614c02L93J90m04q4J26Q2J47o06p6K50P82j24m33j79P60k68o0j43l15N36M7k87
6636C2k64j40N12K1m36M27k50J90J35o80J19O03N4j99j12n1K32l48J05k74J78
6657a46K93j59j68k02M99j9rj20k46N47K0j44k44k43N40J22l52k42J32J04M90
6678D53n93j35J03L21J67q22K23M34K55l46k51R7K24M0l61k20L37L45j85k45j08
6699b67K54j12J68l3k75L75M0rm17N1K30L67l54k39O0M14j43j08j56K03L70m50
6721c1k48K56j91K33N3m98K50L11j61K0q5J34j8L63l36k73J25K7M14n84J28J17
6743FK10j94j87N2Q4L36m70l2J47J06K86l08l27J50M61k7m50j44K74L49m73n7
6765b08K94k22J68j05j69K59j9O2j97J89k51M81j14j38k92J48M28l72j75RK54
$$ plain form
6786 30 204 -128 -217 -56 -85 92 -129 -224 -193 361 207 -85 -284 -84 108 -67 -226 -93 139 227 -164 1
6808 1 -335 249 128 -302 -70 216 164 21 -146 -160 149 393 -78 -50 0 -40 85 -69 -187 36 143 37
6830 37 84 -435 -21 219 170 -536 14 13 346 159 65 91 122 379 -209 -387 -37 -109 193 -53 -201 -91 210
6853 210 293 -91 -171 -229 571 -33 -89 -278 -174 444 11 -245 -157 -26 369 -2 -5 -25 105 266 -190 -105 -438
6876 -438 215 -123 -121 -113 -204 315 -3 -345 59 132 139 81 -184 -151 421 -148 -97 100 -217 424 109 157 -269 142
6900 142 260 -177 -133 -42 122 183 -33 -101 126 12 360 -147 -339 331 353 294 -122 12 -136 174 289 -23
6922 -23 -275 358 -61 -90 -201 -15 93 133 -36 -67 254 36 -56 -283 -283 53 112 98 -122 -10 127 211 -57
6945 -57 -284 -225 228 308 -403 -266 156 180 169 -263 41 152 78 192 -78 226 125 34 -239 -202 10 47 221
$$ packed form
6786C0J74l32q9J61k9J77k21r5L1N54j54k92j99K00J92j75j59J33K32Q8l91J65
6808Al36N84j21m30K32K86n2j43j67j4L09K44m71K8N0m0J25j54j18K23J07j06
6830C7M7n19M14K40m9p06N50jL33j87r4K6L1K57n88j78L50p2L02k46j48J10L01
6853B10Q3l84q0n8Q00o04n6j89J04O18m33k56Q8J31L95l71lk0J30J61m56Q5l33
6876d38O53l38KQr1N19l18l42M04P3Pn8k65L3N72n69N1J97l17O41l15M8m26M11
6900A42J18m37M4R1J64O1k16o8K27j14L48n07j92O70K2n9m16J34j48L10J15l12
6922b3k52O33m19k9j11J86J08M0j69l1L21k18r2k27%L36N9j4k20J12J37Q4k68
6945e7k27N9M53Q0p11J37M22K4j1m32L04J11p4J14k70L04j01r1k73L7K12L7J74
$$ plain form
6968 221 15 -4 -39 38 57 -120 -19 35 286 26 -151 -8 -20 455 208 -262 311 287 192 -283 -285 174 75 338
6992 338 -312 -256 -82 34 152 23 -290 218 293 2 -172 -25 -85 94 165 -320 6 117 53 49 76 166 120
7015 120 223 -193 -259 334 200 -178 -277 101 246 43 -16 -386 -64 -48 -22 -370 257 280 385 -96 52 -155
7037 -155 44 175 -5 -449 127 150 -136 -296 -169 109 108 51 -382 -169 0 180 42 -221 121 539 186
7058 186 -78 -503 -55 334 128 70 64 133 129 -7 -169 -230 71 309 -6 -333 -45 121 -68 121 -123 -10
7080 -10 289 27 -190 -241 7 182 38 -10 -253 75 5 13 -21 244 399 73 -111 -114 172 187 -24 -347 -97
7103 -97 30 47 9 327 4 -21 196 159 -207 -24 -14 15 84 -285 -202 133 283 207 -196 -129 218 86 32 -312
7127 -312 38 248 -112 -62 -143 159 -230 9 -62 -102 271 45 12 -427 13 362 368 -87 -40 55 235 60 -29
$$ packed form
6968B21k06j9l5P7J9j77J01N4K51k60j77J43j2M75k47m70N73k4r5m75kM59r9K63
6992C38o50N6J74J16J18j29l13N08P5k91j74J47o0J79P1m85L26J11o4mK7R0m6
7015A20J03m16o6N93j34l78r9L78J45k03n9l70L22J6K6l48O27K3J05m81J48k07
7037a55J99J31j80m44N76K3k86j60J27K78jn7m33K13J69J80j38k63L42M18l53
7058A86k64m25M48L89k06n8oO9mj36j62o1L01K38l15l27K88J66j89J89k44J13
7080a0K99k62k17n1K48J75j44m8k43L28p0Ql4K65J55l26j84lK86J5k11l23K50
7103i7J27J7l8L18l23k5K17l7l66J83J0K9O9l69Q3L35J50p6m03O7L47j32n4l44
7127c12L50K10l60N0q1L02l89K39p1m0L73k26l3m39M40L49Om55M7R5J80j75q9
$$ plain form
7150 -29 -57 -65 -154 11 -16 28 353 220 -83 -350 -75 -208 62 -138 -82 280 154 122 -233 -229 19 -207 14 -476
7174 -476 -40 332 348 220 -210 -194 123 93 -86 -327 348 158 19 -248 -115 41 -6 18 -278 -44 -14 -51
7196 -51 -175 -482 -111 223 159 -2 -155 78 308 -207 -246 -405 432 207 98 -222 -290 -110 395 -327 -78
7217 -78 172 497 41 -78 -193 189 140 48 -44 -182 -154 319 312 -290 86 294 38 -112 -321 -176 186 148 -129
7240 -129 -124 -22 80 346 -208 -123 -72 5 108 -176 111 8 89 179 -104 -49 306 32 -170 -141 -135 128 -87 -48
7264 -48 47 -97 317 -100 -17 -70 182 234 -12 -182 -120 124 -164 -220 -57 -26 -51 0 -183 -254 192 271 -75 -227
7288 -227 28 105 56 -97 87 -138 -60 -29 157 -184 88 391 -141 -31 53 -86 362 -158 -211 -168 -142 80 -120
7311 -120 -198 -84 207 -128 -135 -320 90 129 -10 -2 -31 87 62 -171 -248 -292 -107 326 -283 -122 244 154 126 -215
$$ packed form
7150b9k8qq9J65k7M4L25j33l03k67K75j33K70k00N6L62j26l2l55MK48k26K21m90
7174d76M36L72J6j28m30J6L17l0j79k41O75j90j39k67J33J56m7K4k96K34L0l7
7196e1j24l07L71L34o4j61j53K33K30n15l9j59Q37k25j09l20o8J80N05p22K49
7217g8K50L25m56j19j15L82m9r2r2j38K8M73po02L76K08k56j50k09J45L62l8k77
7240a29NJ02J02K66n54Q5N1P7J03k84K87j03Q1R0k83N5L55k74k02K9OK63k15L9
7264d8R5j44M14m17Q3n3K52N2k46j70O2K44k88n6J63L1k5N1j83p1M46P9l46j52
7288b27K55P7m9j53J84k25P8L1J86l41K72L03n32J10Q4j39M48n20n3M3K6K22k00
7311a20p8J14K91l35pj85M10L9j39Qk9J18k5k33p7m4J85M33o09J61L66r0k8l41
$$ plain form
7335 -215 -261 -113 -63 64 -155 -238 151 -135 -310 -163 -255 -151 268 45 -75 -148 292 262 9 -417 -107 236
7357 236 -47 -75 -287 -84 -211 -180 11 -434 55 325 -282 -79 -266 -96 138 130 -57 -85 50 228 -246 -193
7379 -193 118 63 366 -51 -62 -99 181 58 -105 163 426 140 63 -80 -91 533 132 -159 -166 36 -112 -86 -436
7402 -436 42 132 269 100 140 -118 416 133 -231 -181 -269 232 70 -210 -203 40 -105 -5 -258 -118 144 255
7424 255 97 -54 77 402 132 77 -33 167 3 -44 -92 -146 233 534 -75 52 48 -21 340 -193 -35 -290
7446 -290 184 3 -158 -181 -189 96 -57 -206 -191 -36 226 -21 69 58 176 125 -23 -92 -56 175 233 57 -181
7469 -181 105 102 -147 -406 21 340 20 42 16 -316 182 -107 90 -437 54 154 214 77 -253 -38 142 -187
7491 -187 141 -278 -134 105 2 -398 -198 224 26 99 20 -132 275 212 91 -264 -146 -88 417 -47 -362
$$ packed form
7335b15m6J48N0J27k19q3L89k86j75J47r2J04M19k23j20p3M40l0k53m26L10L43
7357B36k83k8k12K03j27L1J91m45M89K70o07K03j87J70K34qj87k8J35J78m74N3
7379a93L11n5L03m17j1l7K80j23j63K68K63k86p7j43j1O24m01k91pK02j48K6l50
7402d36M78R0J37j69M0k58N34k83l64N0q8N01j62k80PK43j45J00k53J40K62J11
7424B55j58j51J31L25k70n5j10K00j64m7m8n4L79L01o09J27mo9L61n33J58k55
7446b90M74j81j61k3qK85j53j49J5J55K62k47R0j1J18n1j48o9L6K31N8j76k38
7469a81K86lk49k59M27L19l20K2k6l32M98k89J97n27M91J00O0j37l30K15J80l29
7491a87L28m19J44K39j03m00K00M22j98P3p9j52M07o3j21l55J18N8N05m64l15
$$ plain form
7512 -362 88 253 137 -170 -107 222 53 -104 -90 -33 96 36 -97 -583 -23 -170 140 -258 -89 50 281
7533 281 -54 -241 -13 131 93 -213 -227 -132 50 33 -161 -282 92 -58 162 73 23 -55 264 -35 78 90 38
7556 38 57 201 -227 -149 55 246 14 -215 50 -102 -170 -39 -157 -64 111 21 -277 -132 59 183 -46 -197
7578 -197 131 236 -15 -36 -19 -100 75 31 -339 -91 -62 171 -111 -83 -390 -114 67 -346 -388 -60 58 -79
7600 -79 93 -127 -71 168 324 48 79 92 -44 -56 -6 -107 -27 251 12 -132 -192 65 195 280 56 -155 -32
7623 -32 2 126 -292 352 416 -55 -51 -163 53 281 -44 -18 -210 169 133 -7 50 -21 -54 95 -186 -118 10 341
7647 341 160 -380 -221 2 188 -4 -470 -127 170 124 -170 -100 -146 358 94 84 1 207 -36 175 -7 -228
7669 -228 242 -7 -97 -247 -125 91 115 -142 -229 -181 -18 244 299 -329 258 119 -395 -312 -265 292 27 -178
$$ packed form
7512c62M50J65j16l07O3L29j69j57J4N7J29o0j33m86N60j47L10l98J69J39K31
7533B81l35j87K28J44l8l06j4R5J82j7j94j21L74j50K20q9n0p8L19k99J13J2n2
7556C8J9J44m28P8K04J91k32k29K65j52o8J31j18R3J75r0k98J45J91J24k29j51
7578a97L28J05k51k1J7q1J75m4l70K48K9K33k82K8l07K76J81m13m2L28J18j37
7600g9J72k20N6K39J56k76L1J3j36j2N0j01Q0K78k39j44o0K57J30Q5k24k11J23
7623c2L4J24m18O44O4m71Mj12K16K28l25K6j92L79l6j40N7p1l3J49k81O8J28L31
7647C41j81n40J59K23J86j92m66L43K97m6k94P0m6N04k64j0q3K06k43K11j82k21
7669b28M70k49r0j50J22K16K4k57q7M8J63K62N5o28N87j39n14Q3M7N57k65k05
$$ plain form
7691 -178 66 -74 118 264 61 -255 -166 261 -64 -84 -90 -12 121 32 -121 -110 -18 22 35 -215 -319 370 469 -179
7715 -179 -323 23 175 102 -126 -224 -79 152 104 62 -155 -16 -6 65 7 -366 -95 167 251 -75 7 231 72
7738 72 -236 -290 -89 -81 -181 -127 -32 120 208 191 -150 5 -71 -39 97 -11 136 373 31 -307 -95 91 244
7761 244 328 -80 -148 -127 408 -199 164 110 28 70 -201 -168 4 60 41 -46 114 10 194 107 -362 -290 -30 232
7785 232 -98 116 -189 469 156 152 -173 56 19 35 -202 -237 -127 -51 -223 -186 93 15 -110 -7 74 -19 58 18
7809 18 2 37 77 286 239 -128 8 -66 -92 371 -210 53 -36 178 -154 -168 159 52 -131 -198 -175 112 154 34
7833 34 -23 333 103 43 -136 34 -88 -147 -109 105 -71 -206 148 53 40 -345 -214 155 189 -72 38 142 252
7856 252 -152 -168 81 306 149 -76 103 64 185 219 332 -18 -194 69 69 150 -54 120 306 220 -91 13
$$ packed form
7691a78K44j40J92J46k03l16Q9M27l25k0oP8J33q9j53J1R2M0J3k50j04O89R9o48
7715a79j44L46J52p3k28r8J45K31m8m2k17J39J0P1n8l73K71K62Q4l26Q2K24j59
7738G2l08n4K01Qj00N4R5J52Q8j7l41J55p6L2J36j08J47K37l42l38K12J86J53
7761B44Q4m08o8K1N35o07L63n4q2M2k71L3J72N6j9q7J60j04J84q7m69P2K60K62
7785B32l30K14l05O58l13ml25K29l7J6k37l5J10P6j72L7K79p8j25J03Q1r3P7m0
7809A8j6L5M0K09m7l67J36p4k6M63n81K63q9K14l32j4L27j07j83o7K3K87M2j20
7833C4n7L56k30o0j79J70j22n9L8K14j76j35L54r5j3l85J31L69L4k61J10J04J10
7856B52m04j6K49K25j57k25J79l9J21L4J13l50j76K63%Q1k04J74J86q6l11J04
$$ plain form
7878 13 182 34 97 43 -15 52 238 188 97 260 55 227 -25 -191 -492 -250 9 -60 -106 -263 261 -257 -321
7901 -321 -183 134 85 -7 91 -209 51 42 -81 -65 -6 93 21 -77 -141 2 -24 3 -268 34 94 94 -85 -150 123 204
7927 204 71 129 -124 -318 61 -176 -57 -144 149 73 171 -58 37 13 280 187 -282 -56 -13 22 -52 -75 145 13
7951 13 213 238 201 17 320 -148 -20 -98 60 101 -176 -23 -131 237 -24 -155 -48 -209 95 -99 11 -242
7973 -242 -143 -3 29 -48 -153 77 42 15 -101 171 156 63 -266 -175 -104 -139 160 -45 -153 216 332 -13 100
7996 100 -8 -265 136 454 90 -20 129 161 343 -377 1 36 -134 -17 -122 228 197 -8 -182 23 -142
8017 -142 -169 315 -142 -47 -32 96 -22 -160 -91 383 221 -175 -142 -121 69 -161 -72 -101 187 222 -25 -87 -341
8040 -341 -47 15 -5 -163 35 146 180 -209 -368 154 162 490 -99 108 43 -66 307 140 -8 94 248 -149
$$ packed form
7878A3J69j48O3n4n8O7J86n0r1J63k05J72k52j66l01K42K59o9m6j57N24n18o4
7901c21J38L17m9r2R8l00K60rj23J6N9R9p2r8o4J43k6K7k71L02O0%j79o5K73Q1
7927B04j33N8k53j94L79k37J19q7K93p6R8k29R5k4K67r3m69K26M3L5p4k3K20j32
7951A3K00K5l7j84L03m68J28p8J58M1k77J53j08L68k61j31J07j61L04j94J10k53
7973b42R9J40L2p7j05K30l5k7j16K72j5r3l29R1P1l5K99k05j08L69J16l45J13
7996A00j08k57M01L18l64j10J49L2J82p20L78L5j70J17j05L50l1k05j74K05j65
8017a42k7M84m57R5J5J28j18j38O9M74j62l96L3K1J90k30Q9k9K88L5k47o2k54
8040c41K94O2k0j58J98J11L4l89j59N22QL28n89K07o5j09L73j67j48J02J54l97
$$ plain form
8062 -149 149 109 150 300 148 112 -83 153 -121 -198 -249 -14 183 -54 -104 -172 -66 357 -30 -320 -122 44
8084 44 -176 17 -48 167 57 100 47 -277 226 208 -24 -276 -70 39 206 30 43 113 108 298 -16 101 190
8107 190 123 59 -1 178 -36 95 127 -36 81 220 -60 -152 -136 133 64 136 -496 -320 64 69 13 -335 -170 450
8131 450 -105 1 -214 -201 222 41 105 74 -40 285 331 45 -191 -68 -62 14 -72 211 -42 -204 132 -299 168
8154 168 264 -87 -205 -164 -150 33 127 -192 -131 161 301 57 -133 -39 -35 -256 -182 -398 -119 258 59 -163 -129
8177 -129 131 -118 -45 -242 -105 -36 4 29 -55 -188 -134 63 55 76
$$ packed form
8062a49K98m0M1J50j52l6j95K36k74p7n1K35J97k37n0o8J06M23l87k90J98J66
8084D4k20J93o5K15j10M3n3l24N03j8k32k52K06J09J67j76J3P0nJ90l14J17Q9
8107A90o7o4o0J79k14J31L2j63J17J39k80r2J6K69o9P2o32J76L84Nn6l48J65O20
8131D50n55J06k15J3M23j81O4l1j14L25M6k86k36J23OP6q6K83k53j62L36m31M67
8154A68R6l51j18M1J4J83R4l19O1K92J40k44j90R4Mk21P4k16K79L77j99k22L4
8177a29K60k49P3j97J37O9M0K5q4j33N4J97qK1
8191G6
$$ Imaginary data points
##PAGE= N=2
##DATA TABLE= (X++(I..I)), XYDATA
$$ plain form
0 0 0 0 0 -8 8 -8 8 -23 24 -24 40 -48 56 -72 88 -104 120 -151 176 -203 241 -283 324 -372 435 -498 562
27 562 -642 728 -820 923 -1040 1166 -1300 1454 -1622 1800 -2000 2223 -2461 2723 -3018 3343
43 3343 -3698 4098 -4550 5054 -5628 6290 -7063 7967 -9057 10399 -12088 14297 -17327
56 -17327 21755 -28856 42154 -75582 331514 395684 -549183 -549386 119598 608668 160278
67 160278 -435430 -379859 252036 445345 -20695 -451621 -169936 347116 344430 -187169 -421915
78 -421915 -30491 409082 220438 -286133 -355848 111263 391900 82682 -346456 -240975
88 -240975 226010 346126 -67388 -372724 -109055 321688 261916 -194357 -360665 20025
98 20025 374813 164310 -297727 -310026 144206 380550 45537 -356669 -224755 245090
$$ packed form
0@%%%qJ6j6J6l1M7m8O4q8J04j28J60j92K24k71L27l79M44n24O07o96Q07r33J060
27E62j204J370j548J743j963K206k466K754l076L422l800M223m684N184n741O361
43C343p041P796q648R604j0682J1918j3353J5030j7024J9456k2487K6385l1624
56a7327L9082n0611P1010j17736M07096O4170r44867k03O68984M89070m48390
67A60278n95708N5571O31895J93309m66040m30926K81685N17052k686n31599k34746
78d21915L91424M39573j88644n06571o9715M67111K80637l09218m29138J05481
88b40975M66985J20116m13514l05336K63669M30743n9772m56273j66308L80690
98B0025L54788k10503m62037j2299M54232K36344l35013m02206J31914M69845
$$ plain form
108 245090 347321 -73775 -383581 -114156 324644 273085 -185780 -364275 3153 365974
118 365974 178319 -277628 -313062 123082 369338 59944 -334943 -225351 220800 334060
128 334060 -56053 -360021 -119111 298623 262374 -166487 -340893 -3287 336751 169014
138 169014 -253266 -291175 111150 341244 55614 -309095 -206464 204253 305938 -52826
148 -52826 -331223 -107544 276810 240131 -157295 -313184 1248 310972 152219 -235808
158 -235808 -266562 105257 315878 47872 -288753 -187302 193586 281459 -54033 -307587
168 -307587 -96010 260649 221306 -151734 -291858 7829 292850 136938 -224691 -247799
178 -247799 104086 298032 40168 -276459 -173476 188928 264990 -57148 -293381 -86926
$$ packed form
108B45090J02231m21096l09806K69425M38800n1559m58865j78495L67428L62821
118C65974j87655m55947l5434M36144K46256l09394l94887J09592M46151J13260
128C34060l90113l03968K40910M17734l6249m28861j74406L37606L40038j67737
138A69014m22280l7909M02325K30094k85630l64709J02631M10717J01685l58764
148e2826k78397K23679L84354l6679l97426j55889L14432L09724j58753l88027
158b35808l0754L71819K10621k68006l36625J01451L80888Q7873l35492k53554
168c07587K11577L56659l9343l73040j40124K99687K85021j55912l61629k3108
178b47799L51885J93946k57864l16627J02983L62404P6062l22138k36233K06455
$$ plain form
188 -86926 251674 209167 -150133 -280426 12507 284206 126960 -220805 -236521 105428
198 105428 288392 34123 -271117 -164611 188724 255606 -61302 -285451 -80497 246982
208 246982 201181 -149643 -273361 16518 278976 120525 -217880 -228042 105075 280513
218 280513 32049 -265012 -160040 185593 249198 -61567 -278231 -76595 240560 195364
228 195364 -145891 -266441 16393 272576 116532 -212743 -221400 102324 272470 31886
238 31886 -257811 -157551 180711 244157 -59532 -271749 -75713 233924 191996 -140180
248 -140180 -261751 13349 267503 116948 -207994 -218899 98663 267845 34146 -251983
258 -251983 -158178 175436 242969 -56127 -268704 -76960 229405 191961 -134986 -259397
$$ packed form
188h6926L38600m2507l59300j30293K92933K71699j57246l47765j5716L41949
198A05428J82964k54269l05240J06506L53335O6882l16908k24149K04954L27479
208B46982m5801l50824j23718K89879K62458j58451l38405j0162L33117J75438
218B80513k48464k97061J04972L45633O3605l10765k16664K01636L17155m5196
228A95364l41255j20550K82834K56183j56044l29275q657L23724J70146k40584
238C1886k89697J00260L38262O3446l03689k12217J96036L09637m1928l32176
248a40180j21571K75100K54154j50555l24942j0905L17562J69182k33699k86129
258b51983R3805L33614O7533k99096k12577J91744L06365l7444l26947j24411
$$ plain form
268 -259397 7884 263565 120666 -203264 -219397 93158 264918 39152 -246284 -160853
278 -160853 167365 243238 -48434 -264825 -82375 222071 193396 -125497 -256153 -1004
288 -1004 256177 126033 -193467 -219284 83249 259119 46381 -235514 -163924 155262 239757
299 239757 -37514 -256869 -88477 210530 192325 -113440 -248815 -9708 244317 129662
309 129662 -180434 -216246 72822 250238 51760 -222577 -163039 141899 233110 -27150
319 -27150 -245921 -92600 197937 189412 -102028 -239452 -17641 230993 131580 -166257 -212212
330 -212212 61529 239974 57366 -209691 -161210 129111 225125 -18091 -233621 -95318
340 -95318 185381 185165 -91971 -229410 -22783 217551 130724 -153247 -205357 52460 228857
$$ packed form
268b59397K67281K55681j42899l23930j6133L12555J71760k25766k85436Q5431
278a60853L28218P5873k91672k16391J82450L04446k8675l18893j30656K55149
288a004K57181j30144l19500k5817L02533J75870k12738k81895P1590L19186Q4495
299B39757k77271k19355J68392K99007j8205l05765j35375K39107K54025j14655
309A29662l10096l5812K89068J77416j98478k74337N9538L04938R1211k60260
319b7150k18771J53321K90537q525k91440j37424K21811K48634r9413k97837m5955
330b12212K73741J78445j82608k67057M8481K90321R6014k43216k15530J38303
340i5318K80699k16k77136j37439K06627K40334q6827k83971n2110K57817J76397
$$ plain form
351 228857 60677 -196164 -157442 116422 215484 -9919 -220276 -97170 171418 179953 -81583
362 -81583 -218034 -27523 203156 127839 -140280 -196512 44190 216707 61454 -183851
372 -183851 -151360 107326 203656 -5983 -207124 -94795 160154 171783 -74752 -206351
382 -206351 -27400 190901 122070 -130196 -186378 38953 204758 60365 -172941 -144026
392 -144026 99710 192538 -3601 -194711 -92259 149590 164429 -68627 -196369 -27789
402 -27789 179936 116779 -121426 -176988 34667 193733 59815 -163598 -138271 93929 183134
413 183134 -2505 -184119 -88483 140966 157453 -64442 -187234 -27118 172152 111961
423 111961 -115996 -169179 32164 185269 57939 -156664 -133533 90514 176252 -2757
$$ packed form
351B28857j68180k56841L8722K73864R9062k25403k10357J23106K68588Q535k61536
362h1583j36451J90511K30679p5317k68119n6232K40702J72517j55253k45305
372a83851L2491K58686R6330k09639k01141J12329K54949J1629k46535j31599
382b06351J78951K18301o8831k52266n6182K25331J65805j44393k33306K8915
392a44026K43736R2828j96139j91110J02452K41849J4839k33056j27742J68580
402b7789K07725o3157k38205n5562K11655J59066j33918k23413K5327K32200Q9205
413A83134j85639j81614R5636K29449J6487k21895j22792J60116J99270o0191
423A11961k27957n3183K01343J53105j27330k14603K3131K24047Q5738j79009
$$ plain form
433 -2757 -176505 -85143 134862 151805 -61498 -181258 -26237 166881 107878 -112106 -163131
444 -163131 31113 178868 56193 -151589 -129576 87836 171397 -3166 -171809 -82145
454 -82145 130853 147258 -59168 -176397 -26261 162823 105159 -109581 -158723 30216 173946
465 173946 55473 -147488 -127472 85562 168047 -2945 -168386 -80400 127631 144308 -57052
476 -57052 -172935 -26956 159461 103879 -107379 -155760 29448 170311 55262 -143852
486 -143852 -126205 82273 166042 -992 -165171 -80378 124619 142442 -53940 -169753 -29531
497 -29531 156186 105216 -103780 -155277 26428 167487 57419 -138961 -126907 77315 164624
508 164624 3106 -162512 -82657 120436 141934 -49416 -166954 -32970 151276 106666
$$ packed form
433b757j73748R1362K20005J6943k13303j19760J55021J93118n9003k19984n1025
444a63131J94244J47755j22675k07782K2013K17412Q3561j74563j68643Q9664
454h2145K12998J6405k06426j17229J50136J89084n7664k14740m9142J88939J43730
465A73946j18473k02961K0016K13034Q2485j70992j65441Q7986K08031J6677k01360
476e7052j15883J45979J86417n5582k11258m8381J85208J40863j15049j99114
486a43852J7647K08478Q3769j67034j64179Q4793K04997J7823j96382j15813J40222
497b9531J85717n0970k08996n1497J81705J41059j10068j96380J2054K04222Q7309
508A64624j61518j65618P9855K03093K1498j91350j17538J33984J84246m4610
$$ plain form
518 106666 -99057 -154254 22775 164442 59066 -134638 -126427 72564 162430 6536 -158866
529 -158866 -83794 116375 140791 -45811 -163501 -35721 146442 107602 -94399 -152625 19255
540 19255 160867 60482 -129642 -125409 67718 159674 10362 -154443 -85139 111682 139748
551 139748 -41556 -159078 -38171 141364 107941 -88376 -151094 14549 156867 63012
561 63012 -124472 -124550 61984 156077 14691 -148986 -87632 105688 138208 -36401 -155403
572 -155403 -40923 134811 108015 -81806 -147978 9743 152333 64472 -118813 -122498 57394
583 57394 151119 17541 -142861 -87252 99979 135438 -33085 -150403 -41511 129034 105961
594 105961 -76591 -144050 6293 146426 64749 -113448 -120062 52655 146124 19878 -136044
$$ packed form
518A06666k05723n5197J77029J41667j05376j93704Q211J98991Q9866j55894j65402
529a58866P5072K00169K4416j86602j17690J27780J82163l8840k02001n8226J71880
540A9255J41612j00385j90124M233J93127R1956j49312j64805O9304J96821K8066
551A39748j81304j17522J20907J79535l3423j96317o2718J65643J42318r3855
561F3012j87484p8J86534R4093j41386j63677O1354J93320L2520j74609j19002
572a55403J14480J75734k6796j89821o6172J57721J42590q7861j83285l685J79892
583E7394R3725j33578j60402N5609J87231L5459j68523j17318J08892J70545k3073
594A05961j82552o7459J50343J40133q1677j78197o614J72717R3469j26246j55922
$$ plain form
605 -136044 -87111 93364 132461 -28360 -144798 -43214 122474 104038 -70454 -139136 2043
616 2043 140120 65787 -106648 -117636 47568 140423 22576 -129428 -86878 87277 129218
627 129218 -23880 -140137 -44381 116640 101974 -65408 -134809 -1109 134877 66646 -101627
638 -101627 -115507 44210 136345 23522 -124562 -85337 82712 126534 -21067 -135940 -45040
649 -45040 112560 100046 -62634 -130700 -2496 130180 65973 -97865 -113143 41846 132706
660 132706 23656 -119684 -83609 78551 122655 -18773 -131388 -45197 108374 97762 -58978
671 -58978 -126560 -4032 125001 65755 -92888 -110344 38429 128555 24897 -115027 -81871
682 -81871 73763 118952 -15533 -126990 -45753 104112 96081 -55943 -122630 -5052 120350
$$ packed form
605a36044M8933J80475L9097j60821j16438J01584J65688j8436j74492o8682J41179
616B043J38077p4333j72435j0988J65204R2855j17847j52004M2550J74155M1941
627A29218j53098j16257R5756J61021j4666j67382o9401J33700J35986o8231j68273
638a01627j3880J59717R2135j12823j48084L9225J68049M3822j47601j14873R0900
649d5040J57600j2514j62680o8066J28204J32676o4207j63838j5278J54989R0860
660A32706j09050j43340L6075J62160M4104j41428j12615Q6191J53571j0612j56740
671e8978o7582J22528J29033n9246j58643j7456J48773R0126j03658j39924L3156
682h1871J55634M5189j34485j11457Q1237J49865q031j52024o6687J17578J25402
$$ plain form
693 120350 64555 -88953 -108496 36416 125281 24758 -111953 -79976 71843 115853 -14356
704 -14356 -123668 -45648 101370 94875 -54614 -120752 -5324 117690 64119 -86334 -106901
715 -106901 34588 123779 25688 -110467 -79212 70369 114012 -13605 -121573 -46440 99230
726 99230 94195 -52560 -119316 -6379 115276 63800 -83912 -105648 32476 121476 26753
737 26753 -107723 -79058 68116 111929 -11997 -118186 -46563 95403 93128 -50129 -116754
748 -116754 -7606 112017 62683 -80491 -102956 29619 117752 27990 -104093 -78325 64599
759 64599 109615 -9617 -114263 -47398 91235 92439 -46215 -114571 -9769 108641 63575
770 63575 -76200 -101566 25931 114894 30549 -100098 -79104 60650 108603 -6871 -111489
$$ packed form
693A20350n5795j53508j9543J44912Q8865j00523j36711L1977J51819M4010j30209
704a4356j09312P8020J47018o495j49489o6138J15428J23014n3571j50453k0567
715a06901J41489Q9191r8091j36155L1255J49581M3643j27617j07968P5133J45670
726I9230n035j46755o6756J12937J21655n1476j47712k1736J38124Q9000r4723
737B6753j34476K8665J47174M3813j23926j06189P1623J41966k275j43257o6625
748a16754J09148J19623m9334j43174k2465J32575Q8133q9762j32083K5768J42924
759F4599M5016j19232j04646O6865J38633J204j38654o8356J04802J18410m5066
770F3575j39775k5366J27497Q8963q4345j30647K0994J39754M7953j15474j04618
$$ plain form
781 -111489 -48643 87317 92070 -42919 -113350 -12027 106684 64049 -74255 -100535 23942
792 23942 112829 31792 -97683 -79437 58978 107455 -5761 -109578 -49366 84823 91473
803 91473 -40153 -111683 -14121 104440 64938 -71277 -99589 21418 110074 33313 -94032
814 -94032 -79501 55615 105645 -3540 -106701 -49157 81359 89607 -37382 -108046 -15519
825 -15519 100677 64162 -68420 -97270 19402 106346 33658 -90238 -78165 51748 103385
836 103385 -1750 -103264 -48763 78226 87654 -34557 -105066 -17094 97235 64477 -65334
847 -65334 -95550 17803 103565 33891 -86926 -77451 49363 101515 -62 -100936 -49171
858 -49171 75931 86781 -32478 -103151 -18462 94441 64516 -63049 -94996 16642 102313
$$ packed form
781a11489O2846J35960M753j34989p0431J01323J18711m2635j38304k6280J24477
792B3942Q8887q1037j29475J8246J38415M8477j13216j03817O0212J34189O650
803I1473j31626p1530R7562J18561l9502j36215k8312J21007Q8656p6761j27345
814i4032J4531J35116N0030j09185j03161N7544J30516Q248j26989p0664R2527
825a5519J16196l6515j32582k8850J16672Q6944p2688j23896J2073J29913N1637
836A03385j05135j01514N4501J26989R428j22211p0509Q7972J14329l2758j29811
847f5334l0216J13353Q5762o9674j20817R475J26814N2152j01577j00874N1765
858d9171J25102J0850j19259p0673Q4689J12903k9925j27565l1947J11638Q5671
$$ plain form
869 102313 34059 -84703 -76325 47113 100140 1384 -99302 -49534 74186 85623 -31197
880 -31197 -101040 -19007 92311 64223 -60824 -93461 15111 100296 34625 -82386 -75410
891 -75410 44809 98297 3459 -96527 -50040 71521 84263 -29503 -98014 -20036 88673
902 88673 63921 -57566 -91896 12700 97781 34910 -79136 -74370 41833 95601 5265
913 5265 -93366 -50032 68420 83379 -27155 -95844 -20894 85543 63528 -54707 -90334
924 -90334 10595 95465 35576 -77187 -73310 40068 93494 5863 -90942 -50811 66243
935 66243 82448 -25795 -94966 -21222 83981 63040 -52635 -89338 8974 93764 36290
946 36290 -75556 -73223 38687 92065 7330 -88752 -51467 64133 82603 -23840 -92938
$$ packed form
869A02313o8254j18762Q378J23438N3027r8756j00686M9768J23720J1437j16820
880c1197o9843Q2033J11318k8088j25047l2637J08572Q5185o5671j17011O976
891g5410J20219N3488r4838r9986M6487J21561J2742j13766o8511P7978J08709
902H8673k4752j21487l4330J04596Q5081o2871j14046M766J16203N3768r0336
913E265r8631M3334J18452J4959j10534o8689P4950J06437k2015j18235l5627
924i0334J00929Q4870n9889j12763L877J13378N3426q7631r6805M0131J17054
935F6243J6205j08243o9171P3744J05203k0941j15675l6703R8312Q4790n7474
946C6290j11846K333J11910N3378q4735r6082L7285J15600J8470j06443o9098
$$ plain form
957 -92938 -22114 81578 62543 -50423 -87597 7689 92083 36930 -73367 -72268 37561
968 37561 90086 7851 -86510 -50766 61552 81116 -22387 -91526 -22011 79452 61273
979 61273 -48447 -85681 6060 89330 37575 -70853 -71560 35198 88460 8782 -83966 -50553
991 -50553 59156 79929 -20198 -89709 -23281 77589 61246 -46761 -84319 4647 87129
1002 87129 38294 -68776 -71334 33747 87192 9627 -81767 -50511 56677 78676 -18116
1013 -18116 -87944 -24297 75642 60783 -45003 -82880 3416 84696 38633 -66332 -70836 31922
1025 31922 85819 10466 -79911 -49871 54682 77768 -17133 -85959 -25022 73785 60451 -43473
1037 -43473 -81254 2942 82426 38080 -64374 -69967 30558 84353 10561 -78201 -48918 53461
$$ packed form
957i2938P0824J03692j9035j12966l7174R5286Q4394n5153j10297J099J09829
968C7561N2525q2235r4361L5744J12318J9564j03503o9139O9515J01463j8179
979F1273j09720l7234R1741Q3270n1755j08428p07J06758N3262p9678r2748L3413
991e0553J09709K0773j00127o9511O6428J00870j6343j08007l7558Q8966Q2482
1002H7129m8835j07070k558J05081N3445p7565r1394L1256J07188K1999r6792
1013a8116o9828O3647R9939j4859j05786l7877Q6296Q1280m6063j04965m504J02758
1025C1922N3897p5353r0377L0040J04553K3086r4901o8826O0937R8807j3334j03924
1037d3473l7781Q4196P9484m4346j02454n593J00525N3795p3792q8762K9283J02379
$$ plain form
1049 53461 75941 -15820 -84000 -25285 72047 59846 -42317 -80117 2587 80944 37860 -62116
1061 -62116 -69033 29109 83164 11503 -76972 -48813 52247 74629 -14951 -82023 -25524 70325
1073 70325 59803 -40702 -79005 1780 79161 37506 -60460 -67560 27392 81249 12390 -75379
1085 -75379 -48275 50487 73115 -14600 -80031 -25705 68017 58951 -39370 -77665 1401 77573
1097 77573 36869 -58470 -66457 25840 79673 12663 -72991 -48360 49183 71848 -13247 -78218
1109 -78218 -25576 65665 58210 -37862 -76111 743 75745 36538 -57304 -65076 24766 77483
1121 77483 13105 -71417 -47724 48358 70302 -13142 -76261 -25239 64356 56853 -36303 -74701
1133 -74701 343 74490 35708 -56457 -63811 24598 75990 12732 -70013 -46847 47206 69180
$$ packed form
1049E3461K2480r1761o8180N8715R7332j2201j02163l7800Q2704P8357m3084r9976
1061f2116o917R8142N4055p1661q8475K8159J01060K2382q9580o7072N6499R5849
1073G0325j0522j00505l8303Q0785P7381m1655r7966p100R4952N3857o8859q7769
1085g5379K7104R8762K2628q7715o5431N4326R3722r066r8321l8295P9066P6172
1097G7573m0704r5339p987R2297N3833o7010q5654K4631R7543K2665q5095o4971
1109g8218N2642R1241p455r6072l8249P6854P5002l9207r3842p772Q9842N2717
1121G7483o4378q4522K3693R6082K1944q3444o3119N1022Q9595p503r3156l8398
1133g4701P5044P4147l8782r2165p354Q8409N1392o3258q2745K3166R4053K1974
$$ plain form
1145 69180 -12998 -74849 -24049 62645 55316 -35479 -73190 -191 72821 35206 -55120 -61896
1157 -61896 23808 73611 12863 -67809 -45827 45384 67979 -12412 -73143 -23489 61081 53975
1169 53975 -34160 -71355 -593 71143 34699 -53614 -60414 22728 71641 12924 -65551 -44944
1181 -44944 43810 66594 -11397 -71326 -23730 59173 52910 -32549 -69380 -1623 69185 35164
1193 35164 -51781 -59448 22087 70106 13009 -63890 -44687 41857 65425 -9964 -69962 -23924
1205 -23924 57449 52268 -31168 -68168 -2279 66973 35306 -50227 -59246 20914 68704 13223
1217 13223 -61663 -44429 39824 64073 -8997 -68488 -24182 55979 51461 -30492 -66040 -2752
1229 -2752 64866 34841 -48144 -58268 19659 67197 13251 -59892 -43420 38502 62440 -7685
$$ packed form
1145F9180q2178o1851N0800Q6694p329r0795l7711P2999P3012l7615r0326o776
1157f1896Q5704M9803o0748q0672K1982R1211K2595q0391o0731M9654Q4570p106
1169E3975q8135l7195P0762P1736l6444q8313o800Q3142M8913n8717p8475K0607
1181d4944Q8754K2784p7991n9929M7596Q2903o263q5459l6831O7757P0808l4021
1193C5164q6945p667Q1535M8019n7097p6899J9203Q6544K3568p5389n9998M6038
1205b3924Q1373n181q3436l7000O5889O9252l1667q5533r019Q0160M7790n5481
1217A3223p4886J7234Q4253K4249p3070n9491M4306Q0161m518q1953l5548O3288
1229b752O7618l0025q2985j0124P7927M7538n3946p3143J6472Q1922K3938p0125
$$ plain form
1241 -7685 -66549 -24459 54282 50911 -28661 -64418 -3782 62608 34631 -45732 -57453 18336
1253 18336 65999 13775 -58027 -42618 36571 61062 -6661 -64846 -24892 52511 50228 -27192
1265 -27192 -62819 -3839 60832 34301 -44136 -56413 17130 64399 14457 -56909 -42324 35286
1277 35286 59761 -5531 -62894 -25427 50768 49841 -26544 -61945 -4260 59361 34151 -42579
1289 -42579 -55669 15549 63249 15346 -55516 -41972 34183 58495 -4485 -61188 -25856 49001
1301 49001 49548 -24747 -61162 -5152 57482 34046 -40573 -54639 13650 61802 16102 -53756
1313 -53756 -41647 32435 57379 -4144 -59369 -25535 47103 49015 -23274 -59816 -5989 56182
1325 56182 33706 -39190 -53229 12807 59802 16420 -52033 -41501 31382 55997 -3229 -57511
$$ packed form
1241g685n8864M2090P8741l371p9572l5757O0636O6390k7977q0363j1721P5789
1253A8336M7663n2224p1802J5409P9189K4491o7723n8185L9954P7403k283p7420
1265b7192l5627N8980O4671k6531p8437j2277P3543M7269m9942p1366J4585P7610
1277C5286K4475o5292n7363L7467P6195r27p6385l5401N7685O3621k5210p6730
1289d2579j3090P1218M7700m7903p0862J3544P6155K4312o2980n6703L5332P4857
1301D9001N47p4295l6415N6010O2634k3436p4619j4066O8289M8152m5700o9858
1313e3756J2109P4082K4944o1523n5225L3834P2638J912p2289l6542N3827O2171
1325E6182k2476p2896j4039O6036M6995m3382o8453J0532P2883K4615n9226n4282
$$ plain form
1337 -57511 -25541 44936 47913 -21795 -58467 -6841 54635 33845 -37541 -52105 11631 58134
1349 58134 16669 -50024 -41040 29843 55602 -2428 -56033 -25298 43448 47196 -20231 -57072
1361 -57072 -7447 53386 33144 -36606 -50851 10858 56380 17261 -48184 -41115 28646 54595
1373 54595 -2045 -54760 -25391 41820 46119 -19158 -55778 -7904 52431 32959 -35502 -49726
1385 -49726 10433 55124 16958 -46894 -40443 27636 53371 -1787 -53670 -24901 40906 45072
1397 45072 -18111 -54523 -8059 50616 32807 -34428 -48875 9727 53567 16762 -44912 -39203
1409 -39203 26266 52284 -1221 -52150 -24287 39721 43452 -17657 -52387 -8596 48787 32377
1421 32377 -33494 -48035 9405 51700 16131 -43878 -38227 24956 51015 -543 -50925 -24041
$$ packed form
1337e7511L1970P0477K977o9708l6672N1626O1476k0790p1386j4564O3736M6503
1349E8134m1465o6693Q984P0883K5759n8030n3605L0735O8746L748o7427l6841
1361e7072M9625O0833k0242o9750j4245O1709M5522l9119o5445P069O9761K5949
1373E4595n6640n2715K9369O7211M299o5277l6620M7874O0335j9472o8461j4224
1385d9726O0159M4691l8166o3852O451O8079K5735n5158n1883K8769O5807M166
1397D5072o3183l6412M6464N8675j7809o7235j4447N8602M3840l6805o1674N709
1409c9203O5469K6018n3505n0929K7863O4008L731o1109l4730M3791N7383j6410
1421C2377o5871j4541N7440M2295l5569o0009N651O3183K6059n1558n0382K6884
$$ plain form
1433 -24041 38491 42760 -16743 -51246 -8725 47363 31835 -31798 -47262 9187 50732 16387
1445 16387 -42309 -37739 23773 49339 489 -49552 -24248 37362 42359 -16286 -50016 -9101
1457 -9101 45723 31791 -30628 -46739 8126 50206 16448 -41690 -36959 23029 48311 812
1469 812 -48434 -24190 36115 41619 -15565 -48653 -8694 44458 31031 -29232 -45353 7294
1481 7294 49010 16256 -40203 -36231 21996 47166 1234 -46729 -24178 34921 41118 -14796
1493 -14796 -47615 -8816 42906 30534 -27665 -44857 6255 47919 17056 -39093 -35820 20929
1505 20929 45854 2308 -45120 -24892 33377 41016 -13409 -47029 -9666 41685 30556 -26682
1517 -26682 -44029 5252 46713 17402 -38222 -35398 20004 45392 2486 -44006 -24445 32435
$$ packed form
1433b4041O2532M269n9503l4503M2521N6088j5528o3633j5464N6449M1545l4345
1445A6387n8696M570O1512K5566m8850n0041K5304O1610M997n8645l3730M0915
1457i101N4824j3932o2419j6111N4865M2080l3758n8138M731N9988K5282m7499
1469H12m9246K4244O0305N504n7184l3088L9959N3152j3427o0263j6121N2647
1481G294M1716l2754n6459L972N8227K5170m5932m7963K2551N9099O197n5914
1493a4796l2819L8799N1722j2372n8199j7192N1112M1664l0863n6149L273N6749
1505B0929K4925m3546m7428K0228N8269P639n4425l3620L7363N1351j1129n7238
1517b6682j7347M9281M1461k9311n5624K824N5402K5388m2906m6492J9561N6880
$$ plain form
1529 32435 40207 -12944 -46435 -9775 40888 30047 -25696 -43204 4527 46033 17550 -37113
1541 -37113 -35270 19431 44557 2657 -42790 -24188 31196 39633 -11763 -45479 -10248 39723
1553 39723 29570 -24702 -41972 3718 44152 17870 -35797 -35242 18148 43542 3324 -41550
1565 -41550 -24267 29604 39151 -10249 -44390 -10723 38762 29587 -23822 -41042 3013 42939
1577 42939 18276 -34165 -35005 17035 42956 3679 -40519 -24213 28362 38156 -9851 -43380
1589 -43380 -11480 37796 29643 -22918 -40260 2512 41557 18276 -32753 -34530 16050 42411
1601 42411 4494 -39646 -23853 27218 37474 -8492 -42045 -12075 36504 29386 -21667 -39848
1613 -39848 1840 40470 18442 -31953 -33975 15201 41299 5146 -38693 -23540 26428 36798
$$ packed form
1529C2435P772n3151l3491L6660N0663j0841n5743j7508M7731M1506k8483n4663
1541c7113J843N4701K5126m1900m5447J8602N5384Q437n1396l3716L5231M9971
1553C9723j0153n4272j7270M5690M0434k6282n3667N55N3390K5394m0218m4874
1565d1550J7283N3871R547m9400l4141L3667M9485r175n3409j7220M4055L9926
1577D2939k4663n2441q40N2040K5921l9277m4198J6306N2575R794m8007l3529
1589d3380L1900M9276q153n2561j7342M2772L9045k3281n1029j777N0580K6361
1601D2411l7917m4140J5793N1071J0256m5966l3553K9970M8579p118n1053j8181
1613c9848M1688L8630k2028n0395k022M9176K6098l6153m3839J5153M9968J0370
$$ plain form
1625 36798 -8187 -41106 -12215 35489 29532 -21346 -39245 1715 39506 18150 -30413 -33576
1637 -33576 14215 40654 5188 -37625 -23360 25581 36159 -7675 -39857 -11935 33881 29169
1649 29169 -19651 -38487 1215 38918 18481 -29231 -32886 12884 39576 6086 -36632 -23675
1661 -23675 25017 35591 -6700 -38950 -12431 32727 28595 -18777 -37797 708 38050 18175
1673 18175 -28567 -32317 12703 38546 6688 -35817 -23839 23853 35222 -6618 -38193 -12564
1685 -12564 31613 28318 -17910 -37247 32 37124 18071 -27622 -31809 11832 37778 7025
1697 7025 -34628 -23745 22872 34718 -5836 -37196 -12622 30598 28274 -16859 -36479 -661
1709 -661 36194 18345 -26749 -31218 11101 36742 7465 -33465 -23817 22098 34096 -5083 -36413
$$ packed form
1625C6798m4985l2919K8891M7704n957n0878j7899M0960L7791k1356m8563l163
1637c3576M7791K6439l5466m2813J4265M8941J0578m3834l2182K7922M5816m712
1649B9169m8820j8836L9702L7703k0437m7712l655M5770K6692l3490m2718J2957
1661b3675M8692J0574m2291l2250K6519M5158m132m7372j9020L8505L7342j9875
1673A8175m6742l750M5020K5843l1858m2505J1978M7692J1369m1840l1575K5629
1685a2564M4177l295m6228j9337L7279L7092j9053m5693m187M3641K5946l0753
1697G025m1653J0883M6617J1846m0554l1360K4574M3220k324m5133j9620L5818
1709f61L6855j7849m5094m469M2319K5641k9277m0930R648M5915J1998l9179l1330
$$ plain form
1722 -36413 -12743 29494 27590 -15674 -35913 -1620 35210 18500 -25969 -30987 10241 36042
1734 36042 7832 -32117 -23923 20683 34056 -4099 -35700 -13259 28662 27498 -14959 -35129
1746 -35129 -2661 34057 19202 -25145 -31042 9528 35081 7971 -31093 -23817 19856 33785
1758 33785 -3553 -35104 -13249 28125 27271 -14410 -34549 -2722 33344 19155 -24164 -30800
1770 -30800 9114 34589 8155 -30117 -23425 18908 32960 -2740 -34193 -13840 27094 26843
1782 26843 -13268 -33589 -3442 32220 19221 -22996 -30535 8114 34006 8655 -29502 -23263
1794 -23263 17976 32279 -1784 -33471 -14028 26460 26880 -12830 -33107 -3729 31130 19273
1806 19273 -21852 -30162 7412 33679 8989 -28706 -23275 16889 32149 -1174 -32804 -14629
$$ packed form
1722c6413K3670M2237j904m3264k0239L4293L6830j6710m4469n018M1228K5801
1734C6042k8210l9949Q194M4606J3373l8155l1601K2441M1921j164m2457k0170
1746c5129L2468L6718j4855m4347n897M0570K5553k7110l9064P276M3673J3929
1758C3785l7338l1551K1855M1374q54m1681k0139L1827L6066j4189m3319o636
1770c0800L9914K5475k6434l8272O692M2333J4052l5700l1453K0353M0934k51
1782B6843m0111k0321L0147L5662j2999m2217p539L8649K5892k5351l8157O239
1794b3263M1239J4303l4063l1687J9443M0488M20l9710k0277K9378L4859j1857
1806A9273m1125q310L7574K6267k4690l7695N431M0164J5260l3323l1630J8175
$$ plain form
1818 -14629 25495 27059 -12252 -32503 -4104 30269 19397 -21009 -29892 6614 32981 9377
1830 9377 -28211 -22962 16531 30873 -1036 -31667 -14697 24554 26531 -11745 -32056 -4143
1842 -4143 29504 19355 -20135 -29244 5574 32044 9610 -27097 -22500 15731 30430 -187
1854 -187 -30921 -14914 23362 26690 -11060 -31178 -4484 28751 18839 -19095 -28678 5149 31674
1867 31674 9955 -26469 -22974 15566 29737 182 -29879 -15127 23047 26160 -10668 -31130
1879 -31130 -4912 28403 19018 -18782 -28401 4791 30809 10319 -25974 -22611 14600 29784
1891 29784 167 -29432 -15085 22059 26158 -9365 -30884 -5558 27812 18730 -18063 -27853
1903 -27853 4232 30025 10488 -25296 -23243 13866 29277 476 -28559 -15087 21287 25614
$$ packed form
1818a4629M0124J564l9311k0251K8399L4373j0872m0406q883L6506K6367k3604
1830I377l7588N249L9493J4342l1909l0631J6970L9251J977l8276k0311K7913
1842d143L3647j0149l9490r109L4818K6470k2434l6707M597L8231J4699l0617
1854a87l0734J6007L8276L328l7750k0118K6694L3235r912l7934r583L3827K6525
1867C1674k1719l6424L495L8540J4171k9555l0061J4752L8174L113l6828k0462
1879c1130K6218L3315r385l7800r619L3192K6018k0490l6293L363L7211J5184
1891B9784k9617k9599J4347L7144M099l5523k1519K5326L3370r082l6793r790
1903b7853L2085K5793j9537l5784K053L7109J5411k8801k9035J3472L6374M327
$$ plain form
1915 25614 -8914 -30020 -5770 26930 18775 -17470 -27309 3505 29317 10761 -24011 -22541
1927 -22541 13087 29036 1299 -27929 -15045 20367 25193 -8076 -29729 -6094 26079 19148
1939 19148 -16834 -26885 3437 28551 10860 -23575 -22422 12614 28443 1526 -27707 -14754
1951 -14754 19953 24887 -7512 -28697 -6523 25438 18946 -16334 -26542 2940 27841 11106
1963 11106 -22819 -22419 11984 28239 2016 -27192 -15003 19092 24127 -7230 -28276 -6868
1975 -6868 24931 18821 -15898 -26585 2680 27453 11155 -21616 -21807 11033 27694 2377 -26639
1988 -26639 -15223 18746 24210 -6337 -27100 -7071 23919 18901 -14807 -25985 2082 26908
2000 26908 10956 -21278 -21380 10196 27055 2556 -25978 -14895 18204 23937 -6265 -27073
$$ packed form
1915B5614l4528k1106K4250L2700q155l6245r839L0814K5812j8556l4772J470
1927b2541L5628J5949k7737k9228J2884L5412M826l3269k1653K3635L2173o931
1939A9148l5982j0051L0322K5114j7691l4435J153L5036J5829k6917k9233J2953
1951a4754L4707M934l2399k1185K2174L1961o492l5280j0208K9482K4901j6735
1963A1106l3925M00L4403J6255k6223k9208J2189L4095N035l1357k1046K1408
1975f868L1799o110l4719j0687K9265K4773j6298l2771j91L2840J6661k5317k9016
1988b6639J1416L3969N464l0547k0763K0029L0990n018l3708j1178K8067K4826
2000B6908j5952l2234j02L1576J6859k4499k8534J1083L3099N733l0202k0808
$$ plain form
2012 -27073 -6941 23679 18850 -14438 -26044 2090 26536 10964 -20669 -21620 10172 26686
2024 26686 2901 -25435 -15052 18064 23679 -6284 -26645 -7419 23140 18473 -14128 -25812
2036 -25812 1502 26262 11135 -20336 -21219 9867 26068 3029 -25086 -15477 17542 23855 -5879
2049 -5879 -26206 -7456 22495 18695 -13329 -25153 1106 25990 11134 -19865 -20852 9626 25593
2062 25593 3744 -24274 -15904 16698 23481 -5503 -25918 -7270 21828 18433 -12490 -24917
2074 -24917 400 25374 12053 -19598 -20897 8841 25323 3709 -23481 -15667 16181 23539
2086 23539 -4541 -25553 -7925 21316 18346 -12198 -24668 -125 24837 12318 -18697 -21273
2098 -21273 8390 25043 3814 -22749 -15496 15098 23701 -4252 -25298 -8461 21063 18320
$$ packed form
2012b7073K0132L0620m829l3288j1606K8134K4446j5572l1633r51L1792J6514
2024B6686k3785k8336J0383L3116N615k9963k0361J9226L0559m667l2601j1684
2036b5812K7314K4760j5127l1471q83L1086J6201k3039k8115R609L3019O313k9734
2049e879k0327J8750K9951l800l2024j1824K6259K4884j4856l0999r87L0478J5967
2062B5593k1849k8018Q370L2602O783k8984k0415J8648K9098l395l0923j2427
2074b4917K5317K4974j3321l1651j299K9738J6482k1614k7190P814L1848P358
2086B3539k8080k1012J7628K9241k970l0544j2470K4543K4962j2519l1015k576
2098b1273K9663J6653k1229k6563P253L0594Q603k7953k1046J6837K9524k743
$$ plain form
2110 18320 -11536 -24215 -409 23970 12411 -18344 -20983 7876 24504 4312 -22293 -15480
2122 -15480 14678 22966 -3521 -24758 -8147 20668 17779 -11465 -23455 -547 23523 12383
2134 12383 -17758 -20901 7547 24022 4361 -21708 -15221 14063 22279 -3461 -24027 -8373
2146 -8373 19830 17817 -10929 -22877 -784 22842 12218 -16558 -20171 7178 23571 4342
2158 4342 -21073 -14919 13621 22153 -2510 -23446 -8735 19232 17897 -10621 -22462 -456 22233
2171 22233 11702 -15945 -20140 6481 23005 4528 -20784 -14592 13367 21168 -2862 -22293
2183 -22293 -8521 18829 17532 -10309 -21852 -976 21712 11348 -15748 -19363 6575 22519
2195 22519 4754 -20176 -14147 12801 20577 -2829 -22047 -8269 18129 16959 -9989 -21690
$$ packed form
2110A8320k9856j2679K3806K4379j1559l0755k639K8859J6628k0192k6605O813
2122a5480L0158Q288k6487k1237J6611K8815k889k9244j1990K2908K4070j1140
2134A2383l0141l143K8448J6475j9661k6069O487K9284Q216k5740k0566J5654
2146h373K8203k013k8746j1948K2093K3626j0624k8776l613K7349J6393j9229
2158D342k5415O154K8540Q532k4663k0936J4711K7967j335k8518j1841K2006K2689
2171B2233j0531k7647m195K6621J6524j8477k5312O192K7959P801k4030j9431
2183b2293J3772K7350j297k7841j1543K0876K2688j0364k7096l615K5938J5944
2195B2519j7765k4930O029K6948P776k3406j9218J3778K6398j170k6948j1701
$$ plain form
2207 -21690 -851 20984 11025 -15136 -18808 5962 22061 4439 -19636 -14031 12567 20221 -2595
2220 -2595 -21180 -7868 17215 16682 -9160 -20952 -1170 20499 11192 -14761 -18453 5579 21467
2233 21467 5195 -19307 -13989 12094 19737 -2440 -20669 -8055 17146 16448 -8773 -20817 -1193
2246 -1193 20153 10733 -14480 -17831 5228 20742 4666 -18638 -13796 12108 19580 -2703 -20568
2259 -20568 -7761 16698 16162 -8536 -20511 -1173 20233 10699 -14737 -17612 5446 20505 4427
2272 4427 -18681 -13864 12023 19584 -2568 -20574 -7448 16462 15803 -8926 -20487 -1165 19631
2285 19631 10423 -14627 -17174 5720 20552 4404 -18585 -13394 11723 19401 -2371 -20148 -7581
2298 -7581 16307 15764 -8413 -20191 -1460 19474 10979 -14165 -17566 5370 20034 4413 -17853
$$ packed form
2207b1690K0839K1835r959k6161l672K4770J6099j7622k4075N605K6598P654k2816
2220b595j8585J3312K5083n33k5842j1792J9782K1669r307k5953l692K4032J5888
2233B1467j6272k4502N318K6083P643k2177j8229J2614K5201o98k5221j2044J9624
2246a193K1346r420k5213l351K3059J5514j6076k3304M842K5904P472k2283j7865
2259b0568J2807K4459n36k4698j1975J9338K1406r534k5436k875K3058J5059j6078
2272D427k3108M817K5887P561k2152j8006J3126K3910o59k4729j1561J9322K0796
2285A9631r208k5050k547K2894J4832j6148k2989N191K5117P678k1772j7777J2567
2298g581K3888n43k4177j1778J8731K0934q495k5144l401K2936J4664j5621k2266
$$ plain form
2311 -17853 -13729 11176 19408 -2124 -20037 -7726 15970 15655 -7948 -19957 -1779 19324 11311
2324 11311 -14185 -17895 5217 20310 4943 -17261 -13727 10743 18637 -1471 -19987 -8157
2336 -8157 15975 15755 -7909 -19509 -2047 18864 11244 -13334 -17588 4410 19781 5209 -17151
2349 -17151 -13744 10346 18915 -751 -19837 -8459 15072 15877 -7320 -19145 -2498 18038 11235
2362 11235 -12857 -17824 4139 19453 5501 -16590 -13527 9488 18501 -719 -19021 -8705
2374 -8705 14952 15461 -6892 -18704 -2727 17486 11621 -11701 -17480 3580 18953 5347 -16276
2387 -16276 -13577 9239 18090 -105 -18132 -8768 13834 15448 -6196 -18560 -2379 16991 11377
2400 11377 -10931 -16872 2931 18136 5815 -15217 -13162 8458 17388 67 -17312 -9065 13120
$$ packed form
2311a7853M124K4905Q232k1532j7913J2311K3696l15k3603j2009J8178K1103q013
2324A1311k5496l710K3112J5093j5367k2204L534K4470P894k0108j8516J1830
2336h157K4132k20k3664j1600J7462K0911p620k4578m254K1998J5371j4572k2360
2349a7151L407K4090Q569j9666j9086J1378K3531Q05k3197j1825J6647K0536o803
2362A1235k4092m967K1963J5314j3952k2091L063K3015R013j9220j8302J0316
2374h705K3657N09k2353j1812J5977K0213n865k3322n779K1060J5373j3606k1623
2387a6276K699K2816Q851j8195j8027R364K2602J614k1644j2364J6181J9370n614
2400A1377k2308n941J9803J5205j2321k1032K055K1620Q930j7321j7379Q247K2185
$$ plain form
2413 13120 14961 -5729 -17835 -3047 16051 11009 -10440 -16362 2511 17637 6082 -14687
2425 -14687 -12950 7877 16612 626 -16668 -8609 12402 14507 -5210 -17396 -3018 15281 10679
2438 10679 -10064 -15649 2107 16651 5775 -14094 -12690 7888 16130 376 -15711 -8296 11844
2451 11844 14123 -5062 -16568 -2778 14910 10027 -9961 -14877 2392 16256 5678 -13697
2463 -13697 -12365 7661 15424 80 -15198 -7823 11416 13690 -5091 -15898 -2715 14820 9573
2476 9573 -9748 -14097 2490 15365 5269 -13099 -11368 7588 15326 -226 -15066 -7243 11397
2489 11397 13313 -5009 -15607 -2589 14439 9217 -9854 -14126 2665 15228 4898 -12859
2501 -12859 -11346 7512 14995 -613 -14965 -6406 11374 12670 -5131 -15658 -2426 14307 9172
$$ packed form
2413A3120J841k0690j2106J4788J9098n042k1449n922J8873J5126j1555k0769
2425a4687J737K0827Q735j5986j7294Q059K1011K105j9717j2186J4378J8299m602
2438A0679k0743n585J7756J4544j0876j9869J404K0578Q242j5754j6087P415K0140
2451A1844K279j9185j1506J3790J7688m883j9988m916J7269J3864j0578j9375
2463a3697J332K0026P763j5344j5278P375J9239K274j8781j0807J3183J7535n247
2476I573j9321m349J6587J2875j0096j8368J731J8956P738j5552j4840P823J8640
2489A1397J916j8322j0598J3018J7028n222j9071m272J6791J2563j0330j7757
2501a2859J513J8858P483j5608j4352Q559J7780J296j7801j0527J3232J6733n135
$$ plain form
2514 9172 -10108 -13753 3025 15251 4676 -12516 -11227 7628 14693 -465 -14690 -6621 11685
2527 11685 12482 -5230 -15022 -2132 14300 9125 -9940 -13696 3235 15129 4454 -12642 -11102
2540 -11102 7337 14675 -183 -15098 -7053 11316 12479 -5107 -15176 -2306 14075 9245 -9461
2553 -9461 -13707 2727 15281 4558 -12816 -11201 7284 14655 331 -15056 -7152 11309 12764
2566 12764 -4954 -15161 -2647 13660 9670 -9463 -14123 2317 15329 4838 -12284 -11256
2578 -11256 6740 14643 797 -14877 -7545 11040 12754 -4499 -14897 -3140 13355 9638 -8583
2591 -8583 -14270 1770 15145 5203 -11985 -11559 6011 14549 1018 -14151 -7995 10612 13035
2604 13035 -4055 -14785 -3421 12990 9732 -8324 -14052 965 14844 5728 -11607 -11389 5749
$$ packed form
2514I172j9280l645J6778J2226j0575j7192J289J8855P065j5158j4225Q069J8306
2527A1685P97j7712r792J2890J6432n175j9065l756J6931J1894j0675j7096J540
2540a1102J8439P338j4858j4915Q045J8369J163j7586j0069J2870J6381m830j8706
2553i461m246J6434J2554j0723j7374J615J8485P371j4324j5387P904J8461J455
2566A2764j7718j0207J2514J6307l990j9133m660J6440J3012j0491j7122J028
2578a1256J7996P903j3846j5674P332J8585J714j7253j0398J1757J6495l717j8221
2591h583n687J6040J3375r942j7188M26J7570Q538j3531j5169O156J8607K423
2604A3035j7090j0730J1364J6411l258j8056n728J5017J3879r116j7335K18J7138
$$ plain form
2617 5749 14406 1304 -13701 -8406 10149 12995 -3690 -14774 -3593 12308 9870 -7645 -13839
2630 -13839 790 14312 5998 -11299 -11406 5568 13938 1545 -13159 -8120 9193 12862 -3408
2643 -3408 -14156 -3956 11821 9832 -6868 -13668 344 13870 6222 -10570 -11180 5105 13562
2656 13562 1921 -12573 -7917 8485 12559 -2302 -13726 -3536 11584 9478 -6930 -12764 -91
2669 -91 13043 6180 -10075 -10793 4410 12951 1781 -12070 -7885 8097 11857 -2663 -12817 -3916
2683 -3916 10947 9227 -6300 -12014 118 12264 5743 -9738 -10753 4668 12481 1499 -11542
2696 -11542 -7220 7683 11462 -2267 -12525 -3641 10629 8969 -6350 -11778 339 11780 5620
2709 5620 -8814 -9784 4382 12103 1351 -11229 -7353 7424 10981 -2293 -12196 -3549 10601
$$ packed form
2617E749Q657j3102j5005N295J8555K846j6685j1084J1181J5901k438j7515o194
2630a3839J4629J3522q314j7297j07J6974Q370j2393j4704N039J7313L669j6270
2643c408j0748J0200J5777j989j6700o800J4012J3526p648j6792o10J6285Q457
2656A3562j1641j4494M656J6402M074j4861j1424J0190J5120k106j6408n834J2673
2669i1J3134o863j6255p18J5203Q541j1170j3851M185J5982L760j4520j0154Q901
2683c916J4863j720j5527n714J2132J2146o521j5481j015J5421P813j0982j3041
2696a1542M322J4903L779j3729j0258Q884J4270j660j5319n428J2117J1441o160
2709E620j4434r70J4166P721j0752j2580L876J4777L557j3274r903Q647J4150
$$ plain form
2722 10601 8302 -6116 -11380 527 11504 5421 -9006 -9835 4217 11509 1163 -11142 -6497
2735 -6497 7526 10476 -2084 -11592 -3495 10399 8277 -5912 -10877 503 11179 5257 -8847
2748 -8847 -9736 4238 11743 1356 -11006 -6103 7551 10172 -2234 -11267 -3392 10160 8246 -6158
2762 -6158 -10993 855 11214 4669 -8511 -9072 4159 11679 1314 -11142 -6575 7709 9906
2775 9906 -2319 -11327 -2996 10040 7650 -6274 -11100 1020 11374 4806 -8510 -9386 4279
2788 4279 11612 1157 -10708 -6402 7486 10044 -2509 -11264 -3313 9972 8071 -6115 -11104
2801 -11104 574 11187 4895 -8828 -9149 4129 11414 1563 -10729 -6762 7566 10246 -2725
2814 -2725 -11546 -3534 9740 8196 -5552 -11225 400 11142 4865 -8637 -9473 3838 11009 1863
$$ packed form
2722A0601k299j4418n264J1907J0977o083j4427q29J4052P292j0346j2305M645
2735f497J4023K950j2560r508Q097J3894k122j4189m965J1380J0676n922j4104
2748h847q89J3974P505j0387j2362M903J3654K621j2406r033P875J3552j914j4404
2762f158m835J1848J0359o545j3180n61J3231P520j0365j2456M567J4284K197
2775I906j2225r008Q331J3036k390j3924m826J2120J0354o568j3316q76J3665
2788D279P333j0455j1865M306J3888K558j2553q755P951J3285j901j4186m989
2801a1104J1678J0613o292j3723l21J3278P285r851j2292L967J4328K680j2971
2814b725q821Q012J3274j544j3748n673J1625J0742o277j3502q36J3311P171r146
$$ plain form
2828 1863 -10554 -6715 7482 10211 -2009 -11258 -3460 9356 8258 -5253 -11090 10 11120
2841 11120 5326 -8755 -9468 3695 11018 2089 -10205 -7328 6954 10622 -1811 -11039 -3761 9094
2855 9094 8284 -4962 -10918 -248 10944 6045 -8247 -9525 3091 10869 2417 -9948 -7506 6375
2869 6375 10478 -1401 -11070 -4081 8703 8185 -4742 -10790 -850 10712 5689 -7522 -9720 2771
2883 2771 10732 2059 -9531 -7153 5574 10498 -911 -10727 -4503 8401 8172 -4314 -10407 -911
2897 -911 9930 5998 -7141 -9532 2442 10464 2392 -8985 -7092 5462 9760 -503 -10242 -4332
2911 -4332 7996 8017 -3826 -10061 -1058 9638 5962 -6692 -9321 2314 10275 2438 -8378 -6865
2925 -6865 5316 9261 -441 -9765 -4260 7860 7778 -3606 -9361 -1161 9176 5959 -6701 -9121
$$ packed form
2828A863j2417L839J4197K729j2220r249P798J2816j098j3511n837J1100J1110
2841A1120n794j4081p13J3163P323q929j2294K877J4282L668j2433r228P278J2855
2855I094q10j3246n956J0670J1192m899j4292j278J2616P778q452j2365K442J3881
2869F375M103j1879r669O989J2784n18j2927o048R940J1562n023j3211k198J2491
2883B771P961q673j1590K378J2727M924j1409r816O224J2904k29j2486o093R496
2897i11J0841l932j3139k391J1974Q022q072j1377J893J2554M298j0263r739N910
2911d332J2328K1j1843o235R003J0696l676j2654k629J1635P961p837j0816J513
2925f865J2181L945r702r324N505J2120q2j1384n755Q200J0337l217j2660k420
$$ plain form
2939 -9121 2181 9919 2625 -8650 -6630 5164 9056 -217 -9460 -4317 7418 7695 -3812 -9373
2953 -9373 -1038 8962 5597 -5933 -8694 2028 9585 2729 -8280 -6345 4817 8865 -356 -9263
2967 -9263 -4278 7143 7567 -3651 -9333 -855 8678 5269 -5706 -8286 2034 9268 2739 -7768
2981 -7768 -6113 4497 8379 -364 -9079 -4053 7051 7551 -3554 -9332 -889 8446 5065 -5899
2995 -5899 -8370 2028 9068 2614 -7833 -6259 4917 8281 -528 -8763 -3920 6945 7372 -3244
3009 -3244 -9068 -672 8525 4697 -5774 -8093 1750 8954 2731 -8074 -6301 4576 8582 -648
3023 -648 -8759 -3801 7132 7448 -3190 -9072 -795 8481 5013 -6085 -8100 1870 8748 2495 -8060
3038 -8060 -6479 5105 8689 -658 -8708 -3720 6579 7103 -3160 -8933 -1197 8094 5040 -5900
$$ packed form
2939i121J1302P738p294j1275K020J1794L892r273r243N143J1735K77j1507n561
2953i373Q335J0000l365j1530k761J0722P557o856j1009J935J1162M048r221q907
2967i263M985J1421M24j1218n682Q478R533l409j0975k580J0320P234o529j0507
2981g768J655J0610L882q743q715N026J1104N00j1105n778Q443R335l381j0964
2995e899k471J0398P040o454j0447J574J1176L364q809q235M843J0865M27j0616
3009c244n824Q396R197l828j0471k319R843P204o223j0805J773J0877M006r230
3023f48q111M958J0933L16j0638n882Q277R276l468j1098k015R970O878o253j0555
3038h060J581J1584L584r347q050M988J0299N24j0263n773P736R291l054j0940
$$ plain form
3052 -5900 -7737 1677 8477 2908 -7589 -6409 4541 8582 -674 -8610 -3744 6454 7395 -2947
3066 -2947 -8838 -1226 8522 5234 -5759 -7942 1872 8838 2546 -7467 -6331 4751 9045 -333
3080 -333 -8691 -3927 6849 7137 -2886 -8907 -1331 8302 5295 -5439 -7836 1612 8796 2677 -7543
3095 -7543 -6426 4292 8628 -133 -8514 -4060 6381 7167 -2672 -8355 -1577 8180 5544 -5249
3109 -5249 -7940 1402 8607 2806 -7058 -6285 3778 8206 327 -8677 -4099 6249 7054 -2817 -8501
3124 -8501 -1751 7821 5543 -5215 -7773 971 8300 2558 -6661 -6373 3589 8330 206 -8244 -4087
3139 -4087 6070 7175 -2675 -8227 -1748 7314 5412 -4942 -8217 959 8347 3066 -6551 -6091 3533
3154 3533 7916 680 -8083 -4383 5956 6773 -2499 -7990 -1771 7176 5255 -4709 -7593 769 7990
$$ packed form
3052e900j837R414O800n569j0497J180J0950M041r256p936M866J0198R41j0342
3066b947n891P612R748l288j0993k183R814O966o292j0013J136J1082M294r378
3080c33q358M764J0776K88j0023o021P576R633l007j0734k397R448P184o119j0220
3095g543J117J0718M336q761q381M454J0441P86r839n683O778R757k636j0793
3109e249k691R342P205n801r864P73J0063M428p879r004M578J0348Q05r871n684
3124h501O750R572k278j0758k558Q744P329n742r219K88R962M741q124q450M157
3139d087J0157J105r850n552O479R062j902j0354l275R176P388n281r617M60R624
3154C533M383p236q763L700J0339Q17r272n491O219Q947j921r964k884Q362P221
$$ plain form
3169 7990 3195 -6625 -6131 3243 7447 540 -7592 -4409 5728 6826 -2155 -7763 -1704 6832 5211
3184 5211 -4309 -7509 573 7863 2890 -6372 -6064 3469 7582 480 -7364 -4338 5380 7067 -2164
3199 -2164 -7811 -1516 6716 5320 -4356 -7084 661 7417 2998 -6272 -6065 3181 7621 731 -7001
3214 -7001 -4257 5373 6924 -1924 -7524 -1698 6671 4874 -4291 -6972 417 7624 3028 -6054 -5895
3229 -5895 3077 7240 488 -6878 -3828 4976 6824 -1580 -7660 -1786 6621 4913 -4032 -7029 537
3244 537 7242 2903 -5950 -6130 3018 7204 376 -6818 -4027 4826 6538 -1560 -7406 -1983 6627
3259 6627 4664 -4058 -6891 596 6918 3332 -5652 -5939 2977 7190 405 -6671 -3857 4613 6187
3274 6187 -1374 -7262 -1857 6112 4741 -3900 -6768 330 6803 3071 -5340 -5846 2290 7465 682
$$ packed form
3169G990m795r820M94R374M204o907q132L183J0137J098q981n608O059Q536j621
3184E211r520l200Q082P290m973r262L08R533M113p102p844L026R718J687r231
3199b164n647O295Q232j396r676k728P745O756m419r270K07R246M440o890p732
3214g001K744R630J551q848n600N826Q369j797r165k681P389P207m596r082J59
3229e895Q972M163o752p366L050Q804J848q404o080N874Q407j708q945k997P566
3244E37O705m339q853j80R148M186o828p194K791Q853J712q098n846N423Q610
3259F627j963q722k833P487O322l586q984k87Q916M213o785p076K814Q470J574
3274F187p561n888N405P969j371q641k868P098O473l732q411n06Q136N175o783
$$ plain form
3289 682 -6724 -3591 4683 6409 -1400 -7118 -2099 6307 5120 -3901 -6982 755 6709 3064 -5230
3304 -5230 -5738 2598 7317 1070 -6504 -4031 4551 6162 -1351 -6976 -1982 6236 5113 -3643 -6553
3319 -6553 499 6732 3151 -5512 -5550 2456 6910 649 -6474 -3856 4695 6157 -1416 -6849 -1969
3334 -1969 6050 5000 -3629 -6580 322 6704 2809 -5446 -5516 2467 6663 515 -6595 -3892 4480
3349 4480 6050 -1315 -6616 -1944 5810 4795 -3516 -6534 467 6752 2877 -5094 -5557 2330 6732
3364 6732 955 -6260 -3829 4356 5667 -1490 -6510 -1876 5356 4868 -3413 -6563 487 6550 2621
3379 2621 -4987 -5266 2425 6345 658 -5981 -4062 4352 5746 -1490 -6015 -1920 5580 4594 -3138
3394 -3138 -6324 232 6174 2869 -4766 -5438 2149 6378 736 -5880 -3656 3686 5947 -1256 -6326
$$ packed form
3289F82p406L133Q274J726p809n718N019Q406j187r021l081P737N954l645q294
3304e230n08Q336M719o247p574K473Q582J611p513n625M994Q218j123q756k910
3319f553P052O233l581q663l8Q006M454o261p123K618Q551J462p573n433M880
3334a969Q019j050q629k951O902O382l895q255p0P983M196o148p110K703Q372
3349D480J570p365n301M672P754j015q311l018P001O285l875p971m63P887M402
3364F732n777p215K431Q185J311p157n020M634P232m88q281l150P050O063l929
3379B621p608k79P691L920n687o639J919Q414J394p236m525M095P500r86p732
3394c138l186O556N942l305p635o72P587M229n642o616K224P342K261p203n070
$$ plain form
3409 -6326 -2086 5459 4478 -3016 -5995 30 6240 2913 -5011 -5064 2151 6002 736 -5782 -3902 3922
3425 3922 5908 -1205 -6112 -1993 5335 4313 -2761 -6183 -11 6111 3348 -4878 -5210 2269 6068
3440 6068 958 -5690 -3792 3559 5748 -1079 -6224 -1722 5024 4388 -3181 -6181 -146 6051 3135
3455 3135 -4398 -5016 2020 5873 851 -5424 -3801 3742 5452 -941 -5873 -1890 5041 4388 -2695
3470 -2695 -5925 136 5293 3072 -4440 -4828 1914 5978 1045 -5266 -3501 3244 5257 -729 -5797
3485 -5797 -1934 5017 4422 -2942 -5712 190 5631 2678 -4081 -4825 1757 5680 868 -5214 -3619
3500 -3619 3501 5475 -401 -5793 -1837 4925 4267 -2615 -5586 92 5372 2495 -4209 -4844 1462
3515 1462 5646 1060 -5045 -3240 3483 5245 -735 -5571 -1913 4720 4053 -2558 -5627 -223 5106
$$ packed form
3409f326M240P545r81p494k979O025O210l327p924n3P215L851n266o518J880P824
3425C922J986p113m907M119P328j022p074l422O172O122k763q226l32P479L799
3440F068n110o648J898P351K189o827n145M502O746o36p569l000O035O197k916
3455C135p533o18P036L853n022o275J623P543J710o393m932L983O931o53p083
3470b695l230O061N157k221p512l88O742M064m933o311J765O745K013n986n068
3485e797L863O951n95p364k770N902N441k953o759p44O582L923m812o082J595
3500c619P120J974n876n392L956O762o58o882k971N678N280k877o704o35O306
3515A462M184m586o105J805O723J762n980m836L658O633o67o611l069N404N329
$$ plain form
3530 5106 2982 -4192 -5093 1567 5737 1079 -5119 -3535 3059 5162 -847 -5519 -2087 4379 4183
3545 4183 -2361 -5718 -256 5152 2866 -3618 -4608 1343 5177 1160 -4848 -3287 3067 4815 -542
3560 -542 -4965 -2065 4319 4317 -2273 -5536 -208 5300 2579 -3652 -4637 1408 5339 1032 -4730 -3762
3576 -3762 3266 5333 -674 -5275 -1980 4276 4097 -2254 -5468 -217 4848 2420 -3514 -4434 956
3591 956 4976 1291 -4508 -3680 2746 4968 -480 -4698 -2129 3729 4299 -2037 -5193 -385 5025 2690
3607 2690 -3236 -4288 1232 4986 1227 -4343 -3538 3038 4937 -417 -5025 -1747 3954 4057 -2074
3622 -2074 -5137 -487 4814 2695 -3323 -4541 1011 4787 1372 -4367 -3547 2541 4780 -425 -4812
3637 -4812 -2115 3476 4165 -1895 -4984 -624 4663 2745 -3124 -4415 1103 4672 1043 -4066 -3464
$$ packed form
3530E106k124p174r01O660M170m658o198J584O594K103o009m672L432O466j96
3545D183o544l357N462N408k286o484r90N951L834m017o008J561O354J748n357
3560e42m423K900O384ko590l263N328N508k721o231r85O045L931m307n762R68
3576c762P028K067o007m601L295O256j79o351l214N251N065k428n934r20N390
3591I56M020l685n799Q28O426K222n448m218K569N858N70o336l156M808N410k335
3607B690n926j052N520L754l759n570Q05O576J899n354m608L278N701J03o131
3622b074l063M650N301k119o018j218N552L776l415n739Q20O088K239n205m387
3637d812K697N591O89o060l089M360N287j918n869j291N518L569l629n109O02
$$ plain form
3652 -3464 2623 4686 -365 -4921 -2133 3842 3726 -1947 -4990 -852 4502 2669 -3217 -4444 1366
3667 1366 4601 1176 -3995 -3389 2345 4475 -166 -4971 -2313 3753 3861 -1801 -4556 -873 4369
3682 4369 2759 -2967 -4189 971 4492 1424 -3907 -3274 2359 4611 -206 -4425 -2262 3604 3936
3697 3936 -1768 -4607 -729 4166 2635 -2906 -4120 979 4604 1365 -3922 -3500 2324 4471 -128
3712 -128 -4563 -2293 3335 3545 -1806 -4529 -538 4089 2790 -3027 -4383 538 4864 1509 -3653
$$ packed form
3652c464O087K063n051m556K788N975j16n673l043M138N354j833n886j227N810
3667A366L235l425n171O06N734K130m641m805K658O066J08n662k755L683N242
3682D369j610n726j222N160L521l068n331O33N633K252m817m219K163N866L32
3697C936n704k839L878M895j531n541j214N099L625l239n287M22N824K147m599
3712a28m435K270N628K10n351k723L991M627j299n817j356M921M326l355n162
$$ [...]
8191a66
##END NTUPLES=NMR FID
##END=
