##TITLE=1H_CA-8661-1
 DMSO, 8 sc, 
 23.10.2019
##JCAMPDX= 6.0         $$ Bruker NMR JCAMP-DX V2.0
##DATA TYPE= NMR FID
##DATA CLASS= NTUPLES
##ORIGIN= UXNMR, Bruker Analytische Messtechnik GmbH
##OWNER= root
$$ XWIN-NMR		Version 3.5
$$ Wed Oct 23 15:26:22 2019 Russian Standard Time (UT+4h)  she@DPX200
##.OBSERVE FREQUENCY= 200.1315
##.OBSERVE NUCLEUS= ^1H
##.DELAY= (6, 6)
##.ACQUISITION MODE= SIMULTANEOUS
##.ACQUISITION SCHEME= undefined
##.AVERAGES= 8
##.DIGITISER RES= 18
##SPECTROMETER/DATA SYSTEM= spect
##.PULSE SEQUENCE= zg30
##.SOLVENT NAME= CDCl3
##.SHIFT REFERENCE= (INTERNAL, CDCl3, 0, 15.7039)
##AUDIT TRAIL= $$ (NUMBER, WHEN, WHO, WHERE, WHAT)
$$ ##TITLE= Audit trail, XWIN-NMR		Version 3.5
$$ ##JCAMPDX= 5.01
$$ ##ORIGIN= Bruker BioSpin GmbH
$$ ##OWNER= she
$$ F:/spectra/data/she/nmr/H-F/1/audita.txt
$$ ##AUDIT TRAIL=  $$ (NUMBER, WHEN, WHO, WHERE, WHAT)
(   1,<2019-10-23 15:25:25.01 +0400>,<she>,<DPX200>,
      <created by zg, POWCHK disabled, PULCHK disabled
       configuration hash MD5:
       00 E9 B6 7A A2 85 ED C7 34 08 36 98 17 FE 4E 26
       data hash MD5: 16K
       EB 3C 77 98 A2 0C 2C 9C F2 38 F9 B4 9D D4 A1 32>)
$$ ##END=
$$ 
$$ hash MD5
$$ C5 DC B5 1F 10 BB 86 0D 89 78 07 7D C4 7B 44 B4
##$RELAX= 
##$RELAX= 
##$RELAX= 
##$RELAX= 
##$RELAX= 
##$RELAX= 
$$ Bruker specific parameters
$$ --------------------------
##$DU= <F:/spectra>
##$EXPNO= 1
##$NAME= <H-F>
##$PROCNO= 1
##$TYPE= <nmr>
##$USER= <she>
##$AMP= (0..31)
100 100 100 100 100 100 100 100 100 100 100 100 100 100 100 100 100 100 
100 100 100 100 100 100 100 100 100 100 100 100 100 100 
##$AQSEQ= 0
##$AQ_mod= 1
##$AUNM= <au_zg>
##$AUTOPOS= <>
##$BF1= 200.13
##$BF2= 200.13
##$BF3= 200.13
##$BF4= 200.13
##$BF5= 200.13
##$BF6= 200.13
##$BF7= 200.13
##$BF8= 200.13
##$BYTORDA= 1
##$CFDGTYP= 0
##$CFRGTYP= 5
##$CHEMSTR= <none>
##$CNST= (0..31)
1 1 145 1 1 1 1 1 1 1 1 1 1 1 1 1 1 1 1 1 1 1 1 1 1 1 1 1 1 1 1 1 
##$CPDPRG= <>
##$CPDPRG1= <>
##$CPDPRG2= <>
##$CPDPRG3= <>
##$CPDPRG4= <mlev>
##$CPDPRG5= <mlev>
##$CPDPRG6= <mlev>
##$CPDPRG7= <mlev>
##$CPDPRG8= <mlev>
##$CPDPRGB= <>
##$CPDPRGT= <>
##$D= (0..31)
0 1.2 0 0 0 0 0 0 0 0.06 0 0.03 0 0 0 0 0.0002 0 0 0 0 0 0 0 0 0 0 0 0 
0 0 0 
##$DATE= 1571829924
##$DBL= (0..7)
120 120 120 120 120 120 120 120 
##$DBP= (0..7)
150 150 150 150 150 150 150 150 
##$DBP07= 0
##$DBPNAM0= <>
##$DBPNAM1= <>
##$DBPNAM2= <>
##$DBPNAM3= <>
##$DBPNAM4= <>
##$DBPNAM5= <>
##$DBPNAM6= <>
##$DBPNAM7= <>
##$DBPOAL= (0..7)
0.5 0.5 0.5 0.5 0.5 0.5 0.5 0.5 
##$DBPOFFS= (0..7)
0 0 0 0 0 0 0 0 
##$DE= 6
##$DECBNUC= <off>
##$DECIM= 24
##$DECNUC= <off>
##$DECSTAT= 4
##$DIGMOD= 1
##$DIGTYP= 9
##$DL= (0..7)
0 120 120 120 120 120 120 120 
##$DP= (0..7)
150 150 150 150 150 150 150 150 
##$DP07= 0
##$DPNAME0= <>
##$DPNAME1= <>
##$DPNAME2= <>
##$DPNAME3= <>
##$DPNAME4= <>
##$DPNAME5= <>
##$DPNAME6= <>
##$DPNAME7= <>
##$DPOAL= (0..7)
0.5 0.5 0.5 0.5 0.5 0.5 0.5 0.5 
##$DPOFFS= (0..7)
0 0 0 0 0 0 0 0 
##$DQDMODE= 0
##$DR= 18
##$DS= 0
##$DSLIST= <SSSSSSSSSSSSSSS>
$$ [...]
##$SUBNAM2= <"">
##$SUBNAM3= <"">
##$SUBNAM4= <"">
##$SUBNAM5= <"">
##$SUBNAM6= <"">
##$SUBNAM7= <"">
##$SUBNAM8= <"">
##$SUBNAM9= <"">
##$SW= 24.0689530833862
##$SWIBOX= (0..15)
0 0 2 0 0 0 0 0 0 0 0 0 0 0 0 0 
##$SW_h= 4816.95568400771
##$TD= 16384
##$TD0= 1
##$TE= 0
##$TE2= 300
##$TE3= 300
##$TEG= 300
##$TL= (0..7)
0 120 120 120 120 120 120 120 
##$TP= (0..7)
150 150 150 150 150 150 150 150 
##$TP07= 0
##$TPNAME0= <>
##$TPNAME1= <>
##$TPNAME2= <>
##$TPNAME3= <>
##$TPNAME4= <>
##$TPNAME5= <>
##$TPNAME6= <>
##$TPNAME7= <>
##$TPOAL= (0..7)
0.5 0.5 0.5 0.5 0.5 0.5 0.5 0.5 
##$TPOFFS= (0..7)
0 0 0 0 0 0 0 0 
##$TUNHIN= 0
##$TUNHOUT= 0
##$TUNXOUT= 0
##$USERA1= <user>
##$USERA2= <user>
##$USERA3= <user>
##$USERA4= <user>
##$USERA5= <user>
##$V9= 5
##$VALIST= <valist>
##$VCLIST= <CCCCCCCCCCCCCCC>
##$VD= 0
##$VDLIST= <DDDDDDDDDDDDDDD>
##$VPLIST= <PPPPPPPPPPPPPPP>
##$VTLIST= <TTTTTTTTTTTTTTT>
##$WBST= 1024
##$WBSW= 4
##$XGAIN= (0..3)
0 0 0 0 
##$XL= 0
##$YL= 0
##$YMAX_a= 299242
##$YMIN_a= -608217
##$ZGOPTNS= <>
##$ZL1= 120
##$ZL2= 120
##$ZL3= 120
##$ZL4= 120
##$ABSF1= 10
##$ABSF2= 0
##$ABSG= 5
##$ABSL= 3
##$ALPHA= 0
##$AQORDER= 0
##$ASSFAC= 0
##$ASSFACI= 0
##$ASSFACX= 0
##$ASSWID= 0
##$AUNMP= <proc_1d>
##$AZFE= 0.1
##$AZFW= 0.1
##$BCFW= 1
##$BC_mod= 2
##$BYTORDP= 1
##$COROFFS= 0
##$CY= 11.3945322036743
##$DATMOD= 1
##$DC= 2
##$DFILT= <>
##$DTYPP= 0
##$F1P= 20.1720416913024
##$F2P= 0.152960286110954
##$FCOR= 0.5
##$FTSIZE= 0
##$FT_mod= 4
##$GAMMA= 1
##$GB= 0.15
##$INTBC= 1
##$INTSCL= 1
##$ISEN= 128
##$LB= 0.24
##$LEV0= 0
##$LPBIN= 0
##$MAXI= 10000
##$MC2= 0
##$MEAN= 0
##$ME_mod= 0
##$MI= 1.114404
##$NCOEF= 0
##$NC_proc= 0
##$NLEV= 6
##$NOISF1= 3.799351
##$NOISF2= 2.8
##$NSP= 1
##$NTH_PI= 0
##$NZP= 0
##$OFFSET= 15.70392
##$PC= 1
##$PHC0= -9560.764
##$PHC1= -3.199186
##$PH_mod= 1
##$PKNL= yes
##$PPARMOD= 0
##$PSCAL= 0
##$PSIGN= 0
##$REVERSE= no
##$SF= 200.130013532006
##$SI= 16384
##$SIGF1= 3
##$SIGF2= 2
##$SINO= 400
##$SIOLD= 16384
##$SREGLST= <1H.CDCl3>
##$SSB= 0
##$STSI= 0
##$STSR= 0
##$SW_p= 3612.71676300578
##$SYMM= 0
##$S_DEV= 0
##$TDeff= 0
##$TDoff= 0
##$TI= <>
##$TILT= no
##$TM1= 0
##$TM2= 0
##$TOPLEV= 0
##$USERP1= <user>
##$USERP2= <user>
##$USERP3= <user>
##$USERP4= <user>
##$USERP5= <user>
##$WDW= 1
##$XDIM= 8192
##$YMAX_p= 0
##$YMIN_p= 0
$$ End of Bruker specific parameters
$$ ---------------------------------
##NTUPLES= NMR FID
##VAR_NAME=  TIME,          FID/REAL,        FID/IMAG
##SYMBOL=    X,             R,               I
##VAR_TYPE=  INDEPENDENT,   DEPENDENT,       DEPENDENT
##VAR_FORM=  AFFN,          ASDF,            ASDF
##VAR_DIM=   8192,          8192,            8192
##UNITS=     SECONDS,       ARBITRARY UNITS, ARBITRARY UNITS
##FACTOR=    0.0002076,     1,               1
##FIRST=     0,             0,               0
##LAST=      1.7004516,     0,               0
##MIN=       0,             -608217,         0
##MAX=       1.7004516,     299242,          0
$$ Real data points
##PAGE= N=1
##DATA TABLE= (X++(R..R)), XYDATA
0@%%%qJ6j6J6k4L5m3N6p2Q8j04J28j60J92k25K66l17L73m36N08n88O78p76Q85
$$ 0 0 0 0 -8 8 -8 8 -16 19 -24 32 -40 48 -56 72 -88 104 -121 145 -172 201 -235 273 -315 363 -413 472
27D72j011J149j298J465j651J852k072K317k585K877l196L548l937M362m829N347
$$ 472 -539 610 -688 777 -874 978 -1094 1223 -1362 1515 -1681 1867 -2070 2292 -2537 2810
43B810n922O558p267Q069q977J0010j1204J2604j4267J6279j8779K1984k6262
$$ 2810 -3112 3446 -3821 4248 -4729 5281 -5923 6681 -7586 8693 -10086 11898 -14364
56a4364L2295m1517N7535r3141L08176j33183n60836L84913L56337j62695l76353
$$ -14364 17931 -23586 33949 -59192 248984 115801 -445035 -60122 296215 133520 -242833
67b42833J23420K70841j7919k46843J8187J83670L3148j50117j8062O9978j4026
$$ -242833 -119413 151428 133509 -113334 -95147 88523 121671 -28446 -46508 23470 9444
78I444q8978L3308J00807J4820j18948n8116J08456J06103j10693j28908J12926
$$ 9444 -79534 -46226 54581 69401 -49547 -107663 793 106896 -3797 -132705 -19779
89a9779J71245r5409j85936M8377J68958j9357j20995L6182J12252p0283j44338
$$ -19779 151466 56057 -129879 -81502 87456 68099 -52896 -16714 95538 25255 -119083
100a19083P7793J91137m3401j92720N403J48829l976j04967J8799Q6359k1091
$$ -119083 -41290 149847 106446 -86274 -80871 67958 63982 -40985 -22186 64173 43082
111D3082q6896r275P4013M6714l9953o2194P98M8767K3374k4275l3151O909L4314
$$ 43082 -43814 -53089 20924 67638 27685 -34509 -33711 15056 38430 14155 -18996 -12087 22227
124B2227o001l6167K0884M5359l4096m8855M7355N0102n1640m5288M6751L6080
$$ 22227 16226 -19941 943 46302 12206 -36649 10706 60808 9168 -36120 10631 46711
136D6711m1644k8338L6564K6903l7564l7813L1188N0654j3787n3867k1247K3349
$$ 46711 5067 -23271 13293 40196 2632 -35181 -3993 46661 32874 -20993 -42240 -18891
148a8891M3270K1769n2659o7685M2151Q4408m1233r0679N0602J05953m8397j30796
$$ -18891 24379 46148 -6511 -74196 -32045 52363 11130 -79549 -28947 77006 28609 -102187
160a02187J3598J40480M1370j14885q1324O8334Q5458k1465n7291p97L0386J9556
$$ -102187 -88589 51891 93261 -21624 -102948 -34614 50844 29379 -27912 -28709 1677 21233
172B1233k457l0874j8301L8857L5678k8780l8194J1702K6461L544j0191j4121
$$ 21233 18776 -12098 -30399 8458 44136 15356 -22838 -11136 15325 18869 8678 -5443
184e443P7K5973J2549l4139l6405K3912N7958k079p1465k1879O9910K4291p5017
$$ -5443 -5366 20607 33156 -983 -37388 -13476 44482 42403 -29062 -50941 18969 43260 -31757
197c1757j7523R0443J9790j02199m1253Q9979O1395n8352o6831K4679N5067q805
$$ -31757 -49280 41163 60953 -41246 -82499 7480 68875 10523 -56308 -31629 23438 14633
209A4633m1591Q706L4023r495k5940R174J7137o835r392K842R624K197j7693j2235
$$ 14633 -26958 -18252 15771 6276 -19664 -10490 6647 -188 -9580 -6738 2886 5083 -12610 -24845
223b4845K7333K2752l4740k9070M1549L5484m1425m4349L2646N1313j8126n4106
$$ -24845 2488 25240 -9500 -38570 2979 38463 -2962 -47311 -14665 36648 18522 -35584
235c5584N981N0366m358m6711J3186M8853j8125n0251J5873M7090o013l5726m254
$$ -35584 -29603 20763 16405 -30306 -17120 31733 13608 -36643 -20770 26320 20307 -15419 -19673
248a9673K2213R538j3958j0717J2709J1220j0715q341R125K784n239L061L444
$$ -19673 2540 12078 -1880 -12597 112 11332 617 -7724 1401 4185 -1054 2007 5451
261E451p510p642K706J4917Q988k3046k7162K9405M6057k7334o1819J6745O8310
$$ 5451 -2059 -9701 -6995 7922 16910 -6136 -33298 -3893 42164 14830 -46989 -30244 38066
274C8066K45o6934k1877N8575L9540m6551n3303L3598O0019j5823n5227l349M1269
$$ 38066 38311 -28623 -50500 8075 47615 1064 -52239 -18641 41378 25555 -29672 -33021 8248
287H248K0859k1121l3162M31L5441J5480k9518k2870J6745K4549P28j8721j4421
$$ 8248 29107 7986 -25176 -24745 10696 26176 -3342 -26212 -9467 15082 15810 -2911 -17332
300a7332J0050K1408j276k1629p087J3536J5266k166k1622j1393K5716K4038k2613
$$ -17332 -7282 14126 12850 -8779 -15866 -2330 12936 10770 -10852 -22245 3471 27509 4896
313D896k8933J4083K6151m770j9702m842J3232J1940j0060j6237P181J7755k180
$$ 4896 -24037 -9954 16197 11427 -8275 -13117 115 12055 1995 -14242 -7061 10694 8514
326H514j3495j641O779N614k191j0389N73J3927r32j6495K456J5475j642j1153
$$ 8514 -4981 -6622 157 5771 3580 -6809 -6236 7691 6759 -9736 -7280 8195 6553 -4600
340d600K119Q028J08o981m466P003Q439p403j0577P184Q343o150k412N709j662
$$ -4600 -2481 5547 5655 -1326 -5792 1211 9650 2247 -8330 -1146 7197 1047 -1365 4344 2682
355B682m772L462M403k459o864l205J0077J0767j3970k0140J4932K8638j0561
$$ 2682 -2090 1372 5775 3316 -3548 -6753 3324 14091 121 -20019 -5087 23551 12990
368A2990l2069K47L1023J3048k6782k6596J8114L5231j0105l7844J586L4209P820
$$ 12990 -19079 -18832 12191 25239 -1543 -28139 -10025 25206 15101 -22743 -21157 13052 20872
381B0872k4400j5313J2152J9971j135k0086o520J4650Q050p365n975j480L347
$$ 20872 -3528 -18841 -6689 13282 12147 -7939 -14459 191 8241 876 -5099 -6579 -3232
394c232J1178J653j7713p612J8358J5531j1833k1727p35K5110J3231k5068k2457
$$ -3232 7946 9599 -8114 -15726 2632 18163 6330 -15397 -16132 8978 22209 -2859 -25316
407b5316K2681K9691j4765l1033L622K8959J0012k2483k0615J4531K3663q411
$$ -25316 -2635 27056 12291 -18742 -15120 13839 23851 1368 -19247 -4716 18947 10536
419A0536k2045M963J8323j502j3091l076P583O922l279r045L06O909k431n269
$$ 10536 -11509 -6546 11777 10275 -2816 -5892 1691 8613 5334 -3711 -3405 3504 1073 -4196
433d196L168K581l408R69Q89m559r17O169K374m409o009j871Q543O213r946r376
$$ -4196 -1028 1553 -1855 -886 3 -4556 -5473 696 3070 -1339 -7348 -9219 -676 5537 -4409 -13785
449a3785J1830J1217r871j1902O674J2722R69j2160p905J0957J2232j0001j2585
$$ -13785 -1955 9262 -609 -12511 -5837 6885 7854 -4306 -12211 -1254 10978 977 -11608
462a1608R260J3108n374j1839J83J0470P324q155j3295N458J4426k941j3401M38
$$ -11608 -2348 10760 5386 -6453 -6270 4200 11524 3369 -9926 -4468 9958 7017 -6384 -5946
476e946R025K510l692m794j947O608N472l581p706k901N049R944k70j5830m437
$$ -5946 3079 5589 1897 -2897 -4844 1764 7236 3655 -4051 -6952 -1903 8041 7771 -8059 -12496
491a2496J7980Q680j6428j0289J2343J3120n996j6321k964J7704J0573j6109j6161
$$ -12496 5484 14164 -2264 -12553 -210 12910 6914 -9407 -12371 5333 15906 -203 -16364
504a6364J0887J7371m442j6277l595J5011J1318j2952j7812P395J7286k234j2703
$$ -16364 -5477 11894 7452 -8825 -12420 2591 13909 957 -16855 -9460 7826 5592 -7111
517g111j254N000K029J261k072n106L337Q474j280j0215n227R980J2640m531j6405
$$ -7111 -8365 -3365 -1336 -75 -2147 -7253 -3916 4558 3278 -6937 -12164 -2184 10456 5925 -10480
532a0480J7J5937L445j1210j750P820K868l219n301j879Q805O731r581j0274P738
$$ -10480 -10463 5474 8919 -2291 -4041 3779 6647 3428 -1873 -3752 5053 11784 2203 -8071 -333
547c33J0858m237j1142P11J1182L618j1641p709Q353O546o246l051L817k072k256
$$ -333 10525 6288 -4854 -4143 7039 10657 -984 -8693 -340 6206 -40 -3091 726 -1346 -3602
562c602L431m25m821N294O419p589r493M816J0973M79r133m878O850M747m405
$$ -3602 -171 -596 -5417 -123 6296 -1293 -10786 -5970 5003 5482 -3651 -8529 -1679 3068 -1337
577a337k051M333J068k486Q4j886j556Q291L295j3037o480J5095R773j2947j2045
$$ -1337 -3388 945 2013 -473 -389 -2275 -3831 4460 7755 -5282 -11762 3333 13106 159 -11886
592a1886P965J3287j996j1437k760Q018L185m720j802K95N33M060r6r264O73J4828
$$ -11886 -3921 9366 7370 -4067 -6827 1191 4376 -344 -2146 -1851 -1318 2742 2646 -6618 -5945 8883
608H883J720j7162n048J4984Q314q558q521J580N419K651l84k485k756L33N133
$$ 8883 10603 -6559 -11607 3377 11691 3133 -5388 -3808 1611 4262 3878 1393 -1363 -1030 4103
623D103O35q366M05J2662j457j8481k01J9195M186j5363o958P180O284k06l715
$$ 4103 4738 -3628 -3223 9439 7982 -10499 -10700 8495 12681 -2682 -9640 -2460 3824 3618 -97
638i7l935J08L954J570l445l890L654O882n726r311Q021J2651q055j4004O137
$$ -97 -4032 -3924 30 1600 -1845 -5735 -2081 4801 -925 -10236 -2215 10436 2381 -11623 -5486
653e486J1884k064o126N97j627j165O018N059n547o017L622N652l923m845P479
$$ -5486 6398 4334 -1792 -1195 -2822 -3987 2031 7090 1543 -4474 -852 4800 877 -3968 3511
668C511O344j1175j0342J0452J2357o530r205J606K822N57L978p71p731j33P765
$$ 3511 9855 -1320 -11662 -1210 11147 4617 -4588 -2982 -160 397 4375 3604 -4127 -4260 3505
683C505M6p750Q51P765j041j0710j34J4212L184j4606n527J0282N080l771k97
$$ 3505 3551 -4199 -3348 4417 3376 -7334 -7468 6744 9928 -4678 -10205 77 5157 1386 1089
698A089j720o279K837J0548k282r321K108P718l799p237M655R801l283j3131l71
$$ 1089 -631 -6910 -4073 6475 4193 -5128 -3020 4698 899 -6338 -1683 8118 4835 -8296 -8667
713h667J1810L492o173k928p80j606O468O694p938r664P329Q424o927o002P394
$$ -8667 3143 6635 462 -2466 -3246 -4852 1616 8310 372 -9292 -1963 6461 -466 -6468 926
728I26N152q043o692P756Q657l713q492L21L467J517K798R33q557m903J0910O256
$$ 926 6078 -1965 -8657 -901 7756 4043 -4449 -4128 -661 856 3654 4587 -3970 -8873 2037 8293
744H293r646m652R088J963r969l0R841J844q233n097M196M801M72r77l077m786
$$ 8293 -1353 -6005 3083 5046 -4923 -4953 4888 6732 -1501 -6598 -2402 2399 2871 1894 -1183 -5969
760e969J598J1005P04j2509k361J0987J083r532K230P862l321p823J852O899J241
$$ -5969 -4371 6634 7338 -5171 -7532 3455 4538 -4994 -2764 5098 1777 -6046 -4194 2705 3946
775C946k806k151k401o25N337N950n124r929K689J0209j526q217L562O497o053
$$ 3946 1140 -1011 -3412 -4037 1300 7250 2126 -7803 -5114 5095 3569 -4648 -1086 5411 -642
790f42n677O738M775l964l584K06J94J505L697J5o277l762P403O826o253p477
$$ -642 -6319 419 5194 1230 -2354 -2148 -1954 -449 3248 3263 -3014 -6776 627 7453 1200 -6277
806f277N345N723n781l498P150J731p149j988M506J517O16J315l565n442L089
$$ -6277 -932 4791 -990 -4488 2662 4393 -2756 -4744 -238 1279 1895 3210 -355 -5797 -2708
821b708Q497l78q875k971P387L675o299k062O414N18o340J15N257o1k167O46j836
$$ -2708 5789 5411 -3464 -6435 952 4627 -1672 -3734 2680 3198 -3142 -3027 2230 2169 2 648 -1188
838a188k945N282N266n145p713K700Q609n53o405j158N155L51m313P23M362k104
$$ -1188 -4133 1149 6415 1270 -6443 -3743 4866 4313 -2092 -3250 1905 2256 -2057 -1334 3028 924
854I24k649R17J54j095M446K090p346l852P325N669n343o181K450M677p01l391
$$ 924 -1725 -808 -654 -1749 2697 4787 -2559 -6411 914 6583 1240 -4941 -2491 2186 1485 -1906
870a906J105K551j684j716J791M73p26J688lm990j43P440R24p436k187N169L148
$$ -1906 -801 1750 66 -1650 141 614 -112 1576 1573 -3417 -3560 3880 4804 -2632 -4819 350 3498
887C498l005j909J456J041r04j252R78N13k13L78m70k693J799M933j868p124J620
$$ 3498 493 -1416 40 1081 177 -1075 -97 416 203 581 111 -2582 -783 4150 2282 -4842 -3222
904c222P353k42n658r67K608J544o37j257l02R87L63o13o15j34K342J668l766
$$ -3222 4131 3889 -1769 -2736 -128 1416 779 -478 -780 207 570 -43 -658 -792 1550 3218 -548
921e48m063L251O221l125n367J414M069m53j833k66J41R31Q71j194j706J071J801
$$ -548 -4611 -1360 4861 1736 -3631 -2217 1852 1399 -434 -700 -559 372 1243 49 -1657 -586 1215
938A215j17k547j564L700L159m257l450L424L630j875k970L30R20O20J005j552
$$ 1215 1098 -1449 -3013 687 3846 -411 -3861 -437 3193 1318 -1652 -1322 -402 218 1223 -329
954c29j524J964J502j384k343J337K799k06l547j359L684K363l306k198K125J479
$$ -329 -1853 111 1613 229 -2114 -777 2022 1816 -1731 -3090 594 2957 -349 -2547 -422 1057
970A057n49n57p40j52K149M07k887j165K819J411k175j789N43L035O82l367j575
$$ 1057 508 -49 -789 -941 1208 1615 -1272 -2437 382 1793 -382 -2171 -1628 1407 2089 -1278 -2853
987b853L439J496j876j789K40J045J000o7k624k28L612N70l259p55J927J594j016
$$ -2853 586 2082 206 -1583 -1343 -298 702 635 -1989 -2217 1395 1965 -1294 -2049 -122 1472 456
1004D56k304q8K686J086k863j529K055J360N7j271j274P22K618q11l136N24L102
$$ 456 -1848 -1936 750 1836 -1027 -2556 -501 859 916 -355 -1629 -907 1711 900 -2236 -1712 1390
1021A390k75k178r11J032K031L35k465p87K293J034j607j543M09J532P57j200
$$ 1390 1115 -1063 -1974 -942 1089 1424 -1041 -1828 465 1499 -108 -1651 -1242 290 1047 -153
1037a53k283J431K776n53k703K20K069M20j369j245J43K317L44k765r43J969J553
$$ -153 -2436 -1005 1771 1218 -1485 -1265 804 1224 -145 -1390 -1247 1070 1414 -1351 -2294 -325 1228
1054A228j030j284j23J401J356j300k438J296K302j078j544j98Q41J738n02j870
$$ 1228 198 -1086 -1209 192 1548 248 -2190 -894 1408 330 -1214 -1412 -571 1167 665 -1205
1070a205l83K774L47k180q74J028J335L2j348j608J819J996j326k139J090J415
$$ -1205 -1588 1186 1533 -647 -1521 -493 842 874 -474 -2082 -263 1733 407 -1732 -642 773
1086G73K58r95j027n8K399l29k266m29K079O85r74j165R2J578Q33j652j733J767
$$ 773 1031 36 -991 -1049 1350 1021 -1245 -1674 405 1090 116 -1049 -957 621 1454 -198 -1931 -164
1104a64J362j320j387P00N39J051n76j915O69K573l86j876k65J132R85m18j165
$$ -164 1198 -122 -1509 -809 -270 781 205 -1710 -1041 1532 1146 -730 -995 137 1122 704 -461
1121d61j141J887J570j797j343J458R78j73q79p84Q16J147m86k276N32K220p7
$$ -461 -1602 285 1855 58 -1285 173 1151 978 99 -685 131 1278 792 -1484 -952 1268 1191
1138A191j320o59L79J455L70k219l41J955M60j541r43N99J237J46n94j523J184
$$ 1191 -129 -788 -409 1046 1416 -803 -1144 811 1271 -270 -1213 -614 623 769 175 -1348 -164
1155a64J764o49j823L92Q79O62q19j288K28J970J84j559p90J201P80m58o56j044
$$ -164 1600 951 -872 -480 399 1061 242 -1046 -818 1152 1336 -223 -1013 188 968 510 -146 -1190
1173a190J610J133j183j961J013K285p63j632j26P75J277n15j171m27J703K31
$$ -1190 420 1553 370 -1591 -578 1707 944 -688 -814 -39 1238 723 -448 -875 828 1059
1189A059j417m62J67J261P64j231j384J285K109j675j605Q95J203r8j029m33J74
$$ 1059 -358 -820 -653 608 1372 141 -1243 42 2151 476 -1129 -234 969 871 -158 -591 -417
1206d17J291P6r05o28N31J001k43r50n30J268J234j739j414J866Q90j317j045
$$ -417 874 950 45 -583 -52 949 706 -244 -774 494 1728 -11 -1425 441 1331 14 -1031
1223a031N49Q44M98k83r06m74J194P31r37j129P10J236j72j498k15J753O13k014
$$ -1031 -482 362 860 577 -329 -803 391 1122 185 -944 -234 1002 830 -668 -883 870 1483 -531
1241e31m07J539L44q57j54m50J38J216M57j365p18R22J434r49r80J52J758n47
$$ -531 -938 601 945 88 -66 -516 -378 838 1295 -70 -788 134 1568 619 -361 -209 1549 1002
1259A002j715j2J587P5j761M86J75J06Q80M0j725j7J705N69j814p55J462P12j280
$$ 1002 -713 -725 862 937 -824 -338 -163 -57 823 863 -862 -879 826 1395 -419 -1174 288 1000 -280
1278b80o56R65J352j058j537Q98J101j35k12L0j623J72K149L76k329r3J652L62
$$ -280 -936 29 1381 323 -1214 -316 785 650 438 468 -1155 -983 1166 1542 -787 -880 772 1134
1296A134j493k29J182K96j210r98J546N00p10n20M52m98O82J340p06k760R39K646
$$ 1134 -359 -588 594 890 -320 -1318 228 728 18 -502 -50 -548 134 1474 768 -1992 -1053 1593
1314A593n90j948K48J178m75p43O1J744o17p43o32J051K21J27N01j426j629J832
$$ 1593 1003 -945 -697 481 6 -737 -676 1068 451 -292 -924 127 348 475 976 -450 -2079 -247
1332b47K197r45k787J172J488j056o24R14Q20j388l4J8Q24r4j68o1q18q8J698
$$ -247 1950 1005 -1782 -610 878 -178 -802 112 932 -456 -490 -472 352 258 90 29 -789 -877 821
1351H21J050j941j875K214J594j882j078J690k49j113L06J180j09o28J34m27k01
$$ 821 1871 -70 -1945 269 1863 -19 -1097 593 344 -769 -463 717 608 -20 114 -313 -514
1368e14L73J553o80k136j74K541O93k185r57J903J71j218O52R83r83o84M47K65
$$ -514 -141 1412 732 -1404 -1578 963 1656 -529 -1486 417 588 -630 22 1005 22 -662 -215 50
1386E0m44O76O92j304j522J359K211m46k615O5J828J92j371N70L93l81q49J242
$$ 50 -394 282 974 -330 -1852 -493 1718 1272 -1343 -1278 550 742 -629 -59 334 -47 -896 346
1404C46o1l19K34J59j397r8K112Q30j885j687J314J481l94j088P9Q04j010L58
$$ 346 285 -34 200 359 -1038 -1136 976 1806 -79 -1766 -452 1029 635 -453 -374 430 -580 -222
1422b22J207l43j038P4Q60r45k0K073o02k480j33K497Q49j790j100P88P18l88
$$ -222 985 642 -396 -322 538 -407 -427 1646 1044 -1436 -1569 928 1777 -13 -1113 -325 393 5
1440Ek8N49o27q89R16N81j028L73J180j031j934J638K133j036k068J23J272N67
$$ 5 -23 526 -101 -990 -74 507 -521 -148 1032 1 -1933 -295 1838 802 -1266 -1143 129 696
1458F96p29l02N48n23n50J365L36j460L23O61o56o99J075K000k328j622J095K017
$$ 696 -33 -335 213 -310 -860 505 841 -619 -296 365 -291 -990 85 2085 -243 -1865 -770 1247
1476A247p21q12N5N5j10O42M45l73r42Q0J155r49m41J416O01j891j124K318J318
$$ 1247 526 -286 -231 -176 -286 356 801 428 -514 -434 721 -228 -669 747 1348 -543 -1667 651 1969
1495A969j945j020P30O78k69O58m64p65j48P66M42p53k88Q68Qj511J38J856K48
$$ 1969 24 -996 -266 412 143 801 337 -428 -576 190 632 -121 -409 459 467 -1044 -906 950 1198
1514A198k553o4J830J55n77J68l08m79O09R41q67q27M70N53j82n83J05J615r81
$$ 1198 -1355 -1419 411 566 -11 157 -151 -630 -21 920 53 -774 -304 249 67 -516 -411 1204 223
1533B23j617O54J548k25q21j9J22m82Q02M60o64q54Q71N62o14o36J040L53q63
$$ 223 -1394 -740 808 583 -238 -257 -135 -617 185 645 -19 -873 -2 560 -54 -690 350 703 -160
1552a60p57J170O67o24j093N58O59j80j12L17q41l57J117M16j070m5Q13J77j170
$$ -160 -917 253 920 296 -797 -239 420 240 128 445 -396 -753 364 780 -290 -335 478 655 -515
1571e15P0Q73L54p45r78J026N84r4n67j07j98k23Q10L62j765N30J198l77q12P5
$$ -515 -445 428 782 37 -941 85 669 575 8 -99 -297 -520 290 652 -1113 -583 615 238 -574 -499
1591d99Q14L3q39N2M36N93r34k19M24O1J77L85l32q16Q66O05o48r68P33J006r55
$$ -499 315 348 -491 -439 -3 590 -344 -563 -139 -78 99 484 152 -664 202 807 159 -809 -76 930 -25
1612b5n44N58M53N9m26l34L44K13J87k18m20k28L42Q29r82m65R29P02j192l40
$$ -25 -569 -11 442 501 75 -259 85 298 485 267 -153 -381 -39 790 -192 -657 272 974 -218 -558
1632e58O57K60m20j52o9M07J29no74j61N68L15J34q12j1P98J99r47l49J053J04
$$ -558 99 359 -61 -213 -282 125 254 249 -425 -586 -18 297 431 -381 -392 406 605 -342 -691 362 466
1653D66n88j18J52M21J59l27n93J53L60J90j45o73N70L58j96o48k48J062J12o63
$$ 466 -122 -240 -88 333 492 165 -428 -275 85 275 130 -543 27 385 189 -459 -707 355 467 -196
1673a96k42P98k87k24J7kJ44M30n2o63P3L36L87l74l05K21N87n9r97L48L74J31
$$ -196 -438 360 73 -151 -134 -136 8 438 386 -277 -204 132 519 145 -160 61 648 589 -408 -60 314 445
1695D45m36p7J41M00nm56n68N70M87k05q57K47N00K38l10n04j23O54j7l24j36
$$ 445 9 -68 73 473 468 12 -556 14 501 296 -561 -314 186 424 114 -390 -513 141 124 -200 -336
1716c36M21jM2k98k78J43O83m71l08O58K36m02k53j67L27O70l31o90j67J071j0
$$ -336 85 84 126 -172 -450 -307 376 -95 -403 255 491 89 -164 -331 -4 666 335 -355 -522 549 539
1737E39p71J56J60L85l84l39k19M82N42m06m37K04K91M8o2n58K43K72k23k11O9
$$ 539 -232 -76 84 469 85 -254 -473 9 551 145 -292 -88 203 251 189 -369 -126 146 -77 -288 -219
1758b19L48J76j32o84N12K56J30l10m44N23m5R3m25R6M9L54o1o28K63L48L92q31
$$ -219 129 305 173 -511 1 257 387 77 -367 156 111 204 -221 -125 -76 278 217 -411 -148 200 592 -239
1780b39Km3O67l91l82M9O42N1k76k83J98L3L82o40r2K71K15q9o30L48L85J39m54
$$ -239 -237 -280 387 -4 -386 -337 305 356 80 -203 -5 28 410 -230 -322 -51 164 75 -555 -207 178 317 -137
1803a37J94j7K36p3j56m36O00J54n43N3L6K87J02n59j18L71O03m66m54j55N02
$$ -137 57 40 276 203 47 -389 211 365 -178 -125 -89 198 300 -259 -377 -6 597 131 -323 -478 24
1824B4L25m8p21J70Q11k40m74k01N71P7k8o12l7M28K57r4n49L71L85J35o48j07
$$ 24 349 301 -420 -250 561 321 -153 -354 217 294 266 -346 -383 45 302 208 -341 30 415 550 -98 -205
1846b05N9N29q5n03R7K42L60p35j06L75J40L04q06j99Q04L50n74o10K88N95j7
$$ -205 -146 383 298 -205 -108 134 494 -241 -347 28 168 472 -334 -533 271 621 47 -563 -275 320 303
1867C03l15o67M20O86j18n02J17K40N5k85k16LJ17O68m94m45N65K97o93j06J45
$$ 303 -12 -679 -259 427 309 -193 -76 164 219 -66 -282 -279 -162 506 12 -433 132 429 -264 -370 -225
1888b25N31k1m36j74J39M62l31l54N05o45Q00K08q95j98R54K35o94j99N06J63
$$ -225 306 285 -151 -325 -186 276 -55 -409 96 -549 251 459 -436 -634 320 555 -139 -338 168 331
1908C31k97j54j71J24L76l20k6J85J92J79m49k51J78P50L0p70j90M17L87n70K13
$$ 331 34 -120 -291 -167 209 -111 -137 48 240 419 -30 -281 -103 647 677 -93 -283 134 521 -49 164
1929A64r7l5M48m83p0m0N90p37J35k08K56K00L05j027J10J082j98p91J33L75l47
$$ 164 67 32 480 -3 -73 -113 477 -260 -125 -333 -77 123 428 -599 -489 593 395 -396 -263 112 -235
1950b35P6K53j18k59J61J01n30J14P29K20m50m99K00P90m51o67L39O14j83l05
$$ -235 -159 94 -24 -283 -122 -21 -551 -437 292 512 62 -437 -237 553 102 -565 -226 388 205 -100
1970a00N56l37k08N66j35l55KK69l52n35J98Q34L41q99j14J80N77k85l54K33j40
$$ -100 456 119 -89 477 342 -13 -11 258 -94 -629 -431 403 744 -155 -269 -89 488 203 -151 82 -58
1991e8p8K11K88o16J58N24l40m94K29R46o45p75K72P98l2l50k89J01L21l60M43
$$ -58 -136 75 363 -253 -95 429 89 -405 -176 770 125 -650 -378 420 388 38 -251 -150 171 -189 254
2012B54l01m02l2Q58m92k82N60L15m15p97M08P28k71m85Q4N82K35m56J9k05l77
$$ 254 -47 -449 -481 377 -115 -397 163 478 63 -734 -326 402 131 -354 -270 312 547 91 110 -95 -472
2033d72O34J60j38m93L65N99r31k65J010J94n24p19O42L83l30J20j25k46J74K79
$$ -472 162 322 184 -309 56 655 -276 -541 469 663 139 -580 62 445 115 235 110 -136 38 317
2053C17N6k09k77M39J06r73J84J088J12j580J27J285o1l08n10J7J60K22M20r6
$$ 317 373 164 -113 326 432 -541 -357 731 843 -737 -610 675 614 306 -204 -187 -27 195 615 519
2073E19r29m3N62K46q36K35O27J01j141N84Q51o14m79j51M78Q3o2K40k84k55J75
$$ 519 -410 -453 109 355 -481 -246 381 482 -659 -75 776 162 -317 -468 10 93 31 271 -13 -268 -93
2094i3N35m0r03K21P96m26k37J44R63p82p30M20N53K4m09q7l7j49P18K84o00o93
$$ -93 442 402 -501 -280 516 90 -147 -3 960 178 -552 -132 421 445 36 -51 -88 -237 481 765 165 -528
2116e28Q48K98m13m52N73Q2o96l38R45L74q45j89K81N3j92L76K32r74K51O82K69
$$ -528 320 618 205 -247 326 408 -288 -626 319 693 -152 -341 -60 -7 -199 177 409 -565 -314 368 637
2137F37p19j94O92r5n35M4M42r6n16j45N47L17j06R6o23n72P49Q69m66o32k35
$$ 637 -82 -276 416 321 -214 -170 272 176 -340 -485 62 379 273 369 -254 -826 -77 792 326 -306 -541
2158e41P74k82k1q8N41m01m40M23P7L6k03J69m69j05O90N94j065k26N76N38p42
$$ -541 233 -49 -70 -158 383 -18 -458 -35 42 78 -125 44 -425 -530 160 754 -311 -537 39 577 -165
2179a65L5K71L21m36n48P49Q5l39n7r9N9k20K27J4n50O4J201M9q35m79P75M5n47
$$ -165 -130 141 462 26 -522 227 312 -27 -84 -183 -124 -344 -117 -103 -653 -589 612 661 -174 -653 122 167 -380
2202c80L92P4k91Q8j45J86K88k42L53m19k63J69P07Mr26N2O12j80j71J73k65J99
$$ -380 12 86 -205 -117 -262 -76 212 -30 323 -96 -359 -190 517 521 -405 -353 259 79 -92 81 -184 15
2224A5j62l9M12l61J41P8m02j4N53J91o01n03M64O36m24k54L08Q1l34p4M91J43
$$ 15 -147 -186 226 -135 6 84 -318 -332 221 412 -189 -692 -228 408 -16 -270 38 119 -215 -289 202 345
2246C45l49j93pm1L8M63k72l03Q4K82K49l86j59Q4L36k01j4K17J12n13l7K40J42
$$ 345 -4 -197 -204 -245 -207 256 -16 -319 -235 47 296 -90 -249 -165 171 -30 -44 173 285 -228 -265 -25 117
2269A17j26J58q7k46M0L57J27o06m23R42R4n74K6L15J9k11J21jJ0n6K16p2k20
$$ 117 -9 149 62 -184 -144 213 340 -266 -689 253 347 -227 -201 114 133 -78 43 42 52 -4 212 140 -80
2292h0M4J66j67l44J06M36J6l08O6R5K49n90M23J05k61Q7K8M4l15K97P1l37k78
$$ -80 -36 130 -37 -381 -275 161 177 -131 -65 30 279 -311 112 217 -44 43 71 115 -200 97 168 -169 -447
2315d47N72K02k23l20M8K71j74J31o1L03n99M76j27J11l71J49K99n25N1L69r1
$$ -447 125 327 104 -216 -168 103 -71 60 -1 302 -297 179 52 163 -208 -59 240 -285 -234 135 44
2336D4n5K4K49j75q5K4k12K53R8J49n52J43RK63j54j69L69j51j49J09k36L53O
$$ 44 -11 13 262 87 2 26 -186 67 165 314 -238 -95 -86 177 23 -146 223 72 -77 32 -204 149 155
2359A55j91l40L17Q2J73k27k17K04K80ql17k1N5L09m89P3J32O25p21j04J47K76
$$ 155 -36 -376 -59 23 196 -31 -248 -44 236 228 -89 -110 -55 254 -235 -162 -30 595 -126 -230 -83 193
2381A93o8M3l08r2K54p4k53K0L58l5J40lm49K10L09l81j78J44K68L9k8j77l3k
$$ 193 125 168 -140 -232 22 -52 -305 -285 73 38 178 175 -274 -64 245 -136 -314 -170 98 137 109 -68 -101 -103
2405a03K18L17o99K57J57K38m43j59m3L64O8l10ML02L1j10j98K36n5M20l52k36
$$ -103 115 432 -267 -10 147 385 -58 -217 -260 104 172 -138 -134 168 199 89 -109 127 72 492 140 -96
2427i6j01L94j85j83N6K48N9j74k54K87n4l40J46M11j29q8k72N47j21P1k42l8
$$ -96 -197 197 12 -171 -115 133 192 18 -236 51 -3 -343 -197 214 85 -3 -275 272 151 222 -20 -58
2449e8J96j52Pk32RN2K55j82k9J31K45Lk73j86L09M72m17N8k53L1P4J84m68r7
$$ -58 138 -14 -7 -239 -230 -178 77 -105 -134 -3 242 245 -28 -214 95 567 150 208 -45 -14 60 244 -224 -321
2473c21O33j69J8j29N4n9J9M8l55J24M65k27j35J22J15J7k10l29J23J13Q0k14
$$ -321 312 143 161 32 86 27 46 94 -261 -137 328 101 -34 88 203 220 10 -319 -196 -83 -3 -217
2495b17J77P1J65l37J01k77M50J2l02J76j22%N17n20O6j41p1L85n14L29RJ41O7
$$ -217 -40 31 196 -141 -40 -317 133 145 -157 19 -103 -103 414 -106 -40 -181 -252 133 -381 -52 -43 98 165
2518A65p7k08K33K14l01k48O10p05K97R2l0k30K69Pj31MR7M6l1k15Ko0M18k17
$$ 165 88 -120 113 327 26 -222 388 -317 -20 72 42 -188 81 88 -43 -39 58 104 73 -142 -140 -200 218 1
2542Ar5k04Q6L68j42j10O1J7j31k8K70m5j1j15n0M6R1j41J62k27J74n5J47j60
$$ 1 -94 -298 -212 156 14 -96 -35 -18 -149 -177 93 48 37 -78 -128 -82 9 -132 30 -197 -23 -78 69 -91
2566i1R9r8m7Q0j04O5n1J87j79j5M77j44p9L2J32L1k07l80K26J62j87Qj16N64
$$ -91 8 -90 -137 -57 -161 -96 -147 40 -139 -154 323 179 100 132 264 295 88 -292 -66 96 -91 -83 -199 365
2590C65l27k76K75r0K6L56m06k11K05L1R7%j84j17J90m6L6P1L89k39k91J05mP4
$$ 365 38 -238 37 -53 -27 329 -77 -288 -83 -52 45 45 -139 -256 -66 -112 -76 -5 384 145 -146 -41 -45 29
2614B9j56K44k18j54J22m1R5J46J49l1l88L93k22J8J70l38J49K79l15J13l1j88
$$ 29 -127 117 -101 -255 -133 -174 -79 67 216 185 -203 190 -32 -14 156 -182 -33 246 -69 44 13 -175
2636a75L57k60K52k46p8J46K25l02j4n4L20j11j0k24L33J9m40Q5L80k69J56j89
$$ -175 182 -78 174 -72 -150 -4 221 -81 -95 -149 171 60 50 -174 159 178 -262 -177 203 -66 90 -99
2658i9m4l9O24j29o50L35J26Jo9k10J00j03M9J63J82n5m15j34P66k35L8k37l06
$$ -99 -143 -182 442 313 -337 -2 124 125 56 -154 -54 -157 -108 55 237 182 -233 -367 399 164 202 -35 -341
2681c41J18N43l04l8l20M06K0M8p4m00M16J13j52J8J49k48J51k04L83k82J90q0
$$ -341 -223 320 16 -22 -342 64 84 132 58 -342 74 187 35 53 202 -46 105 -99 284 2 192 112
2703A12J11k83j74M16o4l50K37m3K9j21J33P4j21J36m15O11m00M28j53k04l80
$$ 112 223 -60 -234 182 118 -232 5 -38 -9 -130 3 77 -44 92 -323 288 -112 316 163 -41 -421
2724d21N97m03K72j31K08R8k46j2R7n1M9l83N2K95R2n8O0j18j66J51K96k27l88
$$ -421 176 -227 45 -86 122 220 -26 -38 59 8 57 -326 -274 21 113 55 115 -3 -169 -18 278 51 -337
2747c37M20p9J18j48K5J27mk73M34o0j68m6K86l29q3J99J63j17m88M70j43m1k2
$$ -337 83 4 122 -26 -1 126 122 -151 283 223 55 9 295 -34 -117 82 245 128 -360 110 -33 -74 -96
2770i6j92J55J28k75M62k78J37m3r6J05L2O7O5k53N9K14N9k87R5k52j10K90J81
$$ -96 -288 -133 -5 -280 182 -96 41 -2 -98 7 39 106 171 -82 -23 191 250 -37 58 -194 -304 -14 167
2793A67p8N2j80L81o38j09O55n57J93P5K65k3j60k34k1N7K18l6OO2j25L6L8R0
$$ 167 89 141 -39 342 -296 -405 250 -307 -114 -39 226 203 43 -191 -212 -155 63 27 33 95 -30 6 44 134
2817A34l7j25J5N2o0L97m76j74K15K55L33m44m94K69L17j56o9L83l88M3N5J26
$$ 134 97 -28 -13 39 -21 376 -100 -274 -59 196 529 85 -409 -140 177 21 -48 335 -53 -10 45 171
2839A71l58K46K3k07L9L5M75m37N3m35O05J13j24o9k63P9j6L02n49M57j5q7q3
$$ 171 -187 59 82 -125 -86 -51 424 -13 40 -395 210 323 199 130 -133 -54 -70 232 -317 140 125 38 -45
2862d5k50N74j2l19j83L37j0r7k27N31l76q3M97m57J01k10K46n8j1L1K34O2m21
$$ -45 -295 279 267 -52 -235 102 92 -5 -232 299 -77 -160 337 -120 -19 -229 17 -41 -52 -21 213 275 -146
2885a46j93M63n0j78l7M34l92K26J07j14j08J93l37L72k45J35J08k58k8J11L7
$$ -146 -339 124 74 -104 -141 293 -99 127 234 120 12 205 -132 240 -5 130 238 -20 -48 63 100
2906A00q8j16L6Q3n8j9q4O8J56k82M49j00k25J13J22Q0m39L84J36m80M52k22j41
$$ 100 12 -104 -68 15 -43 -62 -146 -78 78 -204 245 145 -80 33 155 235 -204 180 316 -164 288 66 -75
2929g5L99k14m80K85MK78r2j55j46J20J4J43P8j62j38J50j04J05J94k03J65l43
$$ -75 324 110 -370 -85 -81 197 105 -50 -196 -76 -62 81 159 -3 -141 9 -95 10 204 1 166 -177
2951a77N0K58o4J10j02Q9J50m39k8L46P0o7r8l17LL27M7j8J71k60N6N4K2m85M96
$$ -177 -127 131 67 177 75 164 314 -125 -153 193 263 196 98 -219 -216 111 158 140 311 51 107 161 183 -302 194
2976A94l7l84J30P1J19j07NJ81r9M5j52%J43l27L07J35l77K3n2K93k39j15P2J23
$$ 194 157 -227 -97 -26 93 -14 -9 172 73 118 -34 -34 109 -218 89 224 -153 -130 -182 111 -128 -243 -171 -48
3000d8K83p2K04l88l21M44R3k66J7j33L24K7j79J37r0o5M2J87K8m08O0N9j27L12
$$ -48 235 163 367 -21 -342 102 195 -71 -54 -187 137 164 -15 122 32 -33 9 196 224 -184 -124 -65 -192 120
3024A20j82O9R6p9j42K49J26q7j56J56j36j03P4j58j76K41R6K9j22J37Q2J1l30
$$ 120 -62 7 103 24 -118 131 257 170 14 170 34 -69 5 -153 -329 -88 8 37 -85 52 134 145 -185
3047a85K52p1N4J01q5K17m45J75l0O6NOk34N6J71K06n74K32Q9m6mQj5J7L75l73
$$ -185 67 -4 50 151 66 283 -162 13 -17 49 54 60 -174 -118 53 259 -315 -83 6 -40 -44 -36 -51 -34 341 -32
3073c2P0J4R5l28J54jk9M39k42j19M4k1J48n8k90L69k81l2j53L29J9j54p7K10
$$ -32 38 52 147 -181 -27 -28 -57 382 140 21 65 44 192 134 -156 213 -68 -100 -253 76 95 -59 -136 74
3097G4M5r6k30N47j54j23J66l39N5K82j06K62j43m1j19k57J08J29j58j26R8M9
$$ 74 119 23 -207 340 186 63 229 -110 -55 227 121 383 240 199 80 -177 -69 60 -98 -224 -126 -77
3119g7L49k25K10k60j15K0o6N5PO1R4%k20K21L35o8k79Q7l44K10J85jj17l05L39
$$ -77 272 47 257 -3 -118 -98 -164 -109 -102 -41 53 53 -167 54 389 321 42 129 -215 -5 180 179 62 -243 96
3144I6J36l82P8J99j81j37K58M8j19K11l76J77K21j26k52j08O04m17L2j39M42
$$ 96 232 -150 -72 127 -54 -191 67 115 -4 207 -169 8 229 103 -149 -257 347 -70 -38 -177 265
3165B65k13M6Kl56K44K5j99L94k35Q4j78L10k31K31k32P3q9J13p3MK02j43J1k08
$$ 265 52 98 100 -256 -12 13 -186 208 -27 57 -121 189 -42 189 -43 30 -59 54 -19 -15 187 44 55 -153
3189a53K10o9n5K71k30l0k82K06N6n7K58l65K37k9n2K9K77j70j79K28l7j03p1
$$ -153 57 -12 -67 204 -26 -56 -338 -132 -76 -133 125 -240 -3 -32 -84 -55 222 52 -127 101 64 -39 -110
3212a10P7K3j2l1l34L86K96k85j68J60j81j07L86l54J75N2j46L8M77m19k34K31
$$ -110 -33 -10 -22 -53 -387 -1 295 10 -158 2 -179 -286 100 -254 -79 -27 -173 -135 342 -77 -311 -80
3234h0P9j36M45o38K32N7N6l5j00qK02J37k10j42O9K35j11j27M4j9L26l82J91
$$ -80 -1 -137 308 -330 -98 -41 15 -20 -120 -128 74 211 1 -141 -72 163 52 -75 -31 -50 276 -106 85
3257H5j92k8M45k69K69l89K7K49j20R6N7l39J47oj01R2j36j8k15R3K6L9M53j41
$$ 85 -107 -135 310 41 310 -79 -52 197 77 173 230 -109 38 32 -69 23 -113 -131 -346 -253 -227 -188 265 124
3281A24o5K0j1k62J92l21M50kk79L16m30M45j71P5J41k89K89k81K42n7k36K09
$$ 124 59 79 68 -194 -2 -323 127 125 -154 162 -268 177 6 81 222 -67 222 -59 183 126 -110 99
3303I9K22l35M3K2j70oL12j27O2j80p9K80Q1P4j84k03j9J05r5J8J35j08J47n0
$$ 99 321 -14 29 51 -119 -125 187 60 122 -58 -137 143 224 298 114 -89 -108 -3 -98 -80 55 -53 94 44
3327D4J1K21j07l21P4j74N72o71K64j3K54k18k07R4K73K8K68m06j53J93lj0P3
$$ 44 55 276 169 -152 -78 -252 320 -351 -87 -100 154 -64 -271 -177 96 124 392 -14 -167 26 23 13 86
3350H6o9j36L80k96K39l71k58N05l41K95K7j42q9K02l05M88k35K5j8r6j99J79
$$ 86 17 -119 261 -35 204 -167 -425 80 -261 34 61 -81 -170 32 -273 215 -20 5 -13 -109 -308 -129
3372a29LL19j89o2J74j78K46j15N3j84K84j37mk33Q6R7J27l69M8J52PO1J27j28
$$ -129 -126 193 4 -58 116 -62 184 69 122 -62 222 85 81 -152 -66 31 158 -211 -163 -11 -4 57 184 56
3396E6l76J85M4MJ09L04m28J94k02N4l9J9J54j18Mm5k42N12j59L3J03N2o6r1j65
$$ 56 -320 -135 -91 -87 22 326 -102 92 -110 -56 -95 -76 78 -40 -36 -81 -323 189 30 63 166 218 152 61 -104
3421a04K21l48L71r2j63J86M1k41K19j10J19l87J32K54k15O3J23K55l64J50j4
$$ -104 117 -231 140 48 -115 71 112 -129 90 -20 99 -288 -156 98 -117 -54 69 324 -40 110 96
3442I6k77J24n9K2M45L9j70j19n4k05L01l60K03K38k86J06L3J64j97p8j93J23
$$ 96 -181 -57 -116 -94 351 390 220 101 47 -158 143 -217 -14 224 -62 44 77 241 44 -34 -227 -104
3464a04P4L9rn8R1j52K98qk86Q9K12k47Q9O5p6J74q1j88J3L36Pm00K77k20K44
$$ -104 -30 9 0 -58 33 -119 179 171 -115 -26 186 -61 28 93 17 191 110 -78 -65 271 278 -122 155 -65 179
3489A79q9Jj21p2J66j2M9k21J54k34N0J63k09M85k42k15J61J0%j34J28O1j1m0
$$ 179 90 91 -30 -102 64 52 101 -120 34 -200 -150 13 -196 289 47 -168 -7 3 3 -131 -3 58 47 7
3513GL9L3k26J34j83L91j86J43k44J03j93L26Kl03J49J93j06j71l2p1J82q5L9
$$ 7 46 79 -147 -13 -196 195 9 152 -92 11 -182 144 146 -157 -8 185 79 -92 -124 -195 -13 -98 -59
3536e9k0J69k88L40k35n8J6K46r1k23J09K31pk0l07J61J02j69J13j8p6O0K35k42
$$ -59 -79 90 -198 142 -93 -151 -135 111 20 -203 -94 137 130 110 -197 -36 66 -103 10 -8 -84 -24 211 -31
3560c1K10J31l15N0k30L87O0j29m14K04K10q7J7K4m8q0n0L74k66k6j1L5M0r4q3
$$ -31 179 310 -5 45 -185 202 262 133 -281 -77 133 46 63 87 39 -41 -91 283 17 -9 -20 15 55 -39 -122
3585a22J1K56k03J80k38m0J24J19J42l99J78q2L35m23J87J43q1n1K57m51J00j50
$$ -122 -111 145 -58 122 -116 -156 -32 87 229 -170 8 -74 261 -162 25 168 87 36 293 -158 -58 -208
3607b08K06J5l19J48K80k16p2K97k19j53K18j9P3j7K69j06l84J93l30K35K81L
$$ -208 -2 13 -306 -158 122 -94 -166 131 -88 -241 -23 -42 31 14 283 177 -207 -14 -344 -109 172 175
3629A75j01l25L05o4j4r0j21J8K23J11j60m2P1J22k81M4J60K21m67K23k10K28
$$ 175 74 -251 54 -10 -24 -114 -235 -217 6 117 -43 -85 -14 108 -173 -129 31 252 -215 8 -202 26
3651B6r2J28k69J99J20p1p1j77K36j49j6L75L8l13K12p0j77J07J03j76K29k26
$$ 26 -66 62 -207 -8 112 41 -30 -207 29 -120 -136 239 277 -36 176 106 -71 36 139 -37 192 -34
3673c4N1j85K52l82R1K64K4K28l63O1L00k24K7q4m0O0k19M10j61k4K1l03k0M71
$$ -34 17 -168 84 -298 -207 57 81 309 -54 7 307 83 110 26 -14 46 -173 237 76 52 73 -230 -250 221
3697B21k25rP8J5q3K8LRRk42K80k31J10L8K91k38k27J77J07k76J29p7L90k73p6
$$ 221 -4 -13 65 80 -3 25 28 37 46 -196 84 -147 -37 1 292 54 -173 4 111 -165 -36 -113 277 4 -72
3722g2K74k35k85K78P2K93o75L58m1K28J2rm8J87l12n0K92m29P0J87p3J38M6m48
$$ -72 202 -33 -318 -40 32 325 -350 8 -33 195 207 198 150 337 25 -25 267 -162 -92 95 22 160 206 -242
3746b42M98k20j86J47Jl9O9j54l7K08ok06K13J59p8l36M59k21O0p9l44L31K40
$$ -242 256 36 -150 -3 -2 -41 28 -126 -163 45 39 -167 46 205 127 -209 250 29 89 10 -334 -3 237
3769B37k53j35J54N3J00j42n2K10p3j94L1j50N5L11o4j04qk5l1JJ6l1K33k23K77
$$ 237 -16 -151 3 56 156 14 -38 172 99 -95 -64 -214 -159 152 88 -16 -24 -49 -80 -79 -63 -94 139 -84 193
3794A93n12N05j7k42J75r1j34J83o3q8K61l33J73j61K30k15K11p9k60K17K08l01
$$ 193 -319 186 169 -73 102 11 -123 60 -3 -91 170 -163 10 -151 79 -136 75 -4 -264 -47 161 -140
3816a40Q8J3P4N4k0L45m28K8j68Q8M9l09K35k19J49J44j11J00J59j88j26L48j62
$$ -140 -52 -39 35 89 69 414 -14 14 -154 -66 -17 -326 -91 -310 -161 -17 -128 -28 131 -57 -183 165 3
3839Cq9K26j62M0k8n1m1K53j73L2K51l54K60n0k98P3L45l24Q3j13K78j75q0Q7
$$ 3 -86 140 -22 18 -10 -61 -102 151 -22 10 261 -93 167 117 -181 -108 237 -87 -4 -117 161 -14 -94 -7
3863gj79L11l47K51k36K44l3n0Q1n5K3j21O5J57l51K69j50J97o7k50L20j5n8j1
$$ -7 -186 125 -222 29 -207 37 4 -46 35 -20 3 -118 -53 104 -247 22 -128 69 2 -248 72 57 -1 -12
3887a2o4J44k65jL05k40K1oK55l10j1M4J24Q4j45O4N7L8j42K27k18M4j4O9j47
$$ -12 -76 68 -197 -198 107 -133 -112 -118 137 -173 -184 -140 -16 68 -77 -13 44 82 -60 167 -51 -7 -21 48 -99
3912i9k91J36L4Q1K69j72lj45J0L42l41k1j94L64K22k45p2N5M4J22M4l43K47P
$$ -99 -390 -254 -220 -139 130 -42 -45 -190 -180 162 -179 -200 -394 -30 192 -53 -125 -70 -26 96 140 -203 44 51
3936E1J74k0l01K73r7L58n22lK50K30n44j38K60K16J03l92K31J27j54j47J3k55
$$ 51 225 205 -96 177 80 438 -84 -87 163 393 -151 -289 -29 187 290 -102 129 256 102 -45 -32 -287
3958b87J5P8K81k73J69j0O5O4n53O85l23j40M21k5j15n8J3J09m2j52j72M89l09
$$ -287 -272 -194 87 -186 -17 -27 38 102 -451 234 -89 -229 192 167 52 -6 7 116 74 -78 -250 239 -70
3981g0l4K70j55l43M68l13K70j2m5l92K41j66K38k85L04K2J25k51L95k18m3K81
$$ -70 -104 166 11 -332 136 -177 93 81 36 -356 -115 -281 -43 -328 -24 -2 123 -128 267 49 6 287
4003B87l76n0m0L23j83QK8J20j85q0J26L9O1K05k63k76L83j41n3J62j49R8m09
$$ 287 -89 -139 -179 144 -39 -31 -3 117 -68 -148 -22 17 78 283 20 -256 127 -14 -67 95 -54 44 -365
4026c65L48K1JK11k43j54N2J95m7r0J9K41j66j77L39l14K80o7j84K04j16M8J79
$$ -365 -17 4 5 216 -27 -181 -129 66 19 -71 -52 189 23 -154 185 -129 151 84 -100 104 -12 36 215
4049B15j26m4j13K56Mj04p6k89J76O5M8J49J10j41L2N7n19L79lJ55L2o31K87K47
$$ 215 89 45 -68 188 192 88 12 -277 -101 -36 12 161 271 130 162 219 -300 79 76 231 263 -368 -81 166
4073A66j68j09K67j59j74M78l07j8P2J9m80K75J18k65K27K2J2j43RL80l12N1N6
$$ 166 -2 -111 156 -3 -177 301 -6 -24 48 67 -413 -138 -20 -285 -58 -36 -24 -167 -158 222 -90 -39 17
4096A7J52l00Q6j25L20O7j58j72q2L13m6m7J33p6J71n7j6k02p9L19l50J66L2j3
$$ 17 169 -131 -45 -170 150 217 59 -113 -195 118 72 25 158 82 253 196 180 -22 -101 218 -132 34 66 53
4120E3k7J81J1m58K03J61j87K81o53N57j59J76j10K06k95j47j55Q84n99j53K11
$$ 53 26 207 218 -240 -37 124 -63 218 -435 122 -37 139 29 235 -60 -207 -362 522 -77 -230 -19
4141a9n0J1K23L5k57lJ23Kj82K74l2J05m02P0K63j49j29p8J89j2L3K14l89rN06
$$ -19 -69 -58 165 200 -57 -60 63 65 -117 157 125 230 -172 -102 161 12 -117 -195 -6 -18 15 229 -160 -169 337
4166C37p6k42j18J00P3J75k23l57N37j03k59M52l28j34J78j02J43j95Mj00Q6K8
$$ 337 261 19 -99 1 74 249 26 -331 206 103 -156 296 -32 -166 12 -90 53 -142 -138 -238 -152 -124
4188a24J15J36j97j33L20j48K36j91J72q2j65J05k22L25K02k34j5J3m16K29r4
$$ -124 -9 127 -70 -203 117 -31 205 14 186 104 -61 44 -178 147 349 115 100 113 -303 -74 -168
4209a68l8Q9J09Q4j81K39m0j05k31R5K41j17q8j0J30J20l73K37l06K01J54K3k3
$$ -168 -206 -117 -8 76 -105 134 94 -11 -242 -147 94 -23 -111 -121 9 129 -244 -7 -313 -112 42 65 42
4232D2J20kk14K16O1m63J14J11j66J92o2q4K52j30j51M7L14Rk00n04K81J77J99
$$ 42 162 160 -54 162 223 -240 -126 -15 -181 11 -51 -135 117 -13 -164 -117 197 206 6 -498 -217 -40 159
4255A59j22K43j10j67M7J95L3k94J04R0k80l3J19R2o0j30qJ24K39j00J1k04l3
$$ 159 37 280 170 3 50 245 278 -16 88 178 -102 -135 -16 76 16 -114 -122 2 241 141 152 -52 -85
4278h5j81M22J89o40N87m15L73j07j65n3j03J6P3j20O2k32K79J04N4j00N9p4l6
$$ -85 -266 156 345 -295 292 -123 250 143 -22 -75 -178 -162 -89 -209 -147 -379 -100 4 58 -42 17 -57 -93
4301i3L05k73j77J66k8J76J56j74K3j49j14L42o9m47L18J11k86MJ81J03k46K33
$$ -93 212 -61 -238 -72 -100 76 232 58 81 -68 -182 160 91 -356 -38 73 -213 -209 -28 75 -171 62
4323F2j0J01j4l94L02j79K22R3m01J39K07k56J93K20o71O02K1Q1m20j10J90r5
$$ 62 52 153 139 -255 47 -132 90 183 -218 -79 128 -128 65 285 -386 216 237 318 -102 -212 -22 -117
4345a17p0K95j00J45k41J1K98k85k00J98k5J01R2j97M8Q8J08m6p7l06N13n27K97
$$ -117 -187 108 8 153 -88 -77 221 -64 -264 -66 -91 10 102 -95 -47 41 149 103 26 -280 233 -294 3
4368Ck19P8J32O5l11M78m52j00M94k86r3J25j3j09J14K42j84k1J2j69L49k69l16
$$ 3 -216 -138 -6 59 -252 226 -226 -326 168 -118 -211 -86 -99 -208 -94 148 -36 -57 -45 -214 135 -134 -450
4391d50O24k4j40k18J46k3o8M5L49k22j95j02k2L39N6J97l02L2n1l7O9j3k5pO6
$$ -450 174 150 10 -208 -62 -85 -153 -108 241 19 -176 -278 -300 39 95 292 -10 22 -29 -66 3 -10 -35 -42 24
4416B4j34O6M8o9K67o7Q4N7j14P0p1J73m59L22j75J91j30K16k29k73Q7j1K50k34
$$ 24 -110 -44 4 -65 202 135 219 276 162 232 161 334 -125 197 22 213 83 299 70 -203 -116 -127 123 -111
4440a11p9j63O29l19j61J34Q3J8j86K00r0M3L34l54m3K51m3l9k8p4l81M96l12
$$ -111 -190 -353 276 -43 -204 -70 13 31 -155 45 -45 -2 332 -22 -65 186 143 104 76 2 -379 117 -195
4463a95L63p7M42m88l1K2k87N67l78J07k97R4K5l5J40j22K08j09k38K55j53r9
$$ -195 168 91 533 45 14 36 -251 316 -62 45 -252 -158 -133 -168 -28 -150 58 -51 -289 -34 -187 -286
4485b86N21l75L86m06pR3j11L57j10j95O7O9n9O2j15J53K7j05J23k27K65m36O89
$$ -286 235 -140 246 -160 -167 -74 -185 172 62 -133 -66 3 -56 6 -109 44 71 -34 89 -138 127 -309 380
4508C80k56q9j82j58M25k88K47k53J63J20J31l28L72n6j74j18J61k53K54j27M0
$$ 380 124 35 -147 -305 120 -168 79 -174 -11 109 240 -88 284 228 54 -64 97 -156 98 -29 11
4529A1L3j16j02O6j57j48N09l57R9j81M90j74J65k01P4J26j99J25J53l4m63J96
$$ 11 44 -72 -174 -108 -265 -413 96 -261 -162 -343 147 -27 138 -63 11 137 -62 63 216 182 -281 -85
4551h5nP8J0m5k10M85l58P6O9K46k85p2N02m18K9O5j98L03j92Rl9J10K5r5J0j3
$$ -85 -90 -12 -2 -47 -257 228 -130 -54 15 261 -24 -96 406 -12 17 82 -116 187 -5 4 -35 75 100 5 15 2
4577Bj92J42K3j21K85M3l22m1J17o9J82j67J00J60l33J27j19J34J3k4j97O19l41
$$ 2 -190 -48 -25 -146 139 182 -140 -181 -64 -133 49 -118 -18 142 -191 -64 -183 -49 -36 -60 -257 362 21
4600B1l1j19K21L3k62M0j6N6j4OL28j60J23j61J57l55N9J57k18m0K57pR6k09K27
$$ 21 -10 -129 92 125 -137 -97 -113 -57 -71 -65 263 103 226 65 222 -133 -74 83 -135 -175 82 75 171 -38 189
4625A89m7k03K65l6l30K67Q3k85J4L7j15K12M7j53J19K20j54j25j42L55k62l6
$$ 189 142 -61 204 168 -162 105 188 -97 -83 -46 -161 51 98 -55 64 284 130 5 -137 218 -44 -80
4647h0L57k54J50l14N3k22K26J15j21j65L44j10L22m02K63j07j75K63OL5rk18
$$ -80 277 23 173 -141 -88 -310 -84 31 -90 -255 89 -21 301 -101 162 55 -120 143 149 184 175 -43
4669d3j10J80J86j68k17L16k29K99j81M21k67m91K53L2J88j35J74k48q8K04m2
$$ -43 -153 27 213 45 -172 144 -85 214 33 454 187 -304 -51 -19 169 34 208 -40 -128 76 34
4690C4j75M0k5O5L14j39j20o2L26k87J36J3j20k9j92J65J13J28k83J19k62J57
$$ 34 -141 -101 -126 -61 253 114 -6 -68 258 -29 107 120 0 -29 -221 -56 57 185 -98 21 -241 -84
4712h4L20m31J19qK07k40K32l9j63J94N1j82o6L29k22k53N56q6l0l62J27J47k09
$$ -84 236 -195 -76 -84 123 -117 115 76 -87 107 158 -24 -90 239 17 -236 320 234 204 -158 -31 116 -93
4735i3K38k17M00l66j43n5J09L21l38J13J36k37K37J2j3l96J24L36o6j20j53M07
$$ -93 145 -72 328 -38 -181 -236 -127 194 -144 -31 105 -132 105 117 104 -292 -168 168 102 -18 -171 236
4757B36J4k05p5m6k9J75N0k08J10oL0Pl15N12n06L72L2q2j30J57k41j57M27k73
$$ 236 250 45 -30 -76 -105 70 120 -88 22 16 46 53 -262 250 -256 116 148 66 -64 93 -148 -305 122 -151
4781a51J78J67k16K10l35J41r6O8P5j11K21m21M14k7j98M7K6j9p3J55k1r7j38
$$ -151 27 194 -22 188 -147 -6 -102 -34 41 -70 151 -270 144 117 -81 -34 -8 -27 -100 55 34 -63 -201
4804b01K55p8k44k8K82J27j44j90K73j5mj09L4j55O24k86j75k5J93m22N99l71
$$ -201 54 -24 -268 -296 -14 113 -31 -221 52 37 33 -76 -42 -197 427 141 -34 -59 134 -288 311 -60
4826f0J22k20M6R2r4L54l05J81K5J62n13K08o8K25k88J23j03K06j74l6O2J69p0
$$ -60 62 -158 -112 -20 -114 240 -65 116 141 303 -210 -2 -70 155 -133 -10 -113 93 -81 -117 -55 114 44
4849D4o9K11q9n1j01L66n70K22j6k1j99N60j74j61J92l15K68k55K30j07J75m74
$$ 44 -25 186 97 46 -55 311 -259 -37 -53 -74 -273 287 113 -48 144 -171 97 -158 72 -35 140 -334
4871c34J36J47K53k01Q8l64l5L03K02l68K11O9k46K78J11j61j0Q8j0k60K39r7
$$ -334 -198 -51 202 1 89 -275 -310 -7 195 -173 38 107 -139 139 250 89 79 167 157 -103 136 39
4893C9j71K01j20J23Q6m59J74K02j44K32l75J60O9k71L36o0k06J87r1J90l64J75
$$ 39 -132 69 -51 72 158 -301 -127 75 -69 163 -212 -52 17 -254 82 22 -184 3 -88 102 -262 -87
4915h7J09k23K95j91M3j53L25Pk72L76nl15O4J83k05j67K93k08J35j4N1j2m3k00
$$ -87 22 -201 94 -97 -54 -207 118 125 -147 229 224 -91 -27 156 -49 -216 77 -131 4 -10 41 29 -14 -214
4939b14K28k8J34l07K68k01R1j29K37R4m95k1J34L95M6m43J3L83j32Q4l16J94
$$ -214 14 -14 120 -187 81 -120 -29 -158 79 173 -322 -343 -209 186 232 -211 -198 185 53 137 -179 15
4961A5p3M27j73j64l4k7M8l67K63J03j6J84O7l45j2L07Q5J5j22q5j67p4J95r5
$$ 15 -58 369 196 32 -2 -29 19 -348 -85 18 2 186 253 -92 -104 203 288 303 181 96 -71 -145 50 -45
4985d5RJ58L3j67k4K19j22J23l43L43Kj01j80J33j88J82R6k21o7J40K22k57K22
$$ -45 -36 122 155 -12 -36 183 61 184 -159 184 186 85 -95 38 -150 32 128 -93 -160 -20 202 -55 167
5008A67j00K9l61R7j02J29nNL18j29K77l67J15j7J76k53j85K64j61l0Q5L3pj49
$$ 167 67 96 -265 -168 -270 -141 -146 -141 177 48 325 -42 73 56 232 -21 -206 58 -103 -133 -48 -15 -22 -171
5032a71M32k79J4J07Mj01L4l12L11l33K51K12j52Q4l57L73l9j24O7n3j30K4L08
$$ -171 261 -18 -4 103 107 6 40 -272 39 -294 -43 169 17 101 -256 117 78 -46 21 -32 -162 -138 170
5055A70k59J57J05l24J78p8J15o6R8k08J40r8J9J02l49K33J62j63J62j66J67j12
$$ 170 -89 68 173 -151 27 -51 64 -2 96 -112 28 -70 -51 51 -298 -65 97 -66 96 -70 97 -15
5077a5M9q5K74j13O1q8m60M53k03J71j07L14k86O5n4J34l35K3M93l12l34O01k50
$$ -15 34 -51 223 110 171 83 -377 76 -127 44 -63 251 -35 30 -24 110 -225 -202 291 -21 -355 246 -4
5100dJ0J00pj74k3J74m50L10J11l29L50J10k70P6O2J16l3lj33j25q0K24J26j23
$$ -4 6 106 99 -75 -98 76 -374 -64 47 -282 68 178 -92 -16 46 162 129 126 -7 -132 -212 12 138 15
5124A5K14k73r9J73j17P7J99q9m6j48J38q6J49j51j0j42J56J06K35K5k03l68M00
$$ 15 229 -44 -143 30 -87 -10 189 100 54 -94 44 -42 107 -44 -54 -196 -40 66 301 326 123 -245 155
5147A55J6p1q9K5R6l13L6j62J87J62NL2J7n5j85o9N20m35P3O6j33K80n6j98L0
$$ 155 171 100 11 36 132 -181 -145 -307 -120 42 47 79 96 41 -144 -213 307 -128 -55 11 -122 158 102 -96 -66
5172f6k31K33J14k03L60j19r9j7J8K21j36m7k57k29M78l1M1j65j5L5L3L3m7J18
$$ -66 -297 -64 50 -153 207 88 -11 -28 -10 211 75 28 -229 -458 20 -11 30 -135 -150 -115 -82 -49 -96 22
5196B2Mo5J82l30K5J68L3mK1j61q7O08l80J35k50R0P5n06K63K79r7n1J79m21K15
$$ 22 26 -39 143 -187 -162 6 39 35 56 -105 -192 416 36 171 -79 11 86 -420 -157 122 25 -26 153 -268 -53
5221e3p0M2L9J14K68k34l24M03l0J43l63j9J60O5k69N7j66J72K20j74j51M03J05
$$ -53 -123 -81 -42 72 340 106 -218 185 155 298 -65 -84 76 141 -128 -71 -237 -65 155 -19 -170 233 338
5244C38k55k4K60n57L54j03j0J23j00j75J46L7o6j23l3N1j10M08j11k3k8M0m6
$$ 338 83 59 319 -238 116 13 3 126 26 -149 -3 34 -32 -155 -188 -137 -247 161 50 27 -1 39 -7
5267gL53p25M60J10q6p3R3o1M0N5q5j40J89j38k5m6J59Om7J2j70j2l4L22j12l8
$$ -7 346 -379 81 191 105 32 125 64 104 159 74 -66 123 -15 -40 -86 73 79 32 44 -126 -138 -172 150 38 0
5293@j14K22k07K11j42j60J59o6q4Q6K80m39P8L21J05n19N23k20O2j92R7m2r7
$$ 0 -114 108 -99 112 -30 -190 -31 -97 -181 -95 185 -254 -176 145 250 -269 254 34 96 -96 1 -41 -138
5316a38J31k21L82jk22K09k49n2J99r3p4M3M42l63J50l79J83j15K66n8n4j64K90
$$ -138 -7 -228 154 153 -69 140 -109 -161 38 -55 -129 -86 356 -7 143 -236 -53 -168 98 40 -14 -178 112
5339A12j20P8l41J07J74k6J31j78KL1k2J9l6J16k73K58J02n05L91J52j92K10k98
$$ 112 -8 70 -271 -164 10 -16 115 -63 -61 -30 -52 -33 -69 47 -226 32 134 -371 20 172 -20 190 -108
5362a08K18q1M7j21R8Q7J20l45J01k84L69Q7j97o0o3Q9n3K61l99K29J45%k44j22
$$ -108 110 29 76 -45 53 140 260 -85 16 -268 101 188 -9 -69 -132 -43 -96 165 -234 -5 140 140 -104 -226
5386b26J53L5J83j87j25q4J34J99r4L7l4K15j32l0j60N8oq1L7J27k8J50l6p9J12
$$ -226 -73 -38 145 -42 -167 -251 -117 82 -12 25 -9 206 74 44 -116 -58 -64 -145 -108 19 -9 141 105 26 138
5411A38j59j64J18L05j56k83R9J61K08k74K71j52K5j40J1l1q2J16l27N88j50k06
$$ 138 -21 -185 -67 238 82 -201 -102 59 267 -7 264 112 137 -3 8 -23 -105 11 -316 272 122 -84
5433h4l08K37P9J87O8j12j7j68P9j8J41J80l37J88Jl3k26M21m93J43J65o49M15
$$ -84 -392 -155 -76 111 179 67 50 -118 -39 -57 84 264 -73 115 116 83 -143 278 -215 -72 93 -556 -141
5456a41L41k13J46j93q8Q9m1jo1J93j34J25k2R3k1M8j77J39j59Q6J15j52r7P0
$$ -141 200 -13 133 -60 -148 -59 -100 -101 -162 31 -103 22 0 93 72 120 -57 82 -77 9 124 -28 -125 -55
5480e5k64M72n4l34K29L1k29K28J74Rk0k47q9J89N5j82P5L10j24k17rj96K27m5
$$ -55 -319 153 99 -235 -6 25 -204 24 198 207 187 -60 -149 40 95 -87 -12 298 174 -43 -52 -248 -21 -66
5504f6j52K11k13J65l7NK31j18j58J61o0k96M00l25L04j06L18j41m00N93m04J2
$$ -66 -218 -7 -220 -55 -92 -87 144 26 -132 29 -31 -327 73 -252 52 -54 264 123 -277 316 -88 -76
5526g6m0RK05K29m94J93N1r8J17l19N6R9K63o0qj88m1K9J71k34pJ24p7O7O1P8
$$ -76 -116 -107 98 327 -167 26 77 -21 96 -223 -167 -68 195 135 127 -61 -102 -73 98 -136 -143 -19 -96 -29 32 110
5552A10k31Q0L04j99k21q0J47j07K76j49J46J49m72M87jl89K43r5J53o0n9l67
$$ 110 -121 -41 263 64 -157 -237 -90 -197 79 -70 76 225 -247 240 239 -150 93 -2 151 91 32 -335
5574c35O13l53rQ4j31L0l8NK3M7J06K6j09L0q7q1j14L47j04M2M9K05m66L61j56
$$ -335 278 -75 -84 0 -131 -101 -139 -134 -111 -64 42 68 -41 -11 -98 -179 -293 54 -50 -8 41 246 -220 141 -15
5599a5j30J50Jk27j15K93p7J70j83K55M8j30N5n1R1n9J17o6Q7l51j01K17P2j33
$$ -15 -145 5 6 -221 -336 -43 -120 50 -133 122 170 40 95 44 135 76 193 127 214 -137 -238 -21 51 -82
5623h2N6K22n81J62J97K8j03J72j8k99L2J80J3j05J6p3j27L77M3j56R9On1q5K64
$$ -82 -26 196 -385 -223 -26 2 -101 71 53 -246 -214 -34 -21 -126 -110 -183 -310 67 110 -46 53 59 8 -77 187
5648A87k51M2J67l50M04k24K31k22o0J72k41L3JJ43J7r2J72n1Ll8q9M5L5M8K81
$$ 187 -64 -22 145 -205 199 -25 206 -16 -76 96 -145 -112 -111 32 49 -43 129 78 81 43 -46 -1 34 82 363
5673C63n14K21R2j57p0p8J30J6N6k4m17L79l9K03l99K75K3k71J32K24q0m6J49
$$ 363 -151 70 162 5 -65 -143 -13 3 59 35 -382 -3 -42 161 -238 37 60 -211 -79 145 65 19 168
5696A68l32N1M5j89L2M33j76M8O4l09K66p0rm4J28j80K51k54j67J0M74j03j2j86
$$ 168 -164 -113 -68 -257 -225 208 32 80 144 -165 101 31 22 -22 106 -74 177 -77 -244 -234 240 137 125 -61
5720f1J87P3k73J95o7L0j44J6j12om1L6J73L8j98J76o6J96j47r4K38k71J12Q4
$$ -61 126 199 -74 121 54 84 -60 -44 -156 -162 -203 -167 6 44 -154 22 -44 152 5 -89 149 -122 -10 74
5744G4j18Q9l2j98M42j59k14P4j5j53r0J91j20J55j30M25k64K40m21N5J55l50
$$ 74 -44 45 13 -185 257 98 -116 -42 -57 -210 -300 -109 -229 -74 -204 221 -43 197 -224 -169 -14 -364
5766c64N24l19ML79j74m4OQ6j33J69j8k2J05n04K44J96k57J72J51l18J71o6M00
$$ -364 160 -159 -155 224 50 6 12 98 -35 134 116 94 199 -305 -61 135 -122 50 201 -117 54 -12 388
5789C88m77J72p7P9j71l4QJ19j17K23J73l62K35J80o21J89M24j43j16r9M8K22
$$ 388 -89 83 6 85 -86 -120 -112 7 -110 113 286 -76 159 339 -282 -93 331 188 72 -27 21 243
5811B43l49J7l0J02l7K99m74l6Q7J15J98k93J59j36j58K05L2J16m3J23j27j18
$$ 243 -106 -89 -119 -17 -54 245 -229 -265 -178 -63 135 -158 1 -135 -293 -88 -56 60 17 140 13 -105
5833a05Q3j8N5j5j85R0K5Q1K69j74J7k70o4L51q9m5j25J70N1j24k11L77M5k55
$$ -105 -22 -40 15 0 -185 -95 -70 11 280 106 123 -147 -211 140 51 6 -119 51 102 -22 -233 144 189 -66
5857f6J2j00n8J97L9O2K01k88qJ57m86J93J01J97N0l5j28M1RP5J12k99J07k21
$$ -66 -54 -154 -212 -15 24 86 287 -1 -9 148 -338 -145 -44 153 203 168 40 81 90 165 277 -22 85 -136
5881a36j7J57J29q5J25k54O1l4M28k07j02k31K3J95Q0r0J63o5k79J60q2J1M21
$$ -136 -153 4 133 48 173 -81 -20 -54 374 167 65 -166 -143 52 132 42 205 140 -139 21 -61 -50 371
5904C71l01l1P4k10J72o1L04l29K65l33K14j19k9L95m26O7j36K00j95p8M18j19
$$ 371 70 39 113 -97 75 14 318 -11 254 -79 135 16 -13 382 -44 23 -113 87 -108 -186 232 113
5926A13l03J97j1K75l05Q6k08J06j4J72j19j23P1L7P1j67J3j4j15K52Q3q4JL93
$$ 113 -190 7 -4 271 -34 52 -156 -50 -64 108 -11 -134 -63 -26 45 -122 -109 -123 -238 14 97 13 14 407
5950D07m60J28k13L03k76k13M26m16K09K25l14P6J14L74k91n4k65K00q3J67j2
$$ 407 -53 75 -138 165 -111 -324 102 -314 -105 120 -194 -118 -4 370 79 25 -240 -40 -123 44 32
5971C2P1j06j48K51r2l04J31J94J07p1J89k94l4j47n5L26j85P1mL87n32L59l03
$$ 32 103 -3 -151 100 8 -296 -165 29 136 65 254 -40 -74 -221 -276 50 -135 -64 -68 319 -213 146 -157
5994a57K81j98L2k00J12J49j49O4nk9K41j12J77l88P5J32m1j5K87l71L17p1p8
$$ -157 124 -74 -42 -242 -130 19 -130 -66 -71 -100 141 29 206 -182 -107 25 -16 -31 256 -115 202 131 53
6017E3R9j69J19k61J99l7J84j91k84L83j52J75k9r2j66L95j89L4J53m35J91p4
$$ 53 152 -17 102 -159 40 3 187 -4 -288 95 -57 118 89 -3 -169 226 37 71 224 -211 -20 -94
6039i4K85m7p2P6m14L29K30l55K71j75N4l94M50r1j44RL34k59J70l16J7M5o9K92
$$ -94 191 144 72 148 -266 63 293 -62 209 34 88 -306 144 53 -91 -82 252 -7 163 -153 -136 -91 -160 132
6063A32J37l95J93j79P1L00m23P3J06j27K52ro8Q5k35L42l20lR0r2K14j40J2O9
$$ 132 269 -126 67 -112 -41 259 -164 -91 15 -112 140 131 63 148 -87 255 -65 -68 22 -70 144 4 16 85
6087H5m19O24n25p7K98m2J06k82P5J92Q4m84M42o9J16k64K66k66O1N2J02m5K35
$$ 85 -334 290 -235 -312 -14 -56 50 -232 -157 35 119 -365 77 8 124 -140 126 -140 -79 -27 75 30 265
6110B65o4j10Nj2J00j93J01j98J4L18l50p9l2L85l0q5PJ21q2j3L1k19J04j7l6
$$ 265 201 91 96 84 184 -9 92 -106 -92 226 -124 -203 -235 150 120 35 42 163 81 68 99 -120 -16 -33 -69
6135f9j66Q6j2J61O2j60K72j98o6J39K6o8O8m5J03m40J16J93O3m5J45j12j0J18
$$ -69 -235 -149 -161 0 62 -98 174 -24 -90 49 75 7 75 30 133 -307 -191 2 65 20 165 53 43 161
6159A61j08k79k7K08l2k02j1M77n00L36j02J87k13J86k7lJ75m41K31j50M40l49
$$ 161 53 -226 -253 -45 -77 -279 -290 187 -313 23 -79 108 -105 81 54 51 226 -215 16 -134 306 -43
6181d3J61p4J40n8j42j5p3n3N11p7j38K0l29K73O5r7J36l20J24J89j49R0o3j87
$$ -43 118 44 184 126 -16 -31 -104 -157 354 277 139 159 -170 103 168 71 207 -113 11 200 51 141 78 -109
6205a09J49k01M1K96m2l4n1K30l02Q6j02L02j55J88l53j09J44l06L45P2j53N8
$$ -109 40 -161 -120 176 134 100 49 279 -23 63 -39 263 108 296 -57 -166 -22 -328 17 89 -64 -6
6227fJ70j63k52M14j67J3o4J09J78j42l38L71N3m19M01O6l51J18j23L24n00Q9
$$ -6 164 1 -251 163 -4 9 -55 54 232 90 -248 123 176 -243 158 224 -127 -9 -132 192 -308 -219
6249b19J77J16Q5m2O5l72J92J57l27JK60k15M6J07R9j95R1rq2J5J6Q5L65j61m79
$$ -219 -42 74 159 117 182 -190 2 159 -168 -167 93 -122 -76 31 130 -65 26 17 -65 -50 -34 51 416 255 -224
6274b24K24L91l91j15J07O9l0k99p1N33k80Q2M8J9l72K72M8r8L7J14qJ15j98K19
$$ -224 0 391 0 -115 -8 61 31 -268 -339 194 -86 -4 44 63 -309 -37 11 -87 -50 64 56 171 -27 192
6298A92J9j47l20M30j99J70j42l6p0K6K85m28J29r5J60J20k08P0J18j95M41l60
$$ 192 211 64 -256 174 -25 145 3 -33 -103 -77 208 -220 -91 -186 -26 94 -114 -44 74 -121 320 -40
6320d0J58R9l07r3n0NK91%j45L08l26Q2r7J82j39J45k58k61K87m8L86j17o9J34
$$ -40 118 217 -90 -183 -233 -228 63 63 -82 226 -100 -18 -115 67 -72 73 -185 -446 -159 -207 179 62 -7 127
6344A27j25J12k36r0M2N6K36l43J90q2J71r7q0J15J82j69l87K80J23o0Q9l42K32
$$ 127 2 114 -122 -212 -170 -114 122 -221 -31 -113 58 -39 -119 -4 178 9 -378 -98 25 -35 54 -288 -56
6367e6M2J42q5j65J97j97N8l1J54R5j14N3jp1K03k50Oj6P0O8j68j41K86o7N5p0
$$ -56 -14 128 43 -122 75 -122 -64 -95 59 154 40 93 92 21 224 -26 -20 -36 34 102 -66 -207 79 12 67 -3
6393cQ2k56J07L09j25j7p6J45l09K71nM4j60R4j55J40j02j72K69j53j4K12j50
$$ -3 79 -177 -70 239 114 97 21 166 -143 128 123 167 7 101 -54 86 -16 -188 81 -72 -86 126 -24
6416b4J18p3J06K20l14Rk1p3k68R6K42N7k89K51k22J14J43n0j7k68L12l8j46Q3
$$ -24 94 21 127 347 33 42 21 -52 -320 -224 18 75 -214 37 -185 -71 72 22 5 -263 49 11 -135 -52
6440e2K46l90oK96Q8o1k05J37K8j49j82K8J96p2K18j06j25R1J43q1m3R8J1j83
$$ -52 194 -196 -202 94 182 121 -84 53 81 -68 -250 -222 -26 -98 120 14 -111 -20 123 42 -1 97 108 -75
6464g5J83P2n2k62J77j10L6O0Qj1r6j40L49p5p5r5O9nj37J1J68J95l44K48nk42
$$ -75 108 180 128 -134 43 -67 -31 29 37 26 -70 -210 139 64 -11 -106 -37 -42 -179 -168 0 195 -149 99 94 -148
6490a48J16O1k55K9K99j75n6%J29kk64N78k05pO0m7m00N12k54J72ln62K90J77
$$ -148 -32 29 -226 -197 102 -73 -129 -129 0 -2 -266 312 107 100 160 113 -287 225 -29 143 140 -422 -132 45
6514D5K97l25K74l37J01j3j67J66o2l67L60p6L58l9o6k47l9K10j64J43o6j66K41
$$ 45 342 17 291 -46 55 42 -125 41 -21 -388 -28 -104 254 215 149 -98 -137 73 -91 52 -14 -180 61
6537F1j0j08r0J67l2L7m5R7J50j96k27L41k67L61j12k05K62k60j2N4N9r5J97k11
$$ 61 51 -57 -147 20 -12 25 -20 77 227 31 -196 145 -122 239 127 -78 184 -76 -88 -34 25 -70 127 -84
6561h4K85j47l01P3J91JJ0o4k1J51j14p4m0L15k07J82K79l59J2q2j11K26J3j60
$$ -84 201 54 -247 -174 17 18 28 -36 -57 94 -20 -94 -134 181 -26 156 435 76 88 6 -105 121 134 -26
6585b6J33j0n4o6JK8k4n7J0Q2k56J97nK28k53N3j36%M47k17q0M00o10Q0L50l23
$$ -26 107 97 43 -23 -22 6 -18 -75 -65 17 -239 -42 -47 181 -72 -19 -155 -155 292 75 -5 395 -215 -135 215 -108
6611a08J99k89L7J2K51mj37n0J24o7M7Rj74K33q5j46K3pL03k45k23L11q3M3rQ4
$$ -108 91 -198 -161 -149 102 98 -39 -89 35 -32 15 24 -150 83 -2 -148 -125 -132 171 -74 -297 14 -69 -26 -35 49
6637D9j2n4K00q0k49K69K3k08KJ50p1j68m1K18J45J43k97O6r2Q2J51K6J00m01
$$ 49 37 -17 183 103 -146 123 146 -62 -60 90 19 -149 -190 28 173 316 19 85 -7 75 226 252 352 -49
6661d9j22L66l2Q3k13J50k87L0K9k8oK89j24l21N11l61J36j41m9M5L83m71L68
$$ -49 -171 195 163 246 33 183 -104 -74 -45 -73 -79 210 86 -235 276 -85 51 -90 -139 -94 289 -182 186
6684A86l34L24j3k64R5L47m76P3N5l19M08J30j06r0k25R9N64l95k35N7m7J53J48
$$ 186 -148 176 163 -101 -6 341 -135 -62 -7 -326 82 212 106 16 -209 -110 454 59 -176 -119 -166 -13 135
6707A35j60r5L34j06j09O8L7l36K76o3L8j58J80r8L28l03K01j0j30r6J87j53L83
$$ 135 -25 -120 214 108 -1 67 104 -232 44 -19 19 -139 41 -57 271 -32 169 159 29 -67 120 -33 350
6730C50m87L3K33k8P8o9j52L66m15K21M8k09n0J93L2n8m0Q8j32j5l6J14kj9l95
$$ 350 -137 -104 129 101 179 110 -42 324 -91 130 178 -31 -81 112 144 86 46 134 2 -13 -49 65 63 44 -351
6755c51N16n0m75K45J81L3k04J17N7J2J41j46n6l1K3jL4n8L29l46O8n2m7Q6Q7
$$ -351 165 115 -360 -115 66 99 -105 12 69 81 222 76 20 -11 12 11 45 -13 316 -30 38 -14 -61 25 112
6780A12k57J38n8K02K1k24j18K19L9j08l21K75O0L66n26K09Q3q2k6J88J7k27M
$$ 112 -145 -7 -65 137 158 -66 -184 35 74 -34 -355 -80 -20 346 -180 29 112 30 4 192 209 -18 -14
6803a4L61k90k82L2J27K60j09J37j64N3Q6j50K33l33J81p5P9k73R9JJ18P6j13
$$ -14 347 57 -225 -193 -66 194 85 222 58 111 197 47 280 -53 128 53 132 -141 -42 -41 77 153 40
6826D0M9o9J13J57l5k19q2N3p7o2l3K21q3K0k63K19K67l98o7m1K99pLL10k27o6
$$ 40 89 20 133 290 255 36 -46 7 -70 -132 -165 56 -27 -7 -270 -51 216 -182 -249 -290 9 2 5 315 88 22
6852B2l3l07M38k62J71l33K5J30J43j07p9K06k33K70p9j12N8J73j66j11N0K67
$$ 22 -11 -318 120 -142 29 -304 -279 -149 -6 -113 -192 14 -219 51 -28 -140 -82 91 -75 -186 -136 131
6874A31j60R3J62n49L02k6J70J03k17J23j39n8j67K08R0k39J86J66k62J24K14
$$ 131 -29 64 226 -323 -21 -47 123 226 9 132 -7 -65 -232 -24 66 -173 13 179 -83 41 255
6895B55j09%k3k26K47k37j33m8J74J31j3k8P7j2j93L7J98k42J51J55j72j32J54
$$ 255 146 146 123 -103 144 -93 -226 -274 -100 31 18 -10 67 55 -138 -101 97 -145 6 161 -11 -143 11
6918A1j52l26M74J14j33L1k72J87K82l36K62o8j45M9j24P0Q2J28j65j16o8j4L38
$$ 11 -141 -467 7 121 -12 19 -253 -66 216 -120 142 74 -71 -22 -146 -76 6 134 -31 -147 -215 -229 109
6941A09k08nR6j35L29k89L26l82L65q6P2l82j36K74K10j37N1J38m9l45J23k1K93
$$ 109 -99 -104 -8 -143 186 -103 223 -159 206 120 192 -190 -326 -52 158 21 72 210 161 -184 -61 -82 211
6964B11j94K09j47RJ08l56j23K29o4j22J53j03O9M2j35K14Omj5Q6p6N3nk6k9J15
$$ 211 17 226 79 88 196 -160 -283 -54 -118 -240 -87 -190 -121 -79 -214 0 6 2 -13 73 -3 50 45 19 -10 105
6990A05l64M20l94P9j1J17j62L23L8l65N9K91l56M76K60k12l88j2J82r2q3J46
$$ 105 -259 161 -233 -154 -165 -48 -210 113 151 -214 -155 136 -220 256 516 304 -84 -96 86 -6 -89 57
7012E7N9L9j54P4J62J12l29nj73P0o5q1J18%J84n6m6j3rJ1J91r5r0p1pP6j90J48
$$ 57 116 155 1 75 237 349 20 15 -158 -88 -153 -234 -116 -116 68 12 -34 -47 -56 -45 146 51 -39 -110 -117 -41 -231 -83
7040h3L92k44n9r4L62j11j65k31L18k89L71k13K9P0k18j50O11k23j2P5j86K69
$$ -83 309 65 6 -88 274 163 -2 -233 85 -204 167 -46 -17 53 -165 -315 296 73 61 136 -50 219
7062B19k91k36M75k28J89j03j04K31l5k56k05K17j3K2P6j36K5K37l54K75o2J85
$$ 219 -72 -308 167 -61 128 25 -79 152 117 -139 -344 -127 -140 -118 -42 -178 -153 84 -270 5 -57 128
7084A28j43l1J39k16J0M0K50l69L01k92J18k15M05k75L16q5oJ13j21k35j32K17
$$ 128 -15 -46 93 -123 -113 -73 177 -192 109 -183 -65 -280 125 -150 166 81 75 188 67 -168 -300 -83
7106h3K78j94j71N3K84k45L3j54K14J92q2k16k98L28J67k24L8K15J5n6k08m5K56
$$ -83 195 1 -170 -117 167 -78 -45 -199 15 207 125 -91 -389 -61 106 -118 -80 135 150 94 -114 -159 97
7129I7j20R7R3m29K09m0P9k97L54j52L14j18jK30r3l38J89j82K8J18j04M9M7j2
$$ 97 -23 74 167 -262 -53 -93 -14 -311 43 -109 205 87 86 316 223 -115 74 -108 -80 38 -66 -17 30 18
7153A8K11j3j91J4n7j18j03J21K39M2J42j70k54J94K4j48J33OL7J19l47K74l86
$$ 18 229 216 25 39 -18 -136 -239 -118 121 163 305 135 -119 75 99 -49 84 90 127 246 -101 173 -213
7176b13K15p8p2K15j69P8M26k77o7l33L69N3q4Q4k99N22m05j50q7J41L45m93M20
$$ -213 2 -76 -148 67 -102 -24 402 125 58 -275 94 147 63 147 -152 370 -35 -185 -272 -131 214 -279 141
7199A41J81l09J63m7o32N23J80l56K3L70l80j9PjQ0o5n4J83OR2p9O5j84K8j24
$$ 141 322 13 176 129 -503 20 200 -156 -133 237 -143 -162 -155 -156 -76 -141 -195 -12 -6 86 7 72 -112 -84 -208
7224b08K91j40p0j24J37J48k5K04q7l47J26PJ57K3k48J37Q9j62J17j3j12L07n18
$$ -208 83 -57 -127 -251 -114 34 9 213 126 -221 -95 -88 69 92 -156 -19 70 -92 25 12 -100 207 -311
7247c11M21J00j40nk76J57M9N3O4k60M17k02J19l08K01M9n7j12J4l1j4j73L37
$$ -311 110 210 70 65 -211 -54 -5 48 112 -148 269 67 186 -122 79 128 71 -41 -27 -58 -72 -245 92
7270I2k03J8J31K14l1j38n8j20K18K08m35k5K57K5k34N7p4KM08j29j94O9Rn2J31
$$ 92 -111 -93 38 252 221 83 25 -95 123 331 -104 -129 128 153 -81 -24 -98 -96 312 183 -11 58 67 15 146
7295A46p6J2PL2k71K34k06l7J78J4Jj76M5j5L8M1J90k24L6n4K03k20J06K0j47
$$ 146 70 82 89 121 -150 84 -122 -159 19 33 34 -142 -97 -112 -74 -33 157 -67 -31 -85 118 -102 4 24 -123
7320a23J30j3L3k91J20K49j85N2n9J04J1j24MP8J31o5J13j09j30J69k77K9J34
$$ -123 7 -6 27 -264 -144 105 -80 -28 -87 17 28 -96 -92 -14 117 52 165 56 -74 95 -182 -153 -19
7343a9Kj00O1kJ49r4j10j02N60l81Q0j34K19q3J4k37m6L87k02j07Q3J26K00j06
$$ -19 -17 -117 -56 -58 91 -3 -113 -215 345 -36 44 -90 129 46 60 -177 -223 164 -38 -145 -62 64 264 158
7367A58k5O5k28M60j92k08M7j18K33J8q6j49j66J85j40M16k51j3J43k28k7K24
$$ 158 133 198 -30 430 238 30 77 -41 192 210 124 -25 -191 -6 -146 270 19 6 149 -79 -106 118
7389A18J31m54M07r6l09K51J45K10o93L43J41j50R9j72P8o4j35j08N54m74K46
$$ 118 249 -205 202 106 -203 48 193 403 -290 53 194 44 143 -29 49 -15 -150 -258 296 -178 68
7410F8m03L17K19l94O9M4j54N4j86J96R8J59l40L87j94KJ35l64J57J50o6M36m48
$$ 68 -335 -18 201 -193 -124 -80 -234 -180 -366 -170 -72 87 -253 134 -60 -58 77 -287 -130 20 -46 390 -58
7433e8j35Q7l3O4K19m20J21K71L0l46K05N9m1O8J38l86J02K25j84K6k28M48j37
$$ -58 -193 -106 -139 -75 144 -276 -155 116 146 -200 5 64 23 91 229 -157 -55 170 -14 12 -216 232 95
7456I5J01j42Q0l50Mn3qL89m97K87J03o3k98M25J5m30K32j6J15J90j61k18P5K17
$$ 95 196 54 134 -216 -212 -265 -273 116 -381 -94 9 -54 -352 73 88 -342 -110 -126 -11 179 18 -200 -125 92
7480I2K39j16k3j39J71l54%Q1J3n4J09j38K11j52J40j02j08J62L55R2p55N3L47
$$ 92 331 215 192 53 224 -130 -130 -49 -36 -90 19 -119 92 -60 80 -22 -130 32 387 479 -276 -223 124
7503A24o3o9n9K26j60J47kl22K14j3J5M9R3l56K28j02p9l03K82j0K72j24n7l08
$$ 124 61 -8 -67 159 -1 146 144 -178 36 23 38 87 180 -176 52 -50 -129 -432 -150 -160 112 -12 -69 -377
7527c77L33L12k84J63oj10k99P3L83o1l93K72M3l07q8M36k43j00M12k97L84l63
$$ -377 -44 268 -16 147 141 31 -268 -195 188 127 -266 6 49 -258 -346 90 -153 -253 159 -138 246 -117
7549a17qn9K66k66J13L62p8j45k88J91n5j23J04R7n4p0J77J02k63J87k32P9K48
$$ -117 -125 -184 82 -184 -71 291 213 68 -220 -29 -84 -207 -103 -6 -60 -130 47 149 -114 73 -159 -80 168
7572A68p2j17p3J80l1j3l59J33R3J96m23K42Q4K55k78pP6j97J8N8J48J36N9m79
$$ 168 96 -21 -94 86 55 42 -317 -184 -91 105 -318 -76 8 263 -15 -22 54 -143 -125 -67 81 217 276 -203
7596b03J88o1Q3p9J10L4j47J25p0J7k14K27N3N2n0O5J71l16J13r8R6R7k47j26
$$ -203 -15 -76 7 -72 38 72 -75 50 -20 -3 -217 10 63 115 65 130 301 -15 98 0 96 193 -54 -180
7620a80J9M25j99j63j6J64Kj18k56K72K81O9l29Kn8M0R3p8J79k60lR3K40l62O
$$ -180 -161 264 65 -98 -114 50 52 -66 -322 -50 231 300 -29 -27 -85 -45 48 -30 149 -111 -114 -21 219 -143 -137
7645a37J33J29P8j21l83M72j63k92J41J01O1l31K93J9O5m2o4k42K45j94J12J31
$$ -137 -4 125 203 82 -301 171 8 -284 -143 -42 19 -312 -19 0 65 23 -41 -283 -38 -232 -120 11
7667A1J3R5NK07n02k38L11J59m1n8J18j6l94K81J07Ol20K53R2j40K14k37k75N92
$$ 11 24 119 124 331 -171 -409 -98 61 20 -38 80 64 -330 -49 58 64 -256 -3 89 -51 163 -74 -349 243
7691B43k84L12m80J15K2K21k67J7L72k70O6M2p5r1K24k0l82M92K2p1l41O1J16
$$ 243 -41 271 -209 -94 -72 149 -118 -101 271 1 67 109 34 -57 167 147 -235 257 279 208 -133 -72 44
7714D4j80L14k96K88L3l83L09R7j62j77K00K3j4l39K65o7O4k18p3K09J75j29j78
$$ 44 -136 178 -118 170 203 -180 129 226 64 -113 87 110 96 -243 22 -45 19 -199 -272 -63 112 -17 -195
7737a95J62N2j40O2J24j77K32j12m5K87k97Q5K8j85K2J30p0m1L1J11m5K7M7m23
$$ -195 -33 19 -121 -59 65 -112 120 8 -37 250 -47 38 66 -119 -97 33 -37 -78 -47 64 19 46 93 -330
7761c30K67K23J38k90Kl23p2M79k1j33k48L28Q2Q6j8j46O3j50O7L13j20k05k36
$$ -330 -63 160 298 8 10 -313 -385 94 73 -60 -308 20 102 188 170 24 87 -63 4 317 197 -8 -244
7784b44K23j3R5j78M25j84j89J06k8K64l18K42j81j67J34l6K22l91K38J4J78j3
$$ -244 -21 -34 61 -117 308 124 -65 41 13 277 -41 201 20 -147 -13 -49 173 -218 20 34 212 199
7806A99m56J8K78l1l6K63j59j92K00j41p9O66o96J32J09j43J32j68J15j42K01
$$ 199 -257 -239 39 8 -28 235 76 -116 84 -57 -136 530 -166 -34 75 -68 64 -104 11 -131 70
7827G0K11l20K17j50nQ4lm6l34M89k37K03k90k4P2R5JJ36k62J7J17J48l30J04
$$ 70 281 -39 178 28 23 107 104 58 -276 213 -24 179 -111 -135 -63 32 33 169 -93 -76 41 189 -141 -37
7851c7j73M72j36n11L91j88K94J2k22K24J5m26K51J27k37K50k0N4l6K38k07o0
$$ -37 -210 262 126 -385 6 -182 112 124 -98 126 141 -285 -34 93 -144 106 86 140 104 342 135 75
7873G5j32o6K53K6j32K1k01nM82p77N96j84R4K9J08j70j97J12p3K30r1J8o6J55
$$ 75 -57 -123 130 156 24 45 -156 -161 321 -456 140 -44 50 79 187 17 -180 -68 -141 89 -2 16 -50 105
7897A05r5K5n8j06J49o8M4J8l22K29J42J23j63Lj38J0J29l3j5J02j7l47j76K74
$$ 105 10 35 -23 -129 20 -48 -4 14 -308 -79 63 186 23 26 -112 -102 27 -6 -21 81 64 -283 -459 -185
7921a85J54m6l4J02k74K44m3J52k55K63k51J29m0oJ64J20j69k98L52k82nK53k99
$$ -185 -31 -77 -111 -9 -283 -39 -82 70 -185 78 -173 -44 -84 -90 74 194 25 -273 79 -203 -208 45 -254
7944b54L83o5R4j55nj1J1oJ72o4j21J41k35Q8P9P2mj09J39k19Q3q8L60k48NK7
$$ -254 129 64 158 3 -2 -13 -2 -8 164 100 -21 120 -115 -27 52 124 120 11 150 -69 14 -74 286 38 43 70
7970G0K6L9j66J89j82lj45J74J89o3k12J91L2l28K70l12K70MP6k99L25k85l13
$$ 70 96 135 -31 158 -24 -27 -172 2 191 128 -84 107 139 -189 81 -231 39 43 119 -180 145 -140 -453
7993d53P56l31l39N35l90n4K22J35j21j39j26N90n6j80j6k07J65J16n7j68K73
$$ -453 303 -28 -367 168 -222 -276 -54 81 -40 -179 -305 285 229 49 33 -174 -9 107 50 -118 155
8014A55k18K69l90K40j18J98o4k93J47p6M6L65l25O4J7j39J68Jj53L40k11j58
$$ 155 -63 206 -184 56 -62 136 72 -221 -74 -150 -104 261 -64 0 17 -122 46 47 -106 234 23 -135
8036a35L87n4Lk80N6J26pJ35j26j50j31J62pJ05k8QROr3j55L24J83o3j78l0k8
$$ -135 252 198 201 -79 -23 103 96 231 105 -45 -176 -14 -21 84 56 64 73 79 -14 -169 155 338 275 97 67 39
8062C9J27k81Q1l28L39l5j46j6J49J96k05j86L16J08j36j96L82o57M36r5l1K11
$$ 39 166 -115 -34 -362 -23 -58 -204 -220 -71 125 -80 -266 50 158 22 -174 208 -449 -13 -108 -139 72
8084G2m4Q1j78J05l4K7K87l91L10k2K59m75jj1l4j39K37l8j03K9R0j95N7J38q5
$$ 72 28 109 -69 36 2 29 316 -75 235 213 472 -3 -4 -15 -49 -188 49 11 -92 -63 27 -168 -111 27 -58
8109e8K99k50l6O3k4N9J76q3k56L2L24k11J19m41L44m0j37J06j56L79j81kk86
$$ -58 241 -9 -45 18 -6 53 229 146 -110 -78 246 35 154 -287 57 17 -120 -14 -170 209 28 26 -260
8132b60L26Jn8k48L77p3k44J65k19J24J90l83K63k64K15k1j9R6mM7N0r4K6k48
$$ -260 66 67 9 -239 138 65 -179 -14 -233 -109 81 -302 -39 -303 -88 -109 -128 -32 -36 11 61 -33 -7 -255
8156b55L15j27L21j25j4l61J84P7mQ9k77K3J45m5j02M08l39J11o1k02J07J15N5
$$ -255 60 -67 254 129 115 -246 -62 15 11 100 -177 -154 -9 -54 -156 252 -87 24 -37 -239 -132 -17 38
8179C8J0j23O4J32k26M31j52q4k5j24R8j66
$$ 38 48 -75 -11 121 -105 326 174 90 65 -59 39 -127
8191a27
$$ Imaginary data points
##PAGE= N=2
##DATA TABLE= (X++(I..I)), XYDATA
0@%%%%%%qJ6j6J6k4L2l5M3n6P0q0R2j10J31j53J77k05K36k71L09l52M02m55N14
$$ 0 0 0 0 0 0 0 -8 8 -8 8 -16 16 -19 24 -32 38 -42 50 -60 71 -82 95 -110 126 -145 164 -188 214 -241 273
30B73n80O51p28Q12r05J010j123J245j382J532j695J876k078K300k546K826l143
$$ 273 -307 344 -384 428 -477 533 -590 655 -727 805 -890 986 -1092 1208 -1338 1488 -1655
47a655L502l918M403m976N667o517P598r025J0992j3892J8602k7511N0044k06662
$$ -1655 1847 -2071 2332 -2644 3023 -3494 4104 -4921 6071 -7821 10781 -16730 33314 -173348
61a73348m34869M77066M30393k31955l77007J58673L17445n4082k62515K4016
$$ -173348 -608217 -131151 299242 67287 -309720 -151047 166398 112316 -150199 -126183
71a26183K08635J2408j75095k9162J02561P029p3583L5346R5485q722j12294l3578
$$ -126183 82452 94860 -80235 -109397 -6836 193 -73390 -38044 57441 48719 -63575 -97153
83i7153J14757Q7566j07931j15595J12665J51681j08940j82277P3224J83992k9589
$$ -97153 17604 105170 -2761 -118356 -5691 145990 37050 -145227 -72003 111989 82400
94H2400j43865K2195J10122n4569j24059P8279J69809o5257k00206K0336J73514
$$ 82400 -61465 -39270 70852 16283 -107776 -29497 140312 75055 -125151 -104815 68699
105F8699j226j24330J0429R1846k3547q6461R302Q3334K9361n8979n8844K0116
$$ 68699 67473 -56857 -46428 45418 21871 -64590 -55288 28046 57407 -1572 -60416 -40300
117d0300N8163J3855l6858k9306J4359L4573m235l4047J2776L9618k7333m7997
$$ -40300 17863 31718 -5140 -34446 -20087 14486 10251 -23796 -11020 28598 1265 -46732
129d6732M0635M8990n1309m9158M8866M0181m5078l2300L8175K5324l7076l1628
$$ -46732 -6097 42893 -8416 -57574 -8708 31473 -13605 -45905 -7730 17594 -19482 -51110
141e1110L5118M3708k5017n5937l049M1737L4628j317n0461m5848M8787P9970
$$ -51110 -15992 27716 2699 -53238 -56287 -14550 20078 18761 -31700 -77548 -28761 51209
153E1209l8247q6487M7086R6754n1739j17451L6060J40314J4652j30974o4155
$$ 51209 12962 -73525 -26439 70315 18576 -98875 -62815 77499 92151 -38823 -102978
164a02978R3864Q9138m1880p2382Q562M3325J0621j6056k6244q673L6065K7445
$$ -102978 -9114 80024 38144 -34238 -25676 17649 28270 12214 -14030 -22703 13362 40807
176D0807l6355l9832K0151L2628l679j8201r801M126J8758M033l1632k4369L0485
$$ 40807 4452 -35380 -15229 17399 13720 -4481 -14282 -10156 8602 12635 -18997 -43366 -12881
189a2881M7534j4529o6965j1375P1976K5603p0759k0745Q1871J6957r8027k9026
$$ -12881 34653 20124 -46841 -58216 13760 39363 -31396 -52141 29730 46687 -51340 -80366
201h0366R9305N2800p4848o6284M0232O2869j3434m7678Q272L7821r198k9805
$$ -80366 18939 71739 -3109 -69393 -29161 33708 20274 -27404 -19132 18689 9491 -20314
213b0314R564K1338p759j2957N079Q582r98j2350o675K2697J8042l1453k5971
$$ -20314 -10750 10588 2829 -10128 -5049 3533 2535 -9815 -16490 6207 24249 -7204 -33175
226c3175L8986L1486m2313l9650L7847M8268k5247n3308J1534N2798l509m7467
$$ -33175 5811 37297 -5016 -44666 -6819 41449 16202 -37106 -25572 27226 23717 -23750
238b3750Q797M6937j6440m9735J8056M9444j1307m2365J30K9169P399j7335r838
$$ -23750 -14953 31984 15544 -34191 -16135 33309 22002 -20363 -20233 8936 16335 -1000 -10838
251a0838J2580J1160j1910j0359R873N374p671l7L847o051n438O336J1233K217
$$ -10838 1742 12902 992 -9367 506 5880 -1791 -1828 2019 -4032 -9470 -3134 8099 10316
265A0316j9102j7518K7116L7000l0110n4795K3107O5936q879o8278j0825O3588
$$ 10316 -8786 -26304 812 37812 7702 -47093 -23986 41950 33071 -35207 -46032 17556
277A7556L1429n2755m7061M0854N7960k4654n9207O449M9328J2174l1765k7735
$$ 17556 48985 -3770 -50831 -9977 47983 23329 -35878 -29429 19899 32073 308 -27427
289b7427J0495L5570Q695l3418j9966K3841K4799q622k2107q344J4113J8732n322
$$ -27427 -16932 18638 27333 -6085 -26051 -2210 22589 13967 -8140 -16484 -2371 16361 11039
302A1039k2687l244J8523J1582q371j8638m304K4519J7895k5078k7590J8656K8135
$$ 11039 -11648 -14892 3631 15213 6842 -11796 -16100 8419 26314 1236 -26354 -7698 20437
315B0437r353k2869p21J6490Q851j1077j4155Q445J7980m997j6375K65J0005L455
$$ 20437 11084 -11785 -12506 3984 12835 1758 -12397 -3952 14028 9031 -7344 -7079 2926 6381
329F381m003p818R57J1886j82j5165J675J6536k187j3343J981Q788j349p288k091
$$ 6381 2378 -5440 -4483 7403 7221 -7944 -6269 10267 8080 -5263 -3282 5506 4157 -3131 -5222
344e222O442O719p273r790P174J0019o488n672O072k08n931K870M507l754n190
$$ -5222 1220 7939 666 -9124 -1950 8069 1581 -4091 1981 1773 -4158 -1288 3219 -535 -5725
359e725j82Q113P091j1958j5650J5224K4353j3638l0352N600L1997O175k9153
$$ -5725 -5907 2206 9297 -2661 -18311 -3087 21266 7628 -22724 -17124 14873 21048 -8105
372h105k0497K2411L2284j4367l7321O266L7000L448k9922j2013J8503J7889o273
$$ -8105 -28602 -6191 26093 11726 -25595 -19329 17671 21119 -8803 -20816 -2313 15576 9303
385I303k0358l511J8116P828j1069p180L367N044O673j040j5113m551J9018J1554
$$ 9303 -11055 -14566 3550 11378 309 -6871 -3504 1540 8213 7173 -7940 -12491 6527 18081
399A8081j6300j8894O185K4165P426k5774j8231K4590K6316j9213l0854R235L0309
$$ 18081 1781 -17113 -10928 13237 20663 -5111 -23342 1248 27564 8351 -22503 -13268 17041
412A7041L061k6516j5704J7694K2914j0895k3559O023K0536l187j6263p07R504
$$ 17041 20102 -6414 -22118 -4424 18490 7595 -15964 -9941 10595 7408 -8855 -9562 -58
425e8M933n413q262Q91P884j010n922L550L954l762p41K532l069n45O060J568
$$ -58 4875 -538 -8800 -7909 -25 -1035 -6957 -3407 547 -3215 -3956 -1424 -4493 -5038 1022 2590
441B590n889m075J884P549M860q790p830J1187J0600j0934j1606Q763J3096l122
$$ 2590 -3299 -7374 -5490 2059 6919 -1871 -9701 1486 12086 1152 -10454 -1691 11405 8283
455H283j2575m830J1449J0425j0160j2688R541J2962p516j2475K542J1290L322
$$ 8283 -4292 -9122 2327 12752 2592 -10096 -555 12407 4891 -7584 -5042 6248 9570
468I570r623j1342O613J4451l897j4679J868J1625Q38o311l858R94N676L760n775
$$ 9570 -53 -11395 -4782 9669 5772 -8907 -7039 4586 5424 -887 -4745 -3751 1925 5685 -90
483i0p036R35O641O573k830j3146k104J7417O969j8045q894J4155J1422r727j4945
$$ -90 -7126 -6191 450 7023 4193 -8953 -11057 6360 13329 -4716 -13610 545 11967 2240 -12705
498a2705J743J7110O840j6837j4090J3751J7143p657j7018K37J6086O963j4200
$$ -12705 -10962 6148 12988 -3849 -17939 -4188 12955 5298 -11720 -11483 4603 11566 -2634
511b634j4736J0578J8174m490j5726P80R617J793j429j369l220K885O798k232
$$ -2634 -17370 -6792 11382 6892 -8834 -8054 1563 3356 1927 558 -2662 223 7021 4789
525D789r531j681J1008Q958p005j5072K106J7103J697j3493k459R104J542o034
$$ 4789 -4742 -6423 4585 13543 6538 -8534 -6428 10675 12372 -1121 -3580 5524 7066 1032
539A032m100O99O830M349r694r027Q240J0720o496j0930K478J0865J037j1986
$$ 1032 -3068 -2369 4461 8810 -884 -9911 -1671 9049 2553 -8377 -5899 4966 6003 -5983
553e983o062J0037P809p374m792M888L77k962L079J611l578K559N296o625p843
$$ -5983 -12045 -2008 5801 -1573 -6365 -1477 -1100 -4062 -983 628 -2950 -391 4905 -1720 -9563
568i563P234J0314k028j0037l056Q758M902n094l739M411J525l719m20J98o49
$$ -9563 -2329 7985 5957 -4080 -7136 1622 6524 1430 -2309 2102 3627 -92 -512 -314 -963
583i63M909K208j1277m182J4393P963j4454j0824J0576J2574n028j2518n96R345
$$ -963 3946 6154 -5123 -9305 5088 13051 -1403 -12227 -1651 10923 5895 -6623 -7219 2126
597B126L265n805k877K942J548J620n20o138L55J2532K25j7367l017J7148O464
$$ 2126 5391 -414 -3291 -349 1199 2819 2299 -3839 -3484 9048 9273 -8094 -11111 6037 12501
612A2501j2183q361M393P096J636l117l020j667J120L939O4o696l57J0008j288
$$ 12501 318 -8043 -3650 3446 5082 1965 -1055 -2722 -1602 2337 2401 -4295 -4652 5356 4068
627D068j6089J529J9213K318j8109n480J1452O769l358n276k489J636M379J427
$$ 4068 -12021 -10492 8721 11039 -7070 -12550 -1098 5671 2313 -2963 -5452 -3816 563 1990
641A990l423l241M581N368m968p595P112J1222q237j4103P978J3495m419r133
$$ 1990 -1433 -4674 -93 5275 307 -7288 -176 11046 2809 -11294 -3316 10179 5760 -3373
655c373R56K153l23M367L091n959o436M618O085l320n297M973N041r587q344J1241
$$ -3373 -2417 -264 -587 3780 6871 912 -5524 -906 5179 1859 -3438 1535 6576 -3011 -11355 -114
671a14J1858r052j1150L902O019j83J078r54o621k7Q168N1p500P17P878j291r271
$$ -114 11744 2692 -8458 -4556 1463 1280 2358 1404 -5217 -5244 2924 2975 -4525 -3808 4070 2779 -6492
688f492R97J2808J398j4875m787J2830N955p235l071M86k859L020Q870k456j0691
$$ -6492 -5495 7313 8711 -6164 -10951 1879 7834 599 -2472 -1986 -4845 -1825 7045 4589 -6102
703f102K344Q291k567p554M267Q572m845j1190J386J3151K040r196l531K586J237
$$ -6102 -3758 4533 1966 -5588 -1321 7251 2406 -8784 -7398 5753 7793 -1403 -4934 -2348 -1111
718a111L983M297p889q693Q059R081o826p061O852N363p789n181Q151P854o033
$$ -1111 2872 7169 -720 -9413 -1354 7727 901 -6160 692 6055 -1734 -6915 1236 9090 3057
733C057r236J504O643J367j086k23o213k854J0076O194j0248n965Q826K821q727
$$ 3057 -6179 -4675 1968 3335 2249 2026 -4187 -7041 3035 9229 -1019 -6984 1842 4663 -4064
748d064q85R541J250r751l268O302N119j202l187k174k322L092Q320q25j2071
$$ -4064 -4949 4592 5842 -3909 -7177 -875 4244 3042 -145 -2319 -4641 -1549 6771 5946 -6125
763f125j684J1948J929j0186L22R105l346q144L566P141m30m484k196M5J069M402
$$ -6125 -7809 4139 6068 -4118 -3796 5309 1963 -6181 -2615 4526 4096 -388 -2584 -2539 -1470 2932
779B932K965n602q247M268J0538j675r955K469P421n010n598O229M987n290m717
$$ 2932 5897 295 -7952 -3684 6854 5179 -4776 -2307 5114 104 -5494 735 5722 432 -4285
794d285K299J805J064K246j094n802j322P829M905o972p697N372P084n240m564
$$ -4285 -1986 -181 883 3129 2035 -3767 -5089 2740 7645 673 -7024 -1652 5432 192 -4372
809d372O320K726p473j717O064J934k093k96k969k614L781P195j820r549j553
$$ -4372 1948 4674 -2799 -4516 1548 3482 1389 1093 -1876 -4490 -709 6486 4666 -4883 -6436
824f436Q560L627o530l144O093J286o242r4N899j14m426P49j48j617L957M327
$$ -6436 2124 5751 -779 -3923 2170 3456 -2786 -2880 3019 2905 -1521 -772 -920 -2537 1420 5747
840E747o054o063M379P985j624p608n70N623N85m333K00M348j597l716J736J154
$$ 5747 -307 -6370 -1991 5994 4370 -3238 -3808 1815 2400 -1933 -1733 2615 1018 -2698 -962 192
856A92j39K010R25n812k841P487M700o389o180L855N484j270l879P45L026j457
$$ 192 53 2063 2988 -2824 -5665 1822 6522 133 -6047 -2192 3292 2022 -1857 -1112 1914 457
872D57k448J852J694j616rO53l685N24O628M77p548k039O737K700l910k983K262
$$ 457 -1991 -139 1555 -61 -70 583 -3102 -2578 4050 4527 -3021 -5060 1677 4377 467 -2516 -254
889b54J458j196j181Q07J121n07l53qj100R17M085k356n942J752P306r14p007
$$ -254 1204 8 -1173 -366 755 248 -105 -113 -1213 -296 3789 1433 -4509 -2757 4549 3635 -3372
906c372k09M521R52j744r38J15J063J45p79l98l7J519Q53k911k907L422N458l265
$$ -3372 -3581 940 1892 148 -790 -675 388 533 -246 -644 -681 838 1691 -1220 -4127 -705 4753 1488
924A488o197K376N202j056k938n39J270J010M7q81j538J414K076r89k389l83L502
$$ 1488 -4709 -2333 2869 1813 -1125 -1664 -394 616 663 -218 -1756 -342 1734 745 -1644 -2027 1475
941A475J974m016l599L898M226k911l749J397J750L18o7j259j042J731J885k041
$$ 1475 3449 -567 -4166 -268 3958 1047 -2702 -1305 445 763 696 -563 -1605 126 2011 -30
957c0j834J712K210q86l447o51L692K023l120k737K783K457j696r18n16L42J314
$$ -30 -1864 -152 2058 1172 -2275 -2926 766 2789 -331 -3068 -285 2172 476 -442 -958 -616 698
974F98M07k612o87L064Q49k192k035K273K622m95l463r22L300J629k599k155J569
$$ 698 1105 -1507 -2194 870 1719 -473 -2508 -235 2387 1892 -1571 -2493 807 2436 -163 -2318 -749
991g49J277J65k11k095L55L052K34l479j91K041J456j360k445O15K488O69k722
$$ -749 528 693 482 -1613 -1258 1794 2028 -1451 -1642 399 1855 495 -1950 -1335 1153 1822 -900
1008i00j476K419J654j049j154m40Q15J543q70k744P90L174l40k354n99J961J161
$$ -900 -2376 43 1697 648 -506 -946 -131 1412 542 -2202 -1412 1762 1422 -932 -1531 430 1591
1025A591o26k036o16K614P86k174q76J167J148O9r33k041J824K388j182k537O47
$$ 1591 965 -1071 -1687 927 1713 -461 -1337 -170 978 1047 114 -1927 -103 2285 1103 -1434 -787
1042g87K235J46j835q75N77J950J06k761l67K617J010j482j236K03J201J337j918
$$ -787 1448 1594 -241 -1116 -539 1411 1517 -1244 -1611 1006 2016 534 -702 -499 702 2039 121
1059A21j692J394K011q24k133L23J379Q41l73k018L30K188K06k221j047K085P56
$$ 121 -1571 -177 1834 1010 -1123 -800 579 1420 1047 -971 -641 1547 1753 -468 -1515 570 1326
1076A326m67j509p35J732K042j964j851J002J796k48j163j084J003J573l46k389
$$ 1326 859 -650 -1385 347 2389 425 -1426 -424 1372 1124 -39 -1123 -120 1453 1107 -1282
1092a282j42K467N34j507j193P00J604L55j712j347J620J549r01j913Q07J129
$$ -1282 -1424 1043 1577 70 -1123 -423 1181 1536 -176 -1523 97 1646 745 -1168 -361 768
1108G68O91r41j218K82J998p4k303M9J366Q64p33j231k48J816J005j865j550J750
$$ 768 1459 518 -700 -418 1580 1506 -797 -748 618 1482 749 -482 -730 1086 2091 226 -1324 426
1126D26J462j174o39o34O89J351p95j968P71K273n82j809j26R74J092l81j787
$$ 426 1888 714 75 -559 130 1481 686 -1282 -511 1762 1180 -629 -755 219 1311 930 -857
1143h57j46J587Q68j604p68P79J034K46j080r97R00J932q56j891lJ688L12j139
$$ -857 -1003 584 1452 -152 -920 -141 893 1139 59 -938 -38 1894 1038 -853 -856 832 1144 5
1161Er38M35J891j5j588p79J547P31r68o99l80R36R02j032j210R13J763q80j362
$$ 5 -933 -498 1393 1378 -210 -989 558 1289 321 -378 -758 178 1080 48 -1162 -249 1514 634 -728
1180g28J68J067Q36q59j103k37J583M21j650k26Q31P76o3q50j078J439J291j091
$$ -728 -560 507 1343 484 -619 -856 727 1148 -502 -728 103 879 816 -34 -1112 327 1618 527
1198E27k060J460J382p81j344J96M40J092j76j121n78J342N28q10m15o37J124
$$ 527 -1533 -73 1309 528 -816 -620 -180 912 736 -385 -963 379 907 97 -318 -955 169
1215A69Q72j696j100J901J457k013p91J005R96l4m61r06m2J007Q02j452p65Q17
$$ 169 1041 -655 -1755 146 1603 -410 -1201 -196 800 766 305 -601 -643 364 1166 -286 -1051 -234
1233b34J076j4j458J09J517K29j983p33K258L53j168m05KK37N72N22j403l48J175
$$ -234 842 828 -630 -521 996 1225 -758 -1491 767 1120 -48 -453 -451 -214 358 880 -523 -871 304
1252C04R68j025j557R08J345m41j856O40J552pj509j13J113j0rJ28j749K17J659
$$ 304 1272 247 -1310 -402 943 502 -1354 -714 838 831 -678 -791 322 312 303 431 -1318 -1101 558
1271E58P41j697j411J805R80j115r81J357R19j241r68L18J782n40p83J9q55N29
$$ 558 1299 -398 -1809 -4 976 -139 -1120 237 1156 -85 -1053 -735 1047 507 -276 -257 -1112 -583
1289e83J895j45k455J15K010N16j981q5J255R6j571l23J335J045j101o75M31J49
$$ -583 1312 1167 -1288 -1173 837 1353 -628 -713 542 638 -933 -1256 79 1124 23 -652 -221 -72
1307g2K24J189j068j964N20K607o46k201M04J618n14o98J15J153m17j093k2Q58
$$ -72 152 1341 273 -1691 -1171 1436 790 -1411 -1007 611 97 -601 -486 667 250 -843 -865 -7
1325gL22q8K3r41r80J395K255j585k370J369K159j082j090Q36Q42j427n17O24
$$ -7 315 227 250 -691 -1671 -276 1979 394 -1976 -607 1552 470 -620 216 1058 -369 -886 -262
1343b62P77l07k62l2o30M56J430O12k294j465K212J597k014j216J855K70j177
$$ -262 515 208 -54 -86 -716 -260 1170 1782 -512 -1977 235 1832 -182 -1398 457 727 -450
1360d50m70J861n89o84K66l31L11J35P62q09j772J78K735P35k847n92K023K55
$$ -450 -920 941 352 -332 -66 -397 -86 49 811 2 -1770 -1592 1143 1878 -969 -1561 462 717
1378G17j538N48J070p16r06N10N49l69M17K20j244q21J396J872r73k281Q3K424
$$ 717 -821 -273 797 81 -825 -315 234 -135 282 502 -742 -1563 -167 1705 732 -1549 -1466 958
1396I58K76j929N75P83q66o47J279L12r71K76M41r76l28J915M26k207j282J608
$$ 958 1234 -695 -120 663 -203 -850 429 741 -230 46 487 -489 -817 1098 1524 -683 -1965 -357
1414c57K272r09j684M93P89p04j23J367n44j161rJ263p43k02Q68k22j882J74K220
$$ -357 1915 1006 -678 -185 604 -100 -223 1144 600 -561 -570 693 -50 -252 616 394 -1488 -1314 906
1433I06Q17j905j660J607R14q57k38Q39o86n93M90J203j040k19Q63m82j377J155
$$ 906 1723 -182 -1842 -235 679 -178 -416 423 -263 -856 -366 837 -203 -422 441 -41 -1418 -263
1451b63J866q40k604N37K020K48r54k63KK09m60J020J92j019m37R26k79o18J155
$$ -263 1603 763 -1841 -1304 716 964 10 -253 -251 -42 -502 518 710 -309 -746 180 -99 -717 438
1470D38J092j851j637J868K065j166j551O13K92o8J78L41l76o62K69Q00k26r68
$$ 438 1530 -321 -1958 -90 1975 809 -742 -129 163 95 273 614 238 -424 -155 645 419 -549
1488e49Q81O31j628q49K287R46k235q15J062N60k08K17j78p55k53J381K98j291
$$ -549 332 963 -665 -1514 773 1719 -516 -1331 -269 291 83 300 122 -633 -886 495 793 -498
1506d98Q4L59K25j227K61K348o94k020k62J971L94p73k76J21q60R09O98l39j142
$$ -498 -414 -55 170 -1057 -796 1552 858 -1162 -1424 547 941 168 -108 13 -847 62 760 421 -721
1525g21J86R39l32n41N55R15o31j667Q30J630m54j176o6P23n39P30Q6o55m83P77
$$ -721 -535 404 72 -469 86 1001 370 -1297 -467 1163 709 -467 -533 190 -349 381 467 -188 -671 106
1545A06M10m11q53J019L32o33q93J103O44o98j371P78J018m21j68N3n15q0J055
$$ 106 516 105 -748 271 603 -30 -923 180 824 126 -1245 -467 551 130 -38 15 -500 -580 475
1564D75K07j009m29J072K99j243o1R43N90j053r55J036P73n10q97M06J27J23N57
$$ 475 682 -327 -756 316 615 -628 -689 254 844 -209 -1164 -128 645 135 -762 -356 -229 -106 451
1583D51j7j145J03J050o1r55K22P98K1j058R2P14K54l59k86K88J27Q7M9m69k85
$$ 451 434 -711 -608 442 381 -574 -352 446 467 -591 -499 215 469 110 -176 112 239 326 375 -94 -379
1604c79M93J018p53q70J22J416q00r18N20O72j99m04l79J088l88k09m8l66Q2M59
$$ -379 114 1132 379 -491 -369 1047 247 -671 -151 521 322 -82 -461 627 239 30 -18 -384 -302 157
1624A57N64p94q82P21R52r21n62P18K47k16n59R6L33M06k93k50qJ73M93k42n21
$$ 157 721 -73 -955 -234 718 -203 -765 -47 200 -16 -575 -479 -146 260 -33 -283 -291 -118 375 133 -388
1645c88j39R65K53r32n35J216j14p59K21J22K5k15L89n66N41L89l49l88k94M72
$$ -388 -527 438 691 -241 -776 440 326 -433 -212 -90 -65 -280 109 -457 84 473 124 -264 -558 -86
1665h6K74J60p59m1O37O17j096p7R07k99j44l99J26K96L50l17n58L85P25k22p89
$$ -86 188 348 -411 -452 185 802 -294 -371 536 237 93 -306 -180 116 466 149 -409 -24 701 479 -310
1686c10j1j37J027j15r55K34N59j3k43k63L33K64k38o0k16mO14m48l50J25K36
$$ -310 -321 -458 569 454 -501 -267 292 279 36 -227 106 370 132 72 -144 -148 466 18 -332 -207 29
1707B9L92m95k78J83O04l22n52J18O58jl60j70J10K24J37m22k85N12L49k31l25
$$ 29 421 -74 -352 -169 435 113 -439 -321 337 336 -24 -194 -84 140 277 -145 -430 82 431 200 -125
1728a25q4L55L95n17n10M01L64j2l51P5K26ok17j31j05L62N73o44q14R29O3N0
$$ -125 -209 146 541 24 -486 -85 279 267 -84 -9 217 211 -6 -137 -242 120 693 49 -765 164 227 277
1750B77l78l98M20L23K68p79O8L13J10l00k86J04K37K83o49J89M19nk48Jj29L15
$$ 277 -101 -499 -79 244 512 -267 -199 114 224 -76 -362 -258 -21 262 -387 -198 221 216 -32 -31 -160 155
1772A55K64m49k66K40L05k20n75J40M49K47j95K9p18Q39K16o84k9M47o6r1m9m78
$$ 155 419 -30 -296 -56 249 29 -546 -406 43 290 95 124 -594 245 461 -223 -252 195 129 38 -11 -489
1794d89L76L61m62j63J84O49q8m43m89L56J85J08l70k05O44L00k02o04L79J02
$$ -489 -113 248 -214 -377 -193 456 368 -75 -564 -208 -23 85 -285 -490 154 454 252 -352 27 129
1814A29Q1N2k89l1L66j45o27J47L37K33l63j35K39N87k52m49j06L81M78o38l60
$$ 129 210 262 -27 -58 308 163 -464 -317 20 253 -110 -245 -6 581 329 -120 -226 155 633 -5 -365
1835c65J17L58Q1n0m78K95P66o55j7m62N00J38k93k82J10N78j60k98q1J91K92
$$ -365 -248 110 191 141 -337 -42 724 69 52 -410 90 228 -65 -347 -237 341 181 -117 -198 -7 285
1856B85r3j8m95J28Q34o75m49K90N07j18p0m92L23L96k24n93K85N81j77k92j60
$$ 285 192 174 -321 -193 641 -34 -483 -193 314 196 126 -366 -43 353 129 -464 -179 402 225 -67 -227
1877b27k27P30K59o76k92L77M73l50m96L5N11j17rk23L63J72l21j14r4L75K05
$$ -227 -454 276 535 -141 -433 -56 417 67 -429 -394 117 0 -9 -232 131 303 -18 -132 -226 149 354
1898C54o7m20k37M73L68m68m06M90K00k30k57P1K06M73k99m78j64L18J34k78l48
$$ 354 287 -133 -370 103 471 3 -403 87 287 57 -200 -129 77 550 251 -227 -391 -73 61 -217 -565
1919e65L75M32J80j033R5N65N88q72k27M92j26L45m80j35J11L15K28o91p3M88
$$ -565 -190 242 422 -611 -516 49 637 -235 -462 30 -96 249 -231 -366 -255 60 288 -403 -476 12
1939A2M04m45n87M48P23k30q18J34M89M7k23J09K5m37N00k33m65N10K86L06o71
$$ 12 416 -29 -616 -168 555 325 -493 -359 130 177 -46 63 88 -349 151 -82 -547 -37 249 555 -116
1960a16j58J39N77qr17J10Q50no22L36K63o38K63N6l45M40K7k0n09L4N57M70r88
$$ -116 -274 -135 442 434 -483 -373 477 472 -150 186 449 -189 74 130 -215 225 252 232 -277 -243 314 784 -204
1983b04k75Q73K24m47m37M09J31m66O05n6n03MK12j63l98L94N62k72q31K09R61
$$ -204 -479 394 618 171 -266 143 274 -192 413 357 -146 -142 70 -93 -491 -97 465 193 -638 -429 532
2004E32k75n81q7O75k22m0J33P6l73j22O03j52n32J87N24m75m31N80P91p92o88
$$ 532 257 -324 -411 264 42 2 135 211 -162 -284 319 167 -365 -178 346 -129 -560 20 811 19 -669
2025f69P06K84K00l57m22M85j90k20L90K03r58N92O64q42k22N32M46o80q70J080
$$ -669 37 321 521 164 -258 227 37 -183 207 410 -548 44 708 -134 -356 176 622 -58 -928 152
2045A52L92l93j92j51l9K18M81j11k22p58M47P45j047m2R18N2j124j29J160J39
$$ 152 544 151 -41 -192 -231 -13 468 357 135 -623 -176 569 -478 -520 398 450 -674 -803 357 496
2065D96p19l19K48J82L79j30j75k33QJ96O15q51j34P61l38o64O23R40m56j154
$$ 496 -223 -542 -294 -112 267 137 -38 -271 -263 -67 548 -303 -437 324 -14 -678 -55 885 429 -725
2085g25L81N97P9k09o5m50J42M05O12l44q86M74K72l16m22N80M64p61n23N30O15
$$ -725 -344 253 332 123 58 -392 -250 155 767 423 -463 11 283 -33 -455 125 589 -172 -695 -165 450
2106D50j82o70N47r6j66M04L10r72k60Q06K62k13n49M72J13o31j32Q89J58o66
$$ 450 268 -402 145 49 -117 287 597 -375 -635 171 433 220 -329 143 256 -375 -507 382 540 -126
2126a26m91M10M10l57M22J15j074j4J366l34o48J80M09k77m87L23N49l8p79j15
$$ -126 -617 -207 203 -154 268 383 -691 -705 661 327 -321 -141 268 -9 -496 -173 376 338 -441 -556
2146e56R83k7n11L26l90k51L53R27o98q53L30P14m43j82K80K43K0p98O66K86k29
$$ -556 427 400 -111 215 -175 -426 -73 854 156 -697 -367 347 -96 -278 2 245 265 -533 133 419 190
2167A90j35p2l03L2M70K08m80p83J171M30n47n24K81M76p59M6M90Q3n39O7k8K79
$$ 190 55 -17 -320 -288 182 390 -90 -873 298 728 181 -343 -62 414 -345 -299 191 274 -265 -198 -226 53
2189E3j77M24l11l88K65N15L5o00l72Q21K1j22k39N05l69k75J41K23J35j0l57
$$ 53 -124 300 -11 -399 -134 381 416 -184 -556 265 286 164 -75 430 61 -214 -73 150 285 275 -82
2210h2L01l76M06J28j8q72J18O71k30j20j03N18n26j96L10K13j66j90P2k87J94
$$ -82 219 -157 249 377 359 -513 -395 276 46 -74 -177 341 -185 -381 -71 142 -24 -214 -142 -429 -235
2231b35K74P7l26j44M70J04j37n57M60K41l98J68J34R5m52j38K10M7J36L60k71
$$ -235 39 116 -210 -354 116 220 83 -474 -14 227 -171 -3 131 226 -226 -364 -154 -107 29 389 118
2252A18l57J61K66K40n72k16J09N08m84j81N02J18r0j32k74K83l07N54k15l66
$$ 118 -239 -78 188 428 -144 -360 -251 257 -227 -408 94 212 122 -10 -284 -1 -308 246 31 -335
2272c35L2R36l94o90M50J46L73o65j06K88p2Ql16L16l14J61J94m0l80N50K53n96
$$ -335 -303 633 239 -451 -1 145 518 -147 -253 35 -37 -29 -345 -29 -343 -182 12 -28 -408 142 395 -201
2294b01l3J0N30m28k8j39O11k82M5k14k8K34N4k92K45j04K34j47k51j16K55K34
$$ -201 -234 -224 306 -122 -150 -289 322 40 85 -129 -157 77 131 -161 84 -20 214 67 -184 -300 -45 189
2316A89Q0m25K22M26l66q6j83q7J49J14M9n1p6L04j94q3j71L94j06j08m01M01
$$ 189 269 -156 66 492 126 40 -143 -230 -81 33 82 31 -45 259 65 -18 -189 205 99 -9 -410 -9
2338iK39j46M7j33j55L75j4j98O2n9R8k84K42K54K7m55l06N64P1R2n31L2L54k93
$$ -9 230 84 131 -2 -157 218 204 6 68 9 107 -177 65 319 346 -109 -415 149 220 312 -219 -187 167 -126
2362a26J31J72m54M58J81k43nj6j55J13j46o6L27j76J42m68K49J31J38r7j03o3
$$ -126 5 177 -277 181 362 119 114 98 -57 56 -90 -156 171 -5 137 -331 -82 49 187 90 -13 -76
2384g6N3o0L03m66M48O4r5k63M1K66L9l51k83L44K53J9l85n6M1J94P5l89K67M55
$$ -76 -23 -83 220 -246 202 266 171 -92 -51 215 254 -97 -380 -36 217 236 -149 -205 -164 30 105 -284 -17 438
2408D38j63n32n4L65J2K09k37k82K08L86k75j67qJ84p2j77M32n38J28K03j1j33
$$ 438 275 -257 -311 54 66 275 38 -244 -36 350 75 -92 -100 84 12 -165 267 -271 -143 60 49 -84
2430h4j76M67j75j09l9n3K00j15J07j5J81j7O4k72K04l87M57m8n02M70o6j49j50
$$ -84 -260 207 32 -77 -116 -169 31 -84 23 8 189 172 236 -36 168 -219 238 190 -312 158 92 -57 -207
2453b07L61l3j77R0m2L06j95J3j77J67K72j21k42l33M74k08L3J02L8P3j14k64
$$ -207 154 121 -56 34 -8 298 103 116 -61 106 378 257 15 -318 156 -52 -19 83 121 194 80 -184
2475a84J64jj93M21j44q9j20K30k60J82J24J5q6N2l62K82R5N8l09k41L39O6j4
$$ -184 -20 -21 -214 207 63 -26 -146 84 -176 6 130 145 59 111 -251 31 126 184 -125 -366 -27 39 25
2498B5k33K8M33j29q1k75K59R4j83q6L1J32J5K27m78M21j85l1o8Q3kP2L7j63n3
$$ 25 -208 -180 253 124 43 -232 27 121 -62 -148 -117 15 30 257 -221 200 15 -16 -84 -1 -3 69 106 -57 -110
2523a10Q0Rj2k8k0R0j33K21l23L0M18m13l2J19m8K69j86J25M7k36M55l88k51L25
$$ -110 -30 -21 -33 -61 -81 9 -124 97 -226 -196 222 -191 -223 -104 -152 117 -69 56 103 -133 322 -66 -317 8
2547Hk1J73l33K00L7J45l41J0QJ34Q3j89M85m79J40ro6k6K18j42j98P0Q8L26k11
$$ 8 -13 160 -173 27 64 209 -132 -122 -114 20 103 -86 399 -80 60 51 -15 -41 177 35 -163 -93 -5 321 110
2572A10k95j44N51l1l21P1J82j21j59R0j96K06j0R4j15R1K06K77o55J17K59p1
$$ 110 -185 -329 222 191 -130 -59 123 2 -157 -67 -263 -57 -67 27 -88 3 209 486 -169 -52 207 136
2594A36k85J96N8J19j73O5l33J39j42j52K62PJ38m3J41m50K12K40qk8k79L87j01
$$ 136 -149 47 105 224 51 116 -217 -78 -220 -372 -110 -103 35 -8 133 -317 -105 135 127 99 -180 207 106
2617A06N4n7o7PML16j96l04J44K22P5j65l82P1K36q9O3L6N4o8l6j05M5L5M0l34
$$ 106 160 103 36 43 47 363 167 -137 7 229 304 139 -243 -172 64 -25 38 74 128 60 24 -81 -36 -1 39 -295
2643b95R3M7J42j09J76k64K57Q1n48M20J75l30L64j88J11k93J63N7k28K63N7n5
$$ -295 -202 -155 -13 -122 54 -210 47 128 -420 0 175 -155 209 21 132 -161 2 59 -169 94 151 96
2665I6Q5m31K19K22l70K84J23Q4l26n2J99P9j18K18l97j2J04o6J67k7j95M11k19
$$ 96 181 -250 -31 191 -179 105 228 312 -14 -66 133 212 94 312 -85 -97 7 -59 108 81 -114 297 78
2688G8l60K64l6K30p1Oj13R4k97J34J74o6k62N07m64j07M95j13nl75L91k4K95
$$ 78 -282 -18 -54 176 105 111 -2 92 -205 -71 103 37 -225 282 -182 -289 206 93 88 -287 104 80 375
2711C75m16l8J68K88n35J7K06j47J22J38l87J0K97J06k12o4l54K19M19j03j78
$$ 375 -41 -79 89 377 -158 -141 65 -82 40 178 -209 -199 98 204 -8 -72 -426 -207 212 109 -69
2732f9J96k73K9K03o1m1J84j80j93K84J04M44p16J62K04l0k94j55K46j19OJ49
$$ -69 127 -146 -117 86 25 -16 168 -12 -205 79 183 627 -89 73 277 247 -47 -202 44 -75 -69 80
2754H0J07k32L61n63N11m77J81J92k1k3m16M02J90n88K47o4K04j22L11k14j68
$$ 80 187 -45 316 -247 264 -213 -32 160 139 116 -300 102 292 -296 -49 -113 91 -31 280 66 -102
2775a02R8K42k57J34k14L1k18L90J25j29j4o6J07k26J46k23ll8J13j02J72k1k9
$$ -102 -4 238 -19 115 -99 -68 -286 104 229 100 86 20 127 -99 47 -176 -179 -217 -104 -206 -34 -55 -84
2798h4L66l15j25j03M27r7j31j30K59K51k80j87K96j93m6r4K81K46l41j40K97
$$ -84 282 -33 -158 -261 166 69 -62 -192 67 318 38 -149 147 -46 -92 -186 95 341 0 -140 157
2819A57k54k27O12l40j8N4K51o6l67P6L43Q4m4k37j19J02j11J19K18j19k12L46
$$ 157 -97 -324 288 -52 -70 -16 235 169 -198 -122 221 305 261 24 -95 7 -104 15 233 114 -98 248
2841B48l32k7K22M2l89Q1j30M25N1J34m77J45P5j32K19r2m50L02K78J1k74l5R4
$$ 248 -84 -111 111 153 -236 -155 -285 140 191 325 -152 -7 68 -64 155 63 -387 -85 193 204 -70 -105 -11
2864a1m1l33M73j33k8L22J21l40o6r0m32M85k26M81m1Q2l64L42k01k36n1M64O9
$$ -11 -52 -385 88 -45 -73 249 370 30 -36 -126 -558 -73 -299 182 141 223 -141 201 0 -236 -287 177 246
2887B46l92L4K57N4j80k3j9M1p7p5N31n65Q0L76m71J00J87l86J20K56k2k69K25
$$ 246 -146 -112 145 199 19 -4 -23 18 -59 -134 397 -168 -88 288 -183 -83 104 -282 -162 94 72 -197 28
2910B8j58J98j50j08K60K3m61M58m10N00p3k33K36k22J42l8RM44l79K7q0P4p7
$$ 28 -130 68 -82 -190 70 93 -368 90 -320 180 107 -126 110 -112 30 -8 1 445 66 93 13 87 10
2933A0n1J66j58K10K61Pp31M67j56l7K0l48M18K28l07r5J51k23j9L49k52N1R4
$$ 10 -41 125 -33 177 438 445 -286 181 25 -12 8 -340 78 306 -1 -96 55 -168 -187 162 -90 -39 55
2956E5l4j59J6k45K34J15K06L21j54m19o0J07j28P2J54k25L68k40l2K56k38J51
$$ 55 21 -138 -122 -367 -133 -18 188 509 355 -64 -124 -17 -145 -73 81 -144 224 -16 -48 208 -30 121
2978A21J03j89L3K5m63M61l93K86P5k16K1J07j03p3L85k08O9L5k66K56l0r6j41
$$ 121 224 35 68 93 -370 91 -302 -16 59 -157 -136 -29 -132 -205 180 -28 41 76 -190 66 36 -60 -201
3001b01K86J0m8LR7R3k56J09l57K00k0k60K86k04J47L89j55n4j03q3M4oo6K48
$$ -201 85 95 47 50 147 240 -16 93 -264 -64 -84 -344 -58 -262 -115 274 119 65 -38 -121 -77 -83 -149 99
3025I9J0k54J20l9r3M25l9k80K16p3j49j45P4K82l08M70m38L53l3n08K32k8J40
$$ 99 109 -145 -25 -64 -157 268 229 -51 165 92 -57 -202 -128 154 -154 316 -122 231 198 -310 -78 -106 34
3048C4J19j18K37j49l38MK82j81R9Q8k02j75M92p6j22M41m67J21j18j17K31M8
$$ 34 153 35 272 123 -215 -211 71 -110 -11 77 -125 -300 192 116 -6 435 -32 89 -29 -146 85 133
3070A33j60ol4j30J22KR1J40p5j48J54J16l52J77l3k46K37J28jj98k3K00j78K9
$$ 133 -27 -33 -67 -197 -75 -73 18 158 83 -65 89 205 -147 30 -3 -249 -12 116 115 -83 -106 94 -84 -55
3094e5J01r5J00l14K48N6K34l86rJ68K1Nl11N11l20p6O6J11O1J63n28R8q4L42
$$ -55 46 -49 51 -263 -15 41 275 -111 -120 48 69 74 -237 274 -46 -122 -56 55 116 279 -249 -151 -235 107
3118A07J0K14k49l58J16ML03rl11K79N3k58K06L0m72K38M18k88K68n13K56j03
$$ 107 117 331 82 -276 -160 -156 147 138 -173 106 159 -99 107 137 -335 -97 321 33 301 -212 44 -59
3140e9j79J90J22O0l10K53k96L88j67j52L52k38j71j06L41j98K60p4m7J81l33
$$ -59 -238 -48 74 134 -176 77 -219 169 2 -150 202 -36 -207 -313 28 -170 90 16 -31 150 -183
3161a83J18m8J35k6J08j83j62M97m4l16K54m04K13J26l86L56k3j23j30O9L00k86
$$ -183 -65 -113 22 -4 104 -79 -241 256 212 -104 150 -254 -41 85 -301 55 32 -91 -221 -152 148 -138
3183a38L65l36j14K65K9J25k13L3J8m5M9O3k47j37L85O0K91m46l3k21L77j49J41
$$ -138 227 -109 -223 42 71 196 -17 16 34 -11 38 101 -146 -283 102 162 453 7 -26 -247 130 -19 122
3206A22j36M8l75J01J03K12n0j6j2j28L20k71J11P9k58o0O10l17J08m94K19o2
$$ 122 -14 34 -341 -240 -137 75 25 9 -3 -131 189 -82 29 108 -150 -210 400 83 191 -303 -84 -146
3228a46j15J71J86K1r3J2l11L59o0J66l7R7l22j07Q8J77j24K14l72K80j44j38
$$ -146 -261 -90 96 117 24 36 -275 84 24 190 153 250 -72 -179 -91 86 -38 176 -196 84 -60 -198
$$ [...]
8191A33
##END NTUPLES=NMR FID
##END=
