##TITLE=1H_CA-8660
 CDCl3, 8 sc, 
 18.10.2019
##JCAMPDX= 6.0         $$ Bruker NMR JCAMP-DX V2.0
##DATA TYPE= NMR FID
##DATA CLASS= NTUPLES
##ORIGIN= UXNMR, Bruker Analytische Messtechnik GmbH
##OWNER= root
$$ XWIN-NMR		Version 3.5
$$ Fri Oct 18 16:14:20 2019 Russian Standard Time (UT+4h)  she@DPX200
##.OBSERVE FREQUENCY= 200.1315
##.OBSERVE NUCLEUS= ^1H
##.DELAY= (6, 6)
##.ACQUISITION MODE= SIMULTANEOUS
##.ACQUISITION SCHEME= undefined
##.AVERAGES= 8
##.DIGITISER RES= 18
##SPECTROMETER/DATA SYSTEM= spect
##.PULSE SEQUENCE= zg30
##.SOLVENT NAME= CDCl3
##.SHIFT REFERENCE= (INTERNAL, CDCl3, 0, 15.7039)
##AUDIT TRAIL= $$ (NUMBER, WHEN, WHO, WHERE, WHAT)
$$ ##TITLE= Audit trail, XWIN-NMR		Version 3.5
$$ ##JCAMPDX= 5.01
$$ ##ORIGIN= Bruker BioSpin GmbH
$$ ##OWNER= she
$$ F:/spectra/data/she/nmr/H-F/1/audita.txt
$$ ##AUDIT TRAIL=  $$ (NUMBER, WHEN, WHO, WHERE, WHAT)
(   1,<2019-10-18 16:13:08.10 +0400>,<she>,<DPX200>,
      <created by zg, POWCHK disabled, PULCHK disabled
       configuration hash MD5:
       00 E9 B6 7A A2 85 ED C7 34 08 36 98 17 FE 4E 26
       data hash MD5: 16K
       C9 F5 70 72 87 2B EE 97 8B DD CC 3F 47 1C E2 B2>)
$$ ##END=
$$ 
$$ hash MD5
$$ 2A B7 85 46 FB 3F 2E 3D CB AC 0C FE A6 2F 07 A1
##$RELAX= 
##$RELAX= 
##$RELAX= 
##$RELAX= 
##$RELAX= 
##$RELAX= 
$$ Bruker specific parameters
$$ --------------------------
##$DU= <F:/spectra>
##$EXPNO= 1
##$NAME= <H-F>
##$PROCNO= 1
##$TYPE= <nmr>
##$USER= <she>
##$AMP= (0..31)
100 100 100 100 100 100 100 100 100 100 100 100 100 100 100 100 100 100 
100 100 100 100 100 100 100 100 100 100 100 100 100 100 
##$AQSEQ= 0
##$AQ_mod= 1
##$AUNM= <au_zg>
##$AUTOPOS= <>
##$BF1= 200.13
##$BF2= 200.13
##$BF3= 200.13
##$BF4= 200.13
##$BF5= 200.13
##$BF6= 200.13
##$BF7= 200.13
##$BF8= 200.13
##$BYTORDA= 1
##$CFDGTYP= 0
##$CFRGTYP= 5
##$CHEMSTR= <none>
##$CNST= (0..31)
1 1 145 1 1 1 1 1 1 1 1 1 1 1 1 1 1 1 1 1 1 1 1 1 1 1 1 1 1 1 1 1 
##$CPDPRG= <>
##$CPDPRG1= <>
##$CPDPRG2= <>
##$CPDPRG3= <>
##$CPDPRG4= <mlev>
##$CPDPRG5= <mlev>
##$CPDPRG6= <mlev>
##$CPDPRG7= <mlev>
##$CPDPRG8= <mlev>
##$CPDPRGB= <>
##$CPDPRGT= <>
##$D= (0..31)
0 1.2 0 0 0 0 0 0 0 0.06 0 0.03 0 0 0 0 0.0002 0 0 0 0 0 0 0 0 0 0 0 0 
0 0 0 
##$DATE= 1571400787
##$DBL= (0..7)
120 120 120 120 120 120 120 120 
##$DBP= (0..7)
150 150 150 150 150 150 150 150 
##$DBP07= 0
##$DBPNAM0= <>
##$DBPNAM1= <>
##$DBPNAM2= <>
##$DBPNAM3= <>
##$DBPNAM4= <>
##$DBPNAM5= <>
##$DBPNAM6= <>
##$DBPNAM7= <>
##$DBPOAL= (0..7)
0.5 0.5 0.5 0.5 0.5 0.5 0.5 0.5 
##$DBPOFFS= (0..7)
0 0 0 0 0 0 0 0 
##$DE= 6
##$DECBNUC= <off>
##$DECIM= 24
##$DECNUC= <off>
##$DECSTAT= 4
##$DIGMOD= 1
##$DIGTYP= 9
##$DL= (0..7)
0 120 120 120 120 120 120 120 
##$DP= (0..7)
150 150 150 150 150 150 150 150 
##$DP07= 0
##$DPNAME0= <>
##$DPNAME1= <>
##$DPNAME2= <>
##$DPNAME3= <>
##$DPNAME4= <>
##$DPNAME5= <>
##$DPNAME6= <>
##$DPNAME7= <>
##$DPOAL= (0..7)
0.5 0.5 0.5 0.5 0.5 0.5 0.5 0.5 
##$DPOFFS= (0..7)
0 0 0 0 0 0 0 0 
##$DQDMODE= 0
##$DR= 18
##$DS= 0
##$DSLIST= <SSSSSSSSSSSSSSS>
$$ [...]
##$SUBNAM2= <"">
##$SUBNAM3= <"">
##$SUBNAM4= <"">
##$SUBNAM5= <"">
##$SUBNAM6= <"">
##$SUBNAM7= <"">
##$SUBNAM8= <"">
##$SUBNAM9= <"">
##$SW= 24.0689530833862
##$SWIBOX= (0..15)
0 0 2 0 0 0 0 0 0 0 0 0 0 0 0 0 
##$SW_h= 4816.95568400771
##$TD= 16384
##$TD0= 1
##$TE= 0
##$TE2= 300
##$TE3= 300
##$TEG= 300
##$TL= (0..7)
0 120 120 120 120 120 120 120 
##$TP= (0..7)
150 150 150 150 150 150 150 150 
##$TP07= 0
##$TPNAME0= <>
##$TPNAME1= <>
##$TPNAME2= <>
##$TPNAME3= <>
##$TPNAME4= <>
##$TPNAME5= <>
##$TPNAME6= <>
##$TPNAME7= <>
##$TPOAL= (0..7)
0.5 0.5 0.5 0.5 0.5 0.5 0.5 0.5 
##$TPOFFS= (0..7)
0 0 0 0 0 0 0 0 
##$TUNHIN= 0
##$TUNHOUT= 0
##$TUNXOUT= 0
##$USERA1= <user>
##$USERA2= <user>
##$USERA3= <user>
##$USERA4= <user>
##$USERA5= <user>
##$V9= 5
##$VALIST= <valist>
##$VCLIST= <CCCCCCCCCCCCCCC>
##$VD= 0
##$VDLIST= <DDDDDDDDDDDDDDD>
##$VPLIST= <PPPPPPPPPPPPPPP>
##$VTLIST= <TTTTTTTTTTTTTTT>
##$WBST= 1024
##$WBSW= 4
##$XGAIN= (0..3)
0 0 0 0 
##$XL= 0
##$YL= 0
##$YMAX_a= 6253
##$YMIN_a= -7500
##$ZGOPTNS= <>
##$ZL1= 120
##$ZL2= 120
##$ZL3= 120
##$ZL4= 120
##$ABSF1= 10
##$ABSF2= 0
##$ABSG= 5
##$ABSL= 3
##$ALPHA= 0
##$AQORDER= 0
##$ASSFAC= 0
##$ASSFACI= 0
##$ASSFACX= 0
##$ASSWID= 0
##$AUNMP= <proc_1d>
##$AZFE= 0.1
##$AZFW= 0.1
##$BCFW= 1
##$BC_mod= 2
##$BYTORDP= 1
##$COROFFS= 0
##$CY= 11.3945322036743
##$DATMOD= 1
##$DC= 2
##$DFILT= <>
##$DTYPP= 0
##$F1P= 20.1720416913024
##$F2P= 0.152960286110954
##$FCOR= 0.5
##$FTSIZE= 0
##$FT_mod= 4
##$GAMMA= 1
##$GB= 0.15
##$INTBC= 1
##$INTSCL= 1
##$ISEN= 128
##$LB= 0.24
##$LEV0= 0
##$LPBIN= 0
##$MAXI= 10000
##$MC2= 0
##$MEAN= 0
##$ME_mod= 0
##$MI= 1.114404
##$NCOEF= 0
##$NC_proc= 0
##$NLEV= 6
##$NOISF1= 3.799351
##$NOISF2= 2.8
##$NSP= 1
##$NTH_PI= 0
##$NZP= 0
##$OFFSET= 15.70392
##$PC= 1
##$PHC0= -9657.65
##$PHC1= 23.00089
##$PH_mod= 1
##$PKNL= yes
##$PPARMOD= 0
##$PSCAL= 0
##$PSIGN= 0
##$REVERSE= no
##$SF= 200.130013532006
##$SI= 16384
##$SIGF1= 3
##$SIGF2= 2
##$SINO= 400
##$SIOLD= 16384
##$SREGLST= <1H.CDCl3>
##$SSB= 0
##$STSI= 0
##$STSR= 0
##$SW_p= 3612.71676300578
##$SYMM= 0
##$S_DEV= 0
##$TDeff= 0
##$TDoff= 0
##$TI= <>
##$TILT= no
##$TM1= 0
##$TM2= 0
##$TOPLEV= 0
##$USERP1= <user>
##$USERP2= <user>
##$USERP3= <user>
##$USERP4= <user>
##$USERP5= <user>
##$WDW= 1
##$XDIM= 8192
##$YMAX_p= 0
##$YMIN_p= 0
$$ End of Bruker specific parameters
$$ ---------------------------------
##NTUPLES= NMR FID
##VAR_NAME=  TIME,          FID/REAL,        FID/IMAG
##SYMBOL=    X,             R,               I
##VAR_TYPE=  INDEPENDENT,   DEPENDENT,       DEPENDENT
##VAR_FORM=  AFFN,          ASDF,            ASDF
##VAR_DIM=   8192,          8192,            8192
##UNITS=     SECONDS,       ARBITRARY UNITS, ARBITRARY UNITS
##FACTOR=    0.0002076,     1,               1
##FIRST=     0,             0,               0
##LAST=      1.7004516,     0,               0
##MIN=       0,             -7500,           0
##MAX=       1.7004516,     6253,            0
$$ Real data points
##PAGE= N=1
##DATA TABLE= (X++(R..R)), XYDATA
0@%%%%%%%%%%%%%%%%%%%%%%%%%%%%%%%%%%%%%JnQqQqRj0J1j2J4j9K3k4K5l0L7
54B0m5N6p5J10j79L68j631o124O657O042m639m257K435L521j25l926j642N158
72A724K576o135k653N853J732m464n92K417O1n26n38m72J922M05l303M26L829
89B262j583l148K561J712k805m25K113pp12o79p86K113J627l568j438M497O04
106B338m400K29L362m43j902l68N92J939J4l540K72M552r59m342J691L129j884
123B80j636J226M99O9l31j528J083K519k000k406K707J289k802K25K218j230j215
140a033J023J29J92O88j650n73K562l70k641J748K064k620j233K361N27j008j85
157a9p01M80J812j390j928K571J240l336l62L188j53j973M7L44N88P47j648q76
$$ y = [0, 0, 0, 0, 0, 0, 0, 0, 0, 0, 0, 0, 0, 0, 0, 0, 0, 0, 0, 0, 0, 0, 0, 0, 0, 0, 0, 0, 0, 0, 0, 0, 0, 0, 0, 0, 0, 0, 1, -4, 4, -4, 4, -4, 5, -5, 6, -6, 8, -11, 12, -12, 13, -17, 20, -25, 31, -44, 66, -113, 255, -1376, -7500, -843, 5199, 560, -3697, -1262, 2259, 2134, -1792, -3434, 1724, 4300, -1835, -4488, 1365, 3097, -1367, -1959, 458, 519, -7, -545, -1017, 905, 1310, -1993, -1567, 2262, 679, -2469, 92, 1804, -1001, -1426, 687, 680, -32, -711, -1497, 616, 2243, -1325, -2763, 1734, 2338, -2062, -1833, 1529, 1086, -816, -1184, -592, 1347, 1361, -2179, -1907, 2645, 1686, -2656, -965, 2164, 280, -1356, -130, 369, 438, 107, -1421, -338, 2181, 181, -2225, 482, 1771, -1031, -806, 1412, 182, -1033, -10, 119, 311, 999, -651, -1224, 1338, 968, -1673, 75, 2139, -481, -1714, 647, 1174, 166, -19, -720, -240, 1572, 182, -1746, 825, 2065, -1271, -1633, 1555, 1402, -571, -524, -180, 408, 1155, -493, -1369]
175a369K742J39l396Q36L258j300k290J076R51k22m6j029o1K058o99k514J729
192a37K251k330j330K166K34j256L89k1k98R92n51j348J669R04k398Q2K373j005
210C86j681J343N91r11L23j68n71J298Mk027J045K069j993j518K174O82j483Q9
228c48K33k52R54l29j580J364J460k313q94K500J59j770M56M85n11O77nj129R28
247H5P34j795M7K012q48j367J365K20j290Q15P60j084O3N09q31N02J055j469n19
266a036J923l94j752J247J146j368l45O79k84M92M09j515N9J987q85j744J554
283A73J035j608j83R09l41K03L13j123L22J529j200j247J818M78j857L56J200
300G77p91k31O27n30J96P65j194l69J839m07j868J141J207j479l23J221k58l50
$$ y = [-1369, 1373, 1512, -1884, -1048, 2210, 910, -1380, -304, 647, 425, 379, -650, -711, 1347, 648, -1866, -137, 2114, -216, -1546, 620, 854, -402, -13, -34, -332, 660, 109, -1239, 430, 1334, -1064, -982, 1391, 386, -1295, 48, 639, -272, 51, -117, -688, 610, 614, -1413, -368, 1701, -292, -1810, 364, 1046, -437, -348, -115, -367, 587, 258, -1322, 42, 1502, -811, -1705, 795, 954, -816, -360, 125, -386, 291, 286, -843, 85, 819, -976, -929, 1083, 235, -1132, 233, 453, -837, -22, 738, -346, -283, 226, -605, -103, 952, -517, -1036, 887, 493, -1259, -12, 1134, -234, -579, 100, -184, 308, 717, -798, -739, 1248, 363, -1381, 173, 1208, -400, -583, 326, -15, 188, 501, -622, -300, 1229, 29, -1218, 600, 1078, -779, -423, 777, -14, -245, 382, -148, 48, 813, -381, -750, 1089, 682, -1186, -45, 1162, -317, -640, 581, 323, -27]
318b7K95o92J99J397r74j421J604P44j839J05J505n81o77M55l05J96R42j034r06
337a014J593K51j721N73J333j031o05Q25k17o8O65q22n39J402j44j438R53R96
355I92j417l03J195l77m44O30m49l42R97l61r91J172M77j573K38J342q56o31R72
374B71k27n44P00k09n98R99L2j312P27J009j291l17J349m17q77P54O9n39P05p1
394B13r62Q26O14j338J03J370p44r12R57J16o03N84o5p99P83M05j218L74J192
413H96j007p15J166K9p58N65L9p21O08K63q92N23Q17j213l14J406k87r82P42K32
433C97p74L72K96o22N09L98j171J67J374p17r74J051K61r55L57L83n50L64K73
452D39r75L50J135r16p52J193O0r88N02L61o45L76K92q81L35R25r38m86J199k02
$$ y = [-27, 268, -424, -225, 1172, 198, -1223, 381, 1125, -714, -609, 896, 315, -362, 93, -212, -16, 926, -108, -1014, 579, 830, -891, -318, 1015, -16, -621, 204, -13, -81, 584, -238, -777, 625, 481, -957, -4, 992, -425, -728, 467, 90, -354, 276, -173, -515, 482, 121, -870, 302, 779, -794, -556, 786, -70, -701, 271, 44, -500, 200, -9, -607, 392, 424, -888, -161, 848, -443, -760, 589, 172, -705, 49, 118, -421, 284, 213, -749, 77, 691, -647, -544, 826, 82, -830, 127, 243, -360, 224, 159, -640, 143, 548, -670, -296, 896, -111, -826, 340, 369, -389, 176, 215, -506, 102, 365, -527, -4, 813, -400, -714, 692, 405, -577, 165, 397, -377, -5, 291, -331, 178, 576, -595, -428, 946, 229, -745, 306, 567, -388, -31, 352, -198, 166, 439, -536, -186, 949, 33, -719, 474, 534, -454, 48, 409, -236, 140, 432, -449, -114, 811, -127, -613, 586, 384]
472C84r58O82L18p18L53L52p59K65O75q79j38J094n38q92R60L07r08L54M67p06
492b85J71N03o90O7Q69p88o50J142J40r85M58M71p62J62N58o17M2O86p44m17J082
513D13q8q93N97L22q30L22O22o94n3O38o09k61R70k93p94P27K15q77M28O47p73
534b64p4O20n06j20Q02m61o17Q74M9r21N47O12q62n7O94m44j35O37m45m17Q46
555C58j25q39O77M40r47J37P79n87k33O94l39l47P00k16o38P15K11r00L23P15
575E78p51j87P75l11l51N91k54n28P60R1q79M55O04q37r9P97l18l76N43k83l79
596c59P40l0q07N37M61q72Q2Q36n13m06N85j92l63O34p9o78N66K66q01K99P50
617F56p39l42P47k00m35N85p2n79N18J76p05M04N65q20j64Q00l19m44O33j20n73
$$ y = [384, -574, 108, 426, -292, 61, 413, -346, -81, 594, -285, -423, 671, 133, -759, 201, 508, -400, -46, 421, -285, -114, 389, -301, -234, 635, -153, -803, 339, 479, -506, -48, 423, -339, -177, 381, -236, -194, 492, -252, -669, 413, 325, -568, 29, 351, -479, -157, 465, -229, -282, 356, -253, -514, 456, 163, -631, 96, 311, -566, -138, 509, -264, -338, 282, -224, -344, 458, -3, -620, 254, 303, -618, -71, 541, -321, -378, 316, -128, -263, 374, -71, -488, 358, 233, -606, 71, 511, -436, -299, 480, -107, -340, 354, 15, -332, 368, 152, -486, 229, 440, -460, -137, 578, -173, -360, 415, 104, -247, 344, 90, -438, 322, 413, -466, -11, 593, -244, -343, 454, 136, -240, 303, 20, -359, 381, 351, -456, 81, 542, -330, -248, 588, 75, -331, 254, 62, -301, 333, 254, -424, 142, 408, -393, -94, 656, -83, -425, 322, 122, -313, 272, 200, -379, 139, 315, -390, 14, 579, -241, -405, 395, 76, -368, 265, 145, -428]
638d28N54J69o79L79M75p87j5P52m31l94O56j53n43N67J14o40L93L74p34J21O76
659D26n70l06P35j68n70N49J14n91L71K77o26K02N31o43j32P90l06n76O21Q3o01
680c90L68L03o01J87M41n91j8P14m03m83O82k2n99M83K77o72J61M67n22J9O10
701D11m84l35O91j07n83N39K13o99K47M32n20Q6N09n41k23P28k04n65N90J46o79
722c48K80M18m99P9M48n42j08O75l14m65O41K5o72L90M07n68N2M59m62p7N61l33
744D7l46O03q3o04M79L18o34J37M73m74r1N50l65k99N93j44n46N11K25o41K37
765e4M38n35m0N51m06k47O14k06n01N38J38o16K84M11n74J0N13l91j98N64k50
786D3m34N64O1n96L84L16o34P5N56m46j70N43k57l68N40j7n12M09K14o23J79N08
$$ y = [-428, 126, 295, -384, -5, 470, -317, -332, 420, -11, -405, 251, 98, -445, 122, 236, -404, -11, 363, -371, -250, 426, -144, -450, 285, 117, -453, 96, 210, -381, -10, 267, -359, -157, 374, -269, -401, 389, 83, -493, 128, 211, -390, -22, 281, -320, -133, 308, -283, -301, 413, 10, -473, 209, 187, -412, 71, 348, -324, -163, 304, -218, -199, 411, -73, -408, 283, 176, -407, 132, 345, -354, -107, 325, -195, -109, 400, -141, -364, 364, 160, -405, 185, 331, -348, -68, 350, -149, -70, 378, -164, -272, 403, 89, -376, 265, 290, -382, 8, 415, -153, -101, 358, -104, -181, 380, 47, -299, 304, 221, -383, 96, 414, -220, -83, 390, -84, -175, 375, 10, -289, 304, 160, -386, 125, 350, -291, -54, 384, -151, -191, 360, -46, -293, 321, 115, -386, 152, 290, -326, -42, 369, -205, -195, 318, -73, -271, 293, 43, -391, 173, 234, -362, 22, 338, -296, -221, 335, -111, -281, 262, 5, -363, 177, 160, -352, 57, 271, -352, -173, 335]
808C35m84j35N45k82l50N61m5m94M03J77n82K43M29n31m8N30l48k82N82r8m93
829c67M28J41n46K74L74n16j4M92l50k32N43j33m28M54N9n17L36L18n56P2M97
850C29m10k03N49j81m02M68M0n00L66K55n32J20M47m46j20N51k75l50N02j7m88
871b97L67K45n36J51M14m40q1N21l13l04N23q8m64M13J89n38J99L93m86k4M92
892C36l15k62M93j12m13M08J19n03K48L35n07L9M95l81k33M96j40l81M28P1m76
913b55K64K83m99Q3M33l85j57M95k10l54M85J2m88L21K45n10J29M10m10j37M80
934B35k27l02M72m2m55L61J76m90J75L84m66o7M91k85k74M93n8m32L51J45m56
955b71K15L18m67j8M82l33k22N03j21m24M02J21m54K17K88m63N1M34l48j67M75
$$ y = [335, -149, -284, 261, -21, -371, 190, 145, -349, 54, 231, -351, -108, 321, -210, -258, 272, -76, -358, 224, 126, -367, 61, 202, -344, -70, 304, -212, -226, 266, -84, -316, 227, 94, -334, 120, 179, -338, -2, 316, -240, -168, 329, -81, -284, 265, 84, -318, 150, 190, -310, 56, 311, -221, -101, 346, -100, -220, 331, 56, -294, 208, 191, -297, 70, 315, -221, -70, 344, -96, -177, 344, 31, -273, 250, 162, -302, 111, 300, -238, -39, 354, -132, -156, 336, 21, -241, 252, 140, -273, 135, 254, -249, -1, 334, -173, -134, 361, -20, -253, 243, 103, -278, 150, 221, -255, 9, 292, -207, -124, 309, -76, -233, 262, 52, -302, 183, 195, -293, 28, 273, -237, -108, 302, -108, -245, 235, 8, -294, 178, 136, -319, 42, 218, -272, -97, 287, -179, -246, 245, -40, -314, 179, 121, -311, 40, 185, -271, -56, 262, -205, -223, 259, -74, -296, 207, 86, -338, 64, 185, -269, -52, 236, -227, -176, 258, -90, -257, 218]
976B18j71l65M26Q4m72K66K59m64Q9L98l60j39M85k01l49M51K1m42K84K11m32
997b03J18L75l99p4M61k61l01M69j8m30K96J94m22J31L29l89j7M20l00k26M80
1018B33r5m18L75J53m43J61L08l93qM34l24j92M56j45l45L99R0m67K17K86m09
1039a27M2L72l20j64M57j68l50M19N2m42K53K32m07P9L48l56j02M45k17k96M26
1060A76qm38L09K09m29J02L21l40r0M23k33k52M14p8l65L51J44m44J50L28l84
1081a34m7M05k49k20M15j04l20L28Q9m30K09L00m17QM02k83k06M21j06l28L69
1102A02M7m17K42K37m21O1L81l00j67M13j38l02L68Kl84K83K03m41R2L91l56j15
1124b19M03j63k61L61l0l42K93J54m40J58L44l96p0M33k06k68L87k8l37K94J05
$$ y = [218, 47, -318, 108, 192, -280, -14, 245, -219, -130, 268, -92, -231, 254, 53, -296, 155, 176, -266, 18, 229, -203, -85, 290, -109, -183, 278, 17, -284, 185, 167, -263, 33, 227, -195, -64, 265, -124, -141, 279, -21, -247, 233, 138, -280, 95, 248, -195, -34, 274, -119, -127, 307, -17, -209, 247, 102, -243, 156, 246, -221, -4, 282, -127, -85, 287, -33, -197, 260, 92, -258, 161, 213, -229, 24, 256, -151, -72, 276, -80, -182, 263, 46, -250, 176, 168, -270, 39, 248, -181, -79, 242, -98, -188, 235, 2, -250, 164, 86, -279, 72, 216, -228, -78, 250, -134, -181, 224, -25, -245, 170, 66, -254, 74, 163, -267, -58, 242, -175, -167, 235, -48, -254, 167, 61, -267, 102, 149, -268, -26, 211, -210, -149, 232, -68, -235, 178, 40, -262, 106, 108, -276, 7, 210, -231, -139, 252, -104, -219, 184, 21, -240, 121, 91, -251, 42, 196, -244, -86, 258, -138, -208, 225, 19, -249, 138, 110, -227, 67, 172]
1145A72l86J87K73l78k4M27k70k34M08o0l30L12Q3l67J96K46l90K5L75k91j67
1166a93M10j13k99L06N6l44K23K03l93O2L58l23j46M18j34k91L28K6l48K43J65
1187B14l87J19L16l45p6M08k07k69L68Nl57K54J48l64J24K87l48k8L74k51k04
1208b19L92n6l44L00J09l60J38K57l25j1L34k65j41L72j25k97L14R1l70J73K30
1229A97l53J7L41k92j05L68j43k79L28N0l71K04K12l52N5K96k63r1L49j78k52
1250b62L80j5l65K57K02l80N9K98k71o5L20j92j95L71o9l32K97J50l96J15K97
1271B04k96o2L22k08j45L47j08k87L00J09l83J55K63l17k1L08k03j46L33j16k72
1292b23L23O1l78J90K48l37J2L03k12j47L28j23k37L21Nl44K23K07l77P4L00k48
$$ y = [172, -214, -27, 246, -132, -156, 271, 1, -233, 175, 115, -215, 97, 180, -187, 9, 255, -135, -110, 265, -26, -193, 217, 104, -195, 111, 167, -177, 46, 249, -144, -82, 276, -47, -193, 225, 91, -200, 128, 154, -194, 49, 214, -173, -54, 262, -83, -159, 249, 42, -227, 141, 146, -211, 43, 191, -173, -49, 238, -110, -138, 236, -15, -219, 173, 117, -227, 73, 182, -178, -40, 217, -108, -119, 215, -50, -191, 181, 56, -241, 73, 164, -206, -33, 197, -156, -139, 202, -90, -195, 173, 30, -249, 79, 129, -242, -38, 174, -178, -123, 173, -90, -181, 168, -10, -262, 118, 103, -262, -5, 197, -183, -124, 174, -97, -162, 158, -34, -229, 142, 73, -259, 38, 188, -208, -93, 204, -92, -154, 168, -40, -185, 162, 54, -233, 67, 176, -207, -52, 211, -106, -127, 181, -22, -168, 165, 49, -223, 100, 161, -217, -27, 221, -116, -104, 199, -13, -160, 168, 45, -192, 129, 134, -210, 13, 220, -157, -83, 217, -31]
1314c1j18L20j24k07L07l8k90K40J39l45J01K88k94r1L49j63j92K96l9k80K53
1335H1R5l20J18K52l12m0L44j99j84L22n8k94K60J00l33J66K04l39K4L27k40j62
1357a88L52j14k53K73P0l17J76J74l23O0K88k54j38L59j24k69L11L3k88J77J41
1378A46l11J04K40k68q0L47j60k48L21K2l00J86J30k75Q8K10k63k9L29k12j85
1399b08L30k4l18K31J33l05J01K10k68J4K76k20j62L39o0k93K55Q6k85J30J97
1420A59k88L1K59k22j16L28j05k61K91M3k99J53J90k73L4K56k39q2L10j34k23
1441a88L05Pl03J99J70k88L9K38k60k3K81j50j86K88rk92K18J27k96R1K17k55
1463g0j7K66j67j60K85o9k39K38R0k94J19J97k62j4K59j69j29K64o4k34K59M6
$$ y = [-31, -149, 171, 47, -160, 147, 109, -181, 59, 198, -147, -46, 242, -52, -143, 206, 43, -149, 147, 108, -172, 81, 176, -144, -26, 226, -86, -126, 218, 19, -165, 157, 99, -195, 65, 165, -168, -2, 202, -137, -113, 214, -26, -188, 164, 50, -203, 70, 140, -177, -1, 173, -150, -90, 198, -56, -194, 165, 41, -228, 83, 116, -172, 5, 146, -165, -61, 179, -89, -169, 178, 18, -230, 91, 113, -187, -1, 129, -146, -58, 152, -111, -140, 189, -23, -208, 122, 98, -220, 11, 144, -161, -60, 150, -118, -104, 172, -48, -210, 129, 69, -224, 31, 117, -168, -38, 159, -129, -98, 161, -61, -177, 151, 46, -215, 76, 119, -180, -27, 163, -110, -76, 180, -59, -141, 169, 35, -188, 117, 124, -179, 20, 190, -98, -59, 179, -81, -104, 177, 27, -159, 129, 120, -172, 46, 173, -123, -32, 185, -70, -87, 179, 12, -148, 137, 68, -171, 67, 157, -137, -18, 179, -83, -97, 162, -7, -136, 128, 64, -170, 89, 135]
1485A35l03J52J86k60LK76k18r6K53q4k10K63J9k78J87J28k78L9K64k04j05K70
1507A39j13j87K51lk52J96J04k85R8K38k65o6K75j32j71K59j6k29J81Q3k82J29
1529d8K16k66l9K70j57j32K40l3k21K01N9k66J39J83k58j3K70j76j33K76q5j94
1551a67K15L9k43J72J29k75L1K61j98j14K79q6j91K13J8k29J70J03k48O7K18k13
1573d9p6K70j05j81K26Mk29J72J06k53Q6J96k40k7K52j43j61K70m2k21J87Q2k48
1596a24R9J76k28JK46j76j25K40m9k09K10N8k44J25J62k54M1K15j92q8K61q8j97
1619a40K24M3k55J28J55k22K5J97j83p5K38r2j74K33Pk54J67J21k45M9K06j92
1641c9n6K28j29j21K20l3k28J75J20k51P8J79k11l9K31j35j26K30l7k18J96P6
$$ y = [135, -168, -16, 170, -90, -87, 189, -29, -125, 128, 44, -166, 97, 116, -162, 25, 153, -125, -86, 178, -26, -131, 139, 26, -161, 90, 87, -165, 31, 135, -150, -52, 186, -79, -145, 130, -2, -173, 86, 70, -159, 22, 105, -177, -48, 168, -98, -137, 133, -24, -156, 84, 51, -170, 31, 90, -176, -37, 146, -112, -125, 145, -31, -164, 112, 27, -167, 48, 87, -156, 16, 145, -130, -99, 162, -36, -150, 129, 43, -148, 65, 83, -146, 24, 127, -121, -54, 164, -49, -125, 145, 40, -141, 85, 89, -140, 32, 138, -115, -29, 167, -73, -100, 152, 9, -152, 118, 76, -145, 42, 124, -124, -25, 151, -77, -76, 170, -6, -131, 109, 60, -149, 61, 119, -125, 0, 162, -92, -51, 164, -28, -116, 145, 57, -140, 84, 127, -128, 0, 155, -67, -42, 155, -28, -103, 135, 43, -131, 102, 109, -145, 22, 143, -102, -53, 153, -39, -95, 133, 4, -117, 103, 70, -158, 17, 137, -114, -36, 143, -68, -107, 124, -11, -137, 93, 56, -162, 34, 110]
1663A10k38J02J49j99k4K23j59j01K29o0j94J99O1k35J08J64k14lK00j50q2K09
1685I5p9j71K19K0k23J40J35k39M0J86j57q0K31j09j57K13Lk11J52J06k39O0J88
1708A23j86l7K10j14j36K08j7j83J58Q1k30Q7J67j89k9K06j25j05K04l8j78J72
1730D9N2k06R1J55k06%K14j46j19K26n3j73J74M1k02J25J24k14K7J87j65o7K09
1753A23p0j52J68J6j79J17J17k04M0J71j80o2K33j01j48J90Jk03J61P6j98M9J58
1776A23j64l5K11j37j21K12l8j77J60O1j84O9J51j94j0K09j30j25K15m6j75J73
1798D8M1j98R6J38j97NJ88j36r4J98n9j62J86N0k05Q9J03j78L6J62j52n8J94q9
1822Fj31J76K3j90J17R5j99O1J56j64n7J81r1j09J92j3j78J40O9j89O9J43j71
$$ y = [110, -128, -26, 123, -76, -100, 123, -36, -137, 92, 32, -162, 37, 98, -137, -29, 135, -79, -82, 118, -32, -114, 95, 16, -155, 64, 84, -139, 1, 136, -103, -63, 123, -34, -114, 117, 8, -149, 64, 67, -144, 8, 114, -125, -65, 123, -63, -100, 110, -4, -140, 68, 51, -132, 26, 107, -123, -36, 131, -58, -87, 119, -6, -111, 93, 55, -123, 49, 101, -105, -14, 141, -65, -65, 149, 3, -116, 110, 57, -116, 58, 99, -103, 22, 146, -68, -41, 146, -19, -86, 123, 53, -99, 69, 85, -94, 23, 140, -64, -24, 147, -33, -95, 138, 37, -111, 79, 80, -123, 38, 114, -84, -35, 123, -41, -76, 135, -2, -123, 89, 51, -126, 34, 95, -89, -20, 131, -63, -73, 136, 6, -119, 96, 50, -125, 48, 89, -109, -13, 125, -72, -67, 121, -15, -109, 89, 30, -132, 54, 104, -101, -12, 91, -87, -51, 111, -41, -99, 95, 6, -125, 51, 74, -116, 1, 96, -103, -42, 114, -50, -107, 74, -17, -126, 66, 53, -125, 15, 84, -105, -36, 107, -64]
1845f4l0J92j16j04J96j8j76J45O6j93J05J11j68lJ58j20q4J98m6j73J74L4j79
1868i5J02J15j67nJ54j19o5J85p3j38J58Qj66J27J06j91J5J72j63m1J76n7j43
1891a05J74mj61J22P0j69M0J43j38m4J79q4j19J79l2j48J37O7j89O8J29j61j4
1914f0J62r7r3J60rj55J42M3j84J01J08j52%J59j22q9J62m0j28J43K2j74J15Q4
1938I8j80M0J60j48p1J87o5j15J29J9j68J22O4j51L9J36j24o4J74q1j09J67j5
1961D4j43J05O5j49N4J20j50k9J77r1r7J66l5j44J30N9j76Q6J02j51j8J64j00
1984a1p1J50l0j44J32K6j39N6J19j54NJ60j27n8J55n3j28J60K0j60R9R4j77L4
2008d2J24j16l9J52o7j00J34Jj33R6Q0j61L1J47j30l0J59r5r5J54j3j32J05N2
$$ y = [-64, -94, 98, -18, -122, 74, 56, -120, 25, 91, -102, 3, 114, -54, -57, 101, -19, -103, 95, 49, -124, 50, 84, -95, 7, 122, -45, -50, 104, -15, -80, 105, 32, -106, 52, 60, -106, 21, 127, -64, -49, 123, -40, -81, 95, 38, -105, 69, 65, -96, 26, 96, -73, -33, 110, -28, -72, 107, 23, -96, 83, 51, -97, 40, 107, -82, -14, 115, -46, -60, 102, 5, -88, 72, 63, -92, 50, 93, -91, 10, 118, -34, -34, 125, 3, -86, 76, 36, -92, 51, 73, -101, 14, 98, -82, -42, 118, -30, -101, 86, 21, -94, 35, 54, -114, 8, 72, -79, -40, 96, -28, -92, 82, 1, -108, 59, 44, -99, 6, 71, -78, -24, 96, -54, -83, 94, 3, -94, 72, 37, -107, 23, 82, -94, -8, 94, -57, -75, 89, -11, -82, 68, 38, -106, 26, 52, -87, -31, 88, -66, -61, 99, -28, -86, 69, 16, -112, 48, 68, -92, 7, 101, -76, -42, 82, -34, -73, 79, 12, -88, 46, 47, -86, 10, 90, -71, -40, 107, -23, -53, 106, 11, -84, 70, 57, -75, 30, 82]
2032H2j47N1J22j34j8J43q9q7J51j8j29J07N6j70Q0J03j39KJ31j10n9J38k9j20
2056h3J21K8j55R3R0j36MJ24j01o2J49m5j11J24K0j47R5Q2j47K2J14j13l5J57
2080H8p3j00J27J4j55J16P1j64N0J16j26j7J31p1r6J39j4j23J13M4j44N0J07j20
2104c7k4J31q2p7J57l6j30J17M3j46N4R4j18%J41r8o8J26l9r7J18K6j48P3Q1j33
2130g2K6J20j05m4J41o2j07J40J6j32P7O9j40M7J04r7k8J19o2q4J18Mj22R5M7
2155F8j26M5J01j11k0J19p4p1J38k0j20R6L4j26N0R7j20j0J31q4n9J25k4j19J01
2180B1L6j24P1Q4j26NJ14j01m9J36m7j07J25J8j34Q3P4j25K1J11j02m0J30p0q0
2205g6J25Nj16Q1P7j48K8J13j14j6J14o3o8J11qj11R5M6j29M1R0j09j4J20p8p5
$$ y = [82, -65, -14, 108, -26, -44, 99, 10, -77, 74, 56, -73, 34, 90, -80, 0, 103, -36, -34, 97, -13, -72, 66, 37, -83, 38, 66, -89, 4, 94, -42, -38, 86, -15, -77, 72, 27, -84, 40, 60, -87, 8, 90, -57, -35, 79, -34, -69, 88, 15, -85, 42, 56, -99, 17, 88, -76, -26, 90, -36, -53, 78, 7, -89, 50, 36, -87, 26, 70, -74, -24, 83, -37, -61, 70, -12, -89, 68, 32, -98, 19, 62, -84, -30, 64, -54, -54, 87, -11, -79, 47, 8, -89, 29, 55, -93, -20, 61, -72, -46, 74, -31, -75, 66, 4, -103, 37, 53, -79, -2, 67, -73, -26, 78, -19, -47, 72, 10, -74, 44, 48, -74, 21, 68, -58, -13, 88, -23, -43, 76, 2, -69, 69, 49, -71, 25, 59, -67, -17, 80, -40, -50, 81, -3, -62, 63, 39, -80, 21, 57, -67, 4, 88, -38, -33, 81, -20, -69, 67, 20, -87, 38, 56, -78, 5, 79, -46, -25, 86, -16, -56, 74, 4, -76, 49, 54, -62, 19, 96, -52, -24, 89, -25, -41, 73, 10, -58, 53, 45, -66, 29, 75, -54, -13, 77, -32, -46, 74, -4, -79]
2231g9J38k6j01R1K8j18L5R5j04qJ10q4m5J26m3r4J10Lj09P3P5j24K2R7q5n2J23
2258E4m2q0J08J0j15O3M8j02K3R9r0l9J33o6p0J19k2j14R9M4j26M3R2j08k1J25
2284F5o3o9J06j6j09R7L2j07N5O4j05RJ06p4o6J15k8p9Q9K6j02M9P9j25J4J15
2310G8p9n2J20m2q6Q2K4j05P1O1j15K5R9q8k8J20o6p3J02Kr0P3L4j03K8Q4q7j7
2338b8R6o0n0Q2Pj15R5L2j16L9Q0r1pJ03o3n7R8k0r4R7K9j14M2Q6j15J0R1o6m8
2367e7J01j6j07J10K1j15N3O4r5J6Q8q3k8J10n4o6R5Qj03O0N9j03J5R6r2j7R9
2394E9m5q0R5lr3P6M7j12M3P1q3k6J10p1n8R5j0q5P8M7j15L1Q8r2oQ6n7m9Q8j0
2424A9r4R5K4j02M8N7r4J4R1p4l3R9l7o8Q6J0q6O1L8r1J2R3p5l7J08m8o7Q5Oq6
$$ y = [-79, 59, 33, -68, 23, 51, -67, -32, 63, -41, -49, 61, -23, -68, 58, 15, -79, 31, 34, -75, -2, 73, -51, -29, 68, -17, -69, 54, 12, -68, 40, 50, -65, -2, 46, -56, -33, 66, -24, -63, 70, 4, -66, 53, 31, -83, 16, 60, -66, -23, 69, -39, -60, 65, 2, -67, 39, 23, -86, 11, 43, -64, -9, 55, -50, -41, 65, -9, -75, 40, 12, -67, 22, 48, -54, -5, 74, -51, -37, 78, -1, -53, 67, 25, -61, 21, 45, -60, 11, 72, -43, -18, 81, -7, -35, 85, 19, -54, 48, 50, -40, 33, 67, -36, -8, 76, -11, -28, 68, 8, -42, 40, 47, -68, 27, 59, -57, -18, 62, -29, -36, 67, 4, -53, 45, 25, -69, 28, 57, -57, -15, 71, -44, -34, 57, -9, -57, 44, 28, -79, 31, 52, -63, -10, 54, -41, -25, 63, -20, -48, 62, 8, -58, 37, 45, -58, 2, 61, -42, -27, 69, -23, -40, 59, 14, -66, 29, 26, -67, 9, 56, -56, -13, 58, -25, -51, 59, -12, -70, 25, 15, -70, 8, 55, -60, -29, 59, -33, -39, 47, -10, -59, 29, 19, -75, 20, 44, -58, -10, 47, -47, -33, 58, -16, -49, 50, 13, -55, 31, 41, -45, 16, 54, -37, -25, 68, -7, -44, 64, 16, -51, 34, 40, -46]
2454d6N9M0r8K8P2p0l5J04n1n9R0Lq9P2K6r8N6N4q8pR1n7n8J00j5q3P8J5r2M7
2484a1O8r8J3R4p8m1J05k6q3Q6K3j03N5N9r9K9O3n6n2J01k9p5R5j2p2N9M6r3L1
2513aP1q0k1R5o1n8Q5jq8P3L7r7L7P3r2MP6n0m3P5j1q3O8L3j00M7O6q1j5R8p1
2544a5n1R8l0o8Q4J6p9L4Q5j09jR1o6l6P3j0o3P1Pp9N0M6q8J4P9o7k5Q2l6n4P8
2575C1Or5M6M0q3K5Q5p9k1J00n7m3P9j2q2O5M0q3K3O9q4pR8o8l4Q4k2p6P0K8r1
2606d8M5N4q0KR2o7l5R1k9o8P4K0q2L7N5p7j0R0o7j5P1l5n9P6Nr0O3M8r0J6P7
2637F4o2l9R2m5o3Q0Qq1N4M9q9J8N9o9j7Q8n1m2Q3k1p5Q2J4q3M5M8q2KQ3n2n1
2668e3R8j0p4O0J6r1M5N6p9J3P5o9l1Q0j9o7Q3Rr7O7M7r5mR1q3lP7m9m6R1j4p8
$$ y = [-46, 13, 53, -45, -17, 55, -15, -50, 54, 3, -56, 34, 37, -52, 20, 46, -52, 4, 58, -30, -37, 54, -3, -61, 39, 24, -59, 19, 34, -58, -11, 57, -41, -28, 66, -12, -53, 52, 26, -57, 29, 52, -51, 4, 63, -36, -7, 56, 0, -52, 49, 20, -55, 40, 28, -44, 15, 61, -32, -1, 70, -10, -31, 64, 3, -55, 30, 29, -59, 14, 51, -46, -9, 64, -28, -24, 52, 2, -41, 34, 23, -60, 8, 41, -59, -12, 54, -27, -42, 56, -15, -66, 32, 2, -66, 18, 34, -45, -11, 74, -35, -36, 55, -11, -47, 26, 16, -47, 24, 31, -48, 2, 48, -40, -26, 53, -14, -39, 43, 7, -47, 31, 37, -58, -12, 28, -55, -30, 55, -24, -45, 55, -2, -45, 34, 22, -60, 5, 45, -38, -15, 54, -30, -37, 61, -7, -41, 43, 21, -55, 15, 43, -48, -3, 51, -29, -27, 65, -2, -37, 54, 25, -43, 31, 51, -31, 6, 61, -16, -26, 64, -3, -18, 53, 18, -41, 35, 40, -50, 13, 61, -29, -13, 64, 2, -37, 55, 10, -53, 27, 35, -46, 8, 57, -32, -14, 45, -24, -41, 47, -4, -46, 37, 16, -59, 23, 37, -46, -1, 47, -35, -33, 50, -2, -53, 45, 35, -39, 21, 37, -54, -9, 47, -32, -19, 56, -13, -44, 36, 17, -50, 33, 42, -55, 12, 59, -36, -40, 51, -32, -35, 42, -7, -53, 38, 24, -54]
2700e4N2L9p5J0O4o7%P5n2m0Q5j6p5N5L2q0L2O1p0mP0m3l7P5k1o4O6K9q6M9L9
2731D9p5%P5m7m8Q5j9o1O9K2q2N2L4q6NQ0o9k7Q8l7l8O1jo9N8Pn9K0O7o4l5P8
2763C3l5m5O5%o2M3L8o5J8N2o7pP7l9n0Q5k3o6O3K8q7M0O1p6OP0n5l5P2j1p1P5
2795C2J4q3M0M3p1J6N5o2k1R0l8n6O2Qq3O5L2p4J7O7q0mP4m2m9P0j0p1O2K9q5
2826e3J2P1o1j8R0m8m0Q1l1n1N3K9q1L6N5p7OP2n5l0P6l1n4O9K7r2M7L2o9J6O6
2857D7o2k2P5k8n8P2Lq0N5L1o4RO6o2k6R9l9o6P2lo7M9L1o0J0O2p3j9Q1k5m4O2
2889B6j3m0M3Qn9K2N5o0j3P4l4m0O7k5m6M7J1n4L8L2n7J2N5n4k5P5k9n2O2J0o0
2920b4J6N0n5PM9o1nN8l8n1P3No5N0L7q7K2N7o2k5P9l0m3N5Jo0N5K3o0J2N3n5
$$ y = [-54, -2, 37, -38, -28, 36, -31, -31, 44, -8, -48, 37, 21, -54, 1, 33, -47, -15, 46, -24, -28, 42, -1, -38, 37, 16, -48, 18, 47, -39, 10, 49, -26, -26, 49, 2, -46, 39, 20, -41, 28, 50, -32, 20, 54, -32, -27, 53, -16, -43, 45, 8, -30, 31, 30, -39, 19, 26, -33, -13, 54, -10, -45, 33, -2, -47, 18, 18, -44, -1, 37, -28, -10, 42, -25, -32, 45, 6, -44, 41, 18, -48, 15, 43, -44, -4, 57, -19, -13, 57, 2, -33, 39, 28, -43, 32, 46, -37, 3, 46, -25, -9, 46, -16, -37, 53, 15, -41, 21, 29, -54, 11, 43, -31, -14, 53, -27, -31, 43, 1, -48, 22, 12, -59, 3, 32, -53, -41, 30, -31, -49, 41, -7, -47, 34, 3, -48, 5, 34, -47, -11, 44, -33, -27, 45, -10, -40, 36, 5, -49, 20, 47, -45, 2, 34, -35, -19, 47, -15, -37, 38, 10, -48, 24, 27, -53, 2, 33, -31, -22, 44, -18, -44, 55, 16, -50, 22, 19, -48, 1, 32, -28, -18, 44, -29, -48, 33, 8, -36, 26, 13, -27, 16, 24, -35, -13, 42, -18, -31, 43, 9, -31, 36, 11, -35, 12, 23, -31, 7, 39, -18, -6, 49, -5, -30, 45, 16, -36, 26, 36, -24, -8, 42, -13, -6, 43, -18, -23, 35, -3, -54, 19, 24, -41, 9, 46, -41, -19, 38, -24, -49, 30, 0, -43, 12, 13, -47, 8, 31, -29, -17, 36, -19]
2952a9j2O7m2l7O2mn0M9J0o1K5N9o4kO0n2k2P3l4m4O3%n9L8L1o1OP1o0j3N1k1
2984Hm3N5Jn8M7K1o8K1M1l7k6N8k8m5P5ln5M1J8o1K5M2m6j9P0l9l6O7j0o2N4K4
3016C2p0L4M7m8rM4k4l2O2j5o1N3J8o8L6M2o5J5N4m0m4P6l2n2O0J2n9L2M1o7R
3047a9M3l2j7M7l0l3N7mn1L8K9o3J8M8o4%O0k8m3N4Nn1M8K0o9K0M7n5PN9l4l6
3079b9O2j2m5N7Kn7L0L6o5NN4l8k4O2j6m5L5J7n7K6M0m8pM6l7j8O2l0m1N4Ko2
3111d1L5L5o6K3N0n8j6O4k0m4M4Pm9L2K1n5J8N3n0j5O2k7l6N0j2l6L2L1o4L8L0
3142C6n0KO6n0k8N4j1n6M8Nm4L6L1n7lM6k6k3M6j0l7M6mm8L8J6n1J0N0m2j5M8
3174B3k0l6O0j7n0L5L1n0J1N4o2j0O0k9k7M6%m5L6J1n1K8M1m2j0N6m1k2M9j6m3
$$ y = [-19, -31, 36, -6, -43, 19, 15, -35, 14, 24, -37, -12, 47, -17, -19, 41, -11, -33, 40, 6, -38, 25, 25, -34, 4, 35, -26, -20, 51, -9, -22, 29, 8, -35, 20, 21, -37, 10, 31, -37, -16, 25, -12, -38, 20, -8, -53, 22, 19, -36, 5, 23, -38, -13, 29, -17, -36, 34, -5, -41, 26, 16, -46, 8, 32, -38, -4, 43, -5, -14, 30, 6, -26, 36, 21, -40, 13, 31, -37, -1, 41, -24, -9, 45, 5, -39, 37, 5, -47, 13, 25, -34, -2, 39, -28, -19, 24, -8, -25, 22, -8, -41, 16, 12, -39, -1, 28, -35, -17, 31, -33, -33, 27, -1, -44, 10, 15, -36, 12, 32, -37, -17, 30, -25, -18, 41, 7, -29, 33, 21, -24, 33, 35, -22, 8, 44, -21, -16, 38, 0, -24, 38, 22, -23, 12, 29, -28, -2, 38, -10, -17, 29, -8, -26, 36, 6, -35, 19, 21, -41, -6, 29, -37, -14, 36, -22, -38, 26, 6, -38, 6, 13, -36, -4, 17, -38, -20, 33, -17, -32, 30, 3, -33, 17, 5, -31, 1, 32, -32, 6, 36, -14, -12, 54, 4, -24, 30, 19, -37, 11, 16, -28, 8, 39, -18, -21, 25, -1, -24, 22, 12, -25, 21, 17, -31, 7, 23, -28, -18, 32, -10, -25, 23, 3, -33, 27, 10, -40, -5, 26, -24, -13, 41, -21, -31, 29, 0, -27, 19, 19, -26, 10, 21, -30, -2, 39, -3, -13, 43, 2, -20, 29, 13, -30]
3205c0N8Mm0NL4m9OO0n7j2M0Jm4N1om3K4K0m1J0L7m6k3O0k0m5O3Jn0L1K8n0RM5
3239C1m0k0M4k2l9N7Oo1M8K4m0RL1m2j0N6l3m4P2mn6M8Pm6K8L1n8K3L2l8k7P2
3271C9k8l7L8J4m6K3K3m2J2L4m1j8M8rl8M3j0m1L7K8o2J6L9l1j3M8k5l5N0ml9
3302b7K8K4n2J3L6k9k3O8l1l4O9j6n4L8K4n3J8L4l8%L4k3l8M5Ml5L0K5n7K3L4
3333C7m9mM8m2rM3j6l5N1j1m7L9L1m5kM2n0j3N6l3j6K7J6m5L5K4o0K2L0k1k7N5
3365C1l2k0L8oj8J6J6l8J2M0l1l1O1l2l1O2j9l9L9kl9L4J2l0lM8n1rM6j5l6L8
3397A1J8n1K0L1n0KM9m3j2M7j5m2N7ln9L6K1m1JN0m5kL7qm1M3Km5L3J9m4J0M6
3430C2m4PL4l0pK4%m5L2K0m2J2L9m7kM0l0k3O1k6l0M1J1m9RK9l7KM2l0j1M0k0
$$ y = [-30, 28, 32, -8, -3, 31, -18, -12, 48, -9, -21, 19, 20, -24, 27, 21, -22, 2, 22, -19, -9, 28, -18, -41, 19, -1, -46, 17, 18, -32, -1, 27, -23, -14, 31, -9, -29, 15, -7, -46, 11, 17, -44, 4, 28, -12, -3, 28, -14, -24, 32, -1, -45, 27, 23, -33, 15, 22, -24, 4, 35, -23, 0, 32, -6, -33, 39, 11, -26, 12, 26, -20, 3, 26, -16, -4, 30, -11, -29, 19, 10, -28, 15, 5, -36, 1, 29, -33, -17, 22, -9, -22, 26, 1, -34, 16, 12, -27, 1, 25, -27, -14, 22, -7, -30, 38, 7, -27, 42, 26, -28, 10, 34, -19, -1, 33, -5, -5, 29, 6, -32, 13, 17, -18, 12, 37, -20, 3, 37, -12, -16, 32, -10, -19, 24, 8, -27, 24, 13, -34, 5, 36, -9, -11, 31, -19, -32, 24, -9, -25, 2, 18, -27, 8, 32, -28, -6, 24, 3, -24, 31, -1, -21, 17, 11, -7, 9, 25, -13, -1, 39, 8, -23, 38, 6, -25, 37, 18, -21, 18, 16, -23, 11, 23, -7, -10, 38, -13, -22, 24, 9, -27, 11, 29, -22, -2, 29, -21, -19, 30, -13, -25, 22, 7, -35, 22, 19, -40, -4, 17, -24, -23, 27, -18, -20, 17, 9, -32, 11, 13, -32, 1, 20, -24, -14, 32, -12, -5, 29, -1, -8, 16, 16, -29, 3, 23, -19, -7, 32, -15, -17, 23, -7, -30, 31, 5, -25, 16, 27, -22, -13, 16, -21, -19, 23, -7, -18, 22, 2]
3463Bk9K8J4m4L7K0m8RL9l4j3M8m1j0L7mm5M0K9m8J3L2k6j4M1k6l4N1qm3M4J1
3495B8m5J4K6l1MK1Jl0M3k6j5J7J6m2J8K1k7JK1j6j0K6j9k7M4Jm2L2J5l7QK5l2
3528a7j0L3%l8L9%m1K8L0l5MK3l9JL4j5k6L8J0m0L0K4m6J8L2m2mM1k9j6K2lk6
3561b0K7J3l2K1J9m6mL8j6j7L2j1k8K4K4l6RJ2j9mL9k4k4L4j4k3L3Ql8L3Ol9J9
3594dK2k7j4N0j8k4J9J4m6L1L0m7RL3k3j3L7j2m0M6Kn1L7Om1L5K0l5mK9k8j8M9
3627B4j3m1L8ok0J9Rl5J5K8l2pJ8J0l5M2%l5J8J8l9J4K2j5j7K7mk7L0Kl4K8J4
3660A6l9K3J8k3lJ4qk7M0jk4K8Nl1PK2k5jL2j0k4L3j1l2L2Ql2J8K0k8k1L1j2k5
3694c0L8ql0M3k1rJ0J6k8ML9k6j9K7kl4M5j4k1J5J7k7QK5l5%L2ok7L8ol3K8J1
$$ y = [2, -27, 1, 15, -29, 8, 28, -20, -11, 28, -6, -19, 29, -12, -22, 15, 11, -34, 6, 35, -13, 0, 32, 6, -8, 33, 7, -27, 24, 16, -27, 17, 28, -17, -3, 23, -8, -4, 17, 18, -12, 31, 5, -10, 7, 23, -19, -1, 20, -7, -6, 15, -1, -11, 15, -4, -31, 13, 14, -28, 4, 19, -18, -10, 15, -17, -27, 6, 6, -32, 7, 7, -34, -6, 24, -11, -7, 16, -23, -22, 12, -3, -29, 9, 19, -21, 9, 33, -13, 5, 37, -5, -9, 32, 3, -13, 9, 6, -20, 7, 20, -12, 9, 28, -18, -22, 16, 0, -17, 15, 4, -24, 0, 24, -12, -3, 9, -10, -14, 25, 1, -23, 11, -3, -26, 7, 15, -23, 10, 16, -23, -4, 18, -9, -23, 27, 9, -15, 4, 18, -28, 3, 33, -14, -5, 28, 5, -8, 29, 17, -23, 23, 25, -26, 11, 17, -24, 11, 31, -4, -8, 21, -7, -25, 24, 11, -30, 8, 2, -18, 1, 10, -25, -10, 18, -14, -21, -3, 7, -28, 14, 14, -21, -3, 15, -24, -10, 12, -3, -20, 7, 3, -24, 6, 8, -26, 2, 16, -23, 0, 18, -5, -8, 6, -2, -29, 11, 10, -14, 14, 19, -12, -5, 17, -8, -9, 23, 13, -11, 22, 11, -21, 11, 19, -13, 5, 25, -3, -24, 7, -5, -30, 8, 0, -30, 13, -8, -17, -7, 9, -19, -15, 24, -2, -21, 6, 4, -30, 15, 1, -20, -5, 12, -15, -7, 18, -17, -17, 15, 9, -18, 20, 14, -19, 9, 20]
3728B0l1J2L0l3j3L5rk0K6mk5J5K4m0J3L2l7mL6k5j8K4lk4L0J4n7K9J7l0LL6k7
3761dqK4ol8L6Ml3K5Pk9K4K9l3qL3k9j3L9nl1L1%j3kK9k8lK2qk2M1j5k4J6K5m0
3797gJ2J1k5QK2k1k1K6%k6K6Ol7J7J9l5NL5j6j4K2j5j4L2pllJ0l5J5K5k9JK8m
3832Hk9M1ok2K2Nk1MK2l2JL0Om4K4J0l9M4pj7OJ7j8qL4k9rK4kl1J2K3l8J2K1k5
3868a1j0K7j3JK0nj4KJ2l0K7J4k6nK5qk7L9j9k0L5%k4LL2l4KL2k0j8L5pk2K5o
3903A2k7K8J6m4J3K5k3JL0k8j6K2Nk4K7jk7J3K6l7OK9l3j0J8J2l6L3j0j5RK7l3
3936a2rL1qj1L3k2j8K5Nl7K8Nj6J3Rj3RPj1j8K5Nm0L2J7l7J3K1l0kL5j0k9L5q
3971A7j8J0Mj7%L1k5lK0k3j1K6pqJ5Ml6K5jk6J4K1j5k1K5jk1K5J2m1K2K4l8OK5
$$ y = [20, -11, 1, 31, -2, -15, 20, 11, -9, 17, 13, -12, 3, 27, -13, 0, 32, -5, -9, 27, 2, -16, 8, 5, -19, 11, 25, -32, -3, 14, -16, -13, 23, -4, -12, 12, 6, -32, 4, 8, -25, 0, 7, -22, 2, 31, -2, -10, 23, -6, -19, 20, 15, -16, 15, 15, 2, 0, 29, 1, -2, 20, 12, -10, 31, 16, -8, 8, 33, -7, 5, 16, -9, -1, 21, 0, -21, 5, 5, -21, 5, 11, -26, -9, 10, -25, -20, 15, -1, -15, 7, -8, -22, 10, 3, 0, -3, 7, -28, -13, 12, -17, -16, 12, 8, -21, 20, 14, -8, 14, 19, -2, 2, 24, -8, -7, 23, 29, -15, 9, 19, -20, 24, 17, 0, 6, 23, 5, -3, 31, 2, -7, 17, 15, -16, -4, 19, -19, -7, 14, -11, -21, 6, -7, -6, 14, 9, -5, -3, 9, -21, 6, 20, -6, -11, 14, 6, -21, 18, -1, -21, 14, 14, -10, -7, 25, -9, -7, 25, 5, -13, 22, 15, -7, 18, 12, -15, 13, 29, -15, -2, 23, 0, 1, 31, 3, -13, 9, 14, -10, 17, 16, -11, 2, 28, -9, -3, 26, -7, -17, 1, 13, -23, 10, 0, -15, -6, 21, -12, -21, 10, 2, -9, 24, 2, -16, 9, 14, -23, 5, 10, -6, 7, 16, 3, 12, 19, 8, -10, 15, 20, -20, 12, 29, -8, 5, 26, -4, -6, 29, 19, -10, 25, 17, -1, 9, 13, -4, -4, 27, 2, -1, 19, -4, -15, 11, 4, -4, 11, 15, -21, 4, 3, -23, -9, 12, -3, -24, 1, 0, -21, 4, 16, -25, -3, 21, -17, -11, 14]
4006A4j5j1L1k1j6K7k0j0L4J3k8MJ9j5qL9m2kK9mk8K2J6k2%J6pj7L5l2j7K8Ql3
4040a3J6oj4J7J9l6ML2k0j3K6ll1L1Qk9J4Rk6J7J4j6j1K8%m0L9Nl5L3mk7LL5j2
4075A4j1J9j1k5M5rl4K3Nk6J4J8j7kJ0j9rL6rk6J1K0j6pJ8j2MPj7k1L4j4j5K3
4109AkprK6j9rL1l0mL6k3j3K3%j3K4ok2QL3k3j6K2j6nJ5J0j1KK5l8J5K4k7LK3
4145B8j2k8M0k0k5K7Ok6%K6j8jK1j9k3L9ql0L2Ll1J0J3k5J0L4m1kL2j5j4J0K2
4178A5k9J3J7l1MK1j0lJ3j3j1L2pj7RJ5k2J1Rk0kK6pj8J7Pk6MJ8k5RJ6j4JJ7k1
4214brJ6lj7K3J7m6J8J0j5j1K8Jk9K0Pl0J6J9k2RNj0NQj9kK5rj5J7J1l7K6J9k7
4250cOK6k2rK6j6nJ6ll1K6J2k5MK0k1MJ5k6qK7pk1J6J9k9RJ4k3rL5l5kJ9krJ2
$$ y = [14, -1, -12, 19, -2, -18, 9, -11, -21, 13, 26, -2, 2, 21, 6, -2, 37, -5, -7, 22, 18, -10, 12, 28, 6, 6, 22, 15, -2, 33, 1, -16, 12, 20, -13, 3, -3, -17, 0, 19, -17, -13, 19, -1, -14, 12, 9, -22, 9, 17, -12, 2, 11, -15, 2, 16, 0, -11, 17, 17, -23, 16, 21, -14, 19, 15, -12, -9, 26, 14, 3, 22, 11, -14, 31, 22, -12, 11, 16, -10, 4, 22, 5, 3, 13, -6, -15, 21, 12, -14, -3, 17, 1, -6, 12, 0, 4, 11, -6, -27, 7, -7, -22, 1, -1, -8, -17, 9, -10, -19, 12, -18, -22, 14, -9, -22, 1, 1, -12, 12, 6, -16, -8, 25, 2, -14, 8, -8, -13, 2, 12, 1, 3, 28, -10, 5, 29, 2, 5, 28, 16, -12, 28, 8, -17, 10, 16, -10, -10, 16, -2, -3, 18, -1, -24, 15, 7, -23, 9, 12, -19, -9, 4, -21, -11, 23, -18, -20, 12, -3, -17, -7, 15, -14, -1, 16, -15, -11, 10, 0, -3, 10, -3, -14, 18, 11, -6, 3, 18, -4, 7, 16, -4, -6, 20, 13, -5, 12, 19, -7, -3, 15, -10, -1, 15, 1, 2, 19, -2, -11, 5, 2, -15, 8, 25, -21, -3, 7, -8, -19, 9, 10, -19, 1, 8, -22, -6, 13, -9, 0, 5, -5, 0, 8, -11, -13, 12, 3, -12, 5, 16, -21, 5, 24, -3, 3, 29, 7, -2, 24, 8, 3, 19, 16, -15, 11, 23, -2, 2, 22, 1, 5, 20, -6, -14, 13, 6, -15, 1, 20, -9, 0, 14, -9, -18, 17, -18, -20, -1, -3, -12, 0]
4287@J0k7J5JJj2J8rk2L1jj8J9Ql0K4Nk9KL9j5j2J3kj2J1J5l6K2J5k2QJ3k5j1
4322a3M1k4k1M1j8j6J9Nl1J6K4m0PL0k1j7J7Rk6J6LqOjpk5M2j3j0L1j2k1K4Nk4
4357a2J8mrpL2j1k1L1orORk4KK6j0j5K9l3J4J0j6oJ5Nk7K6rj7OK4j2k1K9j8rJ8
4394Dj7pQK7m5J8J6k7K1J3l1%K2Pk7J3Pk5J5K3k1jK2k7lJ5jk0K2Ok1J0J4k0MJ3
4430Gj3oK5Lk9K0mj5J9J7l5J1J9k9j2L7k2j8K3J7j6Qok0OJ1oj6L5j2k5K7Kk8K3
4465bJ2k7K0MroJ2j3ROnpJ4ok2J2K6j9oK4j2j1K5j2j1J7kk5J6K0k9J3J5k1j4L2
4501A8k4MJ5ml1K2Qj9lK0k0J0Pj3j6K9j3JK2jk6KJ4rrJ6%pK3j6pRJ3l3MK7j6j5
4539a8K5Pk9M3j6j9J6Nj0KRj0j0K4j8oK1ok1J2J2k4J1J4k6J1J2j6k4M4k3kROk6
$$ y = [0, 10, -17, -2, -1, 0, -12, 6, -3, -25, 6, 5, -13, 6, 14, -16, 8, 13, -16, -14, 25, 10, -2, 11, 9, -3, 8, 23, -13, 9, 24, 2, 10, 23, -2, -13, 28, 4, -17, 24, 6, -10, 9, 14, -17, -1, 23, -17, -10, 20, -1, -18, -1, 8, -18, -2, 1, -7, -1, -2, -9, -34, 8, -5, -15, 16, 4, -17, 7, 12, -12, 6, 2, -7, -14, 18, 7, -14, 17, 11, 2, 8, 17, -7, -5, 21, 11, -4, 25, -8, 6, 16, 0, -6, 9, 14, -13, 13, 4, -13, -7, 17, 5, -16, 13, -5, -14, 4, -13, -20, -12, 15, -30, -12, 4, -23, -2, 11, -20, -20, 2, 9, -18, -5, 2, -23, -8, 15, -6, -7, 15, -12, -15, 0, -1, -21, 1, 7, -14, -4, 10, -10, -6, 7, -6, -12, 13, 16, -13, 7, 3, -12, 7, 24, -11, 0, 19, -10, -22, 15, -7, -25, -2, 15, -1, 7, 1, -19, -13, -2, -8, -24, 11, -1, -26, 1, 3, -25, -2, 10, -17, 3, 7, -2, -8, 4, -9, 0, 6, 1, -6, 8, 2, -20, -8, 18, -1, -7, 17, 5, -6, 19, 7, -4, 13, 11, -14, 2, 22, -7, 6, 21, 0, -14, 18, -6, -2, 13, 9, -22, 0, 8, -11, -14, 6, -14, -4, 3, -10, -26, 3, -10, -9, 13, 12, -14, -12, 2, -7, -16, 0, 0, -7, 16, 0, -7, 2, 15, -18, -14, 13, -3, -18, 7, 14, -15, 28, 12, -7, 9, 14, 4, 6, 15, 5, -5, 19, 1, -5, 16, 10, -11, 1, 13, -11, 0, 14, -12, -1, 11, -5, -29, 15, -8, -10, -1, 5, -21]
4574b1J7Qk9J5J1j7%K1pj0MRj9J5Pk1J0K0k3JJ7j8lK1Pk1J5Qk1OJ2j1j1K0qj2
4610hJ8Lk4J9lj6J5J7j8pK2k1rK1j7jQLqQLk7OK2qpJ4lj7RJ4l0K1Nk5J1J7k3J1
4649eK8k6%jJ3k6J7KJJ3lj2jJ8j9lJ7jk4K2pj4OJ1mj3J9j3jJ6kj7J0Oj7J1J0k7
4687a6J2J0j0nK4l1lJ7Ok3J0J2k0RJ4j4k2L5j8j5M3nk5QOrRJ6j3j0K4j7nK7pj6
4723bRJ0k9J2J6j1j4K5j7j2J6Lj2K1oj6QJ3j7oJ4j5kJ1jj1K3pk2J3Rk6NK5rj9
4759b1L0oj7K9j7j5J6Oj5%K0j6%J9j6jJ8j0mQJ1j3j3K9j3k3J0Nj1ROk4K5Nk2J
4795a0K0k2OJ9j5rK1ok3K5Kk6J7%j9J6K4l6jL1j9lJ6j2J0j6J7k3J1J0j0oJ8%q
4830aRmjkMkMjJkJ9j5mk%lJ0Lj8PJ1j5jMnj2J1Qj7J2%j1J1Rk0J4%j6RJ2j5nJ1
$$ y = [-21, -4, 4, -25, -10, 1, -16, -16, 5, -2, -12, -8, 1, -18, -3, 4, -17, -7, 13, -10, -9, 8, -10, -13, 8, 15, -6, 9, 17, -4, 2, 14, 3, -8, 12, 4, -8, 10, 13, -11, 8, 5, -11, 4, 21, 3, -4, 18, -3, -12, 9, -8, -9, -1, 2, -6, 2, 5, -22, -16, 6, -2, -9, 5, 2, -15, -6, 8, -22, -1, 4, -21, -10, 7, -16, -5, 23, -3, -3, -4, 9, -17, 0, 2, 3, 16, 13, 1, 0, 18, -1, -4, 13, 12, -12, 10, 3, -11, -5, 6, 2, -11, 8, -5, -6, 10, 8, -9, 1, 7, -10, 1, 11, -16, -4, 6, -4, -9, 15, -16, -19, -2, 4, -19, -9, 3, -17, -8, 6, -8, -30, 5, -13, -28, 15, 10, -15, -7, -1, -10, -1, 15, 2, -8, 16, -1, -6, 21, 14, -2, 7, 17, -12, 0, 16, 5, -9, 16, -1, -13, 3, 6, -6, 15, 9, -7, 1, 14, -3, -9, 5, -10, -12, -1, -2, -13, 10, 3, -19, -6, 3, -23, -18, 7, -2, -21, 9, 3, -14, 15, -2, -17, -1, 5, -10, -10, 10, -6, -6, 13, -3, -4, 14, 4, 0, 8, 19, 6, -7, 22, 9, -14, -4, 1, -10, -1, 5, -19, 6, 11, -11, -10, 10, -12, -6, 13, -2, -11, 10, 4, -19, 6, 8, -18, -1, -1, -20, -4, 20, -16, -17, 14, -5, -8, 8, -4, 6, -10, 7, -16, -5, 5, -5, -11, 7, 7, -1, 8, 4, 3, 1, 5, 3, 7, 6, 7, 5, 24, 9, 5, 3, 3, 0, 10, 13, -5, 2, 13, -2, -3, 1, -4, -16, -5, 3, -14, -2, -2, -13, -2, 7, -13, 1, 1, -15, -6, 6, -9, -14, -3]
4873cJk8K8J7l3J3J3j9pK7k0mRJ7k5QJ5j2LRj1%MLj7K1J0l4K3J0l0J0J7j7PJj4
4910hKJ0kk0RJ9j9J0Joj5K6j1j5L2j8jMNk8J7NNj0K2j8lOJj2L5j3k5J3J5k0RQ
4948A0oqRojJ0%j2NLj0QQKj6J4Lk6J6Qk0J8%olJ0j6NJ5mk7K9k1kQMj5J6%j5j3
4989b6K0koK3j6pJ3J7l1NJ1k0RK7j1oPkj5K3mrMK4l2JJ9l1QL1k8nJ7J5l6K1Lj1
5027@PMj1j3K0rrJ5j1kNPk4J2J3j0j6K6j4j2J2Rj5J6qmJ1Mj9LK1k8JJ5MqPJ3k6
5066a4NJ1j3OK2j6j3J2J1k0NJ1k3J4J7j4oQj8J3R%l0K1lj3J9Pk5RJ2j6%J4j2P
5102ckNj8J0Nk1NK5j6pK4k1lK2olJ1jk3RJ8j0LJ9k3KJ6j2oRQj2NNqkJ3j4LJ3O
5143B5k4P%j9J6Qk2OJ8k2mJ7j3LPmj8J3Qj1OJj3lK4k1oJ3Nj3J8rjjJ6j4LJ4Jk6
$$ y = [-3, -2, -30, -2, 15, -18, -5, 8, -11, -18, 9, -11, -15, -6, 11, -14, -6, 9, -3, 0, 9, -2, -2, 2, 5, -12, 9, 19, -15, 8, 18, -12, -2, 15, -2, 5, 6, -8, -6, 4, 2, -18, -9, 10, -9, 1, 2, -4, -19, 7, -4, -19, 13, -5, -6, -2, 3, -25, -8, -3, 2, -8, 14, -4, -7, -1, 0, -12, 23, 10, -15, -2, 13, -7, 2, 10, 4, -4, 5, -1, -2, 8, 8, -4, 1, 4, -6, 2, 10, 12, -4, 10, 13, -13, 3, 11, -9, 9, 9, 3, 0, 10, -6, -1, 14, 10, -17, 12, -9, -11, -3, 1, -14, 2, 2, -13, -26, -6, -8, -14, 9, -7, -14, -1, 16, -15, -10, 1, -19, -10, 17, 6, 0, 7, 5, -10, 13, 9, 0, 4, 28, -4, -3, 16, -15, -7, 24, -4, -9, 8, 23, -13, 8, 11, 0, 7, 11, 0, -13, 7, -2, -11, 4, -7, -9, -4, 3, -21, -9, 4, -6, -22, 4, -10, -22, -10, -1, -16, 0, -8, -12, -1, 3, -16, -13, 8, -20, -19, -4, 0, -8, -1, 12, -14, -9, 2, -11, -5, 17, 1, -12, 0, 11, -9, -4, 7, -16, -2, 15, 1, -5, 3, -15, -2, 7, 7, -23, -2, -5, -18, 1, 8, -17, -8, 4, -12, -12, 2, -10, -3, -5, 0, -18, -8, -3, -24, -19, 6, -10, -17, 7, -14, -17, 5, -1, -4, 7, 6, -17, -8, 10, 0, 3, 22, -1, 1, 17, 5, -1, 8, 16, 4, 9, 14, 6, 4, 17, 3, 6, 19, 25, 1, 8, 8, -11, 5, 13, -9, -3, 15, -7, -11, 6, -7, -4, 3, -1, -19, -6, 2, -9, -3, -2, -15, -18, 6, -15, -21, -8, -3, -16, 2, -7, -8, -9, 7, -7, -4, 10, 11, -15]
5183a5J8j1Q%J2j2lNLKJ7j4j8J9rmQKj0J4Qk0Rk%k0K2j1mLPoJ5nk0JJ7nj4J9j1
5224epJ5Jj9J8Lj6QJ2j2pPKnJ4j7J1ONj4J0lkrJ9j5mJ9j2m%JmOJ7j7jJ4j4kLJ3
5266A5j5JPk2QOj1QqjkNJ6k1NPrmJ8j4%J0kmJ6k1nJ2Mk1J5J4l1K7OpPMk2J1J2
5307A4j2ljJ4j2%Pj6NJ1Qj4JRk3J9Rj4lOj4%J3kj3J0Lk2K0mj8K6j1lJ4Jj2nJ4
5346Bnj2J3nlQJ8j1j4J0j0qK2qKQpLlJj1J9Mj5NQj3KNLj2OQj8J7Lk6LK7j5j1J4
5388Dpj2J1Oj6OJ1j0%K4k4nMqJ2jQj0NMk5J2J9qMlMJnK0l1J8Kj7J1J7k2kJ4j5
5428dMmJ7j3lJ9k0lJ8j4KPj2mJ8oj7J3Pj7jJ3j3J2Nk0J9j1rLJ8j5JmRloK1j4m
5468a1J0Jj7J7%j2J8j0QlMPj0LOj5OJ0j0QLj3J1kjj1K1qk5J5Qj1Mlj0J8mojMk
$$ y = [-15, 3, -8, 0, 0, 12, 0, -3, 2, 5, 7, 24, 10, -8, 11, 2, -2, 6, 8, -2, 12, 20, 0, 9, 7, 7, -13, 9, -2, -6, -3, 4, -2, 13, 8, -12, -11, 6, 1, -13, 6, -5, -12, 3, 4, -15, 3, 6, -10, -2, 10, -2, -9, -2, 0, -5, 9, -8, 3, 9, 14, 0, 10, 7, 5, -4, 15, 0, -4, 15, 3, -1, -1, 0, -4, 2, 19, 2, 1, 15, 1, -1, 2, 15, 0, 1, 8, -14, -6, 0, -11, -3, -11, -12, -14, -9, 7, -14, -9, -2, -11, -15, 3, -11, -11, -1, -3, -7, 9, -12, -17, -5, -1, -22, -7, 7, -24, 3, 9, 2, 9, 13, -9, 2, 14, 2, -1, -2, 12, 0, 0, 7, -9, -4, 7, 15, 1, 2, 11, -12, 7, 16, 2, -1, 5, -9, -9, 4, 2, -11, -1, 2, -20, 0, -4, -22, 4, -7, -10, 4, 5, -7, -12, 2, -3, -15, -2, -7, -10, -2, 16, 5, -9, 1, -9, -17, 5, -3, -1, 7, 0, 3, 0, 1, -10, 9, 13, -2, 3, 11, -2, 0, 5, 8, -4, 2, 10, -8, 9, 12, -14, -11, 16, 1, -10, 4, -3, -15, -4, 2, -14, -8, 3, -7, -7, 17, -7, -12, -8, -16, -4, -5, 3, -7, -2, 2, -23, -11, 8, 0, 4, 1, 5, 6, 1, 21, -10, 8, 10, -7, 4, 21, -1, -3, 11, -4, 0, -4, 13, 0, -3, 16, -4, -7, 11, -3, -1, 6, -6, -10, 8, 2, -15, -2, 5, -12, -13, 0, -13, -1, 4, -16, 3, -8, -17, -14, 4, -11, -10, -14, -5, -8, -14, 7, -7, -11, -1, 0, -17, 0, 0, -12, 6, -4, 4, 1, 5, 12, 2, 5, 11, -4, 2, 12, 2, 10, 13, 0, 11, 9, 8, -3, 18, 10, -15, 0, 8, -3, 1, -2, -12, 6, 2, -4, -5, -1, -3]
5509cpQLj7K2Oj8QJoNMj6KNMj3J9jnPonj1K6j0oK0oj6J2MpRj0j1J8Rj2j0NnmJ2
5553DOj7RMl0J0K4k0jPJ5k0jLj3RkQrJ8j1oJ2j0j0K2Qk4J3Pk2RJ9j6pK3qoQLj7
5594iK6j6j2J8rRLPj9MMNk2QOKMRj9OJPj2Pkj2KQkkJ2k0%Rj1J5rj0MJ3j3j5J9
5637f%mRj0PJJ6qj3J9rpR%JRLpNj1jKLLj6J3kj8J6KqJJ2mJqmlJ0pkKMqjJ5pj4
5685a5L2j7oK0j4j4K0pqJ6Klj4J9j5kPJ4k4J4KojK1j1j4L1k3Mm%nPNLrJ1j3rK9
5725B3j7j5J6Qj5J0rpKJ2j1JK1k3qK5j9nRmoMRj0oK2k1KJ3j3j7K6llJ0JoQpNM
5766FJ1j6j3K8j0jOJ5l5J4mKkJ8j4jJ2j1pKJ5j1Jlj8J8LJ0j2J4j7qRJ2k1lJ3j5
5804a3MJ4j9J4Rpj1RjmjJ2j2ONk0J3QPk5K2kj0J1jJj7K5j2J1Mj6qQkqK6j0Pj3
$$ y = [-3, -10, -2, 1, -16, 6, 12, -6, 2, 3, -3, 2, 6, -10, -8, -3, 1, -12, 7, 6, 1, 8, 2, -3, -14, 12, 2, -4, 16, 10, -6, 6, 10, 3, 12, 2, -9, 9, 18, 6, -4, 1, -4, -8, 4, 10, -7, 2, 6, -24, -14, 10, -10, -11, -4, 11, -9, -10, -7, -20, -11, -13, -5, -14, 4, -7, -13, -1, -11, -21, 1, 9, -15, -2, 5, -17, -8, 11, -5, -12, 11, 3, -3, 5, 8, -9, 17, 1, -11, 7, -2, 7, 10, 17, -2, 2, 6, 11, -11, -3, 3, 5, 9, 18, -1, 5, 6, 13, 1, 8, 6, -6, -4, 4, 2, 0, 12, -8, -8, 1, -10, 5, -4, -14, -10, 3, -10, -25, -6, -6, -10, -1, -11, -4, -3, 13, 5, -8, 11, 2, -5, 4, 4, 5, 14, 17, 10, 15, 4, 3, 5, 8, 11, -5, 8, 6, -12, 4, 6, -2, -1, 11, 7, 8, 0, -4, -7, 3, -4, -6, -4, 0, -8, -9, 6, -1, -15, 17, 0, -6, 14, 0, -14, 6, -1, -9, 7, 9, 6, -8, 11, -4, -6, 1, 15, -9, 5, 7, 1, 0, 21, 10, -4, 27, 4, 8, 4, 4, -1, 6, 11, 14, 5, 16, 3, -6, 23, 6, -9, 7, 15, 0, 10, 1, -6, -4, 8, -3, -2, 19, -4, -12, 13, -6, -11, -2, -6, -12, -8, 1, -9, -15, 7, -14, -12, 1, -12, -29, -3, -6, -9, 1, 2, -4, 4, -3, 2, 6, 17, 1, -12, 16, 6, 5, 11, 26, -9, 5, 1, 3, 1, 19, 5, 4, 16, 5, -2, 0, 15, 4, 5, 2, -16, 2, 5, 15, 3, 17, 0, -8, 1, 13, -8, -11, 2, -13, -9, 5, -14, 0, 9, 2, -9, 0, -1, -5, -6, 6, -6, 0, 5, -15, -2, 6, 13, -12, 10, 8, -2, 9, 8, 9, -8, 17, 5, 16, 20, 4, -4, 4, 2, -6, 20, 10, 17, 4]
5844DkpJ2opmJ5jj1J6lrmQj0%J3qjnllLNmJ0Oj8jPmJ2j0J5%j0PkJLKoJ4j6QMj3
5891cmJ4J2pnLrLPj6kJ9%k7K4MprJ9j8kJ4j4Rkj4QRj2LmMl%LmnQJ0pJ2j9j2K0
5935@oJ%Prl%MmJ8lMLkrkPj5QJ4Jk3K2Jlj2NmJ0LonOpkJ1j8PJ0lj6J6j3j2J6L
5981@j6J1Qj4mK0qj2RO%qQjLmRj3K0pmkOj0Qo%J1jloPOj1J6j4qJ1Mj7OJ6k0LK
6026A%lPlj7J5ljj1NOJjOk2K3lj1J6j4OQJk1J5KoQNPj3J3k3rK2jrlK1%j7K1j7
6069AOQjjpmPLnj1lK1j2oJ0qJ3lMj1j1J0JjnOJJ0qj5J9pkqQpmK1lqRljOlpPqK
6118@J2oq%JPqJ2Kl%Qj0j5J4nmQjj1KLj1NJ3pKrNj5J8J0j2oPk5OK2j0J1rjJ0j4
6162a2QKkJJ0j0NkqJ7lj3K2j3j7K4rNMmlN%%mJ6j4jJ6j2K%kk1J1K4j7pQj2J2J6
$$ y = [4, 2, -5, 7, 1, -6, -10, 5, 4, -7, 9, 6, -3, -7, 1, -9, -9, 4, -4, -5, -10, -13, -16, -13, -8, -12, -2, 4, -14, -15, -8, -12, 0, -10, 5, 5, -5, 2, 0, 1, 4, 6, 0, 14, -2, 6, 10, -3, -7, 7, 19, 12, 7, 10, 1, 4, 11, -5, -7, 12, 12, -15, 9, 13, 6, -3, 16, -2, -4, 10, -4, 5, 3, -11, -3, 6, -6, -3, -7, -3, -6, -6, -3, -7, -12, -4, 6, -1, 11, -8, -20, 0, -6, -5, -5, 2, -7, -10, -10, -6, -10, 8, 5, 9, 12, 10, 1, -1, 6, -9, -1, 13, 14, -9, 13, 14, 11, -1, 4, 0, 10, 13, 7, 2, 8, 1, -1, 10, -8, -1, 9, 6, -10, 6, -7, -19, -3, 0, -16, -5, 3, -11, -15, 5, -3, -15, -6, 0, 0, -8, 0, -1, 2, -2, 7, -6, 14, 7, 3, 1, 7, -3, 5, -1, -1, 10, 9, 6, 0, 7, 13, 2, 18, 4, -4, 7, 11, -6, 0, 16, -4, -1, 1, 1, -2, 5, 2, -15, 0, -3, -4, -15, -10, -4, -3, -4, 2, -20, 3, 0, -11, 5, -9, -3, 5, 6, -15, 0, 2, -4, 4, 9, 16, 3, 16, -7, -16, 6, 5, -4, -7, 14, 14, -3, 18, 1, 7, 15, 14, 13, 6, 2, 9, 12, 7, -4, -7, 14, 2, -4, 6, -2, 11, 8, 12, 1, -10, 0, 1, 0, -5, 1, 2, 12, 4, -11, 8, 1, -1, -9, -1, -8, -12, 9, 6, -2, 7, 4, 3, 9, 6, -1, 6, -2, 0, 12, 6, -2, -2, -1, 6, -2, 10, 12, 9, 9, 17, 7, -8, 6, 1, -3, 5, 4, -7, -5, -2, -13, -8, 5, -2, 0, -9, -4, -19, -1, 9, -3, -9, -2, -27, -21, 1, -9, 2, -7, -8, 2, -12, -4, -2, -4, -3, 7, -3, 2, 0, -8, 9, 6, -7, 15, 2, -15, 9, 0, 5, 9, 5, 2, 7, 7, 7, 3, 19, 5, 4, 20, 8, 10, 10, 8, -13, -2, 22, 5, -2, 6, -6, 6, 22]
6204B2l3LJ2oj1QPj9J1jjj0RnKJ2ok2J9J3j8NNNpJ7j9NkRj5J9qqKJ8j3mK0j4J
6245BJ0oRm%jk2J8nLPj4MlJqPOqkJknNJjM%qNmqRQnoQOrL%kRLJj1J8j3nJ5j6P
6297BNlp%QJPpkj2J8j8PJJ0qmLjj1J4nPnnNQrqJnNqRnKJ9l0J5j1oJ3kJ7j1mJM
6345eJ0rJ1rKJ%Nj5J5kOpMJ0nj0J8k9KK4k6JK2moMnoKJ4j1oJ7j2Kj6J1L%KJ8l7
6388a6J2njJ4oJm%LonkLK0j7NnPJ7lk2KJ6poJ7rMnRlljLKKNqpMOj1%j4J6jpoJ7
6437EpjlMpKOk0RJ6ok0J5jNqJ3j9NJ1m%NnJJ0j7PJ2J%j5P%kK7k6KJ5j7mJ4jkj2
6482eJ6mKKk3QOnMLlmJOqLQ%j4mJ2j5NlnK%J0qkNKRqkNLkOnLoJ2j8JJ8Ok1J4P
6532A4qnNqLJ0llN%qnRrNJ3j6qJPlJ7j2lPnqmoQlRqPOn%pJ3j3JJ2kmMj4J4%ll
$$ y = [22, -11, -8, 4, -2, -13, -5, 2, -17, -6, -7, -8, -18, -9, -14, -12, 0, -6, -28, -9, 4, -14, -9, -4, 1, -6, 11, -8, -3, -5, 4, -11, 8, 0, -8, -6, 12, -1, -5, 15, 1, 2, 12, 6, 15, 11, 11, 10, -12, 6, 1, 4, 11, -3, 1, -2, -1, -9, -2, 4, -4, -6, -5, -7, -12, -7, -6, -7, -3, -3, -11, -6, -10, -18, -9, -1, -6, -12, -4, 2, -7, -4, -4, -6, 3, 6, 7, -4, 14, 1, -4, 11, -5, 2, 7, 4, -3, -3, 5, 6, 13, 6, 4, -8, 10, -8, -1, 0, 10, 2, -2, 1, 0, -11, 3, -2, 5, 0, -5, 0, 8, -1, -9, -8, -13, -8, -16, -7, -12, -10, 9, -21, -6, -17, -23, -10, -12, 5, -6, -10, -9, -5, 5, -4, 7, -2, 0, 1, 1, 6, -9, 6, 4, 10, 3, 7, 17, 12, 2, 20, -9, -7, 17, -9, -8, 14, 10, 4, 8, 3, -3, -1, 13, 2, -4, 13, 1, 3, -13, -2, 1, 1, 3, 21, -16, -4, -9, -10, 4, -2, -1, -5, -5, -2, -8, -13, -15, -12, 8, -9, -4, -9, -2, 15, 12, -10, -8, 8, 1, -5, 12, 3, 7, 2, 11, 8, 5, 4, 7, 9, 11, 16, 8, 1, 5, 11, 0, 0, -14, 2, 1, -6, -12, 5, -2, -3, -6, -2, -9, -7, -1, -21, -12, 4, -2, -22, -7, -8, -3, -11, 2, -17, -12, -1, -5, -5, 0, -5, -4, 6, -11, -4, 8, 9, 9, -6, 1, 1, -1, 26, 0, 2, 17, 0, -4, 10, 9, 7, -5, 11, 7, 9, 11, -12, -4, 2, -3, 1, 4, 1, -3, -2, 4, -4, -1, 7, 7, -7, -11, 1, -14, -9, -12, -17, -15, -15, -5, -13, -15, -10, -8, 1, -7, -9, -4, -1, -3, 3, -2, 1, -5, 7, -11, -10, 8, 14, -7, 7, 14, 6, 1, 6, -2, 1, 11, 8, 5, 10, 10, 2, -3, 6, -3, 2, 15, -1, -9, -8, -1, -4, 13, 1, -2, 5, 0, -8, -12, -18, -10, -13, -4, -12, -5, 1, -4, -4, -11, 2, -11, -10, 2, 0, -4, 0, -14, 0, 0, -3, -6]
6582fOMk%j0M%KJ1q%JMJ3j9QkLqJPj0%RrkJ2jj3KkLkMrMPJnlmmMqnK3mKj1Qlp
6634a4QrKJ2%mJ1Jj4%OjJ8j2oLJ4qj%Mj0J3oqLKOj4J7qj0QmKJJ0j6%J9j6Rpmp
6679a0OqjJ0PpMMj2LmLlJ8j8lJ2j7J8jmMlOjoO%joK1lj0oKOmlRj2QoJ1j1MqJ1
6726Ekj3kK%PKlOljKonKKRj3kOPkLj7NLmPLjnJ7Lj4PkoJ1nkMOmjmNpMPnJ%%qj
6781bKKj2J1JlPpJ5j5mJ5j7m%RpJ2oLk1J4rOK3pnnJ1j1LMJ2j4oJ1lKMj6J1j0R
6824CPnJ5pk%Qoj0PkrJ1J1poj3J2LnLjNOk0%omnJ4Pj3OKj1LlJ0KmJ6k3POmLmm
6872gJ0mKJJ2roQjpJ5nj3LJ4m%j1J2mNrLljkmJ1rj0J2nkRlj0LJ1nKmPrPj8J1K
6919eNmjLlj6K0j1J4oJOnjnJ7Lk0MK3j6Qj5J1NlMKoK%lOJk2K0qLj2J3jj7J3pR
$$ y = [-6, 0, 4, 2, 2, -8, -4, -4, -2, 9, 1, 1, 2, 6, 19, 0, 8, 6, 9, 1, 2, 9, -1, -1, 8, -1, -3, 9, 8, -5, -3, -5, -2, -4, 0, -9, -5, 2, 3, -2, -5, -9, -13, -9, -17, -22, 1, -3, -1, -12, -4, -7, -14, -6, -15, -13, -1, -1, -5, 6, 7, -7, -7, -1, -2, 16, 4, -2, 1, 15, 7, 6, 6, 10, 0, 13, 7, -1, 2, 4, 10, -4, 13, 5, -5, 3, -1, 1, 2, 12, -4, -4, 15, -1, 8, 1, -3, -10, -4, -12, -13, -3, 4, -3, 1, 5, -7, -4, -8, -5, -8, 10, -8, -11, 1, -16, 2, 1, -3, 1, -2, 4, 3, -3, 3, 3, 2, -4, 17, 14, 4, -2, 0, 6, 2, -1, 8, -4, 4, -2, 9, -2, 2, -6, 5, 3, -10, -12, -10, -10, -3, -1, -4, 2, -1, -2, 0, -6, -11, -9, -7, 2, -11, -13, -7, 0, -2, 1, -16, -11, -8, -12, -5, -2, -3, -8, 9, 12, -2, 5, 3, -3, 8, 3, 1, 5, 11, 7, 6, 2, 7, 0, 4, 11, 6, 7, 7, 7, -1, -2, 0, 2, -10, 1, 2, -1, 6, -1, 14, -1, -5, 10, -7, -11, -11, -2, -9, 3, -3, 0, -21, -7, -16, -10, 13, 6, 1, -4, 7, -4, -1, 3, 15, 1, -5, 6, 3, 5, 9, -7, 4, -6, 3, 10, 5, 20, 13, 11, 11, 19, 13, 3, 10, 8, -1, 10, 21, 14, 8, -5, 7, 10, 5, 8, 7, 12, 18, -2, -2, -8, -12, -17, -3, 4, -9, -3, -1, -12, -9, -12, -2, 0, -4, 12, -11, -4, 2, -2, 1, -3, -7, 3, -1, 1, 2, 14, 5, -1, 7, 6, -1, 14, 9, -4, -1, 13, 9, 9, -2, 10, 6, 11, 2, 5, 2, 1, -1, -5, 6, -3, -13, -1, -6, -8, 1, -2, -12, -9, 2, -3, -1, -5, 2, -7, 0, -18, -7, -5, 0, -4, -5, -2, -5, -21, -1, -12, 2, -4, -3, 3, -2, -3, -8, 9, 12, -8, -4, 19, 3, 11, -4, 7, 12, 9, 13, 15, 9, 11, 11, 8, 14, 15, -7, 13, 5, 8, -4, 9, 8, -9, 4, -3, 6]
6964FPj8kLj3J3MmLQKmj4QJnKJoMKpNqNJ2lj0kJ2J0j3oQkmQj0J6pjQnNlQoqmQ
7014DOj1J6j1nMQpNoj2NQj5J0Jj4OkRLj7J8qJmjPlPLqNMj7J5lJ0kj5J2pnJ5j4
7059e%J5RpmkJ6k9K2Jj2m%JjMJjj3K0qj8J7qLpJ9j0mJ1j3mJ0%kopJ4lmL%pRmJ
7105gQMjrOL%lJpJ7Qj4jMkkQmmk%OOpnOpMpMpK3j6Lj1OKLj2LqJ2PlrmJ1Jm%Kn
7158cjJoJ3%j4J2m%kmRMj4J6j7MNLOoqKJ4lqJ0oJ2k1LJ3j5QKLJoj2J1mpK3j5l
7203drJ5%pqJ0jmjmOnkJ7LnoOK%KOjMj2lRj0J8j4jJ1j0J1lQj2NjlJ1rmj4OJ1j
7250Gp%J6j1%j2OjLPj9J0MmLjj0PqkMlOmRkj9K9rOrMok%QKnjJ8nj0lNRj0QlpK
7300@Qp%jmK0j5LrJnMPQkj1nPjj4PlROj3KLlJJj0jMJ2j1%LJ3oJJ7j0j2RPoJNj5
$$ y = [6, 13, -5, -7, -4, -17, -4, 0, -4, -1, 7, 9, 5, -9, -1, 0, -5, -3, -2, -8, -4, -2, -9, -4, -12, -7, 5, 2, -8, -10, 2, 12, -1, -7, 1, -1, -5, 3, -7, 9, 2, 1, 9, 4, 9, 6, 14, 8, 0, -4, 4, 10, -1, 15, 4, -1, 3, 11, 4, 9, 3, -9, -4, 4, -11, -1, 0, -14, -8, -10, -1, 2, -15, 3, -5, -4, -8, -9, -2, -5, 2, 5, -3, 2, 6, -11, 4, 1, 11, 9, -6, 6, -1, -6, 9, -5, -5, 10, 19, 12, 8, 6, 22, -7, 15, 16, 4, 0, 0, 1, 0, 4, 5, 4, -9, 11, 3, -15, 2, -6, -3, -10, 9, -1, -5, 6, -7, -11, -1, -1, -3, -9, -16, -2, -5, -9, -6, -6, -13, -4, -8, -7, 1, 5, 4, -5, 1, 4, 4, 1, 2, -5, 12, 20, 6, 5, 9, 7, 5, 13, 9, 5, 3, 3, 9, 15, 8, 3, 9, 2, 6, -1, 3, -4, 19, 3, 6, -5, 1, 3, 6, -6, -3, -11, 1, 8, 5, -4, -8, 3, 4, 0, 0, 2, -3, -4, -3, -9, 4, 4, -10, 2, -2, -2, -4, -8, 1, 5, -9, 7, -10, -6, -1, 2, 8, 2, -6, -4, 10, 7, -1, 9, 3, 15, -6, -3, 10, -5, 3, 5, 8, 9, 3, -9, 2, -2, -9, 14, -1, -4, -13, 2, 2, -5, -13, -3, -4, -8, -9, -13, -7, -12, -14, 3, 6, 1, -5, 1, 3, 3, 5, 11, 10, 14, 2, -1, 8, -2, 16, 2, 1, 12, 2, 13, 10, 18, 6, 11, 10, 7, 18, 9, 5, -9, -3, 8, 7, 0, 0, 16, 5, 5, -7, -1, -2, 1, 8, -11, -1, 3, -1, 2, 1, -9, -2, -10, -12, -8, -11, -5, -9, 0, -2, -21, 8, -1, 5, -4, 0, -6, -8, -8, 0, 2, -3, -4, 14, 9, -1, -4, 1, 10, 0, 8, 5, -2, 0, 8, 1, 1, 0, -4, 16, 1, 4, -5, -4, -9, -5, 2, 10, 8, -3, -8, -1, -2, -16, -9, -12, -3, 3, -10, -8, -5, -8, -7, -6, -16, -17, -13, -1, -12, -12, -9, 4, -2, -1, 16, 6, -6, 3, 10, 4, 5, 10, -5]
7349eRJKMonnJ2l%Jnj1J6Oj2QpLKllMjk0J7Pj4J6j8jKJ3prJ6j0MqKLrLJ1lJ1j6
7396hNpQPKrMjKrJ0Pj0J6mj8J7qPj3RPj1JOPJj7L%MJ0j3JNj7NLjMl%j7J8Kj0o
7443a1J5poMlLJ2nqLMLomKqK0lmQlMorJ3kLrJ7pmlLoJ1LpmOj6J3J%kkjJj0J1k
7493Bkoj2J5JkmnQLkoLOMnlmMKQQj0kPpoLJ2j5J1jn%JnJ7J2j3JmjLmPqKJ4kj0
7543A0pOnj%j2Rj2KJ4%qOKmllqJ2mlPojKoJ6j2RnNnJJ7qpRk1RQoLkMoRJj4J5N
7593A2j3J1qjJJqjJ4qMmmkKLnmRkJ%j3POjqJNRj7J9Jk0J5mjJ0onQKj1ROJqj0K2
7642A5j3LJ2qoJ6j0oOLJLj2mPMoRj1JplJ1oRmKnmlkLKpLkmOpOMK%k0J6LJ4j1j2
7691a2J6j2J3mmMnQJ5%k1LQn%LlRRqkj5J2pLmQRj1j%j2Rj2K0k3K0j3nPjoNJnm
$$ y = [-5, 4, 5, 7, 11, 5, 0, -5, 7, 4, 4, 5, 0, -11, 5, 11, -1, 7, 0, 3, 5, 2, -1, 3, 2, -18, -1, 6, -8, 8, -10, -11, -9, 4, -3, -12, 4, -6, -2, -10, -8, -5, -14, -11, 0, -3, 8, -8, -3, -10, -2, 5, 7, -2, 2, 1, 3, -6, 4, 11, 1, 17, 13, -5, 12, 4, 11, -2, 7, 14, 3, 4, 10, 17, 18, 1, 4, 4, 8, 18, 5, 6, 11, -6, -1, 2, 1, 5, 2, 2, -15, 3, 5, -5, -11, 4, -3, -9, -5, -8, -5, 7, 2, -6, -3, 1, 4, -2, -6, -4, -12, 8, 5, 1, 9, 6, 10, 4, -5, 8, 6, 9, 0, 17, 10, 6, 3, 6, 0, 11, 14, 7, 3, 9, -7, 6, 7, 7, 5, 3, 2, 3, -7, 4, 2, 0, -6, -18, -3, -2, -4, -8, -13, -5, -2, -4, -10, -7, -1, 3, -2, -5, -9, -5, -3, 5, 13, 3, 1, 8, 1, -5, -2, 10, -5, 6, 5, 0, 0, 1, -4, 13, 25, 12, 13, 9, 8, 11, 7, 14, 6, 8, 22, 20, 10, 3, 9, 4, 3, 3, -9, 0, -12, -10, 4, 4, -4, 2, 4, 0, -3, -6, -14, -2, -6, -9, -2, -8, -9, -7, -13, 3, -9, 0, -5, 0, -5, -4, 13, 5, -2, 7, -14, -5, 3, -3, 0, -2, 2, -4, 5, 6, -8, 7, 12, -1, 10, 2, 1, 2, 3, -5, -6, 8, 0, 4, 0, -4, -6, -4, -1, -6, -10, -1, -3, -2, -2, -15, -8, -2, -3, -11, -10, -5, 4, -13, 6, 7, -13, 2, -2, -3, 7, 1, -4, 4, 6, -5, 4, 10, 11, 3, -7, 15, 2, 5, 17, 9, 3, 19, 9, 3, 9, 12, 13, 16, 4, 0, 7, 11, 5, 14, 3, 4, -3, -6, 5, -1, 8, 4, 6, 1, -3, -6, -8, -5, -3, -10, -7, -9, -13, -7, -14, -8, -4, -2, -2, -22, -6, -3, 11, 0, -12, 4, -8, 5, 1, -3, 1, -4, 4, 19, 19, -2, 1, 9, 4, 4, 7, 4, 13, 22, 14, 12, -3, 9, 2, 5, 1, 9, 18, 7, 6, 6, -6, 3, -9, 11, -12, 8, -5, -10, -3, -4, -10, -5, -4, -9, -13]
7737a3Noj%J3NnlnPkJ2kPk2kQKJ2rmLmJ3Kj1LJJlOOmj9K2oqKjMoJ0pMPj8oJ0l
7786enQOj2QpJ1j7J8j4J0ml%LQj3JLJ0JoKnq%POMmLjJ6j4KlMOoqJ5qjmQmKj3O
7835CJ0%pLkj3KjL%nnJ3lkPj3%OJjpOOmKJ1j9J1MoJjjQOj5QqJOmJnJ0jkRoMqJ6
7887A9kj8jM%LMj2J3Npj1OllKNj3J7kj1j0RJmJ2j1JojJ4j0Qj0KPLNMnnLLLj0R
7933GmJ0nMj2J1Pj0KkMj4J9j3PpjOqqJ1olPlqjMjNqnRqNljkLJ0lJrJ1LqjJ0pJ5
7983A0Nj3RmmnLLlRj0JOJNLKpPj3P%j1PLj5NJ5k6K2rKrRNpJj1JplJ5LrmPOonk
8033a1OJPj3J3j4J2j0QJQmPnpJ0j8J8JpkKOlQj6J2kOj2OJpkJ4%j5JOnokMlpJ7
8079Dj8J1Jj3J1kKKkRlmoOp%NLlJnrNRMkJ2j2Qj0J1kJ0j0pJ5mRr%J1j3oROj3J4
$$ y = [-13, -8, -14, -15, -15, -2, 3, -2, -5, -10, -3, -5, 7, 5, 12, -10, -12, -4, -2, 10, 1, -3, 0, -4, 9, 11, 0, 3, 4, 5, 2, 8, 14, 10, -9, 13, 7, -1, 1, 0, 4, -2, 8, 1, 5, 12, -6, -12, -2, -5, -10, -2, 4, -8, 0, -7, 4, -13, 5, -9, 1, -3, -6, -6, -3, 5, -8, -7, -4, 6, 7, 1, 3, -2, -10, -10, -3, 3, 7, 3, 6, 5, 21, 7, 9, 6, 10, 16, 10, 2, 17, 9, 8, 4, 12, 8, 10, -3, 3, 13, 13, 6, 9, 7, -6, -4, -5, -2, -2, -7, -12, 1, -2, -4, 3, -10, -10, -4, -3, -4, -11, -5, 1, -3, -1, 10, -9, 2, 6, 0, 1, 0, -1, 7, 13, -2, 6, -2, -1, 5, 1, 2, -3, 7, 6, 4, 13, 7, 11, 3, 19, 17, -1, -2, 2, 2, 5, 9, -3, 10, 15, 8, -3, 3, 0, -3, -1, 4, -9, 8, 6, -5, -15, -6, -5, -9, 3, -8, -7, -13, -14, 0, -10, -2, -12, -10, -3, 0, 5, 9, 4, -1, 2, 5, 8, -2, 7, 3, 13, 8, 12, 0, 11, 18, 8, 10, 8, 12, -2, 17, 4, 11, 4, 3, 9, 1, -7, 4, -2, -5, 2, -1, -9, -10, -6, -7, -2, -10, -15, -6, -14, -9, -12, -13, -15, -12, -2, -5, -4, -13, -2, 1, -7, -8, 2, -5, 10, 15, 2, 11, 7, 3, -2, 1, 4, 1, 10, 0, 1, 7, 8, 13, 16, 18, 11, 18, 5, 12, 12, 1, 8, 11, -4, 1, 16, -10, 12, 3, 5, -4, 5, 10, 3, 4, -7, -6, -13, -16, -1, 2, -7, -11, -4, 2, -4, -9, -11, -5, -4, 3, -10, 3, -11, 1, -9, -1, 0, 8, 4, 11, 6, -1, 9, -9, 9, 10, 3, 1, 3, 9, 6, 14, -2, 10, 8, 14, 2, 8, 9, 2, 0, 14, 14, -1, 0, 6, 1, -5, -7, -3, -6, -13, 4, -14, -3, -2, -15, -4, -6, -4, -2, -4, 5, 2, -2, -8, -2, -9, -9, -4, -1, -4, -3, -8, -17, -12, -3, 1, -1, 11, -1, 7, -3, 8, 6, 16, 6, -1, 14, 10, 19, 10, 10, 21, 8, 2, 11, 17, 4, 18]
8126A8j7mJ5Kk0J1pnQjKroOMm%j1J1mNmkOlJlOKPNk8J5Nj5J2lOLj9J5MjOkJJQ
8174A7Kj4NkqRj0OMqMj2J6nnNM
$$ y = [18, 1, -3, 12, 14, -6, 5, -2, -7, 1, 0, 2, -7, -13, -7, -3, -7, -7, -18, -7, -11, -6, -10, -12, -6, -9, -8, -11, -5, -3, 4, 9, -19, -4, 1, -14, -2, -5, 1, 4, -15, 0, 4, 3, 9, 7, 8, 9, 17, 19, 5, 10, 8, 0, 9, -1, 5, 9, 1, 5, -7, 9, 4, -1, 4, 8]
8191H
$$ Imaginary data points
##PAGE= N=2
##DATA TABLE= (X++(I..I)), XYDATA
0@%%%%%%%%%%%%%%%%%%%%%%qJ6j6J6j6J6j6J6k0K8l2L2l3M1m8M8n3O1o8P6q4R2
44D8j00J12j27J41j58J76j94K19k51K91l42M10n03O47r00J458m860J759Q427o542
64b89m315L083M212j563l263j080M758K015n557k877O307K163n131j203L578J39
80I77j303k13k5J089O10k681l7L681r65l641K161K476k783j003K607P5j457k11
98f43n9J351J342k858j650M119J061m573j48L985m47k656J78J191J094j41k757
115a611K2M176n96m604J355L830j885k390J666R88o20k71q19O19K133j551k620
132b178K410J927k846n13K564q43j750J281O65n00L62r41p69K187K05k706J054
149c91K413k303j663K653Q23j780l03J37K36J391q59j995J951J654l043p86L393
$$ y = [0, 0, 0, 0, 0, 0, 0, 0, 0, 0, 0, 0, 0, 0, 0, 0, 0, 0, 0, 0, 0, 0, 0, -8, 8, -8, 8, -8, 8, -8, 8, -12, 16, -16, 16, -17, 24, -24, 24, -29, 32, -36, 40, -44, 48, -52, 60, -67, 74, -84, 92, -102, 117, -134, 157, -185, 225, -278, 369, -531, 927, -3933, -2174, 6253, -289, -4604, -1521, 2691, 1128, -2135, -3215, 1543, 3558, -1999, -4876, 1431, 3594, -1537, -2740, 838, 977, -326, -539, -564, 525, 1135, -1546, -1583, 2098, 1133, -2508, -347, 2129, -654, -1657, 950, 1025, -432, -643, -702, 649, 1991, -867, -2517, 1602, 2663, -1910, -2058, 1927, 1480, -1176, -998, 193, 1287, 1146, -1611, -1589, 2587, 1991, -2613, -1258, 2572, 687, -1703, -37, 951, 331, 60, -759, -140, 1993, 442, -2178, 232, 2159, -687, -1200, 1364, 521, -1229, 52, 717, 217, 579, -362, -1131, 1056, 1261, -1445, -391, 2022, -281, -1944, 709, 1532, -248, -551, -414, -178, 1213, 354, -1641, 310, 1964, -1079, -1865, 1528]
166A528K8k705J51J157K02L14j086r53K206O01l140L60L457j188k862J291J592
183I53p20m22m01j13J604k51k343J227K466k134j845K356P46j808J55O37m51N76
201B32n4j271J130J193k078m54K469n86k090J284J123j220o7M17n29P50L80j734
219a105M99K129j563j861K213J114j917k67Q98k54M18L8j353Q04J621j893j206
236a685K542N16k201J87J141n37J47L22j017M34J020j403l66K023m58j787J172
253E0Q41j383L52J062j070l71Q97m91l4J037j022q59J780R6j918Q83J480j424
271i4p43J113j7j10M27j043k45J828m47j948J274J410j650n97J315j23l78L98
289C70o89q6J426p71j471J574Q92j913o7J601o38o99P79j98k88P16p02o46J564
$$ y = [1528, 1556, -1149, -998, 159, 361, 675, -411, -1364, 842, 1443, -1697, -1337, 2120, 932, -1930, -639, 953, 233, -189, -590, -703, 901, 650, -1693, -466, 2000, -134, -1979, 377, 1123, -685, -530, 107, -344, 232, 178, -1093, 37, 1230, -848, -1302, 1167, 581, -1509, -225, 898, -322, -389, 28, -501, 249, 629, -1105, -606, 1523, -40, -1901, 312, 1426, -491, -758, 140, -114, 304, 342, -1011, -207, 1414, -479, -1685, 857, 1373, -828, -641, 500, -37, 110, 432, -585, -151, 869, -534, -900, 1123, 665, -1122, 50, 891, -492, -140, 922, -148, -519, 378, -113, -147, 890, -132, -991, 789, 885, -1033, -150, 1330, -94, -837, 276, 259, 149, 576, -467, -712, 1116, 669, -1279, -5, 1405, -245, -842, 473, 350, -28, 370, -319, -405, 1021, 250, -1221, 353, 1245, -668, -735, 866, 228, -471, 308, 110, -178, 538, -164, -810, 754]
308G54J0j945Q01J583j354p43J435o6q29L45k04j06J112n88j508J346J116j792
326f33k94J744m10j150O03J74j69O74o35j028J381O32j720J70J600q95r99R99
344D4J98m97M90l64o88J169K48j478N56J282j273o64J390n8q64N60jn55P98K8
364C21j071P89P84j456j25J533n81j033R92K04q12N29J89p18O46L52j226L45J215
383H77j038o86J383o6j176O68N01p09L55K67r15M62Q57j131k57J432m76j194R26
402H0N30q38K70L01p83M60O75j037k6J241p18j008J165L89j028L00M19p16L12
421a2N59q00J11R33r35n91J385Kj263N52O20q34J14N82n48R4N70r01j37J358m78
442C81j243R42O19j076P8P28n22j2M63p17K1J133o59j021J107M07j142K63O93
$$ y = [754, 764, -1181, -380, 1203, -151, -894, 541, 475, -354, -9, -213, -319, 793, 205, -1303, 43, 1159, -633, -927, 817, 407, -743, -140, 34, -135, 539, -96, -1124, 257, 889, -831, -661, 939, 44, -955, 44, 242, -255, 235, -129, -817, 352, 600, -878, -322, 960, -313, -977, 413, 355, -509, 51, 50, -505, 293, 321, -750, 39, 823, -633, -758, 775, 194, -839, 153, 357, -455, 74, 263, -455, 191, 543, -683, -338, 877, -161, -847, 536, 470, -706, -38, 463, -246, 109, 376, -539, -77, 780, -351, -608, 824, 348, -846, 80, 610, -228, 42, 343, -440, 20, 695, -342, -368, 873, 155, -853, 312, 701, -327, -27, 392, -324, -12, 547, -253, -142, 791, -144, -735, 650, 652, -611, -59, 561, -273, -159, 423, -125, -31, 539, -362, -499, 859, 381, -862, 80, 699, -377, -299, 429, -93, -105, 358, -359, -338, 795, 136, -885, 222, 629, -513, -250, 443]
461D43o32RN24o89JR89o91p28J133J34j145M67O90p78L4N88o20p1P97o07m46J039
483D41k00j054Q00O26r86L5P21n83j64O70m61k49Q16m49p88J021M06j093J70P53
503D32o59j51P22m20l01O94m08n88R83J70j024L56O38p61L0P52n39l63P30k95
523bm91Q71mr57N42N38q39J32P98o59l74P49k22l96P10j71p86P19L60r61K69Q18
545F44p57l34Q50k30m49O08j67n85O87J51q87M19O73q51j52R16l83n34O81m9n78
566c27N61P2p23M84M87q81N7Q64o00m67Q24o1o04M89O3o33N54L34q75J86P74o79
588a01l47Q64j34o49M95K9m93N38K01q43L01O60p38j93R00l31o77O01J08n23M72
609A40J58p20L18N23p38J4Q33n77n91Q12Q1o44M40J86o42L22M26o71J10O73o59
$$ y = [443, -189, -180, 344, -345, -344, 645, -46, -774, 359, 493, -652, -185, 505, -273, -239, 349, -271, -342, 455, -152, -598, 441, 241, -813, -13, 613, -373, -338, 383, -200, -364, 306, -155, -404, 412, -37, -825, 196, 602, -491, -321, 432, -227, -378, 344, -76, -377, 317, -91, -679, 304, 474, -550, -194, 444, -317, -287, 465, -74, -437, 293, -2, -493, 378, 374, -583, -41, 497, -342, -210, 588, -71, -445, 304, 82, -314, 396, 225, -561, 158, 518, -443, -174, 644, -113, -447, 403, 173, -276, 332, 165, -420, 267, 418, -469, -50, 623, -228, -380, 536, 153, -381, 300, 251, -327, 234, 306, -417, 67, 554, -327, -270, 594, -6, -473, 351, 290, -314, 175, 238, -395, 159, 493, -382, -196, 578, -101, -448, 416, 282, -367, 128, 157, -336, 202, 403, -440, -139, 521, -217, -410, 490, 159, -518, 83, 191, -332, 140, 298, -422, -104, 419, -319, -305, 528, -49, -640, 172, 253, -391, 49, 235, -407, -85, 341, -330, -220, 453, -206]
630b06l84Q74q4o71N23J61o37L70L95o55J14O00o12k58Q27k25o22N93J26o46L83
651c4L68o58J47N45n95j36P59l67n12P00M9o90L98L62o24J48M64n27n2O37m46
672f4l52P57r1p18N06L27o53J80M72n32n2N70m21k23O97k15o57O14K27o68K72
693b4M59o32m5O20l77k33O09k58n12O23J26o77L72L94o73L3O07m12j95N47l08
714D4m28O83L8p04M33L60o79Q4N94m30j92N12l21l18O38r0o23N07K61o97J87N93
736D52n31j82N58l02k90N55j34n08N11J35o51L17M93o05r1N84l33l08N69j50m68
757c79N13R3o27L57M01o07J1N59l95k71N73j75m30N30K8n98L88L75o32P4N40m51
779a23k14N86k13l84N20m5n34M38K51o16J70M99n47j23O32k85l72N18m5m84M43
$$ y = [-206, -590, 284, 200, -471, 52, 213, -424, -54, 341, -314, -200, 400, -212, -470, 357, 132, -490, 103, 229, -417, -34, 334, -324, -177, 368, -227, -363, 396, 29, -483, 217, 266, -424, -26, 336, -288, -140, 324, -203, -255, 382, -64, -416, 341, 250, -468, 38, 365, -288, -108, 364, -168, -220, 350, -71, -294, 403, 188, -469, 145, 372, -296, -24, 435, -197, -242, 378, 1, -232, 377, 119, -393, 230, 356, -321, 51, 445, -228, -195, 412, 0, -195, 352, 44, -384, 299, 337, -367, 66, 426, -253, -169, 425, -5, -197, 315, -6, -324, 314, 224, -399, 108, 369, -328, -141, 452, -79, -261, 297, -5, -295, 260, 126, -382, 129, 264, -387, -70, 423, -182, -273, 311, -22, -330, 239, 89, -379, 134, 227, -400, -43, 358, -249, -238, 321, -74, -345, 228, 53, -377, 153, 181, -417, -29, 346, -286, -212, 328, -123, -337, 249, 36, -348, 172, 127, -407, 31, 282, -334, -164, 335, -212, -335, 297, 12, -360, 158, 113, -371, 72]
800G2J69n58K37L85n42l0N96l39l36N64q7m74M50J56n56K51L43n23M4N40m02k58
822b98N68j70m20N02R2n57K66L46n29O4N18m43k07N68j77l99M83L6n14L09K71
843C09n23J49M53n00j28N79k50l80N13Jn09L47K44n12J59M17m98o4N36l08l23
864b88N43q1n00M30J85n38K20L79m83m1M98l33k69N35j22m50M26J46n30K63L35
885C25n02J3M83l66k26N32j61m22M44P9m98K92K90n12Q4M42m17j44N28k19m08
906c63M84L8m80L16K50n02R9M22m14j03N00k53l31M74k3m47L80J90n28J51M02
927B62m36o5N03k90k90M73n8m15L83J50n02K01L41m45j9M82l38k44N13j09m07
948c10M04J17m92K28L09m37M0M11l62j64M96j76l59M44M5m94K76L12m62N2M19
$$ y = [72, 241, -317, -80, 305, -237, -267, 329, -10, -346, 218, 131, -343, 107, 263, -293, -42, 301, -222, -178, 362, -40, -298, 270, 100, -320, 182, 274, -283, -17, 329, -200, -136, 382, -61, -268, 300, 123, -276, 207, 243, -271, 38, 309, -214, -65, 388, -112, -240, 339, 89, -291, 222, 223, -286, 61, 305, -207, -48, 369, -129, -193, 343, 35, -288, 255, 174, -326, 104, 289, -249, -29, 350, -133, -174, 324, -9, -278, 257, 135, -315, 111, 257, -273, -10, 325, -177, -164, 319, -47, -273, 259, 98, -324, 120, 199, -299, -7, 283, -229, -145, 297, -120, -264, 264, 45, -363, 121, 159, -321, -5, 245, -257, -158, 264, -150, -253, 247, -6, -337, 137, 114, -333, 47, 237, -291, -140, 262, -174, -239, 264, -26, -316, 157, 99, -316, 67, 217, -285, -84, 257, -188, -207, 275, -63, -307, 206, 97, -310, 94, 211, -281, -53, 256, -181, -141, 270, -92, -256, 240, 64, -295, 149, 194, -300, -24, 288, -174, -122, 297]
969B97l74j50M83k02l35M59jm54L18K44m65P2L93l66j06M68k45k91M73m8m43L42
991F9K17m89J43L71l91p1M49k71k42M48r7m04L82J67m92J71L42l95m2M09k79j82
1013a87M26j44l61M11P3m68K39K96m32j0M27l10j59M32j70l31M17K2m58L12K30
1034B55m60N7M08l47j32M36k16l04M47lm32L27J98m68J14L63l58p3M00k48k33
1055b69M31n3l97L26J57m45J60L44l95o1M10k47k24M18q1l42L30J04m43K35K72
1076B30m17LM16k80k18M24j03l49L61P9l99K25K26l98N4L88l28j52M29j50l30
1097b89L85O2m03K48K05m11J03L56l51j20M32j79k86L95Ml81K82J49l96J44L19
1118B68l85n3M29k23k76M23k4l74K71J48l73J63K65l86jM16k90k22M41q7l59L11
$$ y = [297, -77, -227, 256, 54, -281, 178, 177, -277, 41, 285, -180, -108, 285, -81, -187, 281, 36, -255, 218, 170, -273, 69, 286, -203, -60, 311, -80, -151, 298, 27, -215, 233, 136, -268, 114, 281, -211, -40, 302, -93, -135, 274, -5, -187, 239, 95, -266, 145, 218, -250, -11, 285, -147, -157, 270, -40, -199, 233, 63, -268, 149, 171, -287, 25, 255, -205, -148, 260, -87, -219, 217, 1, -303, 144, 141, -291, 36, 234, -234, -120, 243, -115, -188, 212, -36, -269, 162, 109, -288, 38, 195, -250, -90, 254, -141, -202, 208, -39, -263, 155, 74, -268, 62, 166, -277, -42, 230, -187, -184, 232, -48, -266, 158, 55, -294, 67, 146, -253, -28, 198, -200, -146, 242, -86, -238, 191, 41, -289, 96, 158, -245, 3, 208, -203, -100, 256, -95, -215, 217, 38, -248, 147, 151, -230, 52, 201, -195, -51, 268, -117, -170, 259, 36, -240, 183, 159, -215, 56, 204, -169, -6, 259, -127, -128, 288, -2, -224, 217, 130, -229, 82]
1140H2J08l65J78K26l61L7L62l02j63M23j30l38L66P5m07K05K17l59P0L25l07
1161e8j20M13j76l05L76M8l93K33K02l84J17K87l37p1L95j99k77L92Nl81K58J77
1183B02l82J21K80l42k4L68k46k12M13p7l80L25J48l95J28K70l28j2L28k42j67
1204b24L66j05l02L31Q5m05J99K48l58J7L31k54j48L66j37k61L34L9l77K29K20
1225A94l75N7L21k99j05L70j50k34L37Rl77K70J74l70Q4L22l06j02L45j48k12
1246a95L29m8l17K91J25l93J38L02l43n5L58j78j78L04o9k74K96P5l70J85K63
1267B46l73j5L67k13j97L41p6k60K90M6l45K15K09l82N2L35k53j64L70j16k47
1288a70K98J3l21K35J77l81P4L22k72j25L40j16k41K90kl00K59J08l52J07L07
$$ y = [82, 190, -175, 3, 229, -132, -95, 267, -35, -198, 225, 95, -243, 123, 198, -209, -4, 213, -146, -76, 249, -58, -178, 235, 59, -246, 130, 178, -215, 18, 220, -164, -47, 240, -97, -168, 227, 28, -249, 143, 148, -233, 25, 202, -180, -59, 221, -121, -145, 223, -23, -235, 178, 101, -279, 46, 194, -201, -73, 197, -131, -143, 185, -57, -224, 142, 37, -265, 66, 151, -254, -55, 193, -165, -148, 183, -71, -219, 147, 10, -251, 83, 122, -255, -26, 194, -181, -124, 197, -102, -207, 163, 13, -221, 116, 125, -252, 18, 192, -178, -94, 228, -78, -180, 165, 17, -195, 134, 86, -231, 60, 185, -208, -70, 232, -111, -166, 192, 14, -164, 140, 71, -203, 93, 168, -202, -17, 246, -127, -142, 225, 12, -185, 156, 80, -180, 110, 156, -189, 26, 235, -147, -95, 240, -13, -177, 193, 77, -170, 128, 141, -180, 55, 232, -149, -75, 247, -25, -150, 190, 74, -167, 123, 121, -179, 80, 188, -164, -57, 250]
1309B50l35p7L66j66k36L20j2k88K50P9l19J37K43l31j1L41k22k07L39l3k99K48
1331C7R5l12J49K13l06ML12k54j40L51r3k76K85N4l25J84J85l12M5K81k55r2L34
1354A64j41k35K93L1l20J92J71l00N3K52k66o0L35j67k39L49kl25K17J65l17O1
1376h9K38k61j3K92j96j81L47o9k97K54J34l22R1K32k60j6K70k02j15L19r7k64
1398b05K72J09l40J21K36k86nK67j87j12L05j19k39K89N5l32J72J90k99L0K67
1419A89k23q3K83j51j85K99J4l17K04J55l15O8K71k49o8K77j57j65K93l4k84K25
1441D7J26l18R0K58k52o1K52j50j47K98o6k53K45P3l08J39K37k95l4K95j89j40
1463a53K96p9k40K55N0k85J58J82k89KK79j93j32K94j03k20K55L6k86J75J55k81
$$ y = [250, -85, -162, 204, 38, -198, 122, 110, -178, 72, 151, -168, -31, 212, -119, -130, 211, -11, -218, 121, 88, -211, 37, 132, -180, -31, 182, -124, -120, 192, -62, -202, 149, 56, -220, 65, 119, -206, -22, 163, -149, -104, 177, -78, -170, 164, 23, -212, 81, 112, -208, -16, 155, -145, -92, 160, -106, -166, 169, 2, -237, 112, 110, -215, 2, 167, -150, -89, 149, -112, -125, 167, -29, -210, 137, 68, -229, 25, 159, -163, -72, 160, -100, -116, 154, -48, -163, 156, 59, -205, 67, 176, -164, -43, 193, -93, -98, 169, -18, -130, 175, 56, -183, 106, 161, -171, 1, 191, -108, -78, 189, -34, -117, 166, 15, -170, 129, 143, -174, 30, 185, -130, -62, 209, -40, -108, 169, 12, -153, 140, 106, -178, 47, 173, -145, -55, 203, -49, -110, 142, -8, -155, 143, 77, -176, 69, 142, -166, -27, 210, -85, -119, 176, -13, -153, 143, 64, -176, 79, 129, -156, 2, 184, -105, -103, 176, -17, -149, 145, 42, -178, 77, 113, -173, 2, 157, -124]
1485a24K9K59k25r3K81j04k14K60Lk38J70J27k78O8K41k51o4K98j50j86K59nk33
1508a70J92Q1k54J07J81k68NK84j88j54K74l3k34K23O8k57J26J56k47J7K67k15
1530c9j20K87p5k13K39L0k65J48J54k61O4K21k28q9K82p6k15K36J9k40J40J43
1552A42k63P5K16k29o5K85j40j76K54Pk55J64J20k28O3J88k21k2K48j54j52K73
1574A30n3k28K02J00k57R0J78k28rK22j40j22K49n2k30K20O3k62J32J54k33PK32
1597A65j83r8K51q6j96K27L9k49J31J45k45K9K13j80q3K35q7j83K28J2k38J65
1619A2J19k57M5K24j92p4K48j33j46K38k5k15J72R9k57P5K11k06n6K25j00j51
1641a44K28l7j87J75P0k50R9J88k36JK20j45j23K27l6k08K21J5k31J40J57k27
$$ y = [-124, -95, 164, -61, -154, 127, 23, -191, 69, 72, -166, 4, 131, -147, -79, 162, -89, -153, 145, -5, -191, 68, 63, -170, 22, 103, -151, -44, 137, -131, -126, 158, -30, -184, 90, 57, -177, 46, 114, -143, -17, 139, -108, -91, 176, -39, -159, 128, 53, -160, 79, 109, -156, -8, 146, -115, -51, 170, -58, -147, 135, 59, -156, 80, 99, -141, -1, 142, -121, -46, 170, -59, -124, 161, 21, -155, 99, 106, -149, 15, 135, -93, -30, 158, -63, -85, 163, 9, -143, 130, 77, -151, 51, 151, -106, -16, 162, -66, -75, 147, 7, -115, 134, 82, -148, 72, 135, -127, 5, 159, -74, -67, 165, -18, -116, 135, 49, -147, 80, 119, -130, 1, 146, -99, -70, 143, -37, -120, 115, 28, -155, 73, 85, -153, 12, 131, -126, -81, 143, -49, -123, 125, -8, -154, 84, 59, -156, 16, 115, -142, -67, 144, -62, -118, 107, 7, -144, 84, 47, -140, 35, 105, -145, -46, 142, -94, -93, 127, -18, -141, 86, 50, -158, 63, 78, -153, -13, 144, -83]
1663h3j8K28j58j05K32q2j48J94K0k30J51J28k46M1K10j78p9K31p6j58J99qk01
1686a36J50J13k39P3J89j99o4K43r9j57K09j1j99J64Q5k26Q6J62k02l1K45j41
1708A5j29K26n8j82J81N9k12R1J47k05J0K07j46j17K23o4j72J92M7k21J11J27
1730A30k20L3J94j70o7K04q1j47J88L4k10J15J01j94N1J63j68n9K16j03j40K06
1752G6lj97J39R1j96N7J67j66n0K11j33j16K13l1j84J50Q0k19Q4J49j83j5J82
1775A06j27r5K08m8j70J63M4k02R0J29j97J8J70j22q5K00o0j71J89L0k07J05J33
1798A01j97J9J79j50n1J99q9j52J80J3j95J34J09k01K6J68j47l7J90j02j13J84
1820F8j4j79J36R3j97N4J47j53l9J85j14r3J94l8j72J60O1j94O5J43j79%J72j18
$$ y = [-83, -101, 127, -31, -136, 96, 14, -134, 60, 80, -150, 1, 129, -117, -76, 134, -44, -123, 108, 32, -126, 73, 65, -136, 14, 127, -112, -39, 150, -49, -113, 130, 31, -126, 83, 72, -127, 37, 122, -104, -18, 144, -58, -89, 156, 15, -114, 112, 54, -128, 53, 112, -100, -9, 138, -67, -57, 150, 4, -113, 110, 46, -126, 66, 113, -108, 3, 130, -90, -57, 137, -33, -100, 104, 23, -124, 64, 98, -112, 3, 104, -90, -39, 124, -44, -103, 113, 10, -130, 76, 73, -124, 15, 106, -90, -33, 134, -32, -82, 129, -4, -120, 93, 62, -122, 28, 108, -111, -27, 122, -61, -76, 106, -21, -116, 92, 44, -126, 37, 81, -121, -31, 98, -99, -81, 89, -33, -118, 82, 22, -149, 40, 70, -137, -32, 101, -96, -77, 102, -48, -99, 100, 11, -141, 39, 52, -143, -9, 100, -101, -75, 93, -54, -91, 99, -3, -116, 68, 54, -125, 11, 104, -93, -39, 108, -45, -84, 101, -13, -106, 88, 50, -122, 38, 99, -95, -30, 113, -66, -66, 106, -12]
1844a2j01K03m8j61J65L4j93Q8J30j83K9J70j46o5J88o6j41J78Pj76J20J01j97
1867g6L8J64j59n8J92p4j26J65lj58J16O9j75N9J44j69k7J86r2j08J65k3j64J38
1891B4P4j80O6J35j73j3J66j03r0J69l3j67J42O4j75Q5J06j88J2J72j16p7J80
1914H0n8j42J48L4j67R0J03j79K9J62j39n3J66p2j25J61J8j53R9O8j55L3J58j48
1938d2m0J72r5j22J78jj61J18P1j78O6J31j54k3J70j06r1J60j5j36J14O7j91P8
1962c0J17j58OJ53j08q7J69k3j43J34L9j70R3R7j45j6J60j03q2J76n5j25J40J2
1986E1j44J13P7j51J6J34j21m4J58n9j20J46Kj39J07P0j52J6J36j24m8J83p5j21
2010h9J53oj38J25L8j47N0J02j34j4J57q3r6J45j8j44J22N3j65P4J06j37j1J55
$$ y = [-12, -113, 90, 42, -119, 46, 80, -113, -25, 105, -78, -49, 121, -25, -90, 98, 32, -109, 69, 76, -100, 20, 121, -76, -38, 126, -33, -91, 101, 27, -99, 66, 63, -95, 21, 90, -85, -26, 118, -51, -78, 108, 16, -92, 73, 50, -114, 24, 98, -82, -16, 119, -54, -67, 99, -4, -94, 75, 42, -125, 17, 81, -94, -9, 97, -91, -79, 93, -23, -100, 80, 22, -120, 28, 62, -105, -15, 88, -91, -62, 100, -39, -92, 74, 2, -123, 38, 56, -97, 2, 70, -85, -52, 106, -42, -82, 90, -5, -127, 51, 50, -111, 7, 78, -100, -34, 97, -57, -80, 90, -16, -107, 53, 38, -98, 16, 83, -108, -30, 87, -71, -65, 88, -20, -107, 62, 39, -104, 30, 69, -101, -8, 89, -56, -72, 88, -15, -97, 79, 24, -101, 39, 51, -93, 20, 97, -54, -38, 96, -25, -69, 89, 30, -90, 56, 58, -81, 26, 96, -56, -40, 96, -28, -76, 107, 32, -89, 64, 58, -80, 45, 83, -64, -14, 88, -46, -60, 97, 14, -82, 63, 45, -99, 23, 76, -89, -15, 91, -46, -57, 98]
2034I8j01p9J48m2j19J30L3j61R6Q5j43J5J33j11n4J54n5j12J27J9j45R6O1j40
2058f7K9J27j20m6J50o4r7J25Qj32R0O9j50M3J22j40k5J50q9q1J41j7j29R5O5
2083E7j53O7J08j39qJ43r5o6J41l7j11J16L0j37O1R2j23jJ16q5n5J32k0j23J22
2108C2L1j34P5P4j40L2J22j03o0J48n8j18J45J1j36J08N2j27J5J18j23rJ40p8
2132A7r4J22lj23R7N3j26L8R8j20nJ23p1q4J37j9j27J09N0j54O3J03j11j1J23
2157H5q2q5J34j0j20J13L4j32O3Q2j17PJ25q9o7J39n4j02J21J6j37P9Q1j29J6
2182b9J26j12m9J33o1p8J25j2j26R4O2j27K7J17j29j9J19o9p3J29k2j12Q3N0j16
2207f9M6Q8j10j9J22p0o4J11j9j04J01K2r6N5O4j10NJ16q6n5J28l0j08J04J6j13
$$ y = [98, -3, -82, 66, 24, -95, 35, 68, -93, 3, 88, -55, -40, 93, -18, -72, 82, 27, -85, 42, 61, -84, 12, 73, -67, -38, 89, -31, -77, 73, 9, -88, 37, 45, -87, 3, 72, -78, -35, 87, -53, -78, 72, -17, -98, 43, 26, -103, -8, 57, -96, -29, 79, -60, -68, 75, -20, -86, 55, 18, -93, 23, 53, -84, -23, 69, -54, -55, 61, -24, -79, 53, 33, -90, 32, 63, -71, 4, 78, -62, -30, 92, -11, -71, 77, 19, -99, 46, 57, -79, 29, 81, -46, -31, 87, -36, -45, 95, 17, -77, 45, 42, -81, 16, 69, -57, -19, 79, -41, -46, 77, 6, -78, 59, 40, -87, 22, 72, -82, -19, 84, -27, -38, 85, 3, -82, 52, 42, -78, 35, 69, -63, 0, 82, -35, -28, 97, 8, -59, 80, 26, -76, 45, 61, -76, 3, 84, -45, -29, 97, -15, -64, 69, 8, -70, 55, 43, -83, 11, 73, -54, -27, 90, -39, -58, 61, -8, -81, 48, 26, -86, -3, 47, -69, -23, 65, -45, -64, 58, -12, -76, 35, 16, -88, 13, 35, -61, -6, 58, -52, -47, 69, -17, -72, 56, 26, -82, 22, 38, -75]
2233g5P8O1j19J6J09q4n1J30n1r0J07Mr9P0O8j26K4J00r9l2J21o9o6J07Mj09O8
2260cO4j19L0R2r5j7J20p5p1J32k8r4Q1L3j04L9Q1r9jJ15q2n1J15l4p8Q7K8j22
2288e6O0O8r7nJ09p7n4J15l2r0J05Rj05N8P5j13K3Q9r6k8J02n0p2J09j1j08R6
2315B4L0r5L9O9q5l4J25o6p6J07Jj14R2L5j08L7P9r9PJ04o9n4R5k5q3Q5L8j15
2343e6L6Q4j02QR3o4o9J24m3p8J08mr4O0M4q0%J01r2k8R9l3q2R6J2r8N3N6j06
2372e5J8R9j05rR7m8o0R5j2r7P8M7j07L7P2p4l4J07m9n6R1Nr6P3K9r9N6N4q0j5
2402c8J08p7m7R3j2p9P3K9j03M8P4r7mR9p0m4R0j5q9Q1J8r1O5L4p8JR5p4l2R1
2432D9m0o4Q2J9j08P4M6j02J6R5q7j9J05o3n5P6Pr2P7M8r9M7M5p4j5J01o1n6R8
$$ y = [-75, 3, 64, -55, -39, 70, -14, -65, 65, 14, -76, 31, 35, -64, 6, 74, -52, -28, 72, -27, -59, 62, -7, -73, 34, 38, -71, -3, 61, -58, -28, 64, -31, -48, 72, -3, -74, 58, 30, -64, 17, 50, -54, -15, 66, -33, -34, 81, -1, -52, 63, 29, -49, 38, 66, -56, 4, 72, -25, -30, 79, 2, -52, 63, 31, -59, 46, 55, -50, 8, 83, -30, -7, 82, -14, -42, 60, 10, -62, 47, 36, -72, 24, 54, -41, -2, 67, -18, -52, 73, 7, -69, 38, 39, -75, 17, 52, -56, -19, 60, -39, -32, 72, 3, -51, 44, 19, -64, 21, 59, -56, -20, 64, -38, -30, 63, -1, -70, 54, 11, -67, 41, 37, -57, 3, 47, -33, -33, 68, -24, -52, 47, 14, -68, 28, 40, -58, -5, 51, -55, -37, 62, -43, -52, 45, -3, -63, 32, 20, -77, 1, 48, -59, -22, 50, -24, -58, 49, 0, -56, 35, 40, -56, 17, 46, -53, 3, 57, -23, -38, 70, -7, -54, 39, 27, -52, 21, 50, -53, -5, 69, -28, -32, 67, -3, -47, 43, 28, -61, 20, 38, -53, 12, 46, -32, -31, 64, -10, -42, 49, 9, -55, 27, 46, -62, 12, 58, -44, -28, 67, -20, -39, 66, 3, -52, 24, 31, -61, 16, 64, -35, 12, 57, -17, -32, 69, 8, -48, 50]
2461E0qr6P7K1r1M1P8r7lR9o8n5J11k9p7R0J0j09O0N8r9J4P7o3k9R4n1p0Q3K3
2491D1j01M3N8q0J0R7q6k5R3n3n4R0j1q1P4J9o8K4O5q8k2J02n1n0R1pq3Q4J9j06
2521e6M5N7p8%R6o1m1P2oq1Q4J7q0L2N9q6J2P9q0l1R8l7p5R0Oq7O0M8r6J7Q3o8
2553hl4R1l9p1Q7Mp6N1M7q9J6P1o7k7R1k9o8R0kq5O8L0j04M8N9p2j0Q0m1o3J02
2584E0k2q0P4M0j03M3O5r2OP6n2l9Q5j8p0N3K5j00O7M3r2K2P1n9m2P6j3n8O2O
2614B4p4N7L3q0K2O9p9k0J00m6o4Q7oo8N3L5q2K1Q5q5j4Q0m2o2R4qp9P5K2r2L5
2645iP0q4%Q0m9o3R2pp8O5L0j02N2N4r0PQ9p5k3Q4k9q0Q6Qq4N4M3r1K1Q7q0j4
2677c6P4l1o1Q7mq8N5L7o9J9O6o4j4P3k9o6Q7k0p5O4M1r6M2N5o0j8Q4m4m6P6j1
$$ y = [50, 42, -54, 23, 44, -47, -6, 72, -25, -28, 71, 3, -52, 59, 30, -47, 43, 53, -56, 4, 62, -37, -23, 54, -9, -38, 56, 5, -65, 18, 41, -60, -17, 41, -39, -29, 68, -18, -43, 50, -3, -57, 33, 22, -59, 15, 34, -34, -10, 55, -33, -55, 47, -4, -54, 37, 30, -53, 31, 50, -56, -11, 46, -32, -32, 64, 3, -38, 34, 28, -53, 31, 48, -32, 0, 59, -27, -15, 64, -16, -47, 51, 14, -61, 29, 35, -52, 8, 56, -40, -23, 60, -8, -42, 49, 10, -61, 26, 30, -46, 5, 52, -37, -21, 50, -17, -44, 47, 18, -50, 40, 38, -47, 21, 51, -53, -5, 54, -18, -28, 52, 11, -52, 50, 28, -52, 22, 62, -41, 2, 67, -25, -19, 57, 5, -34, 51, 33, -37, 16, 41, -59, 8, 51, -41, -19, 52, -7, -49, 27, 14, -44, 18, 24, -50, 7, 40, -40, -18, 51, -28, -48, 52, 6, -58, 29, 23, -45, 8, 43, -39, -18, 67, -18, -32, 48, 6, -56, 38, 30, -49, 26, 48, -44, -9, 61, -23, -23, 57, 8, -55, 37, 30, -48, 17, 47, -55, -3, 51, -39, -32, 57, -18, -41, 43, 14, -66, 20, 28, -56, -2, 41, -50, -29, 58, -22, -36, 38, 7, -54, 33, 29, -59, -4, 33, -36, -17, 49, -15, -29, 44, 15, -51, 36, 16, -59, 5, 46, -50, -8, 47, -13, -31, 53, 9, -37, 39, 28]
2708B8o8O5J4q0M0N6q0JP4n8k7Q0k0o9P4Pp4M5L8p6QP4o4j0Q2m4o8P9Pq1N4M0
2740D7p8J4P1n8k5P2k6n7P3kp5N9L4p9K1O1o2j3Q2n4k5O8k9o4P4L0r1L3M3p5J1
2771b0O2n4l3P8k1o3O6J4p3L2N9p3LO3m6m4P5j2p1P6Mo7K6M6p6K9O1o3j8P9l9
2802@l9O8lp8N3K5o5J7O4o8rP8m6l7P5mp0N2K8q0L2N1o5lQ0m9n7R0k7o0N1K7o9
2835c8M5L8o6pO7m9k9P8l2n7P4%p3N6J5n9J3O6n8k1O0mn2N9J4p3L7M0o8QP1o0
2867ej3P1m8m8Q2j3o3M6L7p2L1M5n8pO9l8n6Q4j2o3N9Mo1K6L9n2PN7n5k2O8k6
2899A3m7N2J3p5L6N1p4jP3n9k7Q1k7m4N2Rp2O8K1q1K7N5n9j8O3j6m9O4mp1O8K0
2931D2q7M3N3o9LN6k8n2O2Qp7N9K6p9K9N3n9j5P9m1m5O5j0n1N0J6p9L4M0o5RO8
$$ y = [28, -40, 25, 39, -41, -1, 55, -25, -24, 50, -8, -35, 45, 25, -44, 30, 37, -37, 8, 46, -30, -22, 52, -12, -22, 60, 16, -52, 27, 34, -47, 7, 47, -31, -17, 54, -4, -29, 43, 17, -40, 33, 31, -44, 15, 49, -30, -9, 52, -10, -23, 59, 5, -20, 48, 19, -45, 29, 59, -32, 1, 44, -31, -20, 42, -12, -45, 33, 12, -51, 15, 29, -44, -12, 47, -26, -23, 40, -6, -50, 25, 13, -58, 18, 22, -45, -19, 27, -49, -20, 41, -22, -40, 39, 0, -39, 29, 26, -52, 1, 26, -39, -22, 42, -26, -35, 43, -3, -40, 35, 31, -39, 13, 41, -39, -7, 44, -21, -24, 56, 7, -50, 40, 13, -47, 4, 31, -38, 7, 45, -21, -28, 39, -10, -39, 39, 7, -50, 24, 24, -49, 7, 22, -37, -24, 42, -16, -37, 23, 19, -33, 26, 40, -33, 4, 44, -24, -16, 55, -5, -18, 53, 5, -43, 39, 26, -37, 9, 46, -26, 5, 50, -8, -15, 54, 16, -40, 44, 32, -31, 28, 32, -29, -3, 36, -16, -9, 48, -7, -29, 39, 13, -34, 18, 31, -44, -8, 43, -31, -32, 41, -18, -45, 36, 9, -35, 17, 26, -46, 22, 43, -38, -11, 44, -15, -33, 30, 14, -35, 29, 25, -46, 22, 42, -45, -2, 51, -18, -15, 41, 13, -39, 23, 31, -46, 13, 39, -40, -11, 42, -17, -32, 47, 6, -39, 26, 16, -35, 15, 31, -48, -14, 26, -39, -30, 38]
2963C8n9k4O1nn7N8Lo3L8M8o7J6M4n1j0O8k8n6P1Qn9K9M2q5L3M8n4j4P3l6m1P2
2995D1ro2M7J8n0MO1n8kM6l1l5O1l0n6P0J8o3K5M4n9ON1m0l3O9k0n3N7Mn1L5L5
3028D0o7J9M1l6j4N8l6m3N7Mn5L1M2o6J3N0n8oO0k6l5N1lm2L5L1p9J9O7p3LN5
3060C7l7l9N7om7N7Mo7K4O1o8JO6n2j8O0l7l3N3No8L9L0o4J0N9m8k0O1l5l6O6
3092A5Jo2N5K0n6KO8n2j6N4l8l0O3Jn6L2L3o5L0N1o4jN5l2l3N9k3m9N8J0n7K2
3124eK8l3j1M8m2j7N5nn5N5J4o8L7M1n4LM0l2l0M9k5k9N1Qo3L1N1p4J5O2o2j4
3156c1O0l2k5N5ln6M2J8n9L0L2l4qN0l0l6N4pm4K4M0p3L1L0m8J0L9l0k6N4kn4
3188b9M3J6o8L6L3n7J3L4k6k5L9Jn2M5J2n1M4J3n2K5M1m0k8O6j6n8O0j9k8L0J9
$$ y = [38, -21, -45, 16, 11, -46, 12, 15, -48, -10, 38, -29, -13, 31, -20, -30, 38, 10, -46, 25, 33, -26, 3, 45, -40, -7, 41, -13, -27, 46, 10, -31, 41, 32, -30, 17, 35, -15, -11, 50, -8, -10, 36, 5, -30, 31, 1, -55, 15, 33, -30, -5, 39, -20, -14, 37, -3, -36, 33, 13, -40, 17, 21, -30, 5, 40, -27, -8, 33, -3, -17, 41, 5, -38, 19, 23, -32, -1, 41, -25, -12, 38, -20, -26, 34, 8, -27, 24, 21, -21, 14, 45, -34, -15, 52, -21, -18, 37, 0, -39, 18, 12, -35, 22, 26, -41, -17, 44, -24, -23, 43, -9, -27, 33, -4, -37, 16, 21, -47, -8, 22, -42, -32, 27, -21, -41, 20, -15, -51, 15, 16, -46, 9, 29, -27, -25, 43, -9, -25, 29, -9, -39, 24, 25, -31, 1, 34, -31, -1, 50, -14, -15, 40, 8, -25, 34, 11, -38, 20, 30, -27, -5, 23, -10, -21, 27, -15, -32, 23, 18, -37, 18, 32, -36, 1, 42, -12, -9, 31, -1, -31, 18, -7, -36, 15, 23, -40, -9, 42, -32, -17, 45, -17, -31, 29, -3, -28, 27, 24, -32, 10, 28, -31, -1, 31, -3, -11, 39, 9, -27, 27, 20, -24, 0, 40, -33, -2, 28, -20, -10, 29, -1, -27, 27, 25, -29, 14, 30, -38, -2, 31, -26, -13, 21, -5, -30, 9, 10, -42, 3, 15, -36, 8, 21, -31, -6, 35, -5, -33, 33, 17, -41, 19, 0, -28, 2, 21]
3219B1m3KM7l9j6N5k9k8N6qn5M8Ro2M3J8m5ON0l1l4N2j6k5L9Qm8J5K8m3ML7l2
3252a6l1O7j0m3K8J7m2K7K9n0QM1k9j4L8j1l7L7J3n5M5Jm2J6M6l8j4M3j2m0N2
3283B4ll8K4K5m4J0L2l5j6N7l2k4L8j2k9K9J5m7K4K1k6j6N8n7j9N6lm0L5J0m2
3314b5K0J9l6lM0k5j5O3k6l2K8Om3K9K7n2PM6k9k7M5j3l6M0J1m5K7L1m9LM1m3
3346a6PK9j5l8N5j4m0L0K1m0J5L4m5%N1l2k7K9Nm8M9J0n1J4L6l8qL2rk6L2Lm1
3379c6L1K1m1K7J6m3RM2l8j7M9k1k9L8Lm6L2K9n0J8N1n6mL0qk2K3J5n4L6K5n9
3411b9J8M4m0j4N1k7k9M7j1l2L3Rm9RL1k7j3N1j9k7M8j4l7L2Rl0J6K3n0QL4l2
3443a7jL0On1M0Rl6L1K2n1lN1l5oL5pl7M3j1l4L6J2l8J3K5k7j3K9j7j5L6ll2K1
$$ y = [21, -22, -20, 27, -12, -28, 27, -2, -30, 26, 18, -37, 11, 20, -42, 1, 19, -26, -20, 30, -1, -35, 17, 1, -24, 15, 23, -25, -10, 18, -25, -21, 16, -16, -47, 20, 10, -33, -5, 12, -30, -3, 26, -24, -16, 25, -4, -18, 20, 9, -28, 9, 22, -33, 12, 13, -29, -13, 33, -5, -19, 24, 12, -28, 24, 21, -17, 7, 32, -12, -2, 30, -5, -21, 36, 4, -20, 18, 6, -23, 6, 21, -26, -2, 19, -7, -23, 35, -22, -41, 15, 12, -28, 7, 17, -25, -5, 14, -22, -25, 15, -10, -25, 38, 12, -20, 8, 14, -29, 0, 27, -25, -18, 28, -1, -28, 17, 4, -32, 8, 19, -26, 1, 32, -17, -14, 27, -16, -9, 20, 5, -33, 22, 8, -32, -2, 19, -21, -6, 28, -17, -17, 34, 2, -25, 4, 9, -39, 10, 20, -31, -17, 19, -19, -27, 5, -4, -30, 2, 5, -36, -5, 16, -25, 2, 18, -25, -16, 26, -12, -29, 20, -1, -30, 8, 11, -35, -3, 26, -24, -6, 45, -11, -15, 15, 7, -15, 8, 23, -31, 5, 30, -29, -11, 33, -7, -21, 30, 3, -26, 21, 10, -22, 11, 20, -29, -20, 11, -16, -29, 22, 3, -24, 24, 10, -27, 5, 14, -16, 0, 23, -27, -19, 15, -17, -18, 12, 18, -33, 7, 16, -20, 11, 33, -18, -21, 30, -5, -11, 24, 17, -20, 23, 12, -22, 14, 26, -12, 1, 26, -1, -14, 15, -2, -17, 19, 16, -16, 5]
3477EK4m9K5K6m7J0L0l9pL6rm4L9Nk5J5J8k2qK7k1%L0k3j3J8J9n2L8J2l4J4J7
3510A5l8mM4k6pJ8J8l8J4L4m2KL4k0k0M4k2l4M5Lm0K6K1m2OM2m8pM4k7k2M2k2
3543gk0K3K4m2RL3l6nL3k6nM3j8k3L0%m5L5K6m0lK8j8j9L8ok8K5J5l0J0K9l8K
3577fK8k2k4M0lm2M8rk0K1Lk2J9Rk0j9M1j6l3N2j0l4K2J4k7J4J8l0pM0k7k0M3
3610B1j7l0K9Nl6J4L0j8j4K6k1kL0j9j9L0Om1K8K1l8ML4l7lL0ql5L7kk5K0Pk2
3644a5%L6k8k5N2j5j9L0j0k5J1J5l6J9L4m3mL2k3k0M1j3j9K2Nk2OL3m0J2J7j4
3676fj7L2Nm8M6jl4J6K1l0JL6j8k1L6j3k6M6Nm3J5J4l6NK4jk3K2mk6L2j3k3L5
3710HRk2lK2k0j6M2k7j7K7jk4K0J0l1J6K8l3j4L5j5k1L1j3j1K4Ml2K1J3k5nL4
$$ y = [5, 29, -20, 5, 31, -16, -6, 24, -15, -22, 14, 5, -39, 0, 5, -20, -5, 13, -9, -17, 10, -11, -11, 19, -4, -17, 1, 20, -32, 6, 18, -16, -2, 15, -23, -27, 17, -9, -16, 2, 20, -18, -4, 30, -12, -10, 24, 4, -16, 28, 6, -28, 17, 20, -20, 6, 27, -15, -9, 33, -15, -22, 22, -5, -27, 15, -7, -27, -4, 20, -22, -13, 20, -16, -21, 12, -14, -19, 24, 6, -17, 13, 13, -32, 3, 29, -11, -14, 14, -4, -23, 15, 9, -19, 6, 21, -9, 1, 30, -8, -6, 22, 0, -24, 16, 13, -29, 19, 10, -10, 11, 14, -8, 11, 20, 0, -19, 22, 6, -27, 25, 15, -19, 3, 17, -10, 4, 22, -8, -15, 25, -2, -22, 21, 4, -26, 3, 8, -28, -14, 16, -2, -16, 10, -11, -13, 17, -2, -21, 9, 15, -26, 2, 23, -15, -11, 23, -14, -17, 13, 5, -30, 7, 5, -20, 0, 7, -15, -15, 21, -7, -32, 20, 5, -14, 16, 6, -19, -8, 7, -29, -10, 24, -19, -23, 9, -14, -34, 7, -6, -25, -3, 2, -20, -14, 19, -21, -9, 8, -6, -23, 9, 14, -34, 12, 11, -23, -7, 14, -16, -15, 21, 3, -18, 18, 5, -21, 25, 30, -13, 2, 16, -20, -15, 9, 8, -15, 7, 3, -23, 9, -4, -27, 8, 17, -5, -8, 14, -6, -22, 20, -7, -24, 3, 2, -22, -2, 8, -23, -7, 21, -12, -26, 9, -6, -27, 4, -9, -20, 4, 8, -24, -3, 10, -15, -20, 14]
3743A4j9oL9k1j3J2jj4OK4k5kJ6j1j0L5k9mK5%l2J7J4l4OJ4j8LK1j3k7L8Kk8J9
3778bK2m1J2K6k5j4L4k4nL0j2k5M0j2l2K8Pj8qL4k7JJ5mk7L8Lk0J4J8m8RL7j5
3812Ik6L5ol3K8Rl5K1Qk5J1J5j5pK9j1k5J9Kk4KK9l0PK9l4LK7j3k2K5lk1L0Lk3
3848a2LJ7j9kK5k6j6M8qk9J6Qk0PK4k4JJ9j2k0L9j4j5L4j4l2K6J3l1J7K4k6j7
3881a6L3rj4K3j2k0J5K3m6QL2j7j9M2k9j3L9ml3K3Rk5oL2l1JK5k0j3M1pl4M0j6
3915Bj7NK8k1j0L9k8j1L1pl4L1Ol3J9J6m5K9J3k5PJ5pj7L2j4l1K8Pk3MK2l0MK2
3950Gk3rL3Qk8J1J3l3RL8n1J2L1k6j7N1k2k1J7J1l1J0L0l8J3K6k3j1L0jl4K6J1
3983A9k7kJ9k0%K7oj4K2j2k5L0J2k7PK7l1kK6k7rL9k7j8K5jk2J3Qj7jL1l2nK6
$$ y = [14, -5, -11, 28, 7, -6, 6, 5, -9, -3, 21, -4, -6, 10, -1, -11, 24, -5, -9, 16, 16, -16, 1, 15, -19, -13, 1, -17, -14, 7, -6, -33, 5, 7, -21, -2, 20, -21, -9, 17, -8, -22, 12, -12, -17, 13, 1, -24, 16, 4, -28, 0, 7, -11, -19, 15, -12, -11, 4, 0, -27, 11, 14, -6, 8, 26, -22, -13, 24, 9, -17, 18, 12, -21, 7, 16, -19, 2, 10, -15, -4, 11, -4, -11, 18, 7, -18, 1, 3, -21, -19, 10, -20, -13, 16, -18, -15, 12, -1, -23, 2, -1, -22, 8, 11, -12, -9, 8, -11, -13, 12, -14, -30, 18, 10, -19, -3, 5, -15, -8, 16, -8, -7, 12, 0, -20, 19, 5, -10, 24, 10, -22, 4, 17, -14, 3, 27, 1, -16, 17, 8, -6, 17, 5, -15, 0, 23, -23, -15, 17, 0, -19, 23, -6, -19, 20, 16, -17, 6, 15, -10, -16, 16, -15, -14, 11, -9, -22, 19, 12, -22, 18, 2, -15, -10, 18, -3, -13, 26, -2, -13, 18, 11, -23, 8, 14, -19, 0, 16, -29, 0, 13, -12, -5, 10, 3, -14, 18, 4, -27, 1, 8, -15, -11, 11, -19, -15, 7, -16, -25, 8, 16, -12, -1, 12, -21, -12, 26, -25, -13, 18, -8, -25, 26, 4, -17, 0, 11, -20, -10, 20, -18, -5, 21, -2, -13, 17, 16, -18, 8, 19, -8, -10, 9, -11, -11, 16, 10, -4, 18, 6, -19, 11, 23, -4, 3, 30, -1, -3, 23, -4, -13, 26, -1, -19, 6, 5, -17, -4, 4, -13, -14, 17, -15, -20, 6]
4018Fkj6K5j3k0K2J0m4L3Rk4QK8l1k2M8j2k1L1rj7QK3l6nL0j3nK6j6k1L1Rl4K8
4053A4Pl0J6J8l4nL3j3l0L5qj8OL1l3lL1l2rL7j7j5K4Mk9J2K1l9K3Rk4lK9j6j8
4088b6L3j1pJ5K0l4J1J9l8lM6k7j9L0j6jJ4Kj8NJ4k4QL4l1j0L7k9j6L1Rl4J9J1
4122A4k5qL5k2j3K5pj9L3rl1L6%k3jK5l2KL1k7nK5nk1J5J7j6jK0j5pL3k1k7L0
4157FPk7K3Mk7J2Oj9LM2l2qL0j5j1J8kk0J6Ok1KJ8j3lK4j9mRJ4l7K5Rj9oJ1rj1
4195a8K8j6k1M0k3j2K1J4k8J9Lj8LK6j1k1K9ql1K9Jj9NK4k9JL1j7rK9j3k9K2Q
4229A0j4J4Pk0J1Rk5mK0%k5K6kk0K3j0j0J0K1k0nJ2j4j6L0ok4K1Lk3K0Pj0j2L0
4264A4pk3L8k0pJ3J7l7K2J0j1jJ7k4j2L4j9j8L4jk4J0J8k6JK3j4k1K5oj2J4jk3
$$ y = [6, 4, -12, 13, 0, -20, 2, 12, -32, 1, 10, -14, -6, 22, -9, -31, 17, 5, -16, 15, 6, -11, -3, 20, -16, -21, 9, -4, -9, 17, 1, -20, 11, 20, -14, 14, 21, -9, 7, 25, -9, -14, 19, 6, -24, 11, 3, -15, -9, 22, -11, -14, 17, -15, -24, 13, -4, -19, 5, 9, -20, -8, 13, -26, -3, 6, -18, -21, 8, -8, -26, 7, -4, -11, 4, 24, -10, 1, 20, -18, -21, 25, -2, -21, 9, -7, -8, 6, 8, -10, -5, 9, -15, -7, 27, -4, -14, 23, -6, -22, 9, 18, -16, 3, 14, -11, -19, 16, -6, -19, 6, -1, -20, 13, 4, -27, 9, 9, -14, -15, 10, -22, -20, 11, -16, -21, 4, -1, -22, -7, 10, -6, -7, 13, -2, -9, 24, 3, -24, 6, 13, -14, 9, 13, -14, -2, 4, -15, -12, 30, -2, -10, 20, 5, -6, 12, 10, -10, 6, 12, -9, -7, 11, -2, -5, 19, 0, -4, 5, 19, -18, 7, 16, -3, -9, 2, -7, -18, 10, -6, -27, 13, -10, -22, -1, 13, -15, 4, 7, -11, -8, 18, 7, -14, 15, 7, -24, 5, 6, -13, -8, 16, -13, -12, 19, 2, -7, 22, 9, -20, 2, 10, -4, 10, 17, -3, 8, 17, -8, -12, 8, 8, -17, 9, 7, -13, 10, 0, -10, 0, 21, 1, -4, 8, -6, -22, 8, 2, -22, -1, 2, -21, -1, 6, -4, -16, 14, 7, -16, 22, 2, -5, 8, 25, -12, 10, 20, 9, 8, 25, 1, -11, 23, 4, -14, 20, 19, -5, 5, 23, -3, -2, 21, 7, -14, 11, 5, -7, 7, 6, -17]
4298a7L1pk4K4J5k0j9L4j3k4K1Qk2J6%k3J5J8j5lK3j7j7K3Mk7K0Oj9K1Pj5pK1
4332A8mj9K7lk5J8Pk3J1J7k6LJ6k4QJ3j4k1L6ok5QK1l2OK3k5KK3ok6K8j3k4K2
4367iQj5NMrrK9j2k2M0Kk0LK1k1LJ5j5rK2j1j9K0Lk1K3lj8J4Qj0j3M1rj1Qlj5
4405eK2Ml4J2J3k8J6Ljj2RJk2J6J9k8J5J4k3j1K9j8j3L5k2k0J5K5l1J4J8l8K4
4438bJ9l1%J9j0j7K6%j6J9mpPK3l0kRlj2K4Mj3KJ1k1J2Kj6J1Opj9K4nk3L2j0r
4476gPQj0rK2k9J0J6j6qJ8J6l3J0J2k6PL3k1j3M0k4j2J9pk1K0J7k6NK3k7j0L4
4510A8j6j5K3jk2J3J0k7K5Kj5oK7k0k1L2J0l0ORk6K3Pk8NK6k5J2Okj3K2kj6jJ9
4546Il7K4Oj9NJ4JnJ4j3k7K8Oj2rL0k8%K7j8qJ3Mj6J3J3k5PK1k1NOoj3K4rPkJ5
$$ y = [-17, 14, 7, -17, 7, 22, 2, -17, 17, 4, -20, 1, 9, -13, 3, 3, -20, -5, 13, -2, -5, 18, 1, -16, 7, 11, -16, 4, 10, -9, 12, 19, 4, -3, 18, 14, -5, 22, 19, -6, 12, 19, -4, 7, 24, -2, 1, 17, -7, 1, 14, 0, -21, 15, 9, -16, -8, 13, -19, -13, 10, -15, -13, 10, 4, -22, 6, -7, -31, -9, -1, -16, -11, -7, -16, -25, 4, -8, -30, 10, 12, -8, -5, 16, -5, -2, 13, -2, -11, 11, 0, -19, 1, 4, -17, 6, 3, -15, -1, 7, -3, -16, 25, 16, 5, 13, 10, -5, 17, 21, -13, -1, 12, -16, 0, 3, 2, -10, -1, 0, -22, -6, 13, -15, 0, 14, -9, -20, 9, -9, -22, 13, -9, -29, -14, 11, -20, -6, 12, -26, -2, 17, -14, -14, 5, -5, -22, 4, 4, -12, 7, 3, -4, 3, 26, -4, -6, 3, 0, -12, 12, 16, 3, 5, 16, -5, 7, 9, -7, 4, 10, 3, -16, 8, 3, -20, 12, 2, -7, 0, 8, -2, -11, 11, -18, -8, 8, -8, -16, 2, 18, -15, -5, 7, -19, -12, 21, 0, -13, 27, 3, -9, 10, 3, -18, 2, 19, -7, -2, 21, -6, -16, 18, 2, -13, 10, 9, -13, 0, 10, -17, 8, 10, -5, -11, 16, -4, -25, 7, 17, -13, -7, 2, -24, -1, 6, -22, -17, 9, -16, -4, 2, 0, -13, 9, 7, -9, -10, 9, -28, -4, 2, -17, -12, 2, 3, -2, 12, -1, -28, 0, 6, -6, -15, 15, -13, -13, 14, -4, -12, 1, 5, -11, 2, 15, -10, -3, 18, -3, 2, 8, 2, -11, 13, 4, 11, 9, 24]
4585B4l4KJ8k1nL2j6j2K8j2j0J1kj3Okjj1J4lk0L1j4oK0jk3J2K6j9%%qqK9j0q
4622fJKj6J5KlOK0k2j0L9k2pJ8j8kkJ1k5K0J8l8J2J7j3oK3oj1KQj2MJ8l9J1K6
4659A5rj5K7j1k0J4mj1J6Kj8J4J6k1mJ9j8%J7Pl1K4pj0qK3j0nJ0JrK6nk0J6lj1
4696cPQj3pJ2lk3L4j2j1QPj5JJ4k1LK7k3pK5j6j2K0J4l6J1K7l0JK4j3j4K0mj6
4732a6L0j0k9K0K1k7PK2k2MJ1lk1J8%pPJ2k3J1J9j8qJ5rk5L8j1k5J9Mj7jL6k8
4767fMJ6k7nK7j0j0J1J5k5JK7l6OJ9j7MOJj7K0Ml2K4J0j7pJ6kk3K6mj6L2qk0J2
4804aRj1NRj7OJ4jk5J9j0lRRj2MJ1j4j6K8j7%J3nj3J1J2k7RMj8KK7j3j4J6Pk1
4842a4J3klj0K7r%J4k4qL3oj5J8kj0PJ5k8NJ1mmJ1j1nJ0J1k5LKkmJ9k2JK3ok2
$$ y = [24, -10, -8, 10, -11, -16, 16, 0, -12, 16, 4, -6, 5, 3, -10, -4, -6, -7, -18, -4, -7, -27, 4, -10, -16, 4, 3, -20, -8, 18, -1, -1, -1, -9, -17, 12, 2, -6, -5, -3, -19, -4, -2, -5, 1, 21, -1, -11, 28, 6, -1, 17, -1, -3, -5, 6, -19, 1, 19, -19, -7, 10, -3, -9, 14, 8, -3, -1, 7, -5, -1, 17, -22, -11, 15, 6, -9, 18, 7, -13, 1, -3, -14, 2, 4, -14, 0, 16, -5, -9, 10, -8, -8, 9, 16, -15, 9, 2, -8, -16, 7, -3, -8, 2, 3, -6, 20, 15, -5, 11, 8, -3, 4, 12, -1, -8, 4, 1, -22, 12, 0, -11, -3, 4, -11, -10, 4, -17, -14, 13, -10, -17, 8, -8, -20, 0, 14, -22, -11, 16, -14, -13, 11, -2, -16, 4, 0, -16, 14, 4, -25, -5, 16, -11, -4, 18, -4, 0, 11, 8, -13, 5, 5, -2, 5, 17, -6, 5, 24, 6, -2, 13, 4, -21, 17, 6, -19, 0, 4, -13, -14, 22, -6, -2, 14, -13, -18, 9, -1, -11, 0, 15, -10, -9, 18, -18, -12, 7, -10, -6, 0, 1, -16, 4, 8, -24, 0, 10, -7, -14, 2, 0, -23, 3, -1, -17, 15, 7, -13, -1, 8, -3, 2, 11, -6, 0, 14, 13, -12, 7, -3, -6, 3, 12, 0, 4, 15, 1, -15, 13, -4, -4, 9, 4, -9, 2, 14, -13, -4, 0, -18, -16, 11, -2, -16, 0, 7, -14, -1, -3, -6, -16, 11, 2, 2, 16, -8, -16, 17, 11, -4, 14, 12, 2, 9, 24, -4, 1, 12, 8, 4, 15, 4, -1, 9, 20, -5, -2, 0, -2, -6, 13, -9, -8, 15, 9, -13]
4881a3K2kj5J4J6l5L3j1k7K3OorRjj8MRj6J8jj1LJ0kk4L8rj8J3KjNKj5LJ0ooK5
4921A9mj6J7Ol1J2Oj8QPmj4L0k3lQJ8k4%OJoRoj0RqNLLj6RJ0rmLKj8K5j6OQ%o
4965fMj5JJ2Pj6PJ1jj6K4poMMl0K7K2l6OOrpK9oj6QNj7QJ1j8QJ2j8PJ7jj7J4r
5006Cj3MKj3NK0j8MJ7rj9J9J3k4RNj9NJ1llJ2j4nK2pKmJ7r%jk1J5K0k1oJ7j5n
5046gPJ1k2J4J7j9kJ8j0j4J8nqJ3mk2KJ8rK%opJ3mqJ6Mj1J5lj9jJ9rnPlj8L7j4
5087Aj4J0Qk3RJ5rMJ0rj3K0mj8K2mk3K7J4k3mJ5oj2J1J1k0RJ0k4RJ0j4MJ5k9l
5124a8K7qj1ONJnMlKJ3j9MR%oMoj0LK0j1kNn%J0j0oJ9J0k8J4Pj8RMj6J3jj1qK9
5167A6j1j1J3jnJJ0j7RjMj5PqMJOpJLj4J1J2mk1J8pLJLrjJ7k3KJ0j0kK4pj3K2
$$ y = [-13, 9, 7, -8, 6, 22, -13, 20, 9, -18, 5, 11, 5, -4, 5, 4, -14, -10, -1, -17, 1, 0, -11, -8, 2, 0, -24, 14, 5, -13, 0, 2, 1, 6, 8, -7, -4, 6, 0, -6, 19, 15, -1, 16, 22, -9, 3, 9, -9, -1, 6, 2, -12, 18, -5, -8, 0, 18, -6, -6, 0, 1, -5, 4, -2, -12, -3, -11, -6, -3, 0, -16, -7, 3, -6, -10, -7, -5, -23, 2, -14, -8, 0, 0, -6, -2, -17, -16, -4, 3, -13, -6, 5, 4, -12, 12, 5, -1, 3, 7, -23, 4, 26, -10, -4, 2, -7, -14, 15, 9, -7, 1, 6, -11, -3, 8, -10, -2, 10, -8, -1, 16, 15, -2, 12, 3, -10, -6, -4, -17, -12, 8, -10, -6, 11, 2, -17, 2, 15, -9, 0, 5, -14, -9, 2, -1, -4, 8, -6, -11, 11, 4, 6, 2, 19, 10, 10, 9, -12, 3, 23, 2, -4, 13, -2, -7, 0, 11, -11, 3, 20, 1, -1, 17, 7, -7, 11, 6, -2, 11, 7, -15, -13, 5, -4, -2, -2, -8, -15, -2, -6, -14, 2, 6, -5, 10, 7, -12, -13, 6, -3, -8, -1, -4, -22, 15, 1, -13, -3, 5, -18, -9, 6, -3, 1, 11, 2, -11, 9, 5, -13, 9, 5, -18, 9, 23, 0, -4, 11, 5, -7, 4, 15, -5, 4, 14, -10, -1, 9, -5, -1, 14, -15, -18, 9, 1, -10, -4, 1, 2, -3, 1, -2, 0, 13, -6, -2, 7, 7, 1, 5, -1, -11, -8, 12, 1, -1, 4, -1, -1, 9, -1, -7, 12, 22, -6, 8, 15, -3, 6, 10, -6, 7, 6, -5, -13, 16, 5, -6, 7, 6, 1, 2, 12, -5, 4, 3, 7, -8, -1, -9, -5, -4, 2, -5, -4, -1, -15, -4, 8, 4, -17, 1, -6, -3, -2, 1, -8, -9, 8, -15, -13, -3, -13, -15, 9, 2, -11, 11]
5209A1Lk5K3Ok1OJ2j6OLqlJ4j3j0LJ9k0PJ4qmJJj1J4mj9J8Jk1J5J5l2NJ5n%J3
5248Ejj2MKk0J3J0j9J0%Oj1RKj4J9Pk0JL0j9J0Nk3KJ2j0mJ9j1rMJ4k0J4pQlN%
5288Hk6K0Kj3MPmrjjj3K5%nKQj7J7j4qK4mj0lJ1roK2j1oJ2r%J1Oj7QQj5ROj4q
5331a3K4Lj8OLooJ9j4qJ9nrJ4Pk1LJ6k1LJk3K3K0j8j6RpJ1j0J9j6KK1k2RPrrJ1
5371aJqJ0kk3K2KMoL%nJ1j6JNOk2K6j0koJ1noJ9k3J4J1j3j0pJ3j3J9Jjj3J4j4
5411a3pJ8llRLj3RKqKkPj7QJpJ1jojJ6j9NPoKJ0oj1J8Lj4LJ0j2j0J6rj4K0Pk6
5454b1K2Oj0%NoONj8RNpj0J1jrLOjpRj6MQjj1K0J0j6J0j2nJJ5k1lK1nj5L3pj5
5496hJ9rPj2J1pnPj0QNooPQj1KJ6j9MoMrK1k0kK1mj6JQj7J0K0j5j0J2%pJ0j0k
$$ y = [11, 14, -11, 12, 18, -3, 3, 15, -1, 5, 8, 0, -3, 11, -2, -12, -9, 10, -10, -3, 11, 3, -1, 0, 1, -10, 4, 0, -19, -1, 0, -21, -6, 9, -23, -18, -3, -8, -8, 5, 4, -8, -4, -2, -22, -9, 1, -18, -8, -8, -2, -13, -4, -2, -16, 3, 10, -10, -9, 21, 2, 12, 17, -6, -4, 8, -2, -6, 13, 2, -7, -3, 11, -9, 5, -2, 6, 3, 8, 8, -18, 2, 4, -9, -5, 2, -2, -11, -12, -13, -26, -1, -1, -6, -4, 4, -13, 4, -10, -18, 6, 2, -8, -11, 0, -9, -15, 7, -4, -10, 2, -7, -7, 4, 10, -7, 1, 9, -6, 3, 9, -5, -13, 11, 14, -4, 2, 5, -1, -7, 12, -2, -10, 9, 4, -5, 9, 16, -5, -2, 14, -7, -4, -3, -26, -3, 17, -1, -17, -8, -15, -4, -14, 5, -11, -9, 12, -10, -1, 6, -3, -12, -1, 0, -8, 2, 0, -23, -1, 1, 5, -1, 2, 2, -3, 8, -8, -7, -2, 4, -18, 8, -2, -4, -10, 1, -4, -10, 9, -14, 0, 11, -2, -12, -19, -6, -19, 0, 1, 0, -13, 1, -13, -20, -2, -5, -8, 1, 4, -9, 0, 2, -6, -4, -6, 1, -16, -8, -7, -14, -3, -4, -10, -11, 5, -14, -9, -2, -8, -6, 4, -2, -13, 5, 8, -6, -3, 7, -5, -15, 1, -8, -22, -2, 5, -21, 1, 7, -3, -3, 2, -4, 2, 7, -11, -2, 3, -4, -14, -3, -4, -13, -10, -4, -5, -12, -3, -19, -15, -7, -8, -19, 1, 11, -5, 5, -7, -12, -11, 4, -17, -20, 1, -4, -19, 14, 7, -8, 11, 2, 9, -3, 8, 1, -4, 3, -7, 1, 6, 0, -6, 1, 9, -2, 0, 16, -3, 1, -5, -1, -10, 11, -9, -11, 10, 6, -10, -9, -1, -18, -8, 12, -3, -13, -1, -1, -8, 2, -8, -10]
5538a0jJ8j4KOlj1J9k8K5Qpj5OJ3j9J2LlpJ4j1LPnj9J3J7k8KK6j4nKJj4J9%j4
5577a2J1%olJ4j5LJ4j2jJ2oj4J6nqQP%j1jkoK0qm%joJ3J1k2MJ4j0LMoj2K0mj6
5619a7K7jpoRj3NNNj5J8j2OLj0nOQk1J9lj2mJ8jj7%J1Jj2J4nqJ6pj4K2qrJ4jj5
5661a6jJ7j5ONkrK5k0kK0j4%kJ5j2pJ2Nj2Pj5kJ2jnJ3nqJ0lKmJ4oOoKqOkmKOj
5706CrPJqNj1oJ8pj9J8J2j3NOj1QLmmJ2qj1K2%Mj1JlKKplJ4Mk2K0olQpNj0J1p
5751AmJ2Kk7K4j1rJ7lpLmmjJ0o%J0LoLj0oOK2j7oLorJ4rNOOj1kJ8j2OMRk2QJo
5797eOMj0oK0Lj0J3lk7J9J4k4QJ2j6lJ4k5ORNmj0J6j9KNmjJ9k7OMPmPj5j1K8o
5838cpPJ3j7MJ2j4nRjoMJ1j5QNj5jJ7j4OLRj8QPj2ONlpRrMJ5j7j1J9Qj7QJ2k2
$$ y = [-10, -11, 7, -7, -5, 1, -2, -13, 6, -22, 3, 11, 4, -11, -5, 8, -11, 1, 4, 1, -6, 8, -3, 0, 7, 2, -17, -4, 13, -15, -13, 13, -1, -6, -4, -3, -17, 2, 2, -12, -1, -1, -7, -10, 4, -11, -8, 6, -6, -7, 5, -1, -15, 1, -4, -12, -4, 3, 3, -8, -9, -11, -17, 3, -5, -9, -9, -10, -16, -3, 8, -14, -10, 4, -6, -3, 1, -5, -17, 3, -1, -17, 10, 9, 2, -4, 5, -8, -3, 2, 7, -8, 10, -2, 4, 7, -3, -8, -2, 6, -15, 4, 1, -11, -15, 3, 2, -15, -15, -4, -3, -15, -1, -6, -14, 2, -5, -19, 3, -5, -14, 0, -1, -16, -17, 0, -15, -9, -4, -6, -15, 10, -10, -12, 8, -6, -6, -8, 7, -5, -12, 0, 5, -7, 0, -15, -17, -5, -6, -11, 2, -3, -11, -1, -4, -2, -6, 8, 2, 8, 2, 4, -4, 2, 0, -4, -2, 4, 3, -6, 1, 2, -6, -1, -12, -18, 0, -7, -26, -8, 4, -9, -4, 2, -9, -1, 2, -2, -6, 6, -2, -13, 9, 9, 13, 2, 3, 0, 2, 4, -3, -6, 8, 12, -10, 10, 4, 1, 9, 2, 7, -3, 8, 1, -3, 9, 11, -16, 8, -3, -12, 5, 2, -5, -2, -6, -10, -11, -1, -7, -7, 3, 6, 0, 3, -7, -13, -7, 15, -2, -8, -5, -11, -20, -6, -15, -10, -4, 2, -9, -11, 7, -5, 1, 5, 14, -8, 0, 1, -5, 1, 5, -5, -11, 9, 12, 2, 15, 12, -15, 4, 18, -6, 2, 14, -2, -5, 9, -16, -10, -1, 4, 0, -10, 6, -13, -11, -6, -10, -11, 8, -19, -13, -9, -2, -6, 1, -14, -25, 3, -3, -10, -3, 10, -7, -3, 9, -5, -10, -1, -2, -8, -4, 7, -8, 0, 5, -10, -11, 6, -8, -2, 1, 10, -8, 0, 7, -5, 1, 6, 3, -4, 5, -4, 0, 15, -2, -13, 6, 14, -3, 5, 17, -5]
5881e%Rj0nJ3Mj7NPj3J5Rj0j0Nj0qK0kj0K2j0pRJ0r%Lk0J7jMnLLj1J1Nj7J7qp
5923dJ2Nj0pK0k4K%OrKJj3J5Kjj1K3jmPnj6K0j0k6K0Rq%J2pj6J5Kklj2J1KLpO
5966aJ1qqK1j8mJpRPQj1lJ2k0J7MpJLjj9OJ0j6KJ1j0qK3Lj6PRj9K4%k0J3nk0J2
6008gKp%QLj4J1J2k2J5Mkk1K0LrQJj2QPj1KQj0JJ7j8JQQlj1PmLNLj1KqRlmj6O
6054a1LJNRqmLnj0J2Rk8J6QrJ2j7OjjKlJ2k0J1jLmK2j0%lj1RJ2lqk0K7Oj6LJ0
6097Hj0J5Jj1kKNj4K0qj1PJk6RjPJ1oj0NMqnJ6mrPJ2j5%OqnJ6Lj5QJ8k3PLokJ0
6142BKk%rnJ6mk%JpJ1mJLPMJj4%qlJ9pqOj5K5j3KpKOoOlJOKk5PJ2j1mJ7j7J4r
6190a0PmQl%NlnkK1j4LmOj2Pj4J9nJ0j5J7Lj3LqPjlJ3k0mK4j8N%%mlLPoJ1j5M
$$ y = [-5, -5, 4, -6, -11, 2, 6, -11, -6, 1, -12, 3, 12, 2, -8, -3, -13, -21, -1, -3, -13, 9, -1, -8, 1, 11, 2, 2, 5, -15, 2, 1, 5, 0, 3, 6, -5, 6, 11, -6, 11, 3, -4, 8, 13, 3, -4, 16, -8, -6, -6, 0, -9, -7, -6, -19, -4, -2, -3, -14, 9, 8, 4, 11, 6, -10, 10, 0, -26, -6, 3, -5, -5, 7, 0, -16, -1, 1, -1, -4, -16, -5, -3, 0, -7, -1, 10, 2, -6, 15, -3, -7, -6, -13, -4, 3, 11, 0, -3, 9, -11, 6, 10, 3, 4, 7, 6, -13, -7, 3, -13, -11, 0, -10, -18, 5, 8, -8, -1, 8, -11, 13, 13, -7, 6, 1, -19, -7, -5, -12, -12, -4, -1, -15, -4, 8, -14, 1, 5, 3, -18, 2, 5, -4, 4, 5, -7, 1, 8, -3, -1, 7, -3, -2, 15, -3, -2, 6, 14, 11, 0, 7, 3, 6, 11, 14, 3, 5, -3, 6, 3, -1, -17, -11, -8, -7, -2, 7, -1, -5, -2, -7, -17, -5, 4, -24, -8, 0, -9, 3, -14, -8, -9, -10, -8, -11, 1, -19, -8, -9, -6, -10, 12, 2, 2, -1, -12, -3, 9, 6, -2, -22, 5, 11, -5, -2, 8, -2, 13, 14, 3, 1, 3, 8, -6, 14, 6, -5, 2, 3, -23, -14, -15, -8, 3, -3, -13, -8, -4, -12, -17, -1, -5, -14, -7, 5, -10, -10, -4, -12, -17, -1, 2, -13, -5, 13, -10, -3, 0, -6, -8, 2, 4, 2, 2, -7, -12, 4, 0, -2, -2, -1, -8, 3, -1, 0, 3, 10, 14, 15, 1, 1, -7, -10, 9, 2, -6, 0, -15, 10, -3, -1, -8, -6, 0, -6, 0, -3, -2, 4, 6, -19, -12, 0, -11, -15, 2, -15, -1, -10, -3, -7, 1, -2, -2, 3, 0, -5, -7, 14, 0, 3, -1, 5, -7, 0, -14, 5, 0, 10, -5, 12, 15, 2, 5, -3, 4, 3, 0, 13, -7, -11, 13, -5, 0, 0, 0, -4, -7, -4, 3, -3, 8, -7, -3]
6235cjjjMj1%QpMLnOQrjmJ8k1K3%k0J0LloLLloJ3Oj0KOokOMrRkmNj0ljJ2j5J7
6284Ij4%kJj6J4J8j3PJ0j2qJ0nkKMrJ1Jj3J2qj2K3JrJ0qkqRQklj1KQknOJ0kMn
6329IJ0k5RJnOoOj2QkRm%JnkJ7k0PqKK%JpMmOlONjoJ0o%mjNnjPknQRj2MnJ2k2
6381iJ1RknjJ9pj6J7j2jlJ3nojNmOj2PJJpJLMj3MLjPJ2j6%kj3J4nPrQmLnNLKo
6430@mlmJ4mkLj1J4KmMJ3j4KjkjoRjlNn%Qj0KPKj8J5rmjJ3j4PJ1j4J0qrNkKj1
6477a7JNONNj6QJ6j4rJ0kqK3j4pJ1pKlJ8j3rJ9Lj3LMlpK0pljljRkmknpJ3j1J5
6522Hqmo%J0JmrJ2oKMpJJ3j3%Mj3J8Jnj6J1J4k0kPMpK0oj8J0nJ0jMrOJ4j5Rjo
6567BpJ0j0MKOolKNpMlnQoMjJj2nJ2%pRorNkJ3j0J8j8JJ1j7J0kL%lNOQlj6J1m
$$ y = [-3, -4, -5, -6, -2, -13, -13, -5, -12, -8, -5, -10, -4, 4, -5, -6, -10, 8, -13, 10, 10, -10, 0, 3, 0, -6, -3, 0, -3, -9, 4, 10, 0, 2, 8, 2, 0, 6, 10, 1, 10, 8, 4, 9, -1, -4, -5, 7, -8, 9, -5, -5, -7, -6, -22, -8, 10, -3, 4, 14, 2, -6, 4, -1, -3, -1, 3, -6, 5, 6, -7, 5, -3, -15, 8, 9, 0, 10, 2, 0, -8, 1, 9, 7, 4, -7, -5, 3, 1, -4, 2, 12, 10, 14, 9, 19, -6, 3, 4, -1, 5, -1, 5, -7, 1, -1, 8, 4, 4, 5, 0, -2, 15, -5, 2, -6, -4, -2, -2, -1, -8, -4, -8, -2, -5, 1, 6, 5, -1, 9, 3, 3, -1, -2, 3, -2, -3, 4, 2, -3, 5, 14, 2, 6, 1, 13, -9, 2, 11, 9, 4, 3, 22, 15, -1, 16, 4, 3, 0, 13, 8, 2, 1, 6, 2, 8, -4, 3, 4, 5, -2, -1, 2, 6, -7, -3, 0, -1, 6, 18, 2, 2, 0, -13, 1, -4, 3, -6, 2, -2, 1, -4, 1, 4, 6, 0, -4, -7, -11, 3, -1, -3, 0, -11, 3, 5, 1, 5, 18, 4, 6, 5, 3, 2, -4, 5, 4, 1, 6, 1, 1, 9, -1, 1, 8, 10, -8, 7, -2, -6, -7, 6, -8, -1, 10, -4, 6, -2, -11, -6, -8, -6, -17, -16, -11, -5, 0, 5, -11, -3, 13, -1, -10, 0, -2, -10, 13, -1, -8, 3, -4, -2, -5, 13, 0, -9, 10, 13, 0, 3, 7, 4, -3, 17, 10, 7, 6, 3, 2, 11, 9, 5, 3, -2, -9, 4, -7, 8, 0, -4, -10, -10, 0, 1, -3, -12, 0, -6, -4, 0, -7, -6, 7, -6, -6, -2, -15, 3, 4, -1, -17, -6, 8, -12, -14, -7, -3, -10, 10, 4, -14, -4, -9, 1, 0, 4, -5, 1, 15, 0, 9, 8, 2, -5, 5, -5, -1, 1, 7, 1, -2, 0, 5, -2, 2, -1, -6, 2, -4, 0, -1, 0, -12, -17, -5, -5, -12, -3, -9, -18, -13, -15, -2, -12, 6, -12, -11, 0, -17, -7, -9, -6, -6, -9, -4, 2, 10, 7, -9, 2, -2]
6615bNJ1plJmOrO%j1Qj2PLMojJ1jj0J3rj2J7kj2ORj2NJ0lj4Q%%mlMoMjJ3j5PO
6662EJj7lLLJ0%j4J3%NJ6j8%pRpNnJM%kJ3j3Pj2LMj1KPrRmLjoMLkmklJ4qJ7k2
6710ikJ3qJJ0pPLj2jOlJN%j5J5Mj1J4j8J2J1k3J7jLJj2OKoo%kjpRNJQrjKlpRk
6758aorJ4Pj5koJ3KqkJ1kjOkjJMjj9QJJ1Mk1J4jNqkJ5j2OJ1j8MKJ1j6jJ0j0Jq
6803a1NJ0kj1J1j7J6JLRj9jRrLJmMkJ2j6PJPj1rQKPj6K0j4KOlQj3%J3nJmjoQk2
6849b2K7J2j5lPLj5J2lj%MjMj6J7Qk0J7j1j1J4%rQqKjKjjKnJ4j4lPLqoJ2kLmo
6894hJ2%pkmJ%OlNN%mR%oJnj%NoJ%lJMmjOKJ3j9J2j9JR%nOOk4%QLolJ0j0MQqJ3
6947CjmN%j0NqjpQ%MjJ9pnkPjMj7kJ1pMkJ5j3PJmJKJrMj0PJ0j7jJ2J7j8mJ3qp
$$ y = [-2, 3, 14, 7, 4, 5, 1, 7, -2, 4, 4, -7, 1, -11, -4, -1, 3, -3, -4, 7, 6, -4, 9, 0, -12, 5, 3, -9, -3, 6, -6, -1, 9, 6, -8, 0, 0, 0, -4, -7, -3, -9, -5, -6, 7, -8, -1, 5, 6, -11, -14, -11, -8, 2, 2, -12, 1, 1, 6, 22, 4, 4, -3, 6, -1, 4, -1, 0, 4, 4, 2, 15, 2, 9, -3, 0, 4, -7, -5, 2, -7, 2, -2, 1, 0, -6, -2, 1, -1, -5, -7, -10, 4, -4, 13, -9, -11, 2, -6, -5, 5, -2, 5, 8, -4, -5, 1, -2, -1, 4, 4, -11, 4, 8, -3, 11, -7, 5, 16, -7, 10, 9, 12, 13, 1, 7, 9, 3, -3, -3, -5, -6, -13, -4, 1, 2, 10, 1, 0, 2, -1, -8, 1, -1, -7, -16, -2, 5, -10, -12, -18, -5, -3, -11, -13, -2, -4, -5, 1, -1, -2, -1, 3, 2, -17, -9, -8, 3, 7, -14, 0, -1, 4, -4, -6, 9, -3, 3, 14, -4, 0, 2, 13, -3, -4, 6, -4, -3, -11, -6, 4, 2, -9, 2, -15, 1, 2, 5, 14, -5, -6, 3, -6, -3, -2, -6, -2, -4, 8, -8, -1, 0, 7, -4, -13, -5, -3, 4, -12, 8, -6, -4, 2, -1, 7, -6, -6, 7, 2, 3, -1, -2, -8, 0, -22, 5, 17, 2, -1, 6, 9, -6, 6, 3, 2, 2, 6, 5, 9, -7, 10, 18, -2, 15, 4, -7, 7, 7, -2, 6, -2, 0, -1, 1, 0, -1, 1, -4, 10, -4, -7, 0, 3, -5, -11, 1, -1, 2, -2, -8, 4, 4, -3, -5, -9, -8, -8, -2, -5, 0, 5, 5, 1, 10, 10, 4, 5, 0, -1, -1, 4, -2, -1, -1, -4, -3, 1, -3, -4, 2, 4, 17, -2, 10, -9, -8, 1, 1, -4, 2, 8, -16, -16, -8, -5, -11, -14, -4, -14, -10, -2, -10, 3, 2, -2, 3, 3, -7, -2, -10, -11, -18, -10, -10, -6, -7, 12, 5, 0, -2, 5, 4, 8, -9, -11, 0, -7, -3, -5, 10, -3, 4, 5, 1, 2, 4, 5, -4, 0, -10, -3, 7, -10, -11, 1, 18, 0, -4, 9, 1, -6]
6995fKoRrROj0OnNKlPj3PrPLj7RJ5j4lJNrRLj7J9%%JOr%mnkJ7j1On%J0rPLl%l
7046BjoRj0LPj2jOPk0J6j1J4klQj8K1j1OkplNQj1Qj4J7pNmJKKJlPrjMLpkj0J5
7093B%%KOj5MQLj6MkJ7mj2j3J8kj2MRo%MlKPplKlMNNnnLl%nLJ3pOnrQjNkKLpJ6
7146A8olj6J2rRqKJ1mLpoJ6kj3PMomknlJ3kkKMrNJlQJjlnJ2j3lJQpLKKQqj3K0
7196Imj0RpJ4lLj8J0Pj7OKKJ0j2J7k0RkMj2JJ6kk1J1pnRpOJjoK0k1OMj%Pj5J1
7240C%loMMj2OLJPJqLJ3j0Pk7NJ7j0%J6qoPlj3lK4nkmnJ5j4Nj%KPj1RJk1J3j4
7286a3J9oRj4RlNRj4nj0%J3pKmoJ5j5MNMJ1pj0J0L%oJ0pOqRpJ1j2RkJKo%jj1R
7332AKNmj3J8KoJnKlj0QPqlJ1j2NJMJj4OJNqK%JKNJpO%Oj0MKol%lJ2%oJ1mnMj2
$$ y = [-6, -4, -10, -1, -10, -1, 5, -5, 1, -4, 1, 3, 0, 7, -6, 1, -8, -1, 2, -15, -6, 9, -5, -8, -7, -2, -11, -2, 1, -16, 3, 3, 3, 4, 10, 1, 1, -3, -8, -10, 7, -4, 2, -3, -3, 7, -2, 5, 8, 5, 5, 2, 1, -5, 4, -6, -3, 4, -8, -9, -3, 4, -16, 0, -11, 3, 1, -2, 6, -12, 9, -2, 4, 2, -5, -8, -3, 5, -6, 2, -12, 5, -2, 3, -1, 0, 2, 4, 5, 2, 9, 0, -1, 3, 6, -1, -3, -13, 2, 2, 2, 4, 10, -5, -1, 7, 10, -6, -2, -4, 13, 9, -3, -16, 2, 0, -12, -8, 1, -5, -5, -1, -4, -2, 5, -2, -5, -3, -6, -2, 3, 8, 3, -2, 1, -2, -2, -7, -4, 9, 2, 8, 3, -6, 2, 1, 6, 4, 6, 9, 2, 18, 12, 9, -7, 5, -4, 5, -3, -1, 10, 6, 9, 2, -4, 12, 10, -3, 4, 8, 2, -2, -4, -9, -12, 1, -1, -3, -1, 3, -6, -1, 0, -3, 5, 6, 5, 2, -3, 9, -4, -7, -6, 2, -5, -2, 0, 2, 10, 2, -11, 9, 5, -5, 4, -3, 11, 8, 11, -7, 3, 10, -7, -1, 1, 3, 13, 1, 18, -2, 7, 5, 9, -3, -2, 14, 12, -9, 2, -5, -10, -1, -8, -2, -1, -2, -8, 12, -9, -3, 1, 0, 0, 7, -8, 3, 3, 0, -6, -2, 2, -10, -4, -1, 0, 7, 8, 0, 3, 16, 6, 13, -14, -9, 8, -2, -2, 14, 6, 0, 7, 4, -9, -12, 12, 7, 5, 1, -4, 11, -3, 2, 1, 1, 3, 10, -1, 8, 9, -12, 1, -13, 6, 0, 9, -5, 4, 1, 6, 15, 1, -4, -14, -14, -1, -8, -6, -10, -16, -1, -16, -12, -7, -3, 8, 1, -9, 1, 4, 4, -2, 8, 1, 7, -1, 8, 1, 12, 0, 9, 7, 8, 10, 4, 4, 3, -8, 1, 3, 8, 4, -9, 9, 11, 5, 6, 1, 3, 0, -10, -2, 5, -3, -6, 5, -7, -2, -1, 3, 4, -10, -4, -3, 2, -6, -4, -4, -3, -1, 4, 5, -2, 4, 4, 10, 0, 4, 6, 0, -3, -3, -6, 6, 6, 0, 11, 7, 2, 6, -6]
7384fOOJNqJ3j5JKjmj2J1JqJ5k2QpLKmKJ2LlJj2Oj3PRpp%PJMqJ4JrRmJrOjlJ1
7434ELj1MlkKmJPJ8j7J5j5%JJ2j5jJ5oqqJ7k2J6j2OjjJ4ojqnJ2lmLmRJpJMMpM
7481Cj1J5j8K1%j6K2k0RlmJ0%j0%MJ2k0MNRJj1mRj1J8k1J4npMJLmKmJ1rkLJ4j4
7524@mLmmQRj3PNn%j2J6nkJ3j0J3Kj4N%lNKj2%J2Jj0PLj0J0j5J2j2KPRNj2nqJ3
7569Ijk3K0nMlm%jRljljNnoLQj0MJmL%MkpLJ5j5J0Opj0Q%Rj4MNljK%lMpMJ6j9
7620bPnoJ3Oj6J7kj9J6mLon%J9pmjrjnPnJ1nLJKJ4j6%Oj6%RpNRpJ7j5n%JPmJ0
7668A1nKklj3J2QmkOJLqrKQoj0Qj1MJ2rRjmjQrJ3qjmNj3RkkMj5J1Prj%J2%pO%
7718Bj2OrJ1LmlJ2mJ2j6qJ1lkPJj1LPoJJ4jmkJoQ%j2N%qK2j7OnPj1LMqJ6j0Kr
$$ y = [-6, 0, 6, 7, 12, 4, 17, 2, 3, 5, 4, 0, -12, -1, 0, -8, 7, -15, -7, -14, -11, -9, -13, -11, 1, 4, 1, 2, -10, -4, -17, -10, -1, -8, -15, -15, -8, -7, -3, -11, 3, 4, -5, 4, 0, 1, -8, -2, -3, -6, 5, 8, -3, 1, -2, -4, -2, -6, -5, 2, 20, 3, 18, 3, 3, 4, 16, 1, 0, 15, 9, 1, -7, 10, -12, 4, -8, -2, -3, -4, 10, 4, 3, -5, -10, 2, -1, -5, -2, -6, 3, 4, -3, -2, 2, 6, -1, 3, -8, 7, -11, 10, 10, -6, 16, -4, 5, 2, -2, 8, 8, -2, -2, 2, 14, -6, -2, 3, 12, 13, 2, -2, 7, -4, 14, -7, 7, 2, -5, -1, 0, 3, -1, 1, -3, 8, -1, -3, 0, 14, 0, -4, -1, -5, -9, -1, 8, -5, 2, 7, 2, 2, -10, 6, 1, -1, 12, 2, 15, 17, 3, 8, 8, 5, 10, 12, 0, 0, 12, 13, 3, 10, 13, 3, 13, -2, 10, -2, 0, 7, 16, 21, 9, 4, -4, 9, 8, -15, 5, 0, 4, 1, -3, -3, -4, 5, 2, 1, -2, -3, 2, -3, -9, -6, 2, -8, -4, -3, -7, -4, -4, 0, -2, -9, -6, 9, -6, 4, 10, 3, -7, 1, 1, 10, -4, 0, 5, 2, 1, 3, 3, 0, 4, -3, 1, 17, -2, 5, 0, -6, 7, 13, -3, 14, 12, -7, 9, 5, 8, 2, -3, -3, 16, 9, 5, 4, -5, -6, -11, -4, -9, 2, -3, 0, 1, 3, 17, 1, 1, 7, -9, -9, 0, -7, -2, 7, 0, 17, 2, -3, -3, -2, 5, 1, 11, 6, 8, 6, 3, -10, 2, 10, 6, 4, 10, 11, 14, 6, -3, -1, 7, 1, -9, -1, -12, -8, 4, -5, 4, 3, -1, -2, 6, -3, 10, 2, 1, -3, 2, -11, -2, -4, -6, -2, -17, -6, 1, -8, -9, -9, 3, 3, -4, 2, 2, -10, -4, -13, -2, 1, -3, -6, 6, 2, 14, -2, -10, 1, -2, -4, 3, 4, -7, -4, 3, -3, -2, 12, 11, 7, 5, 6, 0, 8, 8, -4, 1, 1, -7, 15, -2, 4, -1, 6, -5, -2, 2, -6, 10, 0, 2, -7]
7765gqPJ2j0J%jJ2pKoJ0NrNjkmojJ1kj1J2KKqJ4pN%moJ7oJrknkJ1JKj2RkmQlr
7815eJ1qLj2kMJ1JmqNj2ROlPoJj1J6PpknjP%lj1OjJ5kj0PK1k9QlmJ4nlkrMJ7j9
7863gRLnLMj5J6nPlj0jjPqj3J2NkJ4j8OmNPnJMj3MNJjLlQkpMloKKPLj0Mkj3J5
7913DJMj0j0J8j8jJ4Rj8PMjRpqMPnnl%KKKml%jlQOrONj0mJ0qKJjMn%nJ2jj1ML
7964cOj2PQlqJ4Pk3qPLJnLOlnJ3j1jRk2K8jroKmmJ2qOolOj2K1mqJJ1lpNjlJlJ5
8014Fj1mOqJ7oKQj7J4Nj0jOoPnnOKqRj5JkNkKQlkqOoJ2Rk0PlNlKjlQrkJ0ooQn
8066fRoNrlOJ2j0jqR%kKMlJ2j1NKpN%Mj0Qk1K1j3%RkJknJ5k0MJ1nJj3K1j7QKj
8113AmKmrJ0jkJ7j4%MQrmLmJ5j0%jNonMJ5qLLpjJ5j0KOrkOjomJ1j1RnlmMJ9j6
$$ y = [-7, -15, -8, 4, -6, -5, -5, -6, 6, -1, 1, -5, 5, 10, 1, 6, 5, 3, -1, -7, -8, 3, 1, -10, 2, 4, 6, -2, 12, 5, 10, 10, 6, 0, 17, 11, 12, 3, 1, -4, -6, 5, 6, 8, -4, 5, 3, -1, 7, 4, -5, 6, -2, 1, -11, -13, -9, 2, 3, -1, -9, -4, -16, -7, -1, -4, 3, -3, -2, -13, 3, 10, 3, 1, -4, -5, 2, 2, -1, -12, -6, -7, 8, 6, -4, 3, 24, -5, 3, 0, -4, 10, 5, 2, 0, -9, -5, 12, -7, 2, 5, 0, 3, 7, -8, 8, 3, 10, 7, -3, -4, -5, 2, -6, -19, -7, -2, -4, 10, -8, -2, -6, -1, 6, 1, 2, 6, -7, -3, 2, 3, 2, 5, 2, 10, 8, 1, 5, 2, -4, -2, 0, 7, 10, 0, 4, 2, -11, 4, 5, 9, -1, -11, 7, -11, -12, 2, 11, -7, 0, 4, 3, 12, 5, -3, 1, 8, 3, -2, -5, -5, -3, -1, 1, -3, -6, -6, -7, -10, -2, 4, -5, 1, 6, -4, -8, 2, -6, -4, -3, -4, 0, -5, -5, -10, 2, 1, -10, -6, -3, 3, -9, -2, 6, 3, -5, 9, 16, -7, -15, -8, -5, -4, -9, -6, 0, -3, -8, 5, -6, -7, 2, -20, 8, 7, -2, -8, -6, -10, -14, -2, -10, -4, -10, -13, -7, -19, 2, -2, -10, -9, 2, -1, -8, -3, -4, -7, -6, -9, 6, -5, -9, -3, -11, 6, 0, 2, 10, -7, 7, 12, 2, 1, 7, 1, 8, 3, -2, 4, 6, -2, 7, -8, -7, -9, -4, -6, -4, 4, 1, -1, -9, -3, -9, 3, 12, -8, -1, -4, 1, -2, 0, -1, -4, 4, -5, -7, 3, -3, -9, -1, -6, 3, -3, 2, -7, -10, -4, 8, -2, -3, -11, -2, -2, -4, -2, 2, -1, 11, 0, 5, 7, 0, 5, 5, 9, -1, 7, -14, 7, -6, -6, 3, 1, 2, 0, -5, 10, -10, -6, 5, 0, 1, -12, 9, -8, 0, 2, 1, -3, -1, -5, -14, -4, -5, -7, 10, -4, -4, 0, 8, -1, -5, -2, -6, 9, -1, -1, -2, 3, -3, -8, -4, 11, 3, 6, 9, 2, 1, 16, 6, 8, 14, 5, 3, 9, 8, 2, -2, 9, -2, 7, 2, -1, -5, -1, 18, 2]
8162BmJ1j2LjQj0MKrJ2mj9J9KrJJ1qRoQpj0Rkj2J4l
$$ y = [2, -2, 9, -3, 0, -1, 7, -3, 1, 3, -6, 6, 2, -17, 2, 4, -5, -4, 7, -1, 8, 2, 10, 3, -7, 2, 0, -12, 2, -1]
8191a
##END NTUPLES=NMR FID
##END=
